##TITLE=1H_TG-2300
 CDCl3, 8 sc, 
 24.8.2020
##JCAMPDX= 6.0         $$ Bruker NMR JCAMP-DX V2.0
##DATA TYPE= NMR FID
##DATA CLASS= NTUPLES
##ORIGIN= UXNMR, Bruker Analytische Messtechnik GmbH
##OWNER= root
$$ XWIN-NMR		Version 3.5
$$ Tue Aug 25 10:58:16 2020 Russian Standard Time (UT+4h)  she@DPX200
##.OBSERVE FREQUENCY= 200.1314999998
##.OBSERVE NUCLEUS= ^1H
##.DELAY= (6, 6)
##.ACQUISITION MODE= SIMULTANEOUS
##.ACQUISITION SCHEME= undefined
##.AVERAGES= 8
##.DIGITISER RES= 18
##SPECTROMETER/DATA SYSTEM= spect
##.PULSE SEQUENCE= zg30
##.SOLVENT NAME= CDCl3
##.SHIFT REFERENCE= (INTERNAL, CDCl3, 0, 15.7039)
##AUDIT TRAIL= $$ (NUMBER, WHEN, WHO, WHERE, WHAT)
$$ ##TITLE= Audit trail, XWIN-NMR		Version 3.5
$$ ##JCAMPDX= 5.01
$$ ##ORIGIN= Bruker BioSpin GmbH
$$ ##OWNER= she
$$ F:/spectra/data/she/nmr/H-F/1/audita.txt
$$ ##AUDIT TRAIL=  $$ (NUMBER, WHEN, WHO, WHERE, WHAT)
(   1,<2020-08-25 10:57:00.26 +0400>,<she>,<DPX200>,
      <created by zg, POWCHK disabled, PULCHK disabled
       configuration hash MD5:
       00 E9 B6 7A A2 85 ED C7 34 08 36 98 17 FE 4E 26
       data hash MD5: 16K
       CA 05 07 97 D9 F7 7D 4D 0E 0C DA 67 9E 41 39 AB>)
$$ ##END=
$$ 
$$ hash MD5
$$ F4 10 FB 35 BB 26 86 A4 47 2A FB 13 DE 07 23 92
##$RELAX= 
##$RELAX= 
##$RELAX= 
##$RELAX= 
##$RELAX= 
##$RELAX= 
$$ Bruker specific parameters
$$ --------------------------
##$DU= <F:/spectra>
##$EXPNO= 1
##$NAME= <H-F>
##$PROCNO= 1
##$TYPE= <nmr>
##$USER= <she>
##$AMP= (0..31)
100 100 100 100 100 100 100 100 100 100 100 100 100 100 100 100 100 100 
100 100 100 100 100 100 100 100 100 100 100 100 100 100 
##$AQSEQ= 0
##$AQ_mod= 1
##$AUNM= <au_zg>
##$AUTOPOS= <>
##$BF1= 200.13
##$BF2= 200.13
##$BF3= 200.13
##$BF4= 200.13
##$BF5= 200.13
##$BF6= 200.13
##$BF7= 200.13
##$BF8= 200.13
##$BYTORDA= 1
##$CFDGTYP= 0
##$CFRGTYP= 5
##$CHEMSTR= <none>
##$CNST= (0..31)
1 1 145 1 1 1 1 1 1 1 1 1 1 1 1 1 1 1 1 1 1 1 1 1 1 1 1 1 1 1 1 1 
##$CPDPRG= <>
##$CPDPRG1= <>
##$CPDPRG2= <>
##$CPDPRG3= <>
##$CPDPRG4= <mlev>
##$CPDPRG5= <mlev>
##$CPDPRG6= <mlev>
##$CPDPRG7= <mlev>
##$CPDPRG8= <mlev>
##$CPDPRGB= <>
##$CPDPRGT= <>
##$D= (0..31)
0 1.2 0 0 0 0 0 0 0 0.06 0 0.03 0 0 0 0 0.0002 0 0 0 0 0 0 0 0 0 0 0 0 
0 0 0 
##$DATE= 1598338619
##$DBL= (0..7)
120 120 120 120 120 120 120 120 
##$DBP= (0..7)
150 150 150 150 150 150 150 150 
##$DBP07= 0
##$DBPNAM0= <>
##$DBPNAM1= <>
##$DBPNAM2= <>
##$DBPNAM3= <>
##$DBPNAM4= <>
##$DBPNAM5= <>
##$DBPNAM6= <>
##$DBPNAM7= <>
##$DBPOAL= (0..7)
0.5 0.5 0.5 0.5 0.5 0.5 0.5 0.5 
##$DBPOFFS= (0..7)
0 0 0 0 0 0 0 0 
##$DE= 6
##$DECBNUC= <off>
##$DECIM= 24
##$DECNUC= <off>
##$DECSTAT= 4
##$DIGMOD= 1
##$DIGTYP= 9
##$DL= (0..7)
0 120 120 120 120 120 120 120 
##$DP= (0..7)
150 150 150 150 150 150 150 150 
##$DP07= 0
##$DPNAME0= <>
##$DPNAME1= <>
##$DPNAME2= <>
##$DPNAME3= <>
##$DPNAME4= <>
##$DPNAME5= <>
##$DPNAME6= <>
##$DPNAME7= <>
##$DPOAL= (0..7)
0.5 0.5 0.5 0.5 0.5 0.5 0.5 0.5 
##$DPOFFS= (0..7)
0 0 0 0 0 0 0 0 
##$DQDMODE= 0
##$DR= 18
##$DS= 0
##$DSLIST= <SSSSSSSSSSSSSSS>
$$ [...]
##$SUBNAM2= <"">
##$SUBNAM3= <"">
##$SUBNAM4= <"">
##$SUBNAM5= <"">
##$SUBNAM6= <"">
##$SUBNAM7= <"">
##$SUBNAM8= <"">
##$SUBNAM9= <"">
##$SW= 24.9337058888022
##$SWIBOX= (0..15)
0 0 2 0 0 0 0 0 0 0 0 0 0 0 0 0 
##$SW_h= 4990.01996007984
##$TD= 16384
##$TD0= 1
##$TE= 0
##$TE2= 300
##$TE3= 300
##$TEG= 300
##$TL= (0..7)
0 120 120 120 120 120 120 120 
##$TP= (0..7)
150 150 150 150 150 150 150 150 
##$TP07= 0
##$TPNAME0= <>
##$TPNAME1= <>
##$TPNAME2= <>
##$TPNAME3= <>
##$TPNAME4= <>
##$TPNAME5= <>
##$TPNAME6= <>
##$TPNAME7= <>
##$TPOAL= (0..7)
0.5 0.5 0.5 0.5 0.5 0.5 0.5 0.5 
##$TPOFFS= (0..7)
0 0 0 0 0 0 0 0 
##$TUNHIN= 0
##$TUNHOUT= 0
##$TUNXOUT= 0
##$USERA1= <user>
##$USERA2= <user>
##$USERA3= <user>
##$USERA4= <user>
##$USERA5= <user>
##$V9= 5
##$VALIST= <valist>
##$VCLIST= <CCCCCCCCCCCCCCC>
##$VD= 0
##$VDLIST= <DDDDDDDDDDDDDDD>
##$VPLIST= <PPPPPPPPPPPPPPP>
##$VTLIST= <TTTTTTTTTTTTTTT>
##$WBST= 1024
##$WBSW= 4
##$XGAIN= (0..3)
0 0 0 0 
##$XL= 0
##$YL= 0
##$YMAX_a= 216788
##$YMIN_a= -299519
##$ZGOPTNS= <>
##$ZL1= 120
##$ZL2= 120
##$ZL3= 120
##$ZL4= 120
##$ABSF1= 10
##$ABSF2= 0
##$ABSG= 5
##$ABSL= 3
##$ALPHA= 0
##$AQORDER= 0
##$ASSFAC= 0
##$ASSFACI= 0
##$ASSFACX= 0
##$ASSWID= 0
##$AUNMP= <proc_1d>
##$AZFE= 0.1
##$AZFW= 0.1
##$BCFW= 1
##$BC_mod= 2
##$BYTORDP= 1
##$COROFFS= 0
##$CY= 11.3945322036743
##$DATMOD= 1
##$DC= 2
##$DFILT= <>
##$DTYPP= 0
##$F1P= 16.9975609425685
##$F2P= -3.02152046262296
##$FCOR= 0.5
##$FTSIZE= 0
##$FT_mod= 4
##$GAMMA= 1
##$GB= 0.15
##$INTBC= 1
##$INTSCL= 1
##$ISEN= 128
##$LB= 0.24
##$LEV0= 0
##$LPBIN= 0
##$MAXI= 10000
##$MC2= 0
##$MEAN= 0
##$ME_mod= 0
##$MI= 1.114404
##$NCOEF= 0
##$NC_proc= 0
##$NLEV= 6
##$NOISF1= 3.799351
##$NOISF2= 2.8
##$NSP= 1
##$NTH_PI= 0
##$NZP= 0
##$OFFSET= 15.70392
##$PC= 1
##$PHC0= -9952.808
##$PHC1= 11.20092
##$PH_mod= 1
##$PKNL= yes
##$PPARMOD= 0
##$PSCAL= 0
##$PSIGN= 0
##$REVERSE= no
##$SF= 200.130013532006
##$SI= 16384
##$SIGF1= 3
##$SIGF2= 2
##$SINO= 400
##$SIOLD= 16384
##$SREGLST= <1H.CDCl3>
##$SSB= 0
##$STSI= 0
##$STSR= 0
##$SW_p= 3612.71676300578
##$SYMM= 0
##$S_DEV= 0
##$TDeff= 0
##$TDoff= 0
##$TI= <>
##$TILT= no
##$TM1= 0
##$TM2= 0
##$TOPLEV= 0
##$USERP1= <user>
##$USERP2= <user>
##$USERP3= <user>
##$USERP4= <user>
##$USERP5= <user>
##$WDW= 1
##$XDIM= 8192
##$YMAX_p= 0
##$YMIN_p= 0
$$ End of Bruker specific parameters
$$ ---------------------------------
##NTUPLES= NMR FID
##VAR_NAME=  TIME,          FID/REAL,        FID/IMAG
##SYMBOL=    X,             R,               I
##VAR_TYPE=  INDEPENDENT,   DEPENDENT,       DEPENDENT
##VAR_FORM=  AFFN,          ASDF,            ASDF
##VAR_DIM=   8192,          8192,            8192
##UNITS=     SECONDS,       ARBITRARY UNITS, ARBITRARY UNITS
##FACTOR=    0.0002004,     1,               1
##FIRST=     0,             0,               0
##LAST=      1.6414764,     0,               0
##MIN=       0,             -299519,         0
##MAX=       1.6414764,     216788,          0
$$ Real data points
##PAGE= N=1
##DATA TABLE= (X++(R..R)), XYDATA
$$ [...]
1584B22L30J400o53j716P65J703Q6q50n15j04J025O89j846j711K160K797j493
$$ 222 552 1952 1299 -417 348 2051 2137 1287 772 668 1693 2382 536 -1175 985 3782 2289
1601B289l247n83K083J522p73k518q05K603J876k675l064Q14K639R33j243j847
$$ 2289 -958 -1541 542 2064 1291 -1227 -2032 571 2447 -228 -3292 -2478 161 1094 -149 -1996
1617a996o73J812J517j604j930J218K038k10j022o77n50O91J606O2j111J20N52
$$ -1996 -2669 -857 660 -944 -2874 -1656 382 172 -850 -1527 -2077 -1386 220 282 -829 -709 -157
1634a57n36j26O55r7qQ48J57p66J3K92o32K10J442L00q95n50l24n8J225P66j821
$$ -157 -693 -819 -164 -261 -269 579 736 -30 -17 275 -357 -147 1295 1595 700 150 -174 -232 993 1759 -62
1655f2j207K006J431j805k437J53K074J759q76l270q05L200J691k665k348J423
$$ -62 -1269 737 2168 363 -2074 -1921 153 1912 1036 -2234 -3039 161 1852 -813 -3161 -1738
1671a738K686P75j856k550L25L261J323k521j391J888J337r39j144J14O98R25
$$ -1738 948 1723 -133 -2683 -2358 903 2226 -295 -1686 202 1539 600 -544 -430 268 1193
1687A193J4j125m3Q78p36j376Q26J645m28j342m12J65N07M08j042r51J365J643
$$ 1193 1207 82 39 917 181 -1195 -369 1276 848 -494 -906 -741 -234 174 -868 -1819 -454 1189
1705A189j157j755o0R04R82P63o89j766N80K151q5k021m60J496J773M73j783k361
$$ 1189 32 -1723 -1783 -879 103 866 177 -1589 -1009 1142 1057 -964 -1424 72 1845 2318 535 -1826
1723a826P62L286P62k314j431J045J752M77j637k116J021L330K53l038j317J646
$$ -1826 -1064 2222 2984 670 -761 284 2036 2513 876 -1240 -219 3111 3364 326 -991 655
1739F55J064m75p91m92M38J010p71j800L40J504l22j246L07N60l59n21m51K59
$$ 655 1719 1244 453 -39 399 1409 638 -1162 -822 682 360 -886 -579 -19 -378 -899 -1350 -1091
1757a091J206O22j656j156J729J528j115j377M43J286J131k73k098p55K388J987
$$ -1091 115 737 -919 -2075 -346 1182 67 -1310 -867 419 1550 1277 -821 -1576 812 2799
1773B799j648k183L54J555P56n31j673q62J563J459j264j686O7O69M21J17j008
$$ 2799 1151 -1032 -678 877 1633 1102 -571 -1433 130 1589 325 -1361 -1294 -625 -204 -87 -1095
1790a095j077P88J288o09j322L92P28k67n0J82l00J32N41k74m79P40M58p44j26
$$ -1095 -2172 -1384 -96 -705 -2027 -1635 -907 -1174 -1224 -1042 -1342 -1210 -669 -943 -1422 -682 -224 -968 -1094
1809a094R46K33m49k45j51N37J352j78k133k38K458J142j565j539J67J653J616
$$ -1094 -148 85 -364 -609 -760 -223 1129 951 -1182 -1420 1038 2180 615 -924 -757 896 2512
1826B512j067k914j19L460J499k598k331O21K215J118j410k344J90K748P17k470
$$ 2512 1445 -1469 -1588 1872 3371 773 -1558 -937 1278 2396 986 -1358 -1168 1580 2297 -173
1842a73j495J414J538J76r16j222J57J689M18j546j15J397K61q80Q2J48j61K95
$$ -173 -1668 -254 1284 1460 544 -678 -521 1168 1586 40 -75 1322 1583 703 785 933 772 1067
1860A067N21k74j69K08o34p46P84P34m61l86k68n88k1P92k59j245K59J294r5j272
$$ 1067 1588 1314 1145 1353 719 -27 757 1491 1030 644 376 -212 -233 559 300 -945 -686 608 513 -759
1880g59q54k09J199J623o42k248k42J881M08j322o51P82J191L33j325j796P17
$$ -759 -1613 -1822 -623 1000 358 -1890 -2132 -251 157 -1165 -1816 -1034 157 490 -835 -2631 -1914
1897a914K248q6j539O1R57j26p26l53K41J214P74j283j295J273J223j131q51J168
$$ -1914 334 248 -1291 -1230 -273 -399 -1125 -1478 -1237 -23 751 -532 -1827 -554 669 -462 -1313 -145
1915a45J219k80j059p49M15J695M43j676q22J491J092r54j050j51P66J275O4j938
$$ -145 1074 794 -265 -1014 -599 1096 1539 -137 -959 532 1624 670 -380 -531 235 1510 1574 -364
1933c64q65J688J334r86j211r8O39J028K44j502j129J488J303q33j449N1R77R14
$$ -364 -1229 459 1793 807 -404 -502 137 1165 1409 -93 -1222 266 1569 736 -713 -662 315 1229
1951A229j78j987j076J812J665j139j659L29J164N0q69j051J81K089P95j921j604
$$ 1229 1051 -936 -2012 -200 1465 326 -1333 -1004 160 210 -659 -1710 -1529 560 1355 -566 -2170
1968b170J195J328n06n89L30O59M83n27j480K2K002Q90j356p29O66L13m57l45
$$ -2170 -975 353 -153 -742 -412 247 730 203 -1277 -1255 747 1637 281 -448 218 531 74 -271
1986b71q2Q31J197m82k069l31J490M35m56j7J74q6P6j80p34K16J485K42r26l75
$$ -271 -353 478 1675 1193 -876 -1207 283 718 262 245 419 333 409 229 -505 -289 1196 1438 512 137
2006A37K05p7K92M75l53P0O18l36j219K55J091N3m53j81j35M8M62m76q67P28J298
$$ 137 342 265 557 1032 679 749 1367 1031 -188 67 1158 1211 758 577 442 490 952 476 -391 337 1635
2027A635o62j461L8R34L78k51q68n64Q91J195j210j590N81J541M0j369j023J93
$$ 1635 973 -488 -450 484 862 611 -257 -821 70 1265 55 -1535 -954 587 627 -742 -1765 -1572
2045a572J398Q85j577j901R14J781l74j375l12O88Q12N5j207j015J227J628n54
$$ -1572 -174 711 -866 -2767 -1853 -72 -446 -1821 -2133 -1445 -633 -578 -1785 -2800 -1573 55 -499
2062d99j486J7R54N09k64p08l16J366J046j234j599P84J490K85o11o63j55R34
$$ -499 -1985 -1968 -1014 -505 -769 -1477 -1793 -427 619 -615 -2214 -1430 60 345 -266 -929 -1084 -150
2080a50Q41r95j105J218J600m99j268k31O54J050N76j049q86J195J323r82j243
$$ -150 691 -304 -1409 -191 1409 910 -358 -589 65 1115 1691 642 -244 951 2274 1292 49
2097D9N65J172M63l89j060m85J076R09r52p65P10N11p05m46M39J03r4P4l84j14
$$ 49 614 1786 2249 1860 800 315 1391 2300 1348 583 1293 1804 1099 653 1092 1195 1101 1175 791 677
2117F77P61k28j117J44J236J07q68n38L5M85O86m38j162J31J193j40j194k11L79
$$ 677 1438 1210 93 237 1473 1580 712 174 209 694 1380 942 -220 -89 1104 964 -230 -441 -62
2136f2K19J94l25r91p9J013N6j015m21M27L62K17l68j051q9J409L48j305m96Q28
$$ -62 157 351 26 -965 -1044 -31 25 -990 -1411 -984 -622 -405 -773 -1824 -1913 -504 -156 -1461 -1957 -1129
2156a129L91l00l49m07O14J037n06j513L39J664P7j438l26J069J065k1j502j117
$$ -1129 -738 -1038 -1387 -1794 -1180 -143 -649 -2162 -1823 -159 -82 -1520 -1846 -777 288 267 -1235 -2352
2174b352J496K367n28k434k49J875J149p61j488k22J734J481j398k135N55K028
$$ -2352 -856 1511 983 -1451 -1700 175 1324 563 -925 -1147 587 2068 670 -1465 -910 1118
2190A118J82j099n77J46N88N15o30r45N38J104k70p39J31NM1O45L35o57k60M89
$$ 1118 1300 201 -376 -230 358 873 243 -702 -164 940 670 -69 62 67 108 753 1088 431 171 660
2210F60R5Q7L31j14m66M82M10n48l37O78K1p08J19L71k85n27n6K3L25K99j000
$$ 660 755 842 1173 1059 593 1075 1485 937 600 1278 1299 591 710 1081 796 269 213 236 561 860 -140
2231a40j312P56J431m05j517k06P43M72l78j024j61J478P51j519j395J241J351
$$ -140 -1452 -696 735 330 -1187 -1393 -650 -178 -556 -1580 -1741 -263 488 -1031 -2426 -1185 166
2248A66m04r65J66P05N54m74j158K73J982N43j693p64J317R39o43o78J82J207
$$ 166 -238 -1203 -1037 -332 222 -252 -1410 -1137 845 1388 -305 -1069 248 1187 544 -134 48 1255
2266A255Q91j123j856N08K201L31j590o54O25N60J2p57p92M99J193k06j404m38
$$ 1255 2146 1023 -833 -325 1876 2207 617 -37 588 1148 1160 403 -389 110 1303 1097 -307 -745
2284g45M24K27K70J55o59n73O02L42m99j62L70L11K73j12r57k39J392Q35j037
$$ -745 -321 -94 176 331 -328 -901 -299 43 -456 -618 -248 63 336 224 -733 -972 420 1255 218
2303B18j018Q23Q29j36p81o80O49J388l00k083n24J752R16j424j248L55J023K46
$$ 218 -800 23 852 716 -65 -745 -96 1292 992 -1091 -1615 137 1053 -371 -1619 -1264 -241 5
2321Ej247j192P21J817m93k067j68J464N37p76n49J78N96M21p30o89J183J082
$$ 5 -1242 -2434 -1713 104 -389 -2456 -2624 -1160 -623 -1399 -1948 -1770 -1174 -753 -1483 -2172 -989 93
2339I3p29r73P56J058k12n08J30P22Q18j02j240j28J646R46r54n56M69M89O8j2
$$ 93 -636 -1609 -853 205 -7 -515 -385 337 1155 1053 -187 -315 1331 2277 1323 767 1236 1725 1793 1781
2359A781l44p2P77K37q30k84K79j50NN95k70j032j53P43ro16l20L3L23L90q06
$$ 1781 1437 1365 2142 2379 1549 1265 1544 1394 1399 1994 1724 692 539 1282 1273 657 337 370 693 1083 277
2380B77j111N67J358l52j224NP60J51m31m73M2R69L80j386q41J275J203j132j365
$$ 277 -834 -267 1091 739 -485 -480 280 431 0 -473 -431 538 918 -468 -1309 -34 1169 37 -1328
2399a328N21J318J56j206j356N56K091J85k343j182J638J557o88j574l66J131
$$ -1328 -807 511 667 -539 -1895 -1339 752 937 -1406 -2588 -950 607 -81 -1655 -2021 -890
2415h90J196m30j725k60J670P09j106n69L41L95J20J18l64j46N41ol07K59L25
$$ -890 306 -124 -1849 -2109 -439 270 -836 -1405 -1064 -669 -549 -431 -795 -941 -400 -406 -713 -454 -129
2434a29n21o3Q79R6o87p8M06K20J54K6l77o8O34K4n28L12M99n71k90P61L54p16
$$ -129 -650 -713 166 262 -425 -503 -97 123 277 303 -74 -142 492 516 -12 300 799 228 -62 699 1053 337
2456C37m81K36N94M14n14j255J95J619K57j560o81J021R13k23j047n93Q11J337
$$ 337 -144 92 686 1100 586 -669 -474 1145 1402 -158 -839 182 1095 872 -175 -768 43 1380
2474A380l76j759M2J521K37j067m72N97N98k6p87o07Q88Q39q27j099N84J176m88
$$ 1380 1004 -755 -713 808 1045 -22 -494 103 701 675 -112 -719 169 1008 181 -918 -334 842 354
2493C54r72j37N63P37n4j115m62J203Q74q98q69O01O65R4j64n53j04O99O57o13
$$ 354 -618 -755 -192 545 491 -624 -1086 117 991 93 -776 -175 490 584 420 -133 -237 462 1119 506
2513E06o28M40M31j62Mp6l61J70O33l10o72O4K89N3J58l93o49L61R25m26j094
$$ 506 -122 318 749 587 591 515 154 324 957 647 -25 39 328 381 539 146 -503 -142 783 357 -737
2534g37J04R85L0o41l65J08O23L62r20q25P92J101p06j012K03P49K12l94p12j4
$$ -737 -633 352 382 -259 -624 -516 107 469 -451 -1276 -484 617 -89 -1101 -898 -149 63 -331 -1043 -1057
2554a057J111L62j268o64J095Q99p34p72K81O13M50m12r57J64J332L52j323m46
$$ -1057 54 416 -852 -1516 -421 478 -256 -1028 -747 -134 316 -96 -1053 -889 443 795 -528 -974
2572i74J012M04m41l86r5M44N63l51r34J67R66o9p21N9L05K2J04j6m41O8P83p9
$$ -974 38 442 1 -385 -480 -36 527 176 -758 -591 375 306 -415 -356 -51 -29 75 59 -382 -314 469 390
2594C90n07N2K44o4J41J75l36k03O00K19n51l11K79J28K00o9n22j43Q81J46j095
$$ 390 -117 -65 179 115 256 431 95 -108 492 711 160 -151 128 256 456 387 -135 -278 603 749 -346
2615c46k90Q87M83m66m47q6M37N51k78j063L68J291j53j191j93Q85M26k32o87
$$ -346 -636 251 734 268 -179 -265 172 723 445 -618 -250 1041 888 -303 -496 389 815 583 -104
2634a04k73P70Q09q84j206N83J202nr42l44L24N66J75p24n12P57Q82o99q95L45
$$ -104 -377 393 1202 318 -888 -305 897 892 -50 -394 -70 496 671 -53 -565 192 1074 375 -520 -175
2654a75N76nk6k45j79L22L66n47l66M26L45l17j28K2k15K8M34l03m99L75K99l18
$$ -175 401 396 370 125 -54 268 634 87 -279 147 492 175 47 69 -146 -118 316 13 -486 -111 188 -130
2676a30l09J25m3O0L85l41o92N10O35m45n29J33L98J61q2n30m13Q44O03q29q44
$$ -130 -439 -314 -357 -297 88 -253 -945 -435 200 -245 -774 -641 -243 -82 -164 -694 -1107 -263 340 -489 -1333
2697a333N88Q47k92n84k78L11P56J53r64n12J192P93r11q02N13P33K57k94p35
$$ -1333 -745 102 -190 -774 -1052 -741 15 168 -796 -1308 -116 677 -234 -1036 -523 210 467 173 -562
2716e62Q1J015L31j091l55Q60M83m46l71r7K43N06j33p29N0Q28j04p86O9N29L2
$$ -562 -481 534 865 -226 -581 279 762 316 -55 -152 91 597 464 -265 -215 613 509 -277 -208 321 353
2737C53j71q7j86J79N23j92o24K23N98j41k14m0o5L5N29L3p06J3N27J46l40j81
$$ 353 182 95 -91 88 611 419 -205 18 616 475 261 221 156 191 720 753 47 60 587 733 393 212
2759B12r9Q9N76n9r41n5R04K55o91m27K64K57L21l34q07K06J017n3r89j60P03
$$ 212 113 202 778 719 -222 -277 627 882 191 -236 28 285 606 272 -535 -329 688 635 -354 -514 189
2780A89J84k99l32j11L14N74n17r56N93R79m21q38J55O10J28k25n09k58P61P85
$$ 189 373 74 -258 -369 -55 519 2 -954 -361 618 197 -641 -486 124 252 27 -482 -740 21 806
2800H06o96r37M14P77m4m47j28J2M11L17o85o18O44N92m11m78J2O7K0K18k01m92
$$ 806 110 -827 -413 364 320 -127 -255 -243 168 485 -200 -818 -174 418 7 -471 -459 -392 -372 -154 -355 -847
2822h47M50M62m83m26J87J75L3K08o5l75K67M24l98m13N49M43j59k99j03j5M27
$$ -847 -397 65 -418 -844 -657 -482 -449 -241 -306 -681 -414 10 -388 -801 -252 191 32 -267 -370 -385 42
2843D2L92o09m05P29N92o33o04K00M35L80K3o64l44P51N17p41n19N77N01j77l32
$$ 42 434 -175 -580 149 741 108 -496 -296 139 519 542 -122 -466 285 802 61 -458 119 620 443 111
2864A11k09j5O23J79q60j38P17K71o02k24K86J21J35o7m94j7P63N8q54j40P32
$$ 111 -98 -113 510 689 -171 -309 408 679 77 -147 139 260 395 328 -166 -183 580 638 -216 -356 376
2885C76J94k34j36j30L2O07j03q22K7R41J46n36k63j23K13M32k6p04RP14j3p86
$$ 376 570 336 200 70 102 709 606 -216 -189 752 898 362 99 -24 189 621 595 -109 -100 614 601 -185
2907a85j07K63K24J16M1n47j83N22k0o02K75N92l0m55j56j04J23N51j29n75L56
$$ -185 -292 -29 195 311 352 -195 -378 144 124 -478 -203 389 359 -96 -252 -356 -233 318 189 -386 -30
2928c0M71l95o88J60M88J68J38m06o58L12O86k14o65K01N20J3l27l42j85M05Q19
$$ -30 441 46 -642 -482 6 174 312 -94 -752 -440 246 32 -633 -432 88 101 -226 -568 -753 -348 471
2949D71l37q44J81M82p5j91j2k4K75K55l01p15M12O11k37m55J69J89p2K0j61j63
$$ 471 134 -710 -529 -47 -122 -313 -325 -349 -74 181 -120 -835 -423 188 -49 -504 -335 -146 -218 -198 -359 -522
2971e22K68N44n36n76N90N07k47l47m5J19M99K10p55l13P46N91o37n44K64L76
$$ -522 -254 290 -246 -822 -232 275 28 -319 -364 -245 254 464 -291 -604 142 733 96 -448 -184 192
2991A92K37J24o15m04O64N38n39n08M65L82j53j25k58j39O20K70l97l44M72J15
$$ 192 429 553 -62 -466 198 736 197 -311 154 536 383 258 0 -139 481 751 354 10 482 597
3011E97l87K2K92j17J76J35m47l20N65K51n32r8M14l8k97K2k68k1O11J23p99j85
$$ 597 210 232 524 407 583 718 271 -49 516 767 235 137 551 513 216 238 -30 -51 560 683 -116 -301
3033c01M04K28k42j33j02J41L86j7r07j11Q80K41m78k77R4j2K81m5n30oP06L9
$$ -301 103 331 89 -44 -146 -5 381 364 -543 -654 226 467 -11 -288 -194 -206 75 30 -500 -506 200 239
3055B39q13j42N46J72k46p4j16J40M57l68o04L57Q03j76n81LL26O5J14j97m12
$$ 239 -574 -716 -170 2 -244 -318 -434 -294 163 -205 -809 -452 351 175 -406 -403 -77 -12 102 -95 -507
3076e07L98O16m16q20L56M80k8j17p0l25J49M72j98n75K96M74j12l15p2qR6M45
$$ -507 -109 507 91 -729 -373 107 79 -38 -108 -433 -284 188 -10 -585 -289 185 73 -242 -314 -322 -226 219
3098B19j42n66K86N01k16m31J89J32O5K85k40o39K59P16k02o42J96L72Q0k07k60
$$ 219 77 -489 -203 298 82 -349 -160 -28 37 322 82 -557 -298 418 216 -426 -230 142 222 15 -245
3119b45l14N58N90l63p09K84O14j15l37PM7K98K30m59m32N30N08m34l39L05J96
$$ -245 -559 -1 589 226 -483 -199 415 300 -37 -30 17 315 545 86 -346 184 692 258 -81 224 420
3140D20j31j27m6m8M54L0n72j81P07J99o11j35L17J23N9m5m26K7O56L5o94j22
$$ 420 289 162 116 68 522 552 -20 -201 506 705 94 -41 276 399 458 413 -13 14 670 705 11 -111
3162a11M54J52j43n5k40k04L96K90o27j62M41P5k18j43k09j35M15M13n17m02L86
$$ -111 343 495 352 297 57 -147 249 539 -88 -250 191 266 48 -95 -304 -439 -24 389 -128 -530 -144
3183a44k5j82J9Q3M2K24j1n10k84O54L21n15m9L21K7k85k19j64M01O73j38r12
$$ -144 -169 -351 -332 -249 -207 17 6 -504 -788 -134 187 -328 -377 -56 -29 -314 -533 -697 -296 377 239 -673
3205f73k9O80J65n32j82K56M13K49m26q50K74J084L7p36j27L45J70N8l05m01M24
$$ -673 -702 -22 143 -389 -571 -315 98 347 -79 -929 -655 429 466 -270 -397 -52 118 176 -129 -530 -106
3226a06P39k31q06k8N01J20p5o1k72J30L39p6m20R5L74q7j92K38j57k07K68J54
$$ -106 633 402 -404 -432 69 189 114 53 -219 -89 250 174 -246 -151 223 136 -56 182 25 -182 86 240
3248B40k60NK88j71k33K07J66k46l4O7q7O5L57l05m20K79L91k23k50J12L0J80
$$ 240 -20 -15 273 102 -131 76 242 -4 -38 29 -58 7 364 59 -361 -82 309 86 -164 -52 -22 158
3270A58K09m72m94N70O72l37n43K24L18R5j45l21j34N78M97n87o35M22L84j12
$$ 158 367 -105 -599 -29 643 306 -237 -13 305 400 255 -66 -200 378 875 288 -347 75 459 347
3290C47j18m6o7K78J13n36l00O12L43m22k10K17J20j46p1q0J9N11qo75k41N69
$$ 347 229 183 116 394 507 -29 -329 283 626 204 -6 211 331 185 114 34 53 564 556 -119 -360 209
3312B09J16k22q8l8K1K32r5o57k9O12K25n99k36P5J36K02j7o10j20P35K68o85
$$ 209 325 103 15 -23 -2 230 135 -522 -551 61 286 -313 -549 -474 -338 -136 -153 -763 -883 -148 120 -565
3334e65l59K60M01J54j09m56k55P26L35n29l95L40J88J70j1l41j17N47K17l57
$$ -565 -924 -664 -263 -109 -218 -674 -929 -203 132 -397 -792 -452 -264 -94 -105 -446 -563 -16 201 -156
3354a56j72M24N1k49J10J33j25J97Q1k27J11L78j95l72J16M74r9k56q5L4K25K06
$$ -156 -328 96 147 -102 8 141 16 213 294 67 178 556 361 -11 105 579 480 224 139 173 398 604
3376F04l33n56L68N54k48n21k0J70J81K21l58n20K81P46k13o20K7K92R4M5j09
$$ 604 271 -285 83 637 389 -132 -152 18 199 420 62 -458 -177 569 356 -264 -237 55 149 194 85
3397H5k49Q2L18m0m30J99K70k20q0J29k1m5R2j75k61L65L47m80l56M25K34k15
$$ 85 -164 -82 236 196 -234 -35 235 15 -65 64 43 -2 90 -85 -346 19 366 -114 -470 -45 189 -26
3419b6q3j49p6L68K40m26l90M78M07j53l26r9J36M14J18n28l40M45O07k93l54
$$ -26 -109 -258 -334 34 274 -152 -542 -64 343 190 -136 -235 -99 315 433 -95 -435 10 617 324 -30
3440c0m1J23M02K06m96n59N23N98k26m94P6J37J14M4k01k17L19L17m99l20K52
$$ -30 -71 52 454 660 164 -395 128 726 500 6 82 219 333 377 176 -41 278 595 96 -224 28
3461B8K33k66k9M8j97J67P2m78j66M58J73m78j45K00L3p5k9j14J04K86N8n51m3
$$ 28 261 -5 -34 14 -183 -16 56 -422 -588 -130 43 -435 -580 -380 -347 -422 -451 -565 -461 -175 -117 -668 -711
3484g11M47K4j10k6m%K20L8m84N3N93ql45L1K3pJ25J01k44M4M36m1n15J15L53
$$ -711 -264 -240 -350 -376 -380 -380 -160 -122 -606 -553 40 32 -313 -282 -259 -266 -141 -40 -284 -240 196 155 -360 -245 108
3509A08J1l8l9J3R2L30j23m73J20O47r3l56Q7pJ00J73q9l56J53M69k00m97J04
$$ 108 119 81 42 55 147 477 354 -119 1 648 555 199 286 279 379 552 463 107 260 729 529 32 136
3532A36L75q0j04j7k10K30L12k89n40L22M38j40k61j48k7J35K66k10n05L76M43
$$ 136 511 431 327 310 100 330 642 353 -187 135 573 433 172 24 -3 132 398 188 -317 59 502
3553E02k40m14J1J29J40J45k66l72K85N07l66n46J88M07N6p4k36k42K78L61k69
$$ 502 262 -152 -141 -12 128 273 7 -365 -80 427 61 -485 -297 110 166 92 -144 -386 -108 253 -16
3574a6l86K72K82j72j68Kr4N8K95k72k23K71Q6l40j05K48Q5o5p9%j27K58J21l49
$$ -16 -402 -130 152 -20 -188 -186 -280 -222 73 -199 -422 -151 -65 -405 -510 -262 -177 -242 -321 -321 -448 -190 -69 -418
3598d18p2M02K27k75j95J22nK92J23l59j04M10K05m00j58J93J36P1k5k75j26L96
$$ -418 -490 -88 139 -136 -331 -209 -214 78 201 -158 -262 148 353 -47 -205 -12 124 195 170 -105 -231 165
3620A65K09m67k16L19J42r1r4j97k6L97J23n31nL90M5k86o9J23N4J11pk65q0N39
$$ 165 374 -93 -309 10 152 61 -33 -230 -256 141 264 -267 -272 118 163 -123 -192 -69 -15 96 89 -176 -256 283
3644B83m7m27M4M44R6k49j25o1J37M03j23m69N1N81j8l15p3O7J05K53j46m57J36
$$ 283 236 -191 -147 297 393 144 19 -42 95 498 375 -94 -43 538 520 205 132 199 304 557 411 -46 90
3667I0M39m6m02M7J35q3J29l8m03Q9L86%m64N2J92q1n4K1j20k6K73L6l95K3L76
$$ 90 529 483 81 128 263 180 309 271 -132 -43 343 343 -121 -69 123 42 -12 9 -111 -137 136 172 -223 -200 176
3692A76j26j70Q7p8J06J50j68l41J85M20k06m32J12K87n5j18j29q3K26K58k29
$$ 176 50 -120 -33 -111 -5 145 -23 -364 -179 241 35 -397 -285 2 -53 -171 -300 -383 -157 101 -128
3713a28n45L34L98j84k87l7J20K33J23l58l28N35L13l92k25K35J51j9l9j28j99
$$ -128 -673 -339 59 -125 -412 -449 -329 -96 27 -331 -659 -124 189 -203 -428 -193 -42 -61 -100 -228 -427
3734d27L66K79l73k36L79J58j72o4Q7n4J68K07k88j64K62J66k71QJ41l9k3J35
$$ -427 -61 218 -155 -391 -12 146 -26 -90 -3 -57 111 318 30 -134 128 294 23 31 172 133 110 245
3756B45j23k10K79J90l70n3J72K7j5J5j28j22K83J82l51k85L45K28j94o9j06J
$$ 245 122 -88 191 381 11 -42 130 157 142 157 29 -93 190 372 21 -264 81 309 115 46 -60 -59
3778e9K69O7l93k22N38J74m16j76J73J62O2n5l09qL64P4l90m3L61Q4k88k4LM0
$$ -59 210 277 -116 -338 200 374 -42 -218 -45 117 179 124 -185 -193 171 245 -145 -188 173 257 -31 -55 -52 -12
3802a2K88j67k21K26L26k05m91J54M02N3m8j49j53J14L36j43l77R5L49j13j47
$$ -12 276 109 -112 114 440 235 -256 -102 300 353 305 156 3 117 453 310 -67 28 377 264 117
3823A17j02m3k2K84k7m22lK88k9k15K3qK5K78j26m18J4L79P5l46P3K2K4J38l7
$$ 117 15 -28 -50 234 207 -215 -218 70 41 -174 -151 -159 -134 144 18 -400 -386 -7 68 -278 -205 -183 -159 -21 -58
3848e8l36J02M13kn19P5L64jj69jj87K58K05k66l54L12M27j92l97jK18J23M7k33
$$ -58 -394 -292 121 119 -400 -325 39 38 -131 -132 -319 -61 144 -122 -476 -164 263 71 -326 -327 -109 14 61 -172
3872a72k77K20M18l73l59K94K57j21q5l5l2J01J93k01j60L57Q8l13j7K99J2l3
$$ -172 -449 -229 189 -184 -543 -249 8 -113 -198 -233 -265 -164 29 -172 -332 25 113 -200 -217 82 94 61
3894F1J60j01n7J08J52j87M0K79j33j31N0P9j41J93J26k05j66J78M2j68OO4j12
$$ 61 221 120 63 171 323 136 176 455 322 191 241 320 179 372 498 293 127 305 347 179 185 249 137
3917A37J40J46l65k58L36K46k21k16N3k1J33P3l16p7M67J49n32k53M47K01j96
$$ 137 277 423 58 -200 136 382 161 -55 -2 -23 110 183 -133 -210 257 406 -126 -379 68 269 73
3938G3j89m9R3L45q6m99P3N24J02m60j67K29J94P9k04l13N3N63r8n87J8L63K9
$$ 73 -116 -165 -72 273 187 -312 -239 285 387 -73 -240 -11 183 262 58 -255 -202 361 263 -324 -306 57 86
3961H6j31Nj55k8K58R1l81L3J63o6j21J39j9j89K07L2j25j04K01n8n5J48r1j21
$$ 86 -45 -40 -195 -223 35 126 -255 -222 -59 -125 -246 -107 -126 -315 -108 -76 -201 -305 -104 -162 -217 -69 -160 -281
3985b81J51J84k56l0L27qk81j5J51R3k0j02j96J30L47r3m95Q4M85J0l10n5j8K11
$$ -281 -130 54 -202 -232 95 87 -194 -209 -58 35 15 -87 -283 -153 194 101 -394 -310 175 185 -125 -180 -198 13
4009A3J45j81l09K20M14j06m57R4L33q2m2n7o6K33J28l53j72N01J39m59j42L66
$$ 13 158 -23 -332 -112 302 196 -261 -167 166 84 42 -15 -81 152 280 -73 -245 256 395 -64 -206 160
4031A60J87o0k58j38J35L64j3n17j21N12J02k03j87k3J50J93R6m04o7L31J10j26
$$ 160 347 287 29 -109 26 390 377 -140 -261 251 353 150 -37 -60 90 283 379 -25 -92 239 349 223
4053B23j21K0j00J24K62k31l34J83L39j21q6j34j34K39L33k48n36K50L35r4k35
$$ 223 102 122 22 146 408 177 -157 26 365 244 158 24 -110 129 462 214 -322 -72 263 169 -66
4074f6k7N6J92j1l29q2L15K28m76k32M03K21k93k31N2K43K82j98n69K5O38J44
$$ -66 -93 -37 155 144 -185 -267 48 276 -200 -432 -29 192 -101 -332 -280 -37 245 47 -522 -497 141 285
4096B85n16j94L70J83p3j90j97K36L73j44m66O0M13p4k18J31Qj31M0m4L5M1Q6
$$ 285 -231 -425 -55 128 55 -135 -332 -96 277 133 -333 -273 140 66 -152 -21 -13 -144 -104 -148 -113 -72 14
4119A4k74j43M30k4m37L4K50J10j29Mk30lL08M0k01M8O0j4p2J19J35j36lK37L
$$ 14 -260 -403 27 3 -434 -400 -150 -40 -169 -165 -395 -398 -90 -50 -251 -203 -143 -157 -229 -110 25 -111 -114 123 126
4144A26j00J9j56J94L10m4m94P0M71ll92l7K08K14j3l51k04K78M06k04n01J56
$$ 126 26 45 -111 83 393 349 -145 -75 396 393 1 -36 172 386 373 22 -182 96 502 298 -203 -47
4166d7M36j08k95LJ14K22L8m51k14N64K03l84l70L53K93q8k14j43P2M22R3m56
$$ -47 389 281 -14 -11 103 325 363 -88 -302 262 465 81 -289 64 357 269 55 -88 -16 406 499 43
4188D3l03N18J10j91r5K0L5K1P6j81p9K19K9j80lP0k48K3K52o0k74rJ43m3m4K8
$$ 43 -260 258 368 177 82 102 137 158 234 53 -26 193 222 42 39 109 -139 -116 136 76 -198 -207 -64 -107 -151 -123
4214a23j35N3J62p1l68R6L41j30r7M2N5MN7j18j14K82J61k83j84L19J70k28l9
$$ -123 -258 -205 -43 -114 -482 -386 -45 -175 -272 -230 -175 -171 -114 -232 -346 -64 97 -186 -370 -51 119 -109 -148
4237a48L9Q6J34n0l60JN04J7l97j24L89L1k58nJ3J34J46j62l22J50M04j83l79
$$ -148 -109 -23 111 61 -299 -298 206 223 -174 -298 91 122 -136 -141 -128 6 152 -10 -332 -182 222 39 -340
4260c40J64L38p3k54J6p2J84L43k72l76J84M07j95k03J17P1O8Q6j36j41J77J72
$$ -340 -176 162 89 -165 -149 -221 -37 306 34 -342 -158 249 54 -149 -32 39 107 193 57 -84 93 265
4282B65j58p3O3J7j16J82J23l39P2J60M4j94j0O8jJ94l2l89KL26L3k54n5J58N3
$$ 265 107 34 97 114 -2 180 303 -36 36 196 240 46 36 104 103 297 265 -124 -122 204 237 -17 -72 86 139
4307A39n3o2j09R5K82j43l16J40L32j24j93o4J29J76L3j96k11K43K86k19l79J94
$$ 139 86 24 -85 10 292 149 -167 -27 305 181 -12 -76 53 229 262 66 -145 98 384 165 -214 -20
4329b0K53q9j15m2nJ26P1j97j79K99J71k69j09J50Pj6K2m1j03J74rk75J22K34
$$ -20 233 144 29 -13 -18 108 179 -18 -197 102 273 4 -105 45 52 36 58 17 -86 88 79 -196 -74 160
4353A60j66k62J26J42j19j8Q0j79K1J81j12j56Q5N2q0K1J33j76j22K27R1j86n4
$$ 160 -6 -268 -142 0 -119 -137 -57 -236 -215 -34 -146 -302 -217 -165 -245 -224 -91 -267 -389 -162 -71 -257 -311
4376c11J07J3J14J9j77j68L63J74l28j04K15J68r8o6r4mL04M9l37l4L64R4l22
$$ -311 -204 -191 -77 -58 -235 -403 -40 134 -194 -298 -83 85 -13 -79 -173 -177 127 176 -161 -195 169 263 -59
4399e9l2J58L3J51p4k84P9L22q6l68Q2L42q1j10q8j2R1J51K0l15K0L21j55j64
$$ -59 -91 67 100 251 177 -107 -28 294 208 -160 -78 264 183 73 -15 -27 64 215 235 -80 -60 261 106 -58
4423e8J48m8J0J59q9j53Q8J51j00n3J55k1o7J23l6j56pJ61j1j31K6J03j04jM7
$$ -58 90 42 52 211 122 -31 57 208 108 55 210 189 122 245 209 53 46 207 196 65 91 194 90 89 136
4448A36o7r0K15l9k10k0J98j4j63N8o4k4J56J6l19K08J81p3k52J01R0o8J5K0j57
$$ 136 69 -21 194 155 -55 -75 123 109 -54 4 -60 -84 72 88 -231 -23 158 85 -167 -66 24 -44 -29 -9 -166
4473a66J16K46j82k71J49J80j39o1J33p3qQ9j99n3K17R1j94j36J66J10j77R8j44
$$ -166 -50 196 14 -257 -108 72 -67 -128 5 -68 -76 13 -186 -239 -22 69 -125 -261 -95 15 -162 -64 -208
4496b08j31L38M8k86j03J89J03q5n8L2r0J54K3j75j09K36J29j62p6J42n0M6Q0
$$ -208 -339 -1 47 -239 -342 -153 -50 -135 -193 -161 -251 -97 -74 -249 -358 -122 7 -155 -231 -89 -139 -93 -13
4519a3p5r5J70J59k00j10J96KlN1o8p1K08P7k81m0K30O0k15O6l3l4J89K4k07j05
$$ -13 -88 -183 -13 146 -54 -164 32 34 31 82 14 -57 151 228 -53 -93 137 197 -18 48 15 -19 170 194 -13 -118
4545a18K94K9j72kJ47j01N7R5j55m2K06N8k47m4K42J0j48J15p3j03J78L7k76P3
$$ -118 176 205 33 31 178 77 134 229 74 32 238 296 49 5 247 257 109 224 151 48 226 263 -13 60
4569F0K06p9k18Q5M1k5N5M5j69p4K76l8k79K3J48j8n0Lo3q5K24k6k06N0K49r3
$$ 60 266 187 -31 54 95 70 125 170 1 -73 203 165 -114 -91 57 39 -11 -8 -71 -156 68 42 -164 -114 135 42
4595D2j38M7j5K0J02o4j46R0J84j13k38O7J62o9O0j36o9Q2K03j24k70K03J84j40
$$ 42 -96 -49 -64 -44 58 -6 -152 -62 122 9 -229 -162 0 -69 -9 -145 -214 -132 71 -53 -323 -120 64 -76
4619g6n4J1o1Q3J17j16j57J22J66r0j87J40K2l1J32p8j29P7J73j20j10J39M3n0
$$ -76 -130 -119 -180 -97 20 -96 -253 -131 35 -55 -242 -102 -80 -111 21 -57 -186 -109 64 -56 -166 -27 16 -34
4643c4J5mj11M9K25j05j79J41Q6j08o4K3M1j7R9j61p6J83J18j38j99K37L1q2M3
$$ -34 -19 -23 -134 -85 140 35 -144 -3 83 -25 -89 -66 -25 -42 57 -104 -180 3 121 -17 -216 21 52 -30 13
4668A3j10n2K41J20k46j22K39J68j72p1L1J8J35L3k00q0K60O4k11j4J29k9jO7
$$ 13 -97 -149 92 212 -34 -156 83 251 79 8 39 57 192 225 25 -55 205 269 58 44 173 144 143 210
4692B10j06lJ41j4j52K0J61p9j49Q6J01r6j9N1j76M2J24j5k26J00O1p1M5K6j68
$$ 210 104 101 242 228 76 96 257 178 29 115 216 120 101 152 -24 18 142 127 -99 1 62 -9 36 62 -106
4717a06M3K04rk50K7J20J1l4Q2j88l1K27Pk50J3K32M3j39J3j08j4J38J4k95N2
$$ -106 -63 141 132 -118 -91 29 40 6 88 -100 -131 96 103 -147 -134 98 141 2 15 -93 -107 31 45 -250 -198
4742a98K56Rk63O4Ol6O0n1j04J61P1j01j82P7J60q7j03J23RJ1J26j25j43J72K11
$$ -198 58 67 -196 -132 -126 -162 -102 -153 -257 -96 -25 -126 -308 -231 -71 -158 -261 -138 -129 -118 8 -117 -260 -88 123
4767A23j71j96J70N8q8Q8k1q6J73R1j78j83K29Q6l7j12R0q5J7J86j38p5M7J96
$$ 123 -48 -244 -74 -16 -104 -16 -37 -123 50 141 -37 -220 9 95 58 -54 36 -49 -32 154 16 -59 -12 184
4791A84j58m1N6j02L2J91j31j41R5J66j12q0R8j2p0K09j02j45J85J21k30LJ38
$$ 184 26 -15 41 -61 -29 162 31 -110 -15 151 39 -41 57 45 -25 184 82 -63 122 243 13 16 154
4814A54J0m9j5Q9j08N2J00j93k8K81m3j54m6Q9M2J8Qk49K5K22J07l23j04K37R4
$$ 154 164 115 100 189 81 133 233 40 12 293 250 96 50 139 181 199 207 -42 -17 205 312 -11 -115 122 216
4839B16j30k3o8k7J55K0k10l1K30k5j35NK7p0N0J16j40m4R4j8j71J13J11j54r
$$ 216 86 63 -5 -32 123 143 -67 -98 132 107 -28 -23 4 -66 -16 100 -40 -84 10 -8 -179 -66 45 -109 -118
4864a18Q9lj30K08q6j28L6K22j36j68P2M4k3J36J3k40PK37n2k23O2J03jQ1r4j26
$$ -118 -29 -32 -162 46 -40 -168 -132 90 -46 -214 -142 -98 -121 15 28 -212 -205 32 -20 -243 -181 -78 -79 2 -92 -218
4890b18M9K79j33j94J07O6K5r4lm0K7K00j32j03L2J67j32mO7O4p7P4k4j12J33
$$ -218 -169 110 -23 -217 -110 -44 -19 -113 -116 -156 -129 71 -61 -164 -132 35 -97 -101 -34 30 -47 27 3 -109 24
4915B4J62j58j34K51J1j55N1j3lK0J11j17j65K63j1j13J8Q9m9P9Kj05j20J80R0
$$ 24 186 28 -106 145 156 1 52 39 36 56 167 50 -115 148 137 24 42 131 82 161 163 58 -62 118 208
4940B08q6j24Q4M5L5pm2j88J54J65j67j25J50Q8j06pl4m6Q3P8j19j62K28P4j23
$$ 208 122 -2 82 127 162 155 113 -75 79 244 77 -48 102 190 84 77 43 -3 80 158 39 -123 105 179 56
4965E6m6J36l0m8M0q0p4K15K4k49J5O6J11j31k3Pn1O2N3j68n8J55J6j23L2J42
$$ 56 10 146 116 68 108 28 -46 169 193 -56 -41 25 136 5 -18 -11 -62 0 53 -115 -173 -18 -2 -125 -93 49
4991D9r3PP3p1p2J10l3j20J7J32q1LQ3j25k8J76o6j02l2J58K7r2j3J3q4J18P1
$$ 49 -44 -37 36 -35 -107 3 -30 -150 -133 -1 -82 -79 4 -121 -149 27 -39 -141 -173 -15 12 -80 -93 -80 -164 -46 25
5018B5k47K6K18mj48j2L8p5J92J4j99o1K26M1j75l2J71j08J32o3p0M4N9P0j45
$$ 25 -222 -196 22 18 -130 -142 -104 -179 13 27 -172 -233 -7 34 -141 -173 -2 -110 22 -41 -111 -67 -8 62 -83
5043h3M3J55j12j44J06Q1nO5j24k8J35J76j27j83P1R2m6O0l6l9N7J87r8l19J86
$$ -83 -40 115 3 -141 -35 46 41 106 -18 -46 89 265 138 -45 26 118 72 132 96 57 114 301 203 -116 70
5068G0J66p8q7M0ml4J43o3j99P7K26j07p1K0m9J6J33q0r7k4J07m1n8J09O0j74
$$ 70 236 158 71 111 107 73 216 153 -46 31 257 150 79 99 50 66 199 119 22 -2 105 64 6 115 175 1
5094AN0P6j12L6K5j25m1J87J07k19j05L8J48M9j0j87n4J95P3j82q6R5J04m8jp9
$$ 1 51 127 15 51 76 -49 -90 97 204 -15 -120 -82 66 115 105 -82 -136 59 132 -50 -136 -41 63 15 14 -65
5120f5r8R3J73j76r7J56jq7k1R9r9LJ36j34j09J13M8q2O0K3o7k6Q2pr8J66l0j62
$$ -65 -163 -70 103 -73 -170 -14 -15 -102 -123 -24 -123 -120 16 -118 -227 -114 -66 -148 -88 -65 -132 -158 -76 -83 -181 -15 -45 -207
5148b07L1J78j4j82P1J5j7J50j2k04l4J93P3j82RJ01k9N0nq5o0J67N7j63oJ79
$$ -207 -176 2 -12 -194 -123 -108 -125 25 13 -191 -225 -32 41 -141 -132 -31 -60 -10 -15 -100 -160 7 64 -99 -105 74
5174G4p1NM2j5o4J56k3j72J07J22k2j56N2P0J8J7o1j27J27Q5p7j45J46J69j11
$$ 74 3 8 50 35 -29 127 104 -68 39 161 139 -17 35 105 123 140 79 -48 79 164 87 -58 88 257 146
5199A46l9n8o7J87P5j38j82J46J06m7m7mr2NJ82M4j80q4Q2N4n9L6o9l0J23n9m8
$$ 146 107 49 -18 169 244 106 -76 70 176 129 82 78 -14 -9 173 217 37 -47 35 89 30 66 -3 -33 90 31 -17
5226a7k3J43j29m5R2J05j33kJ2n3M5J45j05k28J65J68j08n4J8j06Q0J24j52j11
$$ -17 -40 103 -26 -71 21 126 -7 -9 3 -50 -5 140 35 -193 -28 140 32 -22 -4 -110 -30 94 -58 -169
5250a69J85J00j87r8P5P3M8n1r8p7J00R6q8j33J42pm1P3Nj87P6J26j19M5J11j03
$$ -169 16 116 -71 -169 -94 -21 27 -24 -122 -199 -99 -3 -91 -224 -82 -89 -130 -57 -52 -239 -163 -37 -156 -111 0 -103
5276a03j46J06J83j05o0K0L9k0J09o7q0j4K14J4j35m3J1J6Q8M7j50mJ62m2p3j7
$$ -103 -249 -143 40 -65 -125 -105 -66 -86 23 -44 -124 -138 76 90 -45 -88 -77 -61 27 74 -76 -80 82 40 -33 -50
5302e0k7K2J67J3k13l9J75P3j47o2K4N5J7P8q4j00J93j9m1n0J22lp6N9k2L5P5
$$ -50 -77 -55 112 125 -88 -127 48 121 -26 -88 -64 -9 8 86 2 -98 95 76 35 -15 107 104 28 87 65 100 175
5329A75r3r5J17K22j29j84L2J34l4M8j34q6J23K03r0k33J00J17r5P8l3j06P2N1
$$ 175 82 -13 104 326 197 13 45 179 145 193 59 -27 96 299 209 -24 76 193 98 176 143 37 109 160
5353A60o0m6k5J06m8k9k3l1o0J06P9k35O6M2J0n2P6j27l0N7J12j31o4J52p8m2
$$ 160 100 54 29 135 87 58 35 4 -56 50 129 -106 -40 2 12 -40 36 -91 -121 -64 48 -83 -147 5 -73 -115
5379a15J20L5j42k2Q2m0O8j5j14p1J16J78j04j59Q6N9o1K5p8p3J49J26j82p1J10
$$ -115 5 40 -102 -124 -42 -82 -14 -29 -143 -214 -98 80 -24 -183 -97 -38 -99 -74 -152 -225 -76 50 -132 -203 -93
5404i3O7q0J3k5J3R1J0j01o4K19k5j28%J07j0K9o1qJ5J25l8j52N0J17k7r7P1p0
$$ -93 -26 -106 -93 -118 -105 -14 -4 -105 -169 50 25 -103 -103 4 -6 23 -38 -46 -31 94 56 -96 -46 71 44 -53 18 -52
5432e2mJ80m9j52J8J56O1j99Q6J8p1Q5R6j73r6J45J08j18o5N2N3O5k6n9j56K02
$$ -52 -56 124 75 -77 -59 97 158 -41 45 63 -8 77 173 0 -96 49 157 39 -26 26 79 144 118 59 -97 105
5458A05O1k13%J68p7M3Nr8%J84k3j60m0J84J5j31M1jLM3N6j78P2J19k8j74O4Q4
$$ 105 166 -47 -47 121 44 87 92 -6 -6 178 155 -5 -45 139 154 23 64 63 66 109 165 -13 59 178 150 -24 40 124
5486A24Pr2L3k0K5J03r7j48J12O7m4j16R1R2j30M7j6p0L5R4j13j34J36J36k38
$$ 124 131 39 72 52 77 180 83 -65 47 114 70 -46 45 137 7 54 38 -32 3 97 -16 -150 -14 122 -116
5511a16Q7l9o8P3K8p6p4P9J20j00m3M4j01M1L7k4m1J0J09n8o1K6KM7R3j23p6J08
$$ -116 -29 -68 -136 -63 -35 -111 -185 -106 14 -86 -129 -85 -186 -145 -108 -132 -173 -163 -54 -112 -173 -147 -145 -98 -5 -128 -204 -96
5539i6J11p8j41M6J07nJ0j0j19J50N4n9j39J82P0j00k6J28m9N9jj07p1K17N9j96
$$ -96 15 -63 -204 -158 -51 -56 -46 -56 -175 -25 29 -30 -169 13 83 -17 -43 85 36 95 94 -13 -84 133 192 -4
5565do6J48J7j0pr9L1J51P4j90o7J70K5q9L2k7mL2O1p3n4J06j6q8J6Q2r3o5J41
$$ -4 -70 78 95 85 78 -21 10 161 235 45 -22 148 173 84 116 89 85 117 178 105 51 157 141 53 69 151 58 -7 134
5594A34l7j2mL8j16K9Q5j01j04J13N9j50J12Pn8m3J31l6m9n3K3L3MQ2j95j1J94
$$ 134 97 85 81 119 3 32 117 16 -88 25 84 -66 46 53 -5 -48 83 47 -2 -55 -32 1 5 87 -108 -119 75
5621G5n0j05oR0Mj6l1q5P8R4J6j82k1J90L7j75O8MJQ1n7j29J17J05q3j41J18P2
$$ 75 25 -80 -86 4 8 -8 -39 -124 -46 48 64 -118 -139 51 88 -87 -19 -15 -14 67 10 -119 -2 103 20 -121 -3 69
5649F9r0l3pJ1M8K3n4q9J20J9q5l6P4m1l6J01j27l0Q8N3j23j6R9n7K1J3J0q5P
$$ 69 -21 -54 -61 -50 -2 21 -33 -122 -2 17 -68 -104 -30 -71 -107 -6 -133 -163 -75 -22 -145 -161 -62 -119 -98 -85 -75 -160 -153
5678a53K33j06j06kM6L0jL9j35L3K06o2q6J1N2j9N2l8k7M6Q7k1j38M2J60j39l1
$$ -153 80 -26 -132 -134 -88 -58 -59 -20 -155 -122 84 22 -64 -53 -1 -20 32 -6 -33 13 100 79 -59 -17 143 4 -27
5705b7J07O3k9K4m8q8P5P2j40j4J42k5no1J50j11M4Kj54O1J99Rk27Q0J21o9K5
$$ -27 80 143 114 138 90 2 77 149 9 -5 137 112 107 46 196 85 129 131 -23 38 237 246 19 99 220 151 176
5732A76j28L3p4J42L9j27J1L0k2l7L5J1n4j1P9l7r4J21r9r7R7K4j40J9O4o3r0
$$ 176 48 81 7 149 188 61 72 102 80 43 78 89 35 24 103 66 -28 93 -6 -103 -6 18 -122 -103 -39 -102 -192
5759a92J73l0l8J7K0r6MJ14q3q2J86j4j90R9J03pn3K6k6j4J72n0j75M8J10N5j29
$$ -192 -19 -49 -87 -70 -50 -146 -142 -28 -111 -193 -7 -21 -211 -112 -9 -16 -69 -43 -69 -83 89 39 -136 -88 22 77 -52
5786e2PJ50j15M5J6j46K9J35m8j93J03J06p8k2k7k0N7Q2o2j44J34K1Ro8P2j5m6
$$ -52 -45 105 -10 35 51 -95 -66 69 21 -172 -69 37 -41 -63 -90 -110 -53 29 -33 -177 -43 -22 -13 -81 -9 -24 -70
5813g0LL9J7k2Q1j22O3L9Q7o6o6R3l0k3O0M8j18R4jq7J9N5n7J2J51j01j21L3Q9
$$ -70 -67 -28 -11 -33 48 -74 -11 28 115 49 -17 76 46 23 83 131 13 107 106 19 38 93 36 48 199 98 -23 10 99
5842I9q8k4J8j0j1N9n4m1O0Q6j52M4J0O5n2L9m2j8P2R1j21n7Q2N8r0o7J56Mk5
$$ 99 11 -13 5 -5 -16 43 -11 -52 8 94 -58 -14 -4 61 9 48 6 -12 60 151 30 -27 55 113 23 -44 112 116 91
5871I1L0r0K4J43k4j64k4J73rr8QQ0j47N9Rj21K5J73j39j27J02O3r3N6lj36%M0
$$ 91 121 31 55 198 174 10 -14 159 150 52 60 140 -7 52 61 -60 -35 138 -1 -128 -26 37 -56 0 -3 -139 -139 -99
5899i9Oo1K6P7l3j0J27j26r0J23O0j02N2K3K5r4N0J5j14J37M8j26k7J10Ko1K0
$$ -99 -93 -154 -128 -51 -84 -94 33 -93 -183 -60 0 -102 -50 -27 -2 -96 -46 -31 -145 -8 40 -86 -113 -3 -1 -62 -42
5926d2p9mQ9K7j22P1Q0j4p9k2J22n6Ll0k2K1R9m6p2J2J45m9p9K4K1oQ9m8r7N3
$$ -42 -121 -125 -36 -9 -131 -60 20 6 -73 -95 27 -29 -26 -56 -78 -57 42 -4 -76 -64 81 32 -47 -23 -2 -8 81 33 -64 -11
5956a1J12o0q4J29n7l4M6J6K6l9M0K6j17Q5m4qO2Q2j84M9K9Q0r7K9J0o7M7mJ4
$$ -11 101 41 -43 86 29 -5 41 57 83 44 84 110 -7 78 34 26 88 170 -14 35 64 144 47 76 86 19 66 62 76
5985G6q7L6M3r5R9Q2j25q9J01nj6O1j3q4L5O5m2q9J44jj15N0j4L1pO9j09q8J49
$$ 76 -11 25 68 -27 72 154 29 -60 41 36 20 81 68 -16 19 84 42 -47 97 96 -19 31 17 48 41 110 1 -87 62
6014F2K3j28K8N0k0o8M2l1p8J46K0q8k8J5O3j07k3M4k1QQ9p6q8J18J9o0j3O7k0
$$ 62 85 -43 -15 35 15 -53 -11 -42 -120 26 46 -42 -70 -55 8 -99 -122 -78 -99 -91 -2 -78 -166 -48 -29 -89 -102 -35 -55
6043e5m3O0l6o1J23L8j35k3P3l8PK2L7p2K1M2j1PJ38o7r1L8OK5Kqo1KJ85j19p9
$$ -55 -98 -38 -74 -135 -12 26 -109 -132 -59 -97 -90 -68 -31 -103 -82 -40 -51 -44 94 27 -64 -26 -20 5 7 -1 -62 -60 125 6 -73
6074g3KJ06k8jk1N1o6P7N4j80J22K7j8%L2j8k9J7J6j63P4J47n2q9O4n4k7Q1J1
$$ -73 -71 35 7 6 -15 36 -30 47 101 -79 43 70 52 52 84 66 37 54 70 -93 -19 128 76 -13 51 -3 -30 51 62
6103F2m0o5Q5Kn3R4L6j37L4M6l3l1R5p4J7j4J00n0n1O3n0M5m9L4q8J21Po8n3P9
$$ 62 22 -43 42 44 -9 85 121 -16 18 64 31 0 95 21 38 24 124 74 23 86 36 81 32 66 -22 99 106 38 -15 64
6133F4k4KLL4j34P9K8j2p7N9J10j61lP0m7K4%o3QJ6%j8j6N9n7j9O3l0l5M2J8q1
$$ 64 40 42 45 79 -55 24 52 40 -37 22 132 -29 -32 38 -9 15 15 -48 -40 -24 -24 -42 -58 1 -56 -75 -12 -42 -77 -35 -17 -98
6165i8n2J05nr3j0P0OJ0N4j48K5N7J2p4m1J56j04L9K3mq2Q7M4o5OJm4J2R5o4j4
$$ -98 -150 -45 -50 -143 -153 -83 -77 -67 -13 -161 -136 -79 -67 -141 -182 -26 -130 -91 -68 -72 -154 -67 -23 -88 -82 -81 -125 -113 -18 -82 -96
6196i6J09M2j02q2J45J9r9L5R7j06M0Q4j05l9J76j09j0l6J23m6J0j4q6Q3J48r7
$$ -96 13 55 -47 -129 16 35 -64 -29 68 -38 2 86 -19 -58 118 9 -1 -37 86 40 50 36 -50 33 181 84
6222H4p4O8Q4j1r9L3q3P0J00k1j33J12N9j33K5O0m2r4O6l4jK7Qn2m0J81l5j04
$$ 84 10 78 162 151 52 85 2 72 172 151 18 130 189 56 81 141 99 5 71 37 36 63 71 19 -21 160 125 21
6250B1o3O2J4L1M4j04p8J37k5q3j7P6k3J5J3r9L8N1L9r3n2O1L7K3q4Q7j00L8J90
$$ 21 -42 20 34 65 109 5 -73 64 39 -44 -61 15 -8 7 20 -79 -41 10 49 -44 -96 -35 2 25 -59 28 -72 -34 156
6279A56j63k9k3P1n6M6nl7m3P9j9j12J29j8m4o0J24m7p7J00n1m2J27L9j48k0Q0
$$ 156 -7 -36 -59 12 -44 2 -3 -40 -83 -4 -23 -135 -6 -24 -68 -128 -4 -51 -128 -28 -79 -121 6 45 -103 -123 -43
6306d3N4o6P2j27K0O6L5K8j97J51N0j08O0k7kPM3j8l2L6M0j07M6L2Nj0k3l8K8
$$ -43 11 -55 17 -110 -90 -24 11 39 -158 -7 43 -65 -5 -32 -34 -27 16 -2 -34 2 42 -65 -19 13 18 8 -15 -53 -25
6335b5L9O7j78Q2N8l9l1k6O5j35J36n2NL7K0J6o9j7J83p2Q2k9q0j2O9P5q6n3L2
$$ -25 14 81 -97 -15 43 4 -27 -53 12 -123 13 -39 -34 3 23 39 -30 -47 136 64 146 117 37 25 94 169 83 30 62
6364F2L3M6j3k1l9M3J17j65O5Rn3m8J5P4o0J4j7l6J7o2M2o6J14qn6p7P9l8Q6m3
$$ 62 95 141 128 107 68 111 228 63 128 137 84 36 51 125 65 79 62 26 43 -19 23 -43 71 63 7 -70 9 -29 57 14
6394A4k7n8R1J0j8q2N4n1M9M1j1q2K9R9m7p7N4J8r6J53n0j14l0J41J7p2P5q7L2
$$ 14 -13 -71 20 30 12 -70 -16 -67 -18 23 12 -70 -41 58 11 -66 -12 6 -90 63 13 -101 -131 10 27 -45 30 -57 -25
6423b5k8K4l9M9M5m2k4kN4n6j00Q4p2L6LR9j08J05K4j36j1J31k6m2O6j18R4j7
$$ -25 -53 -29 -68 -19 26 -16 -40 -42 12 -44 -144 -60 -132 -96 -93 6 -102 3 27 -109 -120 11 -15 -57 9 -109 -15 -32
6451c2R2j40l6J30O5r2m3O4m3K6J8J4j14K6J20j25P4m3L8o4J22l4kk0L4n1lJ10
$$ -32 60 -80 -116 14 79 -13 -56 8 -35 -9 9 23 -91 -65 55 -70 4 -39 -1 -65 57 23 21 1 35 -16 -19 91
6479I1j37qN8pK9j1jL6l0K6k2m5J02jKJ0j2n2K7R8k4o0M3qL6n1M1n3p2J03Qj15
$$ 91 -46 -54 4 -3 26 15 14 50 20 46 24 -21 81 80 82 92 80 28 55 153 129 69 112 104 140 89 130 77 5 108 116 1
6511AM4K3Jk4RMn2M1j3k2j5J21q4l3J1K1n9%lK5L9Mm6j20P1J16p3o8P6Kp5M8J4
$$ 1 45 68 69 45 54 58 6 47 34 12 -3 118 34 1 12 33 -26 -26 -29 -4 35 39 -7 -127 -56 60 -13 -81 -5 -3 -78 -30 -16
6544a6n6RP3j2q0N3p3j5M3Q3p4m6J07j08j6J35r4jN8Qj35P3L7m7LM7K0J2j0n3
$$ -16 -72 -63 10 -2 -82 -29 -102 -117 -74 9 -65 -111 -4 -112 -128 7 -87 -88 -30 -22 -157 -84 -47 -94 -91 -44 -24 -12 -22 -75
6574g5M8j9R1j06k2O6N7l9p8J16k7l9O2m7L3m6R4l8j37J53O2r1J5K0l1m9J45j16
$$ -75 -27 -46 45 -61 -83 -17 40 1 -77 39 12 -27 35 -12 21 -25 69 31 -106 47 109 18 33 53 22 -27 118 2
6602BJ8k3M8m5%N1r0M8O8n3M4l2Ok2K5M2l4o4O3N4l7Jl0l0k7J47Kr6j8N5k3L8
$$ 2 20 -3 45 0 0 51 -39 9 77 24 68 36 42 20 45 87 53 -11 52 106 69 70 40 10 -17 130 132 36 18 73 50 88
6634H8om5p6J30K0r0L4J4p0J13j3n9j01J00O3j23J2L7j5K7L0j8r4L1J13j17j0
$$ 88 82 37 -39 91 111 21 55 69 -1 112 99 40 -61 39 102 -21 -9 28 13 40 70 52 -42 -11 102 -15 -25
6661b5R5o5o3RR7j9k8on2N1N1j57J0Q6P0k9o8L4n8J9K3kj4k7J18p5l1j8J0J9K9
$$ -25 70 5 -58 -49 48 29 1 -5 -57 -6 45 -112 -102 -16 54 25 -43 -9 -67 -48 -25 -27 -41 -68 50 -25 -56 -74 -64 -45 -16
6692a6l7o1J2L7L0j03M7L5k9K3O1j41O8L6oj7PL4l9M1K%l2Q2n0l1P4R3p8p3P2
$$ -16 -53 -114 -102 -65 -35 -138 -91 -56 -85 -62 -1 -142 -74 -38 -44 -61 -54 -20 -59 -18 -16 -16 -48 34 -16 -47 27 120 42 -31 41
6723D1n5N6L8j5m0L4L8m9j1k1P3j07M7J5k0N0M2o2q1R7k4po5R9n1K6K2j1j26J12
$$ 41 -14 42 80 65 25 59 97 48 37 16 89 -18 29 44 24 74 116 54 -27 70 46 39 -26 73 22 48 70 59 -67 45
6753D5Qp2m7J62o9p8J26n6n8J5L2m4L6J4Mq6R8l6K0n6R5p0N9j2J2Lj7J3J0r3L7
$$ 45 53 -19 -66 96 27 -51 75 19 -39 -24 8 -36 0 14 18 -68 30 -6 14 -42 53 -17 42 30 42 45 28 41 51 -42 -5
6784eK8j2J04m1r9K8N3n0j5Q0Jj03J6P7j3o6N8J4j14P4qj8N8n6j4PJ6M4j43K5
$$ -5 23 11 115 74 -25 3 56 6 -9 71 72 -31 -15 62 49 -17 41 55 -59 15 7 -11 47 -9 -23 -16 0 44 -99 -74
6814g4K5J7L0K8q5N5l4l2j5k9N9o2M7PK0q0O1l6m3O5jnq4kQ5j4P%K2ML9j7r5N7
$$ -74 -49 -32 -2 26 -59 -4 -38 -70 -85 -114 -55 -117 -70 -63 -43 -123 -62 -98 -141 -76 -77 -82 -166 -168 -83 -97 -90 -90 -68 -64 -25 -42 -137 -80
6848h0M9n1M2K3m9nR6M2j16R1L5J7j26L3qJ9NmM3k5R6l8q6M0O9o9ojL8oO5p2L8
$$ -80 -31 -82 -40 -17 -66 -71 25 67 -49 42 77 94 -32 1 -7 12 17 13 56 31 127 89 3 43 112 43 37 36 74 68 133 61 99
6881I9N8K8r1m2O3K9m0lO2j01K3N5k3p6M7L3n4K2J8l7L7n9K7n7P3Mj12L3O0o0
$$ 99 157 185 94 52 115 144 104 101 163 62 85 140 117 41 88 121 67 89 107 70 107 48 75 18 91 95 -17 16 76 16
6911A6M8k2p0k4J09j03l7L6J1o0Qj5J4m4R1M6j44J01Lnm6m8M8j1R1jj64Q6R2q1
$$ 16 64 42 -28 -52 57 -46 -83 -47 -36 -96 -88 -103 -89 -133 -42 4 -140 -39 -36 -41 -87 -135 -87 -98 -7 -8 -172 -86 6 -75
6941g5o7O0J4l2L5N2l1P7m8k1n4R3L4n0M6p5J7OR1nr9P0Rj7p4K7M3l3M6L6j06
$$ -75 -142 -82 -68 -100 -65 -13 -44 33 -15 -36 -90 3 37 -13 33 -42 -25 -19 72 67 -32 38 47 30 -44 -17 26 -7 39 75 -31
6972c1L8Q2q1o2R7m9k3rL2Q8n4J8k9k7M3m6M0l5K0k6m0O2J0m7kJ6k9L9j8j9MP2
$$ -31 7 89 8 -54 43 -6 -29 -38 -6 82 28 46 17 -10 33 -13 27 -8 12 -14 -54 8 18 -29 -31 -15 -44 -5 -23 -42 -38 34
7004C4m3j02J32O3o2m3M2K4r9N9kn1L9R3m7j3L8L7k6m6Q4o2L1k2N1q5N4K1k1l5
$$ 34 -9 -111 21 84 22 -21 21 45 -54 5 3 -48 -9 84 37 24 62 99 73 27 111 49 80 58 109 24 78 99 78 43
7034D3K6n3NN7J1k7m0K6Jmj6K1p2Q5mn4j9M0nm5OL0m4m9Q6l4k6P7n7mrO2j13K8
$$ 43 69 16 21 78 89 62 22 48 49 45 29 50 -22 63 59 5 -14 26 21 -24 -18 12 -32 -81 5 -29 -55 22 -35 -39 -48 14 -99 -71
7068g1N2n8J8J2p4J6J6K6m2j7R8l5o5J03K6p6jJ05j23PM5k0Mm5R5o3K1J4pk5J13
$$ -71 -19 -77 -59 -47 -121 -105 -89 -63 -105 -122 -24 -59 -124 -21 5 -71 -72 33 -90 -83 -38 -58 -54 -99 -4 -67 -46 -32 -39 -64 49
7099D9r5j9M2P6k0r6N9L2p0P4n1qj3L7Q0j38L6N0k8J5P6k8m4P0l8K6r3Q3r1K1
$$ 49 -46 -65 -23 53 33 -63 -4 28 -42 32 -19 -27 -40 -3 77 -61 -25 25 -3 12 88 60 16 86 48 74 -19 64 -27 -6
7129fJ24j03K5J6oJ0J5l1k9l3M5M2l1j4J22j49J0O8o1m1J23r6K2J6N8j09kN3J2
$$ -6 118 15 40 56 50 60 75 44 15 -18 27 69 38 24 146 -3 7 75 14 -27 96 0 22 38 96 -13 -15 38 50
7158E0n4Q9kj49J00rj1LQ5q4n4J35m3k8q2M7k7K1k3Ol0M2L1j5k0QL7n0j8O8n4
$$ 50 -4 85 83 -66 34 25 14 17 102 18 -36 99 56 28 -54 -7 -34 -13 -36 -30 -60 -18 13 -2 -22 -14 23 -27 -45 23 -31
7189c1NM5o2M5jL4j20QJ16n7J7R8j24L7n1R5j23nQ7n0j3K8k3k8L7L7l3l4M6j4
$$ -31 -26 19 -43 2 1 35 -85 -77 39 -18 -1 97 -27 10 -41 54 -69 -74 13 -37 -50 -22 -45 -73 -36 1 -32 -66 -20 -34
7219c4j8jK4k8LJ31j10q0J05M3m4j04Q3mK2L7k6j06Q7J27j59j7Q4k1K7N5q3l9
$$ -34 -52 -53 -29 -57 -54 77 -33 -113 -8 35 -9 -113 -30 -34 -12 25 -1 -107 -20 107 -52 -69 15 -6 21 76 -7 -46
7247d6N1O7o4n6Q1J1j05R4J7o1O1pm4Q3n5K4p3Q5N1j02M8K7r2J2J18o3j06O5L5
$$ -46 5 72 8 -48 33 44 -61 33 50 -11 50 43 -1 82 27 51 -22 63 114 12 60 87 -5 7 125 62 -44 21 56
7276E6Op5N3P1q0L8L5j49N5P5l2n6O1k0pL2j9o0n4J88j09K9rJ8l3jJ8m9j6P5k6
$$ 56 62 -13 40 111 31 69 104 -45 10 85 53 -3 58 38 31 63 44 -16 -70 118 9 38 29 47 14 13 31 -18 -34 41 15
7307A5l5J9Pm7l2O2oN0l9j0J7j9L0k5l3N9J5o0Qk9K1k0J05o5r3Q1l8JL6mn9J8
$$ 15 -20 -1 6 -41 -73 -11 -17 33 -6 -16 1 -18 12 -13 -46 13 28 -32 -24 -53 -32 -52 53 -12 -105 -24 -62 -61 -25 -29 -88 -70
7339g0K5J5oL3L5j19K6L6jq4K7M9j5J7n0K6k1R1k6q5L7lO2K9r1P2o8M0M8n9K7
$$ -70 -45 -30 -36 -3 32 -87 -61 -25 -26 -110 -83 -34 -49 -32 -82 -56 -77 14 -12 -97 -60 -63 -1 28 -63 9 -59 -19 29 -30 -3
7370cK3Jk3Jj7N8m2Q4o9J7J6J4l5K1l8l0J06K3r6pO6l5j07J35L4j14J7M6nk3L2
$$ -3 20 21 -2 -1 -18 40 -2 82 13 30 46 60 25 46 8 -22 84 107 11 4 70 35 -72 63 97 -17 0 46 41 18 50
7401E0j9k4K5L9k0m4P4o9M3k6n9J9N2M1k4o6R9n5on1N1n1K0N9m7NJ0l9M6k5M7
$$ 50 31 7 32 71 51 7 81 12 55 29 -30 -11 41 82 58 -8 91 36 30 -21 30 -21 -1 58 11 16 26 -13 33 8 55
7432E5k8mN3o0j0NM6j02K5O8q3N7J1m9p4M9J23j41M2Jj2n0Q1Ql7LO9p2r8R2l4
$$ 55 27 23 76 16 6 11 57 -45 -20 48 -35 22 33 -16 -90 -41 82 -59 -17 -16 -28 -78 3 11 -26 -23 46 -26 -124 -32 -66
7463f6oK0K5o3K6J11j36k2J02l7k7M5l6L8m9RK1o8K9K8j0kK2J7o7J12j1k6oL6
$$ -66 -72 -52 -27 -90 -64 47 -89 -111 -9 -46 -73 -28 -64 -26 -75 -66 -45 -113 -84 -56 -66 -68 -46 -29 -96 16 5 -21 -27 9
7493Ik9k3M3m0l4J02l4N8q6L9j1k0PQ7m5J6J7l7L0j2j5l8J25m1o7K6%M6J6J0j2
$$ 9 -20 -43 0 -40 -74 28 -6 52 -34 5 -6 -26 -19 68 23 39 56 19 49 37 22 -16 109 68 1 27 27 73 89 99 87
7524H7m5M0N4p4pj0l8l7K6N0n1K4P0p6k1O2l5m8K4K0Q9j29P5o0j9J02m9k5o0N0
$$ 87 42 82 136 62 55 45 7 -30 -4 46 -5 19 89 13 -8 54 19 -29 -5 15 104 -25 50 -10 -29 73 24 -1 -61 -11
7554a1k4K3j5N4l3M2o8kjM6J0o9N8M1m9k7L4k2p1N4N3l8j1l1L1PPl8l7R9k9l4
$$ -11 -35 -12 -27 27 -6 36 -32 -34 -35 11 21 -48 10 51 2 -25 9 -13 -84 -30 23 -15 -26 -57 -26 -19 -12 -50 -87 12 -17 -51
7586e1N4m4M2%J3k8k5PM0l2Qnq9N5Q3Rj31Q9Kl6N3k7qm9Q6K3r5OO2j7mQ0o8j34
$$ -51 3 -41 1 1 14 -14 -39 -32 8 -24 -16 -21 -110 -55 28 37 -94 -5 -3 -39 14 -13 -21 -70 16 39 -56 -50 12 -5 -9 71 3 -131
7620a31J74j11J30j21N6rm7R5r5L6j3N8nn3L4J3j6O1m4k8K5J0l1K3M4j1r6N8N9
$$ -131 43 -68 62 -59 -3 -12 -59 36 -59 -23 -36 22 17 -36 -2 11 -5 56 12 -16 9 19 -12 11 55 44 -52 6 65
7649F5j19M6M7n6MP7J3o9K8J6j9J9j5L1j2pL1n6K7J3j4k9J0N0q5J10k0j02N5J4
$$ 65 -54 -8 39 -17 -13 64 77 8 36 52 33 52 37 68 56 49 80 24 51 64 50 21 31 81 -4 106 86 -16 39 53
7679E3m9L0J6K6n0K2Jo4lP9p0J1oJ09q4q0P1o1j7L4R0k9m8j6Jp8P1M2j01P2j9
$$ 53 4 34 50 76 26 48 49 -15 -18 61 -9 2 -4 105 21 -59 12 -49 -66 -32 58 29 -19 -35 -34 -112 -41 1 -100 -28 -47
7710d7M1r3R1k6j6%np2Q4K4n3JN2k8m5K9kMj9O1Om3J0rL1j7J00m5j08J02j5k0
$$ -47 -6 -99 -8 -34 -50 -50 -55 -127 -43 -19 -72 -71 -19 -47 -92 -63 -65 -61 -80 -19 -13 -56 -46 -55 -24 -41 59 14 -94 8 -7 -27
7742b7L8j9j0L5K2p4j5QO8j4L8M1j17J4J06q7p8O5Q3o3mj2pj8M1K9j6kK8j04J27
$$ -27 11 -8 -18 17 39 -35 -50 -42 26 12 50 91 -26 -12 94 7 -71 -6 77 14 10 -2 -9 -27 14 43 27 25 53 -51 76
7773G6k9p9k2O1O8j47L4N2o2nO6L1l3LJ3K6k9Pqm1M7P0l9l4J19j15J8N6j3k9K5
$$ 76 47 -32 -54 7 75 -72 -38 14 -48 -53 13 44 11 14 27 53 24 31 23 -18 29 99 60 26 145 30 48 104 91 62 87
7804H7J9l6k3O9n7Mj7j5lmN8lp8P2j5j1j6rN5n8L0p8n3Q8L7r0L2rm5J6O9p2p3
$$ 87 106 70 47 116 59 63 46 31 28 24 82 79 1 73 58 47 31 22 77 19 49 -29 -82 6 43 -47 -15 -24 -69 -53 16 -56 -129
7837a29J08q8j0O7n1M2k9N5L1j22N5Qk3n9J06ll8N7j8p9ON6p%L3m9M1k1M8j9j8
$$ -129 -21 -109 -119 -52 -103 -61 -90 -35 -4 -126 -71 -63 -86 -145 -39 -42 -80 -23 -41 -120 -114 -58 -65 -65 -32 -81 -40 -61 -13 -32 -50
7868e0M1m4m0J15n2j0LN4%K5n9N7l8P5m6K0j6K8k7j5K8J6L1q9O9l6l2P3mo2K7
$$ -50 -9 -53 -93 22 -30 -40 -37 17 17 42 -17 40 2 77 31 51 35 63 36 21 49 65 96 7 76 40 8 81 77 15 42
7899D2M5r3K4J4J9rJ8J0j9L6l5Kr0Q8J8p8m1N6l9O4O2j24m4Q1l8m2M9J4o3P4k0
$$ 42 87 -6 18 32 51 42 60 70 51 87 52 54 -36 52 70 -8 -49 7 -32 32 94 -30 -74 7 -31 -73 -24 -10 -73 1 -19
7930a9N3n0n1K8k2M4K6o6N2%l8KL8L6j4Nj5j6N8j8j06P4jJ3M6q5O0j7K0k4P1p4
$$ -19 34 -16 -67 -39 -61 -17 9 -57 -5 -5 -43 -41 -3 33 19 24 9 -7 51 33 -73 1 0 13 59 -26 34 17 37 13 84 10
7962A0OM6m9%NM0o0N5O9j08j8M9l9J9j8J9j2k8O3o5pL5n4O5m1j2Q5j27K4jj5Q3
$$ 10 16 62 13 13 18 58 -2 53 122 14 -4 45 6 25 7 26 14 -14 49 -16 -23 12 -42 23 -18 -30 55 -72 -48 -49 -64 19
7994A9o9J8k7N7p1J8P0n1j21J07L7o5l7L3o5J4J23j49J07M3n9j5MN7q3Q5l3M7
$$ 19 -50 -32 -59 -2 -73 -55 15 -36 -157 -50 -13 -78 -115 -82 -147 -133 -10 -159 -52 -9 -68 -83 -79 -22 -105 -20 -53 -6
8022fl4L4K6mj0Ml3K8J1O9o1k1J36m5m6K9jk3RL0m0pJ15j4j22O1M3nm8oK3PL7
$$ -6 -40 -6 20 16 6 10 -23 5 16 85 24 3 139 94 48 77 76 53 62 92 52 45 160 146 24 85 128 123 75 69 92 99 136
8055A36l6j64J15O3j21K2K6K8m8l4mN6m2L5J8j15O7k2K8l4J3ml5O8k8r0N9Q4n4
$$ 136 100 -64 51 114 -7 15 41 69 21 -13 -17 39 -3 32 50 -65 2 -20 8 -26 -13 -17 -52 16 -12 -102 -43 41 -13
8084a3K6r4K4J3K1m2L2K9Nm3j5J02o4k6N5l4l2K3k1Rm4P4K5m4J7K8k5QK5K2q3
$$ -13 13 -81 -57 -44 -23 -65 -33 -4 1 -42 -57 45 -19 -45 10 -24 -56 -33 -54 -45 -89 -15 10 -34 -17 11 -14 -6 19 41 -42
8115d2K8J20m5j34J22J3p9O9n5o0N8J2J9l1P1o4m4P1K4ro6P3q5j1Q1k1l2M4Rl6
$$ -42 -14 106 61 -73 49 62 -17 52 -3 -63 -5 7 26 -5 66 2 -42 29 53 44 -22 51 -34 -45 36 15 -17 27 36 0
8145@k1J6mk5N5m8l0K9Nm0Rj0JK0K1j9J5K1pK9k4N9l2j5lLk4M3O0p3p4R5L3q0
$$ 0 -21 -5 -9 -34 21 -27 -57 -28 -23 -63 -54 -64 -63 -43 -22 -41 -26 -5 -12 17 -7 52 20 5 2 5 -19 24 84 11 -63 32 65 -15
8179a5J8R4p7j8N7J0j7m2J9j1J0k4
$$ -15 3 97 20 2 59 69 52 10 29 18 28 4
8191D
$$ Imaginary data points
##PAGE= N=2
##DATA TABLE= (X++(I..I)), XYDATA
0@%%%%%%%Qj6J6j6K4l2M0m8N6o9P8r0J07j30J52j76K04k31K66l05L46l94M45n00
$$ 0 0 0 0 0 0 0 0 8 -8 8 -8 16 -16 24 -24 32 -37 41 -49 58 -72 80 -96 108 -123 143 -162 184 -210 235 -265
31b65N62o31P07p88Q78r78J086j205J337j481J637j812K008k224K466k741L051
$$ -265 297 -334 373 -415 463 -515 571 -634 703 -778 859 -953 1055 -1169 1297 -1444 1607
48A607l405L820m307M888n599O494p656R232j1512J5118k1700L7547j42562j81484
$$ 1607 -1798 2022 -2285 2603 -2996 3498 -4158 5074 -6438 8680 -13020 24527 -118035 -299519
62b99519K89784J58654j40801k21614M2677J70880N3968j17321p9175M1623Q8030
$$ -299519 -9735 148919 8118 -213496 -170819 61 54029 -63292 -142467 -100844 -12814
73a2814J3996l2442k6783o07m2K0435M0892L0773l1497o5412q594R2955P4797
$$ -12814 1182 -31260 -58043 -58650 -58692 -38257 2635 33408 1911 -63501 -72095 20860 95657
86I5657o5878j21137K5969J51479M8768j32800j12641P1577J50547J9405j27194
$$ 95657 29779 -91358 -65389 86090 134858 2058 -110583 -39006 111541 130946 3752
97C752r0389O7830J16390j453r8301m1176N5389M8541j7911l0439R48K027j6790
$$ 3752 -86637 -18807 97583 96130 -2171 -43347 12042 60583 42672 12233 13181 15208 -1582
110a582P938M8211J0361p5155n7108P0017J04975k8987j27440l4215J04738Q7624
$$ -1582 6356 54567 64928 -10227 -67335 2682 107657 78670 -48770 -82985 21753 109377
122A09377m5105j04514k2182Q5136P3571m0280r4571j0521Q6014N4075n1325p5197
$$ 109377 64272 -40242 -62424 22712 96283 56003 -38568 -49089 36925 91000 39675 -35522
134c5522M723O3296K2760l9503k7390J9215R907k4827m112L2409K096m6499j9048
$$ -35522 -30799 32497 55257 15754 -11636 7579 17486 -7341 -11453 20956 23052 -23447 -42495
147d2495M4645L7321l5485o6225m012P1940N0523m9728q5736J298Q3821M3085
$$ -42495 2150 39471 3986 -62239 -66251 5689 56212 6484 -79252 -77954 5867 48952
159D8952n1501o3383J1196O2257K7202l7980m4939Q531M3441K1496j4736k4613
$$ 48952 -2549 -65932 -54736 7521 34723 -3257 -48196 -39665 3776 25272 10536 -14077
171a4077j1268J1749K6513J2004j6080k0140L22J6201J7515K365k4867k4923K0099
$$ -14077 -25345 -13596 12917 24921 8841 -11299 -10977 5224 22739 25104 237 -24686 -4587
184d587M6154%n3528k7838M0513M9390j3625n5923j6409M4056L4586k5039m0089
$$ -4587 41567 41567 -11961 -39799 714 50104 36479 -19444 -35853 8203 42789 17750 -22339
197b2339K493K7798Q272j2158j0707l143J928M224K029J639K43j0898j3771J0988
$$ -22339 -19846 7952 16224 4066 -6641 -9784 -7856 -3632 -1603 36 279 -10619 -24390 -13402
211a3402K8235j57l6274j9824K9182L9891n675m7376k2990L9330M7314j6539n4726
$$ -13402 14833 14676 -21598 -41422 -12240 27651 21976 -25400 -48390 -9060 38254 21715 -33011
224c3011q390M7972L0058k8417m2121L553M1199J8327k9761k9594J3699K6255
$$ -33011 -41401 6571 36629 8212 -33909 -30356 10843 29170 -591 -30185 -16486 9769
236I769m064j6681J966P795n245m045Q845N649r727j1731O044K0894P548k1873
$$ 9769 5705 -10976 -9010 -1215 -6460 -10505 -1660 3989 -5738 -17469 -11425 9469 17017 -4856
250d856k2177J2610L1551P022k3533k0169Q117K5779R510k1152k0486J3212K5284
$$ -4856 -27033 -14423 17128 24150 617 -19552 -11435 14344 23854 2702 -17784 -4572 20712
263B0712k401k0286m800Q867L563J043N386m42j2106q845J0118K0217M95k6521
$$ 20712 18311 -1975 -6775 2092 5655 6698 12084 11642 -464 -9309 809 21026 21521 -5000
277e000j4436K6286K8875j7551l8663M19L8768J9973k6355l5545M912L8669J5357
$$ -5000 -19436 6850 35725 18174 -20489 -20070 18698 38671 12316 -23229 -18317 20352 35709
290C5709l1197k9595J4334L0235O82k2919j2294R141J4895J302j3480q042Q653
$$ 35709 4512 -25083 -10749 19486 20168 -2751 -15045 -5904 8991 10293 -3187 -11229 -2576
303b576Q253n055m148N411Q40r164l209J0830J1312m436j6822n983J6496J3928
$$ -2576 5677 622 -3526 1885 2725 -6439 -9648 1182 12494 8058 -8764 -14747 1749 15677
317A5677j2528j7063Q303J8048k789j6071n400P301Q362K619m114o291j844J270
$$ 15677 3149 -13914 -5611 12437 9648 -6423 -11823 -4522 3840 6459 2345 -3946 -5790 -4520
331d520K105M428J625o274l221Q372N382r268j0254M189J3473Q134p116j7255
$$ -4520 -2415 2013 3638 -2636 -5857 2515 7897 -1371 -11625 -7436 6037 14171 7055 -10200
345a0200n623J5974J3869r397j5746K660J3755L145j1881j1908M610J5872L070
$$ -10200 -15823 151 14020 4623 -11123 -8463 5292 8437 -3444 -15352 -10742 5130 8200
358H200j4603p055J0467M663j0116l857J1211P521p867j1159J892J3094M814j2738
$$ 8200 -6403 -13458 -2991 1672 -8444 -12301 -1090 6431 -1436 -12595 -10703 2391 7205 -5533
372e533r826J1950J5282o723j6785j222J3125Q626m219j1869m332J1586J1853
$$ -5533 -15359 -3409 11873 5150 -11635 -12857 268 8894 4675 -7194 -11526 60 11913
385A1913p287j5378M24J4073P573o339j0687j261J1226Q052p672r883M582R947
$$ 11913 4626 -10752 -10328 3745 11318 4979 -5708 -6969 4257 12309 4637 -5246 -664 9283
399I283Q98m165k474j938R70N262J920m507k250K071J133j189k287k186K432N128
$$ 9283 10181 6016 3542 1604 2574 7836 9756 5249 2999 5070 6203 5014 2727 541 2973 8101
415H101k057p484K22N288j737m991K091M675k24l140l453j330M029M734k792n218
$$ 8101 6044 -1440 -1218 4070 2333 -2658 -567 4108 3884 744 -2709 -4039 -10 4724 1932 -3286
431c286J999M740j018m709l356J650P558L515r653r475P048J1244m598j2125n1
$$ -3286 -1287 3453 2435 -2274 -5630 -3980 3578 7093 -2560 -12035 -4987 6257 1659 -10466 -10517
446a0517J0842N444p423j1282O98J2658M605j0531o495P752O898m222o054J77
$$ -10517 325 5769 -1654 -12936 -12238 420 5025 -5506 -12001 -4249 2649 -1573 -7627 -7450
460g450M416M826k06o230k243O069L296m860l132L582M481L35l740m225K135P155
$$ -7450 -3034 1792 1586 -4644 -6887 -818 2478 -2382 -5514 -1932 2549 2884 -856 -5081 -2946 4209
476D209N53o415MO444P38m379q67K338J867K425J74m146j629L619K416j804k175
$$ 4209 4762 -1653 -1649 4795 5533 1154 287 2625 4492 6917 7091 2945 1316 4935 7351 5547 3372
493C372j028J616L734j956q713j691R010L386q559o461L324N203m89n533m253
$$ 3372 2344 3960 7694 5738 -2975 -4666 4344 7730 -829 -7290 -3966 1237 748 -4785 -9038
508i038L593P204j812q753j266P355L686k859l636r45L784N891j654p792M41J0043
$$ -9038 -5445 1759 -53 -8806 -10072 -2717 969 -1890 -5526 -6471 -2687 3204 1550 -6242 -5801 4242
524D242L265p444n131M325P203J031o628m886N956P734m021q642J953P468M24
$$ 4242 7507 63 -5068 -743 6460 7491 863 -4023 1933 9667 5646 -2996 -1043 6425 6849
539F849m727k520P86L222K505l542n321K097N605q09n064j884K239L156M44m984
$$ 6849 2122 -398 388 3610 6115 2573 -2748 -651 4954 4145 -919 -2803 -564 2592 3036 -1948
555a948l997M516N864l555o598J082M920J108k033k466n77L916L690l302m591
$$ -1948 -5945 -1429 4435 880 -5718 -4636 284 1392 -641 -3107 -3684 232 3922 620 -3971
570c971K698N377P24k240k416l65M126L803m114n596M176O721l179p736n11N529
$$ -3971 -1273 4104 4828 2588 172 -193 3933 7736 3622 -1974 2202 8923 5744 -1992 -2503 3026
586C026K990l637o293n55O000R83p821m094N644M233l446m842j776J502M403J563
$$ 3026 6016 2379 -3914 -4469 1531 2514 -5307 -9401 -3757 476 -2970 -7812 -9588 -8086 -3683 -2120
602b120n503l699N397N458l232n615M67N598M799j777o519q21P667L895n260l476
$$ -2120 -7623 -11322 -5925 -467 -3699 -9314 -8847 -3249 1550 -227 -6746 -7567 100 3995 -1265 -4741
618d741L983M075k14k261k263P58M794J744m417k330L678K484j900j769k15J192
$$ -4741 -758 3317 3103 842 -1421 -663 4131 5875 1458 -872 2806 5290 3390 1621 1406 2598
634B598K653k22m731r12N190J334n488k664L502K886j028l484k768K232M282j530
$$ 2598 5251 5029 298 -614 4576 5910 422 -2242 1260 4146 3118 -366 -3134 -902 3380 1850
650A850n528K48N268J509k877k938j311L071O163l36p484j377Q091L822n927n115
$$ 1850 -3678 -3430 1838 3347 470 -2468 -3779 -708 5455 5119 -2365 -3742 4349 8171 2244 -2871
666b871L340P409K267o485o769L372Q069o37p007r28M255J062k884l308j390K793
$$ -2871 469 7878 10145 3660 -3109 263 8332 7695 688 -240 4015 5077 2193 -1115 -2505 288
682B88L984k163n849j34L720m96l009J21K252J294r06l822k341M367M950k989
$$ 288 4272 2109 -3740 -3874 -154 -650 -3659 -3538 -1286 8 -898 -4720 -7061 -2694 2256 -733
698g33n041J699M416P4l464k520J405N493K527n798n832L039O247J042l508l298
$$ -733 -5774 -4075 341 415 -3049 -5569 -4164 1329 3856 -1942 -7774 -4735 1512 2554 -954 -4252
714d252k50M757M056m501o775L276Q645M19p045l881L221N666J688m663m081K770
$$ -4252 -4502 255 4311 -190 -6965 -3689 4956 5375 -1670 -5551 -2330 3336 5024 361 -3720 -950
730i50M232j596l002M40J375M92M48j754k977J684L773j256l099J495K027k262
$$ -950 3282 1686 -1316 -876 499 991 1439 -315 -3292 -1608 2165 909 -2190 -695 1332 -930
746i30k143J864L402J366k496m418N26O125J874n625k636M837L830k349n052k252
$$ -930 -3073 -1209 2193 3559 1063 -3355 -2829 3296 5170 -455 -3091 1746 5576 3227 -1825 -4077
762d077L967O772l90q310m010N385M683k063m043j412K630M067j263p012k051
$$ -4077 -110 6662 6272 -2038 -6048 -663 4020 1957 -2086 -3498 -868 3199 1936 -5076 -7127
777g127P443N246m161n524K02L409K142j089k585P96L759k22m172q65K884J532
$$ -7127 316 5562 1401 -4123 -3921 -512 1630 541 -2044 -1248 2511 2289 -1883 -2748 136 1668
793A668P7l09k037r78K635O03l332K87M847M10m995k178K978L446O45k708k626
$$ 1668 1745 1436 -601 -1579 1056 1659 -1673 -1386 3461 3871 -1124 -3302 -324 3122 3767 1059 -1567
810a567K351L908j556m392N35M344J809j552l543k760K797N673o80o344j591M468
$$ -1567 784 4692 3136 -1256 -721 3623 5432 3880 337 -2423 374 6047 5367 -977 -2568 1900
826A900K207k734l425o41L733L814l137o962N05O727J685m835k404K291K431m43
$$ 1900 4107 1373 -2052 -2693 1040 4854 1717 -5245 -4740 1987 3672 -1163 -3567 -1276 1155 712
842G12k832j482L299L335k738m117J183K970k75j452p07p7J647J243l345l332
$$ 712 -2120 -3602 -303 3032 294 -3823 -2640 330 55 -1397 -2104 -2181 -534 709 -2636 -5968
858e968L503M711k275m791K32L271J447j174k517k90L463K338k907l077J501K998
$$ -5968 -2465 2246 -29 -4820 -4588 -1317 130 -1044 -3561 -3851 -388 1950 -957 -4034 -2533 465
874D65J384p82k932j552L777L680l462m677K455M816n99l790j741J687L329O26
$$ 465 1849 1067 -1865 -3417 360 4040 578 -4099 -1644 3172 2573 -1217 -2958 -1271 2058 2684
890B684l979k334L990L281l112l308J831K898K95j550j651P43L002K49l459n54
$$ 2684 -1295 -3629 361 3642 530 -2778 -947 1951 2246 696 -955 -212 2790 3039 -420 -974
906i74L354J192j962j350j24O76J980L7l619j052M303J715m127k844K093L066
$$ -974 2380 3572 1610 260 136 812 2792 2829 -790 -1842 2461 4176 49 -2795 -702 2364
922B364Q69k070l229J51M275J601l575k596K040L305R75k830m269J135O593J523
$$ 2364 3233 1163 -2066 -1915 2360 3961 386 -2210 -170 3135 4110 1280 -2989 -1854 4739 6262
938F262o696l688M710M111k398m041m79K899K815j937m933l8M945J349l871j962
$$ 6262 -434 -4122 588 4699 2301 -1740 -2219 680 3495 1558 -3375 -3413 1532 2881 -990 -2952
954b952K061J649n35j771p68K335K435k292l958J514M186k72k910p69J201J459
$$ -2952 -891 758 223 -1548 -2316 19 2454 162 -3796 -2282 1904 1632 -1278 -2047 -846 613
970F13J73k666k223L064M183k364m994L2L186J322o50j219j110R18J854j051k008
$$ 613 786 -1880 -4103 -1039 3144 780 -4214 -4182 -996 326 -324 -1543 -2653 -1735 119 -932 -2940
987b940P24K017J199K5k248k898J638M721m0m036j67L006k48k591q80J415K608
$$ -2940 -2216 -199 1000 1025 -1223 -4121 -2483 2238 2198 -1838 -2005 1001 753 -1838 -2718 -1303 1305
1004A305J384k991l748J505L976n30k879M65K890Q94k188l481J60N501L622l964
$$ 1305 2689 -302 -4050 -2545 1431 901 -1978 -1513 1377 2271 83 -3398 -3238 2263 5885 1921
1020A921m963K124M362k92k953q80K257L206k04n035k799M379M259j948l401K3
$$ 1921 -3042 -918 3444 3152 199 -681 1576 4782 4578 -457 -3256 1123 5382 3434 33 56
1036E6J253K18j95q88l22J873J018k239j802J118J381K61O2r28q22J236N19k504
$$ 56 1309 1527 1332 444 122 1995 3013 774 -1028 90 1471 1732 1794 866 44 1280 1799 -705
1054g05m74L810R53l869k651J741K337P92j618k949m2L436O68m058k007K964L379
$$ -705 -1179 2631 3584 -285 -2936 -1195 1142 1934 316 -2633 -2675 761 1429 -2629 -4636 -1672 1707
1071A707m07l533l481J342N604J601m670k856K888K639j143k006n05J756L022
$$ 1707 1300 -2233 -5714 -4372 1232 2833 -1837 -4693 -1805 834 -309 -2315 -2820 -1064 1958
1086A958k60m259j832L200K371r61q90Q0k64o0q8p86R20K726j66l095n38K428
$$ 1958 1698 -2561 -4393 -1193 1178 217 -673 -593 -857 -917 -1005 -1791 -871 1855 1689 -1406 -1944 484
1104D84R95j129p15O99K278J361l111m001K544N932J48m917k016K271K638K63
$$ 484 1479 350 -365 334 2612 3973 862 -3139 -595 5337 5485 568 -1448 823 3461 3724
1120C724k685k577K072M220p63m669j644K607K637K32k477k644J112L289n74l338
$$ 3724 1039 -1538 534 4754 3991 -678 -2322 285 2922 3154 677 -1967 -855 2434 1860 -1478
1136a478M7K534pj469m69j75M1R17n51j310M79J027j538j401J218R01p94q19n20
$$ -1478 -1431 1103 1096 -373 -842 -1017 -976 -59 -610 -1920 -1441 -414 -1952 -3353 -2135 -1234 -2028 -2847 -3367
1155c367k34J561J145k333k143K089L074m43k363j033J109L155J487l125k648
$$ -3367 -3601 -2040 -895 -3228 -5371 -3282 -208 -651 -3014 -4047 -2938 217 1704 -1421 -4069
1170d069L113M186r60l256o19K079K685R25k728k614K298L465r79k914K08K254
$$ -4069 -956 3230 2270 -986 -1605 474 3159 4084 1356 -1258 1040 4505 3526 612 820 3074
1186C074R63j056k161k00K921J512k994k077K654J914k187k089J000J884P35j495
$$ 3074 4037 2981 820 620 3541 5053 2059 -18 2636 4550 2363 274 1274 3158 3893 2398
1202B398k834j53L372J036l418k122J989K004o56k359k000R97L615M06m435k256
$$ 2398 -436 -589 2783 3819 401 -1721 268 2272 1616 -743 -2743 -1746 1869 2275 -2160 -4416
1218d416K823K839p83k258j440P13K745O44l084j464K510J717j384j355l0L65
$$ -4416 -1593 1246 463 -1795 -3235 -2522 223 867 -2217 -3681 -1171 546 -838 -2193 -2223 -1858
1234a858J169N14j684j033J507N54j843k14J951N14j176j232o43J336K476l29
$$ -1858 -689 -175 -1859 -2892 -1385 -831 -2674 -2888 -937 -423 -1599 -2831 -3474 -2138 338 9
1250Ik709J65K938J98k216m08J636J973J202j365l137K10L725J409k153j043J206
$$ 9 -2700 -2535 403 601 -1615 -2023 -387 1586 2788 1423 -1714 -1504 2221 3630 1477 434 1640
1267A640J145j08j851j882K006L865l73m088j327K167Q35p38k79L41O52K50k130
$$ 1640 2785 2677 826 -1056 950 4815 4442 354 -973 1194 2029 1291 1012 1353 2005 2255 125
1284A25k243J863K999p72k644J59J435j34j568j551M33L147J760l550m033J297
$$ 125 -2118 -255 2744 1972 -672 -513 922 788 -780 -2331 -1898 1249 3009 -541 -4574 -3277
1300c277L626M18j976j430M34J978Q10k651k145K496L274r15k425k89J014J085
$$ -3277 349 767 -1209 -2639 -2205 -227 583 -2068 -4213 -1717 1557 642 -1783 -2072 -1058 27
1316B7Q34j193j401J543K204j004k067L14J467O68k61j426r25J836J916j598k210
$$ 27 861 -332 -1733 -190 2014 1010 -1057 -743 724 1392 1131 -295 -1220 616 2532 934 -1276
1333a276J025J602m64o68K9K48J137M86k218j754K513K902q49k558n44J257J485
$$ -1276 -251 1351 887 219 248 496 1633 2119 -99 -1853 660 3562 2713 155 -389 868 2353
1350B353q8k479q11L300K263l031l644O52K735J136q96j805o03J575L00k718q90
$$ 2353 2265 -214 -1025 2275 4538 1507 -2137 -1485 1250 2386 1490 -315 -918 657 957 -1761 -2651
1367b651L059J782k067k138J10R56O24m81j025O63K403p69l522p18K904J591j129
$$ -2651 408 2190 123 -2015 -1905 -949 -325 -806 -1831 -1168 1235 466 -3056 -3774 -870 721 -408
1384d08j520k84R43J202j537k308J267L580k21l035j082J120J324R22m97j814
$$ -408 -1928 -2212 -1269 -67 -1604 -3912 -2645 935 714 -2321 -3403 -2283 -959 -37 -534 -2348
1400b348K15K476N28k102p99R71J326J005l44j853l40K178P10j649l56J119L15
$$ -2348 -2133 343 871 -1231 -2030 -1059 267 1272 928 -925 -1265 913 1623 -26 -382 737 1052
1417A052k35q1o71K8J527k95j884L92K583n6k311p51J129J626O48j732k018J730
$$ 1052 817 736 65 93 1620 1325 -559 -167 2416 2360 49 -702 427 2053 2701 969 -1049 681
1435F81L184j198l935o7L514J893j859l185p79L071K523k620l792J453L914j80
$$ 681 3865 2667 -1268 -1335 2179 4072 2213 -972 -1751 1320 3843 1223 -2569 -1116 2798 2618
1451B618l159j708J008K294J412k064k552J079K440n69j599L22J050j9k01l45
$$ 2618 -541 -2249 -1241 1053 2465 401 -2151 -1072 1368 799 -800 -478 572 553 352 7
1467Gl57O71M86q67k21J449j87j803j80J394K08l62lq26n75J202P73j381p21P58
$$ 7 -350 321 807 -60 -281 1168 981 -822 -1002 392 600 238 235 -591 -1166 36 809 -572 -1293 -535
1487e35O08k0j54j186o37J989J620j893k192Q51J969N43j274j980m2K831J271
$$ -535 73 53 -101 -1287 -1924 65 1685 -208 -2400 -1549 420 963 -311 -2291 -2333 498 1769
1504A769k986k608J922K709n19k197r74P78J979M88k517j534K493K038j651j713
$$ 1769 -1217 -3825 -1903 806 287 -1910 -2884 -2106 -127 361 -2156 -3690 -1197 841 -810 -2523
1520b523R25J445P3q49q41Q44K074k25k502K0K489N11j673m86J131R21K88j227
$$ -2523 -1598 -153 -80 -929 -1770 -926 1148 923 -1579 -1559 930 1441 -232 -718 413 1334 1622 395
1538C95j754J139K926q5k820n06J998J048p26j424n05J710K273r92l006m03K361
$$ 395 -1359 -220 2706 2621 -199 -705 1293 2341 1615 191 -314 1396 3669 2677 -329 -732 1629
1555A629J176n27j095r60O27J638l34k631m62K336J217j065j462j103L44J888
$$ 1629 2805 2278 1183 223 850 2488 2154 -477 -939 1397 2614 1549 87 -1016 -672 1216
1571A216M98k181p27J974Q00j704j161N22J086R32m08j420k0J453n79j543Q28
$$ 1216 1714 -467 -1194 780 1580 -124 -1285 -763 323 1255 847 -573 -593 860 281 -1262 -434
1588d34J795m41j416m90L48N88L35j419j277J992K192k059l208L76K731J163j395
$$ -434 1361 920 -496 -986 -638 -50 285 -1134 -2411 -419 1773 -286 -3494 -3118 -387 776 -619
1605f19k122m7K641J357k766k460J848L297J66k057j404J55K039J344j688j617
$$ -619 -2741 -2788 -147 1210 -1556 -4016 -2168 1129 1295 -762 -2166 -2011 28 1372 -316 -1933
1621a933J594K055o53j596k82K54Q70J310k43j465k9P84l13l02P13P5k42L55Q4
$$ -1933 -339 1716 1063 -533 -815 -561 309 1619 1376 -89 -118 666 353 51 764 839 597 952 1036
1640A036r73k05N76k75j0J049p6j419n84J72K87Q11L77j598j075J856J278k129
$$ 1036 63 -142 434 159 149 1198 1122 -297 -881 -709 -422 389 766 -832 -1907 -51 1227 -902
1658i02j932J074K405J005j658k636K12L287J401k842j932K249K762m07k395j634
$$ -902 -2834 -1760 645 1650 -8 -2644 -2432 855 2256 -586 -2518 -269 2493 2086 -309 -1943
1674a943J108L272O36l019j433K138J400j527j271M96Q55M21l90j163k85R92l65
$$ -1943 -835 2437 3073 54 -1379 759 2159 632 -639 -143 712 1133 743 -420 -705 287 -78
1691g8j197Q60J570o77j575q1P22N66K23p20n37J282J296j295j666O03J567O04
$$ -78 -1275 -415 1155 478 -1097 -1178 -456 110 333 -387 -924 358 1654 359 -1307 -704 863 1467
1709A467J13r44j282P81J949l39k123o7J864J091n69j898j624J376L057k4l040
$$ 1467 1580 636 -646 135 2084 1745 -378 -445 1419 2510 1941 43 -1581 -205 2852 2828 -212
1726b12j287J687J599m14j872j384J383K735n28l488r78K346J177j033j049j57
$$ -212 -1499 188 1787 1373 -499 -1883 -500 2235 1707 -1781 -2759 -413 764 -269 -1318 -1475
1742a475N83P56p63j405N55J756k58j401L92R62l70m85J92N10Q99L13j499q38
$$ -1475 -892 -136 -899 -2304 -1749 7 -251 -1652 -1260 -298 -668 -1153 -961 -451 448 761 -738 -1576
1760a576J886J518j497j533R44J341L47r62j671k23K307J309k177k224R01J860
$$ -1576 310 1828 331 -1202 -258 1083 1430 468 -1203 -1426 881 2190 13 -2211 -1310 550
1776E50J59j243j276l15J689J228j483j622N87J332K51l36o39m57R55J362o37
$$ 550 709 -534 -1810 -2125 -436 792 -691 -2313 -1726 -394 -143 -479 -1118 -1575 -620 742 105
1793A05j257O71J058k02k24K43qpO31k07m41N69M98p36k78R18K37p20l11K32L73
$$ 105 -1152 -481 577 375 151 394 386 379 1010 803 362 931 1429 693 415 1333 1570 850 539 771 1144
1814A144P70m55j858L2K322O16k105j467R23J684O08j542k397M69L286P34l153
$$ 1144 1914 1459 -399 -367 1955 2571 466 -1001 -78 1606 2214 672 -1725 -1256 2030 2764 -389
1831c89k107J643K418K01j844j846O78K776K86k627j165K076J596n35j316p12
$$ -389 -2496 -853 1565 1766 -78 -1924 -1246 1530 1816 -811 -1976 100 1696 1161 -155 -867
1847h67N40J543J69j550k74J439J88j280j52M99j60K2L28m88m81J40l62n04O62
$$ -867 -327 1216 1385 -165 -439 1000 1188 -92 -244 255 95 117 445 -43 -524 -384 -746 -1250 -588
1866e88O72o69p56L5k20J22Q12p4j107L48J275k67j328l18O59J222J020r19k065
$$ -588 84 -585 -1341 -1306 -1526 -1404 -592 -666 -1773 -1425 -150 -417 -1745 -2063 -1404 -182 838 -81 -2146
1885b146P9K252M18j519l98J116Q48j86j332j087J268K097l79j840OJ376j49q28
$$ -2146 -2067 185 603 -916 -1314 -198 650 464 -868 -1955 -687 1410 1031 -809 -803 573 424 -404
1903d04q7P59Q63K85j339r80J327J224j028j038J271J106q74j233k36P44J388
$$ -404 -491 268 1131 1416 77 -903 424 1648 620 -418 853 1959 1085 -148 -384 360 1748
1920A748j0j791p48J608Q79j245j052L15R91O54m39j648n05J807J101j344j376
$$ 1748 1738 -53 -801 807 1686 441 -611 -296 695 1349 910 -738 -1243 564 1665 321 -1055
1937a055M72R41N56k30j303p96J455J323j244j538N32J222M05p76j472m58J976
$$ -1055 -583 358 914 684 -619 -1415 40 1363 119 -1419 -887 335 740 -36 -1508 -1966 10
1954A0J498j501j773P09J469r7r92m82P64J567L13j980j284J635J672o93r62M94
$$ 10 1508 7 -1766 -1057 412 315 -677 -1159 -395 1172 1485 -495 -1779 -144 1528 835 -127 367
1972C67O39j5p00r80M34J861M65j761r95Q98N12n75k94K87N99O09q33j783Q3J876
$$ 367 1006 991 291 -689 -255 1606 2071 310 -685 213 725 150 -144 143 742 1351 518 -1265 -1182 694
1992F94N88r45m55M05m5m6j07l34L08J150K8j357m60N66P9J46K94l79k55L52l13
$$ 694 1282 337 -118 287 242 196 89 -245 63 1213 1241 -116 -576 -10 69 215 509 130 -125 227 -86
2013h6j067L49J229j31q97j73P1N2L28k78o75N24J113p61j497L46J256J97o44
$$ -86 -1153 -804 425 294 -603 -776 -705 -653 -325 -603 -1278 -754 359 -402 -1899 -1553 -297 -100 -744
2032g44o41k36R14Q94j097j477Q55J785l37j504n32P70J395M23j504j480J385
$$ -744 -1385 -1621 -707 187 -910 -2387 -1532 253 -84 -1588 -2120 -1350 45 468 -1036 -2516 -1131
2049a131K024n69j598J52J167N98k48j026m17J413J482q47j631L21J411K08m80
$$ -1131 893 324 -1274 -1122 45 643 395 -631 -1048 365 1847 1000 -631 -310 1101 1309 829
2066H29o39K8J090O63j287j470J105J778k58j064m68J51R17N19r50r40J149J399
$$ 829 190 218 1308 1971 684 -786 319 2097 1839 775 307 458 1375 1894 944 4 1153 2552
2084B552q35j548J08R92P64j06j069q15J120J068j219j405P53J248r1j039p96
$$ 2552 1717 169 277 1269 2033 1927 858 43 1163 2231 1012 -393 360 1608 1517 478 -318
2101c18j55J005P54j074q82P06N73q24l92N32K00j90mk86m2M17k7r45J79J089
$$ -318 -473 532 1286 212 -670 36 609 -215 -607 -75 125 -65 -69 -355 -397 20 -7 -952 -773 316
2121C16m7j120l69L90M37K79n21j004K29J235k69j314n9P64J74j05l44o98J04
$$ 316 269 -851 -1220 -830 -393 -114 -635 -1639 -1410 -175 -444 -1758 -1817 -1053 -879 -984 -1328 -2026 -1922
2140a922J114J21j064l11R36L99j39l28o38K37J381K05j266l47J045N40m40l21
$$ -1922 -808 -687 -1751 -2062 -1126 -727 -866 -1194 -1832 -1595 -214 -9 -1275 -1622 -577 -37 -477 -798
2158g98R5N96P02l89j315M75J796n4j496j12J329Q18n49j213m64J582J870j020
$$ -798 -703 -107 595 206 -1109 -634 1162 1108 -388 -500 829 1647 1098 -115 -579 1003 2873 1853
2176A853k483J50K236Q16j358j341L26J568R28j703j901J038K098j99j599m35
$$ 1853 -630 -480 1756 2572 1214 -127 199 1767 2695 992 -909 129 2227 2028 429 -6
2192fN76O11K41o30p56N61J045l92q96m0M02J34L17Q9q46k70M73J32k42n3j61
$$ -6 570 1181 1422 792 36 597 1642 1250 354 314 716 850 1167 1256 410 140 613 745 503 450 289
2213B89n14R9L91o00n07M52L9q52j03O15l29n94J72J13K15J19p81p87R55J485
$$ 289 -225 -126 265 -335 -842 -390 -351 -1203 -1306 -691 -1020 -1614 -1442 -1329 -1114 -995 -1776 -2563 -1608 -123
2233a23n20j587K86J173M91m68n70K60J337N94j431r83J460J623o09j035K91Q03
$$ -123 -643 -2230 -1944 -771 -280 -748 -1318 -1058 279 873 -558 -1541 -81 1542 933 -102 189 992
2251I92L12n03p80M86J709J97j909p77J575R25r54q57M29Q28K18j323j491P84
$$ 992 1304 801 21 507 2216 2413 504 -273 1302 2227 1273 416 845 1673 1891 568 -923 -139
2269a39K054j58k030p55R69N57m09o93n77O34R88m98j420k34J067L42q6p8m45
$$ -139 1915 1757 -273 -1028 -59 498 89 -604 -1181 -547 441 -57 -1477 -1711 -644 -302 -388 -466 -911
2288i11m31O88N27m81k02M44K45j2k21n65r0J174N57j367q97R49P71n40q04l23
$$ -911 -1342 -654 -127 -608 -810 -366 -121 -133 -354 -919 -1009 165 722 -645 -1542 -593 178 -362 -1166 -1489
2308a489P83Q57m51j842j81K084P37j710j008R89J164o5j014n82J134J602n09
$$ -1489 -706 151 -300 -2142 -2323 -239 498 -1212 -2220 -1231 -67 -132 -1146 -1728 -594 1008 499
2325D99j813K71J982N40r37m95N43P85L15o38l55J050R61p85j069Q70J062n12
$$ 499 -1314 -1043 939 1479 542 47 590 1375 1690 1052 697 1747 2708 1923 854 1724 2786 2274
2343B274p09J65O46K88n42j036r7J451M56j418r12N91M31m24m18l11j50L63j1
$$ 2274 1565 1730 2376 2664 2122 1086 989 2440 2896 1478 566 1157 1588 1164 746 435 285 648 637
2362F37r73n00L74M2l17K93k37r58p6Q82P9o99k15L21K87J87n25p27O66J312l36
$$ 637 -336 -836 -462 -420 -737 -444 -681 -1639 -1715 -833 -754 -1453 -1668 -1347 -1060 -873 -1398 -2125 -1459 -147 -483
2383d83j333J93J089J47n80k31J95Q25J56j107o78J361J098j207j352R31J308
$$ -483 -1816 -1623 -534 -387 -967 -1198 -1003 -178 -22 -1129 -1807 -446 652 -555 -1907 -976 332
2400C32j25j308q15J039J818j78k320o54K065J557j210j580K41J353J017q06j492
$$ 332 207 -1101 -1916 -877 941 763 -1557 -2211 -146 1411 201 -1379 -1138 215 1232 426 -1066
2417a066J40J906M63j304p47Q56M39n8p7k44j10M65J40l43K8K58l59k19P56J10
$$ -1066 -926 980 1443 139 -608 248 687 629 552 308 198 663 803 460 488 746 387 168 924 1034
2437A034q94l8N81J22q5j68l32M1N61r6o33J78M79n14l74N77L37q32m50N68M39
$$ 1034 140 102 683 805 720 552 220 261 822 726 93 271 750 236 -138 439 776 -56 -506 62 501
2458E01O3n12r21L20J440J52j732m37J246Q60o07r62k13Q60J096n70j545K14J590
$$ 501 564 52 -869 -549 891 1043 -689 -1126 120 980 373 -589 -802 58 1154 584 -961 -747 843
2477H43P0j274m09Q98M74l55p11k66P85P73r36r46P34J189n94j024J67Q31M34
$$ 843 913 -361 -770 128 602 247 -464 -730 55 828 -108 -1054 -320 869 275 -749 -582 249 683
2496F83k61q91k51J207P73j102r35Q08P84j31n87k61o0O66M44q13o58N04M43k78
$$ 683 422 -469 -720 487 1260 158 -777 31 815 684 97 -164 -224 442 886 73 -585 -81 362 84
2516H4k04j20k49J85N25l49p38R5N66L0k20j95m55M28P75l81j091K92J142m4q05
$$ 84 -120 -240 -489 -304 221 -128 -866 -771 -205 -175 -395 -590 -1045 -617 158 -223 -1314 -1022 120 76 -729
2537g29j91K90N78J53p67o45R93R68p48j023M64R65oo40m11K91R60K41j236n65
$$ -729 -920 -630 -52 101 -666 -1311 -318 650 -98 -1121 -657 308 302 -338 -749 -458 502 743 -493 -1058
2557a058J379P75r06q17M86P81J20m93p26K91J137J13j352l58J111M89q33m02
$$ -1058 321 1096 190 -627 -141 640 760 267 -459 -168 969 1082 -270 -628 483 972 139 -263
2575b63K48M36K93l79q74L01J074p6q83R3M36N7p9k3l57J50O27o7o84K5M19J7
$$ -263 -15 421 714 335 -539 -238 836 760 -123 -30 406 463 384 361 4 154 781 714 30 55 474 491
2597D91j56J30k52k22M71J76o46l11M41J78o5r3m41%P46P8r90k13J043L31o62
$$ 491 335 465 213 -9 462 638 -8 -319 122 300 235 142 -299 -299 447 525 -465 -678 365 696 34
2618C4n03J60N19L53l76p78L18J132l68j226J7J000L31n92n97k3P61M97p60j075
$$ 34 -469 -309 210 563 187 -591 -273 859 491 -735 -718 282 613 21 -576 -599 162 659 -101 -1176
2638a176P18J306l65j147j17N87M79Mo39m19P92P38p62r06N68P17j47l15j50k09
$$ -1176 -458 848 483 -664 -781 -194 285 289 -350 -769 23 761 -1 -907 -339 378 231 -84 -234 -443
2658d43L01L08l97m74M90M09m86k36J86j64P6L02j37m76K71M27l26l60K76J59
$$ -443 -142 166 -231 -705 -215 194 -292 -528 -342 -506 -430 -128 -265 -741 -470 -43 -369 -729 -453 -294
2678b94N0J49k31m81M26O00l96o07M09N65j35k17l41q0O24N49p83p34Q15Q74m84
$$ -294 -244 -95 -326 -807 -381 219 -177 -784 -375 190 55 -162 -503 -583 41 590 -193 -927 -112 762 278
2699B78o20K6M92N04l1q08l24J192N75r54q11P29Q53j04o21m75K57Q41J12j100
$$ 278 -342 -316 176 680 649 -159 -483 709 1284 330 -481 248 1101 997 376 -99 158 999 1111 11
2719A1m05J035M08p18m54J73L31K27j11o07M1P19m7q33Q9P39q9l48l4l8J03M37
$$ 11 -394 641 1049 331 -123 50 381 608 497 -110 -69 650 603 -230 -141 598 509 161 127 89 192 629
2741F29j47n97J25O63j74n25R1K2O1K64%o87p6O08N9n05j68J93K2L07l2p87j09
$$ 629 482 -115 10 673 499 -26 65 87 148 412 412 -275 -351 257 316 -189 -357 -164 -142 165 133 -654 -763
2764g63R97J82q79l52N04K39J36m30n11K64R10j22r67j13Q72J51m65k16J4M36
$$ -763 234 416 -463 -815 -311 -72 64 -366 -877 -613 297 175 -792 -905 -33 118 -347 -563 -549 -113
2784a13K76n11o50N96R51m21r78L15P21O9m35l48R0O01N12p57r10O25Q80k60o49
$$ -113 163 -348 -998 -402 549 128 -850 -535 186 255 -180 -528 -438 163 675 -82 -992 -367 513 253 -396
2805c96n7K51K76K8n71m61O50P13n56o59K61K91JK05j62k22L16M75l91n52M42
$$ -396 -453 -202 74 102 -469 -930 -280 433 -123 -782 -521 -230 -229 -24 -186 -408 -92 383 -8 -560 -118
2826a18L54J5P2p8k91J96M47l01l62N05M68m17k77q7J50K41K95n13m68O76M95
$$ -118 236 251 323 245 -46 150 597 296 -66 439 907 490 213 126 276 517 812 299 -169 507 1002
2847A002p89n96M87N98J1k10o56p0P19L50p99n17P50M96l80m84n3R0N40Qo39k41
$$ 1002 213 -383 104 702 713 503 -153 -223 496 846 47 -470 280 776 396 -88 -141 -51 489 497 -142 -383
2869c83P09K45p21k00M20J61%j62l14N6O52k8q04l6P82J26m46j51k6J59L75j64
$$ -383 326 571 -150 -350 70 231 231 69 -245 -189 463 435 -369 -405 377 503 57 -94 -120 39 414 250
2891B50p64J16R07pp64l03J79K70K71o1o57j6P08q4p53l6O12J56m1q8m84m8N95
$$ 250 -514 -398 509 502 -262 -565 -386 -116 155 94 -563 -579 129 45 -708 -744 -132 24 -17 -105 -589 -637 -42
2914d2P2m60J37O33k38n41r5K70J42L51j63n47J68N99m47o17L61O22Pk31m11m03
$$ -42 30 -430 -293 340 102 -439 -534 -264 -122 229 66 -481 -313 286 -161 -778 -417 205 212 -19 -430 -833
2936h33L84P87l08o73K86O26j94m34j01l6N15N65l60q94K17O89j02l16R5Q7O3
$$ -833 -449 338 30 -643 -357 269 75 -359 -460 -496 19 584 224 -670 -453 236 134 -182 -87 0 63
2957F3J77l06m92M29O29k46m83J66L52j88n5K8j10L33L58m67n02N92N70l73m64
$$ 63 240 -66 -558 -129 500 254 -229 -63 289 101 46 74 -36 297 655 188 -314 278 848 475 11
2978A1J98J99K34Q8n53l82P62N45p25o64N22L96O7k27m59k26O83M42o87m63M92
$$ 11 209 408 642 730 177 -205 557 1102 377 -287 235 631 698 471 12 -214 469 911 224 -239 253
2999B53M10l02k45m0r9M45L21n76l98M09J71m14J9K74q6j44O5l60k02M56K20n12
$$ 253 663 361 116 76 -23 422 743 167 -231 178 349 -65 -46 228 142 -2 63 -297 -499 -43 177 -335
3021c35r7L65n9l66K3M3J7M29L4p54j70P33J87m42r7O3J44K17j15n84l4Q22K46
$$ -335 -432 -67 -126 -492 -469 -426 -409 20 54 -700 -870 -137 50 -392 -489 -426 -282 -65 -180 -764 -798 24 270
3044B70p25k15L08J57O2j7l66K8O75M1q28o3O88K49l99k9O3Q5L04k72n05L26P68
$$ 270 -455 -670 -362 -205 -143 -160 -526 -498 177 218 -610 -673 15 264 -135 -164 -101 -16 288 16 -489 -163 605
3067F05j75p04MM53J46j55j19l22L51M67l89p19K93O52q7k72j26q0J17M28k68
$$ 605 430 -274 -270 183 329 174 55 -267 84 551 162 -557 -264 388 301 29 -97 -177 -60 368 100
3088A00m99L38N61k21m51Q0J52P7K82j16n17J49N47k65l81K03J97K9K2j89m19
$$ 100 -399 -61 500 279 -172 -92 60 137 419 303 -214 -65 482 217 -164 39 236 265 287 98 -321
3109c21K30P41k56p25K23N29l1l00j76k1M79M29n32o93M43O37k00m76MK91J18
$$ -321 -91 650 394 -331 -108 421 390 90 -86 -107 372 801 269 -424 19 656 456 -20 -16 275 393
3130C93J48m42m16M97M81m44n23L61L31l19j29R9l5J76J00n08j25O03J96o40k16
$$ 393 541 99 -317 180 661 217 -306 55 386 67 -62 37 2 178 278 -230 -355 248 444 -196 -412
3151d12M38J58j31q0l37N2N56ro87j05N66J66l48q9k04p8M12J93n00j87M98J27
$$ -412 26 184 53 -27 -364 -312 244 235 -452 -557 9 175 -173 -262 -466 -544 -132 61 -439 -626 -128 -1
3173am03j24J23pL45K49n16l92M78K07k87j3K42kL6N2m89j27O85L40n24l12M77
$$ -1 -404 -528 -405 -412 -67 182 -334 -726 -248 -41 -328 -341 -99 -101 -65 -13 -502 -629 56 396 -128 -440 37
3196C7J2l00p7O7K32M79j93q69KQ64J81o04r5L52K96L7m55n48L73J024q3r12j00
$$ 37 49 -251 -328 -261 -29 450 257 -612 -610 254 435 -169 -264 88 384 421 -34 -582 -209 815 732 -180 -280
3219b80M46K65j71k50j85L30O24l44q52P9P04M9j81p8q5rJ97Q2m80J39M65j38
$$ -280 166 431 260 10 -175 155 779 435 -417 -338 366 415 234 156 71 62 259 341 -139 0 465 327
3241C27j98J36j16j35K05K36l36j19L61j95k51J78J43k60n9J92j34J13K10k48
$$ 327 129 265 149 14 219 455 119 0 361 166 -85 93 236 -24 -83 109 -25 88 298 50
3261E0l86L08M46l50l19K05J83N2m5l11k40M51O98n46n78K38L58l8j50k27k2M39
$$ 50 -336 -28 418 68 -251 -46 137 189 144 -167 -407 44 742 196 -382 -144 214 176 26 -201 -223 216
3283B16L36o60o43M83O12j65l24J5k8J49N8l92j21N91K73n22l34L85O1j74R5k7
$$ 216 552 -108 -751 -268 344 179 -145 -130 -158 -9 49 -343 -464 127 400 -122 -456 -71 -10 -184 -89 -116
3305a16n7K89l4o50r3O88J59m63j61J25N3J02o4l61j3O23J38o54k19L19K43J44
$$ -116 -173 116 82 -568 -661 27 186 -277 -438 -313 -260 -158 -222 -583 -596 27 165 -489 -708 -389 -146 -2
3327bj2m65PN78K45o35l34N29M36p0j77m39l9O81L13o22l04M04L85j12p6k51j04
$$ -2 -14 -479 -472 106 351 -284 -618 -89 347 277 100 -339 -378 303 616 -6 -310 94 479 367 291 40 -64
3350f4M82J88m00k46M20O3l06O0K29n2r0J42k67qK39m3m20R6N32l30l58J24Q6
$$ -64 418 606 206 -40 380 443 137 197 426 374 284 426 159 151 390 347 -73 23 555 225 -133 -9 77
3373G7J27Q4k73m15L25N79k87o22J33M16Q5k9k61l38L35O20k56o41J09N07K5k04
$$ 77 204 288 15 -400 -75 504 217 -405 -272 144 229 200 -61 -399 -64 556 300 -341 -232 275 300 96
3395I6q9k17J00M12j55m53J64L10k55j75J83K7j00J07j24k29L31L23m58l62M53
$$ 96 7 -210 -110 302 147 -306 -142 168 -87 -262 -79 -52 -152 -45 -169 -398 -67 256 -202 -564 -111
3416a11K62k27j30m9J09K67K01n09k97O12L79l47l70K7K02K78Q7n39l30N56N55
$$ -111 151 -76 -206 -255 -146 121 322 -187 -484 128 507 160 -210 -183 19 297 384 -155 -485 71 626
3437F26m17n27J11L88J69N2n50l68N72N07l45o22K04L21r3m5j76j37J93L01m15
$$ 626 209 -318 -207 181 350 402 -148 -516 56 563 218 -404 -200 121 28 -17 -193 -330 -137 164 -251
3458b51m76M06K77j94j91R2k0K1J23l45m0N63J29m78j43L52O5j29P8j2Q3K35J7
$$ -251 -727 -321 -44 -238 -429 -337 -357 -336 -213 -558 -598 -35 94 -384 -527 -175 -110 -239 -161 -173 -90 145 162
3481A62m50p5N88J14l22j0J15j5J34Kl17L1N56J0m60o8K42j3R0L6j71N1K75o7
$$ 162 -288 -363 225 339 17 7 122 107 241 243 -74 -43 513 523 63 -5 237 224 314 350 179 230 505 438
3505D38m26J32M85n0k46O4j22J05J89p2m64J76M56n4m47j07J86R9%q9l50P8M53
$$ 438 12 144 629 579 333 397 275 380 569 497 33 209 665 611 164 57 243 342 342 253 -97 -19 434
3528D34j81m92N0M30m2j94r6n5J17J53j95m85K51M34p0m15L6J8J29J71j93m23
$$ 434 253 -239 -189 241 199 5 -91 -146 -29 124 -71 -556 -305 129 59 -356 -320 -302 -173 -2 -195 -618
3550f18L23M60k98m86R9L73N1k0j85k65K58L84k61n22K68M97qk79j31r9K59K94
$$ -618 -295 165 -133 -619 -520 -147 -96 -116 -301 -566 -308 76 -185 -707 -439 58 50 -229 -360 -459 -200 94
3572I4k43l56J80M47k50k76Q9M3MK98j71k53K62K11l04j16L49J99j77p8M5k1J75
$$ 94 -149 -505 -325 122 -128 -404 -315 -272 -268 30 -141 -394 -132 79 -225 -341 8 207 30 -48 -3 -24 151
3595A51Q8j89o5L76J71m46j12J81J01J67k9k38k17M44J05m74j81M03R9j42m1j81
$$ 151 239 50 -15 361 532 86 -26 155 256 423 394 156 -61 383 488 14 -167 236 335 193 152 -29
3617b9j54L54K63m80k39L79J84k39j47P6j12L10J68l97j23M18P3k91n8K10J22
$$ -29 -183 171 434 -46 -285 94 278 39 -108 -32 -144 166 334 -63 -186 232 305 14 -44 166 288
3638B88r4J8k22L7L99k6m98J14M59j2l51r8Q8J40K10j43m26M9M66k7n08L5J50
$$ 288 194 212 -10 27 426 400 -98 16 475 463 112 14 102 242 452 309 -117 -68 398 371 -137 -102 48
3661D8J18K0j79m06J29M30J3n24M8J73Jm4n3j76q7M25J2m21K6L82j09j51J08r4
$$ 48 166 186 7 -399 -270 160 173 -351 -303 -130 -129 -173 -226 -402 -489 -64 -52 -473 -447 -65 -174 -325 -217 -311
3685c11K1K78m4l04K2L64m3l24N9J36n4P8lk90J62L41j85m30K06L52r7j06q3J8
$$ -311 -290 -12 -56 -360 -338 26 -17 -341 -282 -146 -200 -122 -125 -415 -253 88 -97 -527 -321 31 -66 -172 -255 -237
3709b37J19K84k64l76L03M88k00l44K1K44J31Q2l31j14L34L45l86k96L15K54j40
$$ -237 -118 166 -98 -474 -171 317 117 -227 -206 38 169 251 -80 -194 140 485 99 -197 118 372 232
3730B32j09l9j5J66K57l28k76L69J68k34j12J37oN3J69k57j71K28J11k90l3K20
$$ 232 123 84 69 235 492 164 -112 257 425 191 79 216 210 263 432 175 4 232 343 53 20 240
3752B40o4j56J54r2j82K53Q4l10j03K05R5j33m0l7o4J55K50l95j86L45J99j92
$$ 240 176 20 174 82 -100 153 237 -73 -176 29 124 -9 -49 -86 -150 5 255 -140 -326 19 218 26
3774B6j96M7N6J75O6l24j24M53J21m09k11L71J55q3p7j78K1L06R5m71o8M88M6
$$ 26 -170 -123 -67 108 174 -150 -274 179 300 -109 -320 51 206 123 46 -132 -111 195 290 -181 -249 239 285
3797B85l56l6J54j6J37rk51J20L47k18m15J19M41q1k45j5j71K12J40j73l81J30
$$ 285 -71 -107 47 31 168 159 -92 28 375 157 -258 -139 302 221 -24 -39 -210 2 142 -31 -412 -282
3819b82L55j44k97O4L9j8K18l4l25K7L04kk27P4Q6k1J72m7l75O9M95K3l56o8J36
$$ -282 73 -71 -368 -304 -265 -283 -65 -99 -424 -397 -93 -95 -322 -248 -162 -183 -11 -58 -433 -364 131 154 -202 -270 -134
3844a34J52P7j10k37J61L59o2m51O0L69r5k05Pj5K19J81l00l64L39M45k73m65
$$ -134 18 95 -15 -252 -91 268 206 -245 -185 184 89 -116 -109 -124 95 276 -24 -388 -49 396 123 -342
3866c42J76K44J01m8j72j96L19K75l07l77L66L20j98k11J18K9J08J73j95j10K48
$$ -342 -166 78 179 131 -41 -237 82 357 50 -327 39 359 161 -50 68 97 205 378 183 73 321
3887C21J11k66k6K75L3j75O3k1j05Q6J37k04l8K83j49l03L2R1j2n5J43k43j68
$$ 321 432 166 140 415 448 273 336 315 210 296 433 229 191 474 325 22 54 145 133 78 221 -22 -190
3910a90K37jk15L5j3J2O4J06l19j54L28K81k91k54J72M5Q6K3j70r7M22P4m67k10
$$ -190 47 46 -169 -134 -147 -135 -71 35 -284 -438 -110 171 -120 -374 -202 -157 -71 -48 -218 -315 107 181 -286 -496
3934d96M96J92k58k01O7J19K09r6l49j5N66mn05j89L65K37j04k40k61K17M79j64
$$ -496 0 192 -66 -267 -200 -81 128 32 -317 -332 234 230 -275 -464 -99 138 34 -206 -467 -250 229 65
3956F5n63L5N09L9k21j41rQ8J80mk68N3L21j05j62J07M3j21J28J83j90j37J86
$$ 65 -498 -463 46 85 -136 -277 -286 -198 -18 -22 -290 -237 84 -21 -183 -76 -33 -154 -26 157 -33 -170 16
3979A6K5l8J12o6j11P3K44k37n1K46N7l07p8K58O3r3r0j21J60K81k15l69L2N61
$$ 16 41 3 115 49 -62 11 255 18 -33 213 270 -37 -115 143 206 113 23 -98 62 343 128 -241 -209 352
4003C52n3l98j6J49J53J05k38k73J96N00k17m49J92L19j00j16n4N7P4J31k74j72
$$ 352 299 -99 -115 34 187 292 54 -219 -23 477 260 -189 3 322 222 106 52 109 183 314 40 -132
4025a32M17J19m94j02L26K02k25j69m6J42K80n1n43K3N33J76m09j63J59L1J97
$$ -132 285 404 -90 -192 134 336 111 -58 -104 38 318 267 -276 -253 280 456 47 -116 43 74 271
4046B71j07k27j61L32J67k75r8L0l4J03J49j44l91K35K73j42k07j9m1J68K75l10
$$ 271 164 -63 -224 108 275 0 -98 -68 -102 1 150 6 -385 -150 123 -19 -226 -245 -286 -118 157 -153
4068a53m40L51L34j49l14Q3K25j7o5j48q4L38Q9l25k90M97K77m47j95K59K22J20
$$ -153 -593 -242 92 -57 -371 -288 -63 -80 -145 -293 -377 -39 50 -275 -565 -68 209 -238 -433 -174 48 168
4090A68k17l41J29N67N8o40j07M34J78k00k71L1K37K64j63m37J47L80o6l21M7
$$ 168 -49 -390 -261 306 364 -276 -383 51 229 29 -242 -211 26 290 127 -310 -163 217 151 -170 -123
4111a23J77j00p1P9l4L7M4j71l5K85N3l56j1L89Q8k15r9KO4K01J46j96j34K30
$$ -123 54 -46 -117 -38 -72 -35 9 -162 -197 88 141 -215 -226 163 251 36 -63 -61 3 204 350 154 20 250
4135B50J8j42J82L5j89OK72r1k08PP9N6J72j43m30N6N29k6n22Q0K14Q0j65k24
$$ 250 268 126 308 343 154 160 432 341 133 140 219 275 447 304 -126 -70 459 433 -89 -9 205 285 120 -104
4159a04o6K39L71l54m67K43M48j95l22j0K36J96j71k66j31M37L15m89l32L72K97
$$ -104 -170 69 440 86 -381 -138 310 115 -207 -217 19 215 44 -222 -353 84 399 -90 -422 -50 247
4180B47j79k48j3J58K28Q7m71j59L89J77k42k61K15L5n8j8p1r4J19M6j98J3J04
$$ 247 68 -180 -193 -35 193 280 -191 -350 39 216 -26 -287 -72 -37 -95 -113 -184 -278 -159 -113 -311 -298 -194
4203a94j78K5J80M1k71J7K35p1LL6l5k9K45j04k19R6L57q1k09P9J36p5M8m8o0
$$ -194 -372 -347 -167 -126 -397 -380 -145 -216 -213 -177 -212 -241 4 -100 -319 -223 134 53 -156 -77 59 -16 32 -16 -76
4228g6K15J55k73k33L08K25k55k25K60O2n0n9k93J24L65J00n11n4L30J36l21k1
$$ -76 139 294 21 -212 96 321 66 -159 101 163 113 54 -239 -115 250 350 -161 -215 115 251 -70 -91
4250i1J60L9K5q1k21P3L55j31l61K04L31j14k25l7j9K99J57k62k63K47L46j75
$$ -91 69 108 133 52 -169 -96 259 128 -233 -29 302 188 -37 -74 -93 206 363 101 -162 85 431 256
4272B56l46J50J32L7J2j46j05K00J59j30k34J48l5l6J19J1k67l4K92kk58k5K7
$$ 256 -90 60 192 229 241 95 -10 190 349 219 -15 133 98 62 181 192 -75 -109 183 181 -77 -102 -75
4295g5N6J95j21k32n8M19J2l36l0K34O7j24o8p7J52J99k24k65J61L14q9k75M5
$$ -75 -19 176 55 -177 -235 184 196 -140 -170 64 131 7 -61 -138 14 213 -11 -276 -115 199 110 -165 -120
4318a20J45R5o8k35j23L69K11l28l21K03L27j80k28J05J0P0P9j93j81L31J30k75
$$ -120 25 120 52 -183 -306 63 274 -54 -375 -172 155 -25 -253 -148 -138 -68 11 -182 -363 -32 98 -177
4340a77q5J97O5k25K4J07j26J27O3k38OJ68m1j58J08J59j35l0j5J6L0J92o0j49
$$ -177 -262 -65 0 -225 -201 -94 -220 -93 -30 -268 -262 -94 -135 -293 -185 -26 -161 -191 -206 -190 -160 32 -28 -177
4364a77O9J60q6o0J87q5j58K66N0k26NJ63N3j5P5j60j49K91J50l64n6K77J37j72
$$ -177 -108 52 -34 -94 93 8 -150 116 166 -60 -55 108 161 146 221 61 -88 203 353 -11 -67 210 347 175
4388A75o7n5O5K60o6k87j06L91R3l59p1J55N8K4n1k64M2M31j30l44k1L80l5k29
$$ 175 108 53 118 378 312 25 -81 310 403 44 -27 128 186 210 159 -105 -63 368 238 -106 -127 253 218 -11
4412a1%l0Q5J36Ml27J30K83j30k39J59R3q7L3nk22J23K35j10j11O9Q9j63oJ32
$$ -11 -11 -41 44 180 184 -143 -13 270 140 -99 60 153 66 99 94 -128 -5 230 120 9 78 167 4 -2 130
4437A30k47l1K62j9k87Q0J44j39l0J08n3j29J71O1k68l1K73m4j69L7N3j6J15o0
$$ 130 -117 -148 114 95 -192 -112 32 -107 -137 -29 -82 -211 -40 21 -247 -278 -5 -49 -218 -181 -128 -144 -29 -89
4461h9j85K8L09j50k27Q7K70k03J1R1o2N8J01j23k72K36K37j75k27J74R3q4N1
$$ -89 -274 -246 63 -87 -314 -227 43 -160 -149 -58 -120 -62 39 -84 -356 -120 117 -58 -285 -111 -18 -102 -51
4484e1n6j43K28J98k77j63K19J21j37k0L7j4J53O8k45o3K03J43k20j5J22p2Q2
$$ -51 -107 -250 -22 176 -101 -264 -45 76 -61 -81 -44 -58 95 163 -82 -145 58 201 -19 -34 88 16 98
4507I8P7j71o6L12N5j63q3J09J3k1M1k6j55K64P8l01q5K50J0p7n5J2p2J42Q2k44
$$ 98 175 4 -62 250 305 142 59 168 181 160 201 175 20 284 362 61 -24 226 236 159 104 116 44 186 268 24
4533B4p2K44P0k08n2Q0j9L2Q4j46j22K27R5k42q8J87j1J5o4j0q2J31P3l12K6K80
$$ 24 -48 196 266 58 6 86 67 99 183 37 -85 142 237 -5 -93 94 83 98 34 24 -58 73 146 -166 -140 140
4559A40Lk93O7k7k2J09L4j70j1K63p6k27L0J06J0j3L3j25l6K23J5k67O3J74p4
$$ 140 143 -150 -83 -110 -132 -23 11 -159 -170 93 17 -210 -180 -74 -64 -77 -44 -169 -205 18 33 -234 -171 3 -71
4584g1o9P5q0OJ19K5k19K4L02r5k28J9K15n1l0m3j22J23J94j66j78J31J90j66
$$ -71 -140 -65 -145 -139 -20 5 -214 -190 112 17 -211 -192 23 -28 -58 -101 -223 -100 94 -72 -250 -119 71 -95
4608i5pRl1J23R3k07j58K13J65j01j98J60J6P0rk2j90K10J45j12j71J25P9j8L5
$$ -95 -102 -93 -124 -1 92 -115 -273 -60 105 4 -194 -34 -18 52 43 21 -169 41 186 74 -97 28 107 89 124
4633A24k9j09O8K07j15k24J17K05j68m2N9j52J37J41r0k38J52J57j40j06J28J0
$$ 124 95 -14 54 261 146 -78 39 244 76 34 93 -59 78 219 129 -109 43 200 60 -46 82 92
4655I2o4R4q8j14J94J75k38j69K48P3r5k1l1o4K49O6l21j18L28J39k13q9Q7KJ00
$$ 92 28 122 34 -80 114 289 51 -118 130 203 108 87 56 -8 241 307 -14 -132 196 335 122 33 120 122 222
4680B22n2j46r5K86O5k62j19K73m8r0L5m3q2N6N3j72J4R9J4j04J1N6j05P6%r5
$$ 222 170 24 -71 215 280 18 -101 172 124 34 69 26 -56 0 53 -119 -105 -6 8 -96 -85 -29 -134 -58 -58 -153
4706a53p6J95l9j54K2J57o2K1L0p1r9K97L8k73j8K68j07q2L4N4j04J70N6l10r3
$$ -153 -229 -34 -73 -227 -205 -48 -110 -89 -59 -130 -229 68 106 -167 -185 83 -24 -106 -72 -18 -122 48 104 -206 -299
4731b99L32l9j63j9J11l5J23o8k36M4K54O0k53K4P7J7K0O3r6oK15o2k70J72J71
$$ -299 33 -6 -169 -188 -77 -112 11 -57 -293 -249 5 65 -188 -164 -87 -70 -50 13 -83 -89 126 64 -206 -34 137
4756A37k7k27R9R5m3R7pj91K16J36k26j95K30Q2j16P0l0p2J27Q5j59j46K26J09
$$ 137 110 -117 -18 77 34 131 124 -67 149 285 59 -136 94 176 60 130 100 28 155 240 81 -65 161 270
4780B70j50q1N3r4J25R5j12j65R9K27k10q1R1p8R9J36j53j93K08J53j34j60J48
$$ 270 120 39 92 -2 123 218 106 -59 40 267 57 -24 67 -11 88 224 71 -122 86 239 105 -55 93
4803I3K5o7J51j0k16R9J87j33k09J98O0j55R4k2K0m3O1k30k6K10J04k64j33K09
$$ 93 118 51 202 192 -24 75 262 129 -80 118 178 23 117 95 115 72 133 -97 -123 87 191 -73 -206 3
4827CO9j00Nq4k5J46pk75LK78l9j32l1K2JR4O2k12p2L11M7l01Q1M0j5OJ02r4o7
$$ 3 72 -28 -23 -107 -132 14 7 -268 -265 13 -26 -158 -189 -167 -166 -72 -10 -222 -294 17 64 -237 -156 -116 -131 -125 -23 -117 -184
4856a84R4N1j60O4J62j40m1R6J9j14R4J04j40qJ45Lk35J02J10l8J3L3k41Q4K48
$$ -184 -90 -39 -199 -135 27 -113 -154 -58 -39 -153 -59 45 -95 -103 42 45 -190 -88 22 -16 -3 30 -211 -127 121
4881A21m7k38N7J33n0L2r9m1J00K61q3k60P8K45o1j05Q0q0N2J10n9j63N1K02o6
$$ 121 74 -164 -107 26 -24 8 -91 -132 -32 229 146 -114 -36 209 148 43 123 43 95 205 146 -17 34 236 170
4906A70j31O6M1o3O8k5k1K6J10j38j28J11J13j06k9R4j73J61K9j00n6R9O2j33
$$ 170 39 105 146 83 151 126 105 131 241 103 -25 86 199 93 64 158 -15 146 175 75 19 118 180 47
4930D7j32J73J7j14Q3o2j56J38J98j47j55J76m6j9j6k7j12J67J70j41j86R7J53
$$ 47 -85 88 105 -9 74 12 -144 -6 192 45 -110 66 20 1 -15 -42 -154 13 183 42 -144 -47 106
4953A06j56n7Ol7J10Q4j07j39J36J53j66r6J32O3j39K7m0m2J57K8j82j08J88J58
$$ 106 -50 -107 -101 -138 -28 56 -51 -190 -54 99 -67 -163 -31 32 -107 -80 -120 -162 -5 23 -159 -267 -79 79
4977G9j93N0m6p8J71Mj40q7J91Q6k04L0J04j3q3P3r2l0J94j7j52J2J69n9l4j7
$$ 79 -114 -64 -110 -188 -17 -13 -153 -240 -49 37 -167 -137 -33 -46 -129 -56 -148 -178 16 -1 -153 -141 28 -31 -65 -82
5003h2K8q0J19L5j11l5J91K4j83N2J7j5Q0J4q6r0K18nj56qJ12j8J24L1j85j16
$$ -82 -54 -134 -15 20 -91 -126 65 89 -94 -42 -25 -40 40 54 -32 -122 96 91 -65 -73 39 21 145 176 -9 -125
5029a25K59R1k12qJ58p4j2J02r7o2J37N2j59k5J27nj98J85Q5m0j05K8p4J28J30
$$ -125 134 225 13 5 163 89 77 179 82 20 157 209 50 25 152 147 -51 134 219 179 74 102 28 156 286
5054B86j90j42J00J82j02j24P8j12R0J60j54j73J27J42j39k5lj0N2J05j61k02
$$ 286 96 -46 54 236 134 10 88 -24 66 226 72 -101 26 168 29 4 1 -9 43 148 -13 -215
5076b15J24K42j06j30lP9q0J37j0j51K9O9oj16J68p7r5K9J28j58Q1N2j46j9J57
$$ -215 -91 151 45 -85 -88 -9 -89 48 38 -113 -84 -15 -21 -137 31 -46 -141 -112 16 -142 -61 -9 -155 -174 -17
5101a7Q5k30q8J65P9Rk6p1j77K14J48j72j24J56Rj4k4q2o6J96R4j79j12J86N1
$$ -17 68 -162 -250 -85 -6 3 -23 -94 -271 -57 91 -81 -205 -49 -40 -54 -78 -160 -226 -30 64 -115 -227 -41 10
5126A0j38O7N7r0k1J16m9j26J28P2r6M6Q1j09j3J21Rr9O2N2j32O3J02o9j06R7
$$ 10 -128 -61 -4 -94 -115 1 -48 -174 -46 26 -70 -24 57 -52 -65 56 65 -34 28 80 -52 11 113 44 -62 35
5152C5L8j4M1Lj83K2K87mk22j6R8qQ9k6p9m2J80K3j21p3J51K7j48N5j0lJ42o9
$$ 35 73 59 100 103 -80 -58 229 225 3 -13 85 77 166 140 61 19 199 222 101 28 179 206 58 113 103 100 242 173
5180A73j19j8J63p4j45J41q1Q9mj0j19Q0P9j25n0Q6J25j51r9rL0J37Kj18j30J14
$$ 173 54 36 199 125 -20 121 40 129 125 115 -4 76 155 30 -20 66 191 40 -59 -68 -38 99 101 -17 -147 -33
5206c3J52q4q8k2j5K3J60r7j89L7J49l2Rm0l8o4J36Rj02JJ78p3q2j5N1jqO2r3
$$ -33 119 35 -53 -75 -90 -67 93 -4 -193 -156 -7 -39 -30 -70 -108 -172 -36 -27 -129 -128 50 -23 -105 -120 -69 -70 -78 -16 -109
5235a09K2J10q4r8N7O3k1r4N9k2L5L7p2j39K44P4j44j72J38J66j47Kl3JJ28L3
$$ -109 -87 23 -61 -159 -102 -39 -60 -154 -95 -117 -82 -45 -117 -256 -12 62 -82 -254 -116 50 -97 -95 -128 -127 1 34
5261C4j19j18J66J1n0L6R7j16MJ46q1j4L6L3n6kJ92o5j51KM0L0J17n7j42J6K12
$$ 34 -85 -203 -37 -26 -76 -40 57 -59 -55 91 10 -4 32 65 9 7 199 134 -17 -15 25 55 172 115 -27 -11 201
5288B01pj10p0L1p3Q9O1k08PK03P3j86m2k2P7Q6J6j37q5K73J0j36l3J03k%M6j00
$$ 201 194 84 14 45 -28 61 122 -86 -79 124 197 11 -31 -53 24 110 126 -11 -96 177 187 51 18 121 119 119 165 65
5316F5p4J57O9k02J1J66o8m7Q5p2K5k5Rq1K2J86j22k01K8K22m2p8r2n8N7J84j60
$$ 65 -9 148 217 15 26 192 124 77 162 90 115 90 99 18 40 226 104 -97 -69 153 111 33 -59 -117 -60 124 -36
5343c6j64N4K30r1n7k0l8m3J14n8r3LJ64n7Oo6O3r9J39M1j98O5J01Nj47J24L5
$$ -36 -200 -146 84 -7 -64 -84 -122 -165 -51 -109 -202 -199 -35 -92 -86 -152 -89 -188 -49 -8 -206 -141 -40 -35 -182 -58 -23
5370b3j46N7J31j38m8J48o4l0O2N9j22m0O3R6k1j6r2o8J70J44j21j45Q3P5N0r3
$$ -23 -169 -112 19 -119 -167 -19 -83 -113 -51 8 -114 -154 -91 5 -16 -32 -124 -192 -22 122 1 -144 -61 14 64 -29
5396b9l2n2J73J26j50q0J06Q0j32K0L9J9nM2j27k4J44R9j69m8N6J03j21JR4j48
$$ -29 -61 -113 60 186 36 -44 62 142 10 30 69 88 83 125 -2 -26 118 217 48 0 56 159 38 39 133 -15
5422a5Q4K0j19j8K42k7j47K3K6o7Q5J5p6m4J78j2j61L1N1o5L8R2j12m6J24N4p5
$$ -15 69 89 -30 -48 194 167 20 43 69 2 87 102 26 -18 160 148 -13 18 69 4 42 134 22 -24 100 154 79
5449G9j70J21QL9L1o1r4J11P2j90nJ35J8j26M2l8n9J29N5j51j0J80rj47J5pR8
$$ 79 -91 30 38 77 108 47 -47 64 136 -54 -59 76 94 -32 10 -28 -87 42 97 -54 -64 116 107 -40 -25 -32 66
5476F6m5k3q6L7R9rj85M8J46o8q5M8%n8J54p5j54N2J31j01n6O7N2j33K6N4o9Q4
$$ 66 21 -2 -88 -51 48 39 -146 -98 48 -20 -105 -57 -57 -115 39 -36 -190 -138 -7 -108 -164 -97 -45 -178 -152 -98 -167 -83
$$ [...]
8191E
##END NTUPLES=NMR FID
##END=
