##TITLE=1H_TG-2300-B1
 CDCl3, 8 sc, 
 26.8.2020
##JCAMPDX= 6.0         $$ Bruker NMR JCAMP-DX V2.0
##DATA TYPE= NMR FID
##DATA CLASS= NTUPLES
##ORIGIN= UXNMR, Bruker Analytische Messtechnik GmbH
##OWNER= root
$$ XWIN-NMR		Version 3.5
$$ Thu Aug 27 11:26:50 2020 Russian Standard Time (UT+4h)  she@DPX200
##.OBSERVE FREQUENCY= 200.1315066352
##.OBSERVE NUCLEUS= ^1H
##.DELAY= (6, 6)
##.ACQUISITION MODE= SIMULTANEOUS
##.ACQUISITION SCHEME= undefined
##.AVERAGES= 8
##.DIGITISER RES= 18
##SPECTROMETER/DATA SYSTEM= spect
##.PULSE SEQUENCE= zg30
##.SOLVENT NAME= CDCl3
##.SHIFT REFERENCE= (INTERNAL, CDCl3, 0, 15.7039)
##AUDIT TRAIL= $$ (NUMBER, WHEN, WHO, WHERE, WHAT)
$$ ##TITLE= Audit trail, XWIN-NMR		Version 3.5
$$ ##JCAMPDX= 5.01
$$ ##ORIGIN= Bruker BioSpin GmbH
$$ ##OWNER= she
$$ F:/spectra/data/she/nmr/H-F/1/audita.txt
$$ ##AUDIT TRAIL=  $$ (NUMBER, WHEN, WHO, WHERE, WHAT)
(   1,<2020-08-27 11:25:42.01 +0400>,<she>,<DPX200>,
      <created by zg, POWCHK disabled, PULCHK disabled
       configuration hash MD5:
       00 E9 B6 7A A2 85 ED C7 34 08 36 98 17 FE 4E 26
       data hash MD5: 16K
       28 16 CF E4 71 7C E0 47 6E 0A 22 3C 0A 4D 2A FB>)
$$ ##END=
$$ 
$$ hash MD5
$$ EB CB 0E BE F0 42 47 82 DF 4E 61 56 50 08 C4 86
##$RELAX= 
##$RELAX= 
##$RELAX= 
##$RELAX= 
##$RELAX= 
##$RELAX= 
$$ Bruker specific parameters
$$ --------------------------
##$DU= <F:/spectra>
##$EXPNO= 1
##$NAME= <H-F>
##$PROCNO= 1
##$TYPE= <nmr>
##$USER= <she>
##$AMP= (0..31)
100 100 100 100 100 100 100 100 100 100 100 100 100 100 100 100 100 100 
100 100 100 100 100 100 100 100 100 100 100 100 100 100 
##$AQSEQ= 0
##$AQ_mod= 1
##$AUNM= <au_zg>
##$AUTOPOS= <>
##$BF1= 200.13
##$BF2= 200.13
##$BF3= 200.13
##$BF4= 200.13
##$BF5= 200.13
##$BF6= 200.13
##$BF7= 200.13
##$BF8= 200.13
##$BYTORDA= 1
##$CFDGTYP= 0
##$CFRGTYP= 5
##$CHEMSTR= <none>
##$CNST= (0..31)
1 1 145 1 1 1 1 1 1 1 1 1 1 1 1 1 1 1 1 1 1 1 1 1 1 1 1 1 1 1 1 1 
##$CPDPRG= <>
##$CPDPRG1= <>
##$CPDPRG2= <>
##$CPDPRG3= <>
##$CPDPRG4= <mlev>
##$CPDPRG5= <mlev>
##$CPDPRG6= <mlev>
##$CPDPRG7= <mlev>
##$CPDPRG8= <mlev>
##$CPDPRGB= <>
##$CPDPRGT= <>
##$D= (0..31)
0 1.2 0 0 0 0 0 0 0 0.06 0 0.03 0 0 0 0 0.0002 0 0 0 0 0 0 0 0 0 0 0 0 
0 0 0 
##$DATE= 1598513141
##$DBL= (0..7)
120 120 120 120 120 120 120 120 
##$DBP= (0..7)
150 150 150 150 150 150 150 150 
##$DBP07= 0
##$DBPNAM0= <>
##$DBPNAM1= <>
##$DBPNAM2= <>
##$DBPNAM3= <>
##$DBPNAM4= <>
##$DBPNAM5= <>
##$DBPNAM6= <>
##$DBPNAM7= <>
##$DBPOAL= (0..7)
0.5 0.5 0.5 0.5 0.5 0.5 0.5 0.5 
##$DBPOFFS= (0..7)
0 0 0 0 0 0 0 0 
##$DE= 6
##$DECBNUC= <off>
##$DECIM= 32
##$DECNUC= <off>
##$DECSTAT= 4
##$DIGMOD= 1
##$DIGTYP= 9
##$DL= (0..7)
0 120 120 120 120 120 120 120 
##$DP= (0..7)
150 150 150 150 150 150 150 150 
##$DP07= 0
##$DPNAME0= <>
##$DPNAME1= <>
##$DPNAME2= <>
##$DPNAME3= <>
##$DPNAME4= <>
##$DPNAME5= <>
##$DPNAME6= <>
##$DPNAME7= <>
##$DPOAL= (0..7)
0.5 0.5 0.5 0.5 0.5 0.5 0.5 0.5 
##$DPOFFS= (0..7)
0 0 0 0 0 0 0 0 
##$DQDMODE= 0
##$DR= 18
##$DS= 0
##$DSLIST= <SSSSSSSSSSSSSSS>
$$ [...]
##$SUBNAM2= <"">
##$SUBNAM3= <"">
##$SUBNAM4= <"">
##$SUBNAM5= <"">
##$SUBNAM6= <"">
##$SUBNAM7= <"">
##$SUBNAM8= <"">
##$SUBNAM9= <"">
##$SW= 16.880792210976
##$SWIBOX= (0..15)
0 0 2 0 0 0 0 0 0 0 0 0 0 0 0 0 
##$SW_h= 3378.37837837838
##$TD= 16384
##$TD0= 1
##$TE= 0
##$TE2= 300
##$TE3= 300
##$TEG= 300
##$TL= (0..7)
0 120 120 120 120 120 120 120 
##$TP= (0..7)
150 150 150 150 150 150 150 150 
##$TP07= 0
##$TPNAME0= <>
##$TPNAME1= <>
##$TPNAME2= <>
##$TPNAME3= <>
##$TPNAME4= <>
##$TPNAME5= <>
##$TPNAME6= <>
##$TPNAME7= <>
##$TPOAL= (0..7)
0.5 0.5 0.5 0.5 0.5 0.5 0.5 0.5 
##$TPOFFS= (0..7)
0 0 0 0 0 0 0 0 
##$TUNHIN= 0
##$TUNHOUT= 0
##$TUNXOUT= 0
##$USERA1= <user>
##$USERA2= <user>
##$USERA3= <user>
##$USERA4= <user>
##$USERA5= <user>
##$V9= 5
##$VALIST= <valist>
##$VCLIST= <CCCCCCCCCCCCCCC>
##$VD= 0
##$VDLIST= <DDDDDDDDDDDDDDD>
##$VPLIST= <PPPPPPPPPPPPPPP>
##$VTLIST= <TTTTTTTTTTTTTTT>
##$WBST= 1024
##$WBSW= 4
##$XGAIN= (0..3)
0 0 0 0 
##$XL= 0
##$YL= 0
##$YMAX_a= 403512
##$YMIN_a= -373518
##$ZGOPTNS= <>
##$ZL1= 120
##$ZL2= 120
##$ZL3= 120
##$ZL4= 120
##$ABSF1= 10
##$ABSF2= 0
##$ABSG= 5
##$ABSL= 3
##$ALPHA= 0
##$AQORDER= 0
##$ASSFAC= 0
##$ASSFACI= 0
##$ASSFACX= 0
##$ASSWID= 0
##$AUNMP= <proc_1d>
##$AZFE= 0.1
##$AZFW= 0.1
##$BCFW= 1
##$BC_mod= 2
##$BYTORDP= 1
##$COROFFS= 0
##$CY= 11.3945322036743
##$DATMOD= 1
##$DC= 2
##$DFILT= <>
##$DTYPP= 0
##$F1P= 16.9975609425685
##$F2P= -3.02152046262296
##$FCOR= 0.5
##$FTSIZE= 0
##$FT_mod= 4
##$GAMMA= 1
##$GB= 0.15
##$INTBC= 1
##$INTSCL= 1
##$ISEN= 128
##$LB= 0.24
##$LEV0= 0
##$LPBIN= 0
##$MAXI= 10000
##$MC2= 0
##$MEAN= 0
##$ME_mod= 0
##$MI= 1.114404
##$NCOEF= 0
##$NC_proc= 0
##$NLEV= 6
##$NOISF1= 3.799351
##$NOISF2= 2.8
##$NSP= 1
##$NTH_PI= 0
##$NZP= 0
##$OFFSET= 15.70392
##$PC= 1
##$PHC0= -9969.88
##$PHC1= 4.600921
##$PH_mod= 1
##$PKNL= yes
##$PPARMOD= 0
##$PSCAL= 0
##$PSIGN= 0
##$REVERSE= no
##$SF= 200.130013532006
##$SI= 16384
##$SIGF1= 3
##$SIGF2= 2
##$SINO= 400
##$SIOLD= 16384
##$SREGLST= <1H.CDCl3>
##$SSB= 0
##$STSI= 0
##$STSR= 0
##$SW_p= 3612.71676300578
##$SYMM= 0
##$S_DEV= 0
##$TDeff= 0
##$TDoff= 0
##$TI= <>
##$TILT= no
##$TM1= 0
##$TM2= 0
##$TOPLEV= 0
##$USERP1= <user>
##$USERP2= <user>
##$USERP3= <user>
##$USERP4= <user>
##$USERP5= <user>
##$WDW= 1
##$XDIM= 8192
##$YMAX_p= 0
##$YMIN_p= 0
$$ End of Bruker specific parameters
$$ ---------------------------------
##NTUPLES= NMR FID
##VAR_NAME=  TIME,          FID/REAL,        FID/IMAG
##SYMBOL=    X,             R,               I
##VAR_TYPE=  INDEPENDENT,   DEPENDENT,       DEPENDENT
##VAR_FORM=  AFFN,          ASDF,            ASDF
##VAR_DIM=   8192,          8192,            8192
##UNITS=     SECONDS,       ARBITRARY UNITS, ARBITRARY UNITS
##FACTOR=    0.000296,      1,               1
##FIRST=     0,             0,               0
##LAST=      2.424536,      0,               0
##MIN=       0,             -373518,         0
##MAX=       2.424536,      403512,          0
$$ Real data points
##PAGE= N=1
##DATA TABLE= (X++(R..R)), XYDATA
0 0 0 0 0 0 0 0 0 0 0 0 0 -4 8 -8 8 -14 16 -20 24 -32 36 -44 52 -62 74 -86 101 -117 137 -157 181 -209 237
33 237 -270 306 -345 390 -438 492 -549 614 -685 761 -843 934 -1034 1142 -1260 1391 -1532
50 -1532 1687 -1860 2047 -2256 2489 -2747 3040 -3371 3748 -4185 4699 -5311 6055 -6981 8174
65 8174 -9772 12032 -15494 21583 -60907 380935 33013 -373518 72415 64315 -130876 87434
77 87434 95451 -148653 -7137 141413 141650 -60627 -92923 23377 159918 10190 -91379
88 -91379 67953 32404 -11841 32789 27008 -66076 -12374 75794 81486 -15089 -117939 114878
100 114878 71846 -101809 32562 81096 -83798 39828 102407 -128306 -6080 48307 -55843
111 -55843 6723 50022 -97438 -25499 143785 -101706 -99263 132009 28541 -113951 107103
122 107103 83986 -105330 54170 91232 3223 -35444 65171 89255 -1766 -23597 41281
133 41281 49720 -36004 34777 16582 4605 13465 4203 25745 -11668 -29981 15233 93325 -39775
146 -39775 -41022 90784 34143 -71616 30072 95965 -86120 30667 115509 -54152 -48234
157 -48234 80024 40 -55587 55048 -9038 -18135 20104 11703 -50426 -20427 39645 -36515
169 -36515 90 21932 -22064 -38389 36847 -13433 -58774 27488 14492 -8868 -23811 12156
181 12156 -34999 -14974 27717 -35737 -22332 30579 -94 -63772 30543 -24581 -57282 46644
193 46644 7510 -60914 -16402 45877 -51378 -36860 9879 -18241 -27778 18232 -5033 -76287
205 -76287 15961 -10032 -34888 2132 -16356 -38219 16240 26747 -78713 -21182 39907 -619
217 -619 -50761 32934 23546 -71036 34531 43437 -47613 -32255 70303 14680 -28874 10148
229 10148 2905 16469 -3919 10590 -1865 19634 -6206 -5870 45945 -27517 -49889 44746 60771
242 60771 -85364 -8824 73688 -34378 -46173 36834 27816 -72964 19063 61995 -30707 -48956
254 -48956 38817 31957 -34453 9293 6272 30601 1095 -13746 25371 20939 -21772 -5920 74223
267 74223 -10651 -47515 39127 62476 -62758 -33980 89012 -18398 -50880 31494 33106 -59403
279 -59403 -18134 33847 -14121 -33610 -13049 30497 -25391 -34367 -16636 17560 -4700 -53828
291 -53828 17104 31459 -37818 -46297 59914 -3239 -63054 32678 54204 -32017 -48847 72866
303 72866 15194 -53321 16363 57287 -11803 -20516 41552 4038 -6047 -10768 33112 20184
315 20184 -27439 -5803 32644 16186 -58552 3076 41856 -15916 -49255 33096 17930 -74846
327 -74846 7546 35246 -29496 -50926 34994 20937 -46267 -14123 21377 4845 -31233 22329
339 22329 9292 -4440 -6213 5143 27912 -16384 -14964 23092 37532 -38523 -12386 37414
351 37414 -6005 -33532 8473 35017 -51217 -9098 35692 -20519 -44728 11809 18300 -34065
363 -34065 -5313 -4964 1860 -17244 -8591 -2615 -9627 -1932 -17003 13540 -7189 -23406 -5725
376 -5725 25700 -18227 -26746 34172 -787 -13599 3269 23492 -13264 1043 33613 1977
388 1977 -681 17671 24604 -11510 20225 8660 275 23436 2192 -2875 -90 14546 -18303
401 -18303 132 5982 -10976 -9480 1970 -2045 -32363 10461 -7310 -13419 3402 -3832 -13796
414 -13796 677 10077 -28315 6264 10531 -5758 -12997 13197 2805 -31823 16654 7322 -17941
427 -17941 -10853 21509 -7781 -17907 3903 -4476 3779 -13488 5715 -614 -133 -9582 -5332 13999
441 13999 -17571 -11512 13397 13665 -41591 -505 24779 -28670 -23573 12633 11221 -41072 395
454 395 16376 -19836 -27800 12791 16650 -27287 -1230 9422 14765 -18955 -6375 27407 4865
467 4865 -12704 9652 37187 -19867 -9988 29421 21804 -26396 -2312 50973 -10256 -22427 15359
480 15359 27224 -22639 -6291 32248 3027 -19713 859 36714 -19019 -18808 19547 24345 -11575
493 -11575 -19384 28096 8089 -19409 -7532 38321 -5780 -24519 28485 22158 -20962 -21497 45318
506 45318 10118 -25753 9558 38118 -4684 -22893 30991 14844 -9249 -5759 40900 10435
518 10435 -29935 12757 31239 -1654 -28028 26283 21617 -13275 -16551 22405 7794 -39457
530 -39457 12377 25437 -15344 -37319 23753 17681 -41507 -16949 23026 2710 -38671 11721
542 11721 8988 -24341 -18703 14176 9693 -35045 -3548 23003 3823 -38132 3166 23376 -15263
555 -15263 -12302 12549 17031 -29589 1304 24491 -7920 -27155 13707 29157 -21904 -10896
567 -10896 10254 10707 -24549 -307 17879 -14833 -9704 4284 10271 -22996 -12275 4608 7623
580 7623 -15683 -14805 15622 -10579 -13363 -5193 9808 -14796 -9898 16112 717 -14133 -9300
593 -9300 19292 -8392 -7006 5711 11348 -454 -9224 14139 -1803 -3487 1512 17350 -1273
606 -1273 -2222 9771 1542 2395 -9589 14288 4831 177 1406 5726 1889 -8988 6679 -206
620 -206 4464 -3005 9965 -1998 -8182 4935 -3186 4580 -1491 7697 -3516 4695 2856 -5433
634 -5433 -850 4494 13028 -9226 10297 4381 -6136 -1086 9441 2869 -10318 13764 4640 628
648 628 -10326 4490 3674 -5474 4379 -254 6592 -11602 517 4727 -4640 -14935 6938 16604
662 16604 -20193 -5863 6533 2799 -21262 2836 13681 -15258 -4851 9808 3838 -23304
674 -23304 4421 9501 -807 -6940 -891 15590 -5337 -5689 19 16228 -8010 -5344 21996
687 21996 5283 -16880 -729 32758 -14965 -14673 21901 14656 -14716 -3362 22390 -9606 -8808
700 -8808 7102 17417 -12101 -9392 16127 4043 -11984 -17037 20935 3898 -18677 -1360 19642
713 19642 -12492 -27900 22712 5658 -24852 -7791 32993 -9066 -32513 15272 11945 -16302
725 -16302 -10776 26015 -2686 -14352 2556 12846 -2597 -19788 14909 16949 -3792 -19448
737 -19448 16825 12970 -23079 -2312 23599 2889 -27860 20831 15004 -24289 -11867 22964
749 22964 7166 -25765 9886 13851 -8696 -18833 12596 7750 -15072 572 10650 9234 -21376
762 -21376 -1104 15793 555 -16659 8252 25562 -17065 -8608 17181 10903 -24449 8122
774 8122 28531 -12397 -10241 14969 12609 -21819 3322 15590 372 -9279 953 13515 -11069
787 -11069 -6589 505 11627 -9597 -9560 12749 775 -16679 -8256 21054 -12692 -14297 11117
800 11117 8035 -16592 -7617 18470 -12914 -9940 8333 10162 -13285 -2464 9716 -5005 -256
813 -256 -5380 7337 590 495 -3048 4365 1021 -14057 8280 6470 -5031 -10653 15402 -131
827 -131 -16386 6040 2069 -5292 -3137 13219 -8440 -4421 5189 -1421 -1754 474 7337 -4324
841 -4324 11937 -477 -5252 6805 6720 582 3333 16977 -5220 5781 9631 2087 -1967 9548
855 9548 11610 -3379 13171 27 -2664 4758 7816 -7031 1362 14365 -11828 -318 4500
868 4500 -4437 -14936 9330 5829 -16774 679 2098 -4977 -13076 5028 -4829 -3624 2040 -5197
882 -5197 1082 -6558 -3585 -3025 10825 -8715 -7310 14202 590 -13270 -438 18861 -14672
895 -14672 -2587 18211 -485 -14377 5754 16174 -14105 -1219 8063 5747 -7227 -747 5268
908 5268 -3566 -1351 -6424 11637 -2740 -12195 1033 13392 -10655 -18740 19322 1420 -16051
921 -16051 -450 19609 -13239 -14895 19299 2625 -13742 -1617 20692 -6216 -7647 5414
933 5414 6794 -1241 -8869 11887 5229 -3415 -9706 13505 5817 -18040 1574 16896 -1878 -21665
947 -21665 17975 7805 -21226 -3807 19142 -3222 -22054 14367 6350 -13356 -10498 11710
959 11710 -145 -13809 2809 4241 1123 -16565 1156 8803 -3993 -14021 6573 15120 -19720
972 -19720 -4891 14101 1663 -22144 10908 19377 -17740 -6338 14928 5164 -19158 9341
984 9341 12011 -5397 -4063 6804 8218 -10109 1695 5838 10686 -6727 -4225 14525 2400
997 2400 -10549 -20 21262 -11479 -6987 17246 4455 -18140 1155 21115 -13095 -6476 10209
1010 10209 6052 -12612 64 7766 -6801 -326 -1844 7075 -3033 -5235 -1785 7449 -1735 -13768
1024 -13768 11043 4614 -8907 -6352 15085 -6649 -13314 13928 2822 -10151 -3066 14007 -9036
1037 -9036 -5620 5472 -794 -2137 -862 3995 -6179 3753 -4984 -592 4044 -4811 -3628 4089
1051 4089 5883 -14819 4326 6006 -6347 -3071 8142 866 -10181 10581 212 -4519 1201
1064 1201 7601 -2529 1067 8689 -6301 5723 4192 366 -2119 10737 2585 -4615 10216 351
1078 351 -1780 1272 9091 -4887 1328 5624 -4667 1706 -1335 -879 -4729 7161 -5210 -5594 5352
1093 5352 -5053 -6985 -336 7154 -13700 151 7644 -5990 -8290 3501 5303 -10972 4954
1106 4954 2986 -1180 -3664 2316 1981 -3077 2886 -2826 8315 -1432 -5433 1959 7213 -5937 -7347
1121 -7347 15554 -2812 -9091 2838 10126 -12156 -6256 13934 -3259 -8210 307 9421 -9966
1134 -9966 -4453 4643 1193 -2952 -4507 7808 -923 -2859 -4526 10041 2473 -9128 7094 10455
1148 10455 -2978 -11262 17134 4094 -12179 4749 14882 -4662 -11723 15346 1014 -9136
1160 -9136 -1497 10682 -2258 -8819 3573 566 -727 -11549 3207 4213 -6645 -9317 5250
1173 5250 4804 -19916 -1032 9496 -5144 -17258 9334 7051 -19027 -2129 9454 -2153 -14831
1186 -14831 10241 6228 -8411 -2721 6258 5758 -7522 2998 6111 6828 -6838 58 12207 -3037
1200 -3037 -7782 6036 14689 -14622 -2880 14213 -2251 -13827 5009 13105 -13493 -1146 8984
1213 8984 1115 -10162 2900 8535 -3823 192 777 8976 -3133 -2911 3782 7525 -2887 -5458
1227 -5458 14846 94 -8519 1772 13092 -8370 -6860 14621 618 -7148 1175 11121 -7923
1240 -7923 -2432 7030 1595 -1818 -2415 5787 -2498 -996 -4800 4280 1306 -8006 386 2822 -3108
1255 -3108 -12173 7349 -213 -9386 -817 5926 -3669 -9869 7795 -1754 -3967 72 5742 -1722
1269 -1722 -2674 3774 -2810 2776 -2644 2111 1300 2256 -3078 -1459 4868 -6226 208 1700 2265 -5836
1285 -5836 2733 2983 -6247 1588 1090 1857 -3422 4880 -1292 -1167 2389 -1926 629 -171 4031 -4868
1301 -4868 2750 488 -3941 -614 1613 1264 -5738 4937 -1132 -1962 -2357 755 -167 -2259 3056 -3137
1317 -3137 2712 -3384 -726 716 1035 -2957 -1850 8057 -4916 -3090 1574 3947 -6400 -165 7442
1332 7442 -4620 -2117 1554 5190 -7448 152 4638 474 -1482 -2097 5182 -3194 -905 -1135 5310
1347 5310 -1815 -4915 6257 2232 -4341 -5540 11165 -1350 -6599 4690 6244 -4294 -5296 10926
1361 10926 -2022 -4290 2259 8719 -2128 -4712 6382 1925 -113 -4623 7592 2736 -3565 -504
1375 -504 6571 1740 -10656 7018 6405 -4606 -6746 9561 1969 -12411 2545 5344 -3189 -9250
1389 -9250 7620 370 -9079 -2756 3128 570 -10378 1732 2548 -1226 -9359 1081 5592 -8045
1403 -8045 -3323 5425 4673 -12463 2142 8308 -4916 -6923 6336 8279 -10047 1546 6239 327
1417 327 -7059 3426 7733 -4323 -1520 2263 6471 -7773 -2413 6341 1653 -6002 -856 9937
1431 9937 -6480 -5264 3985 5841 -7860 -1784 10009 -2980 -5347 832 8183 -6034 -2113 6354
1445 6354 2910 -3342 -2796 8016 -1450 -1989 1239 7407 -1437 -4764 6892 2252 -3202 -3392 9499
1460 9499 -738 -5050 2383 3805 -3002 -6251 6339 -1817 -3926 -1877 3905 -2665 -7196 1796
1474 1796 -577 -1650 -6346 3046 -1237 -4568 -1770 577 -427 -6705 3054 669 -1208 -4713 2318
1489 2318 1774 -4631 994 700 2065 -4067 3345 930 -2390 -635 1473 3740 -3347 2540 368
1504 368 2107 -1677 480 1886 -719 2031 -1265 3073 -3031 -181 -153 12 -725 -2530 2898 -2445
1520 -2445 153 -3357 768 -910 -378 1178 -1165 2577 -2768 1789 -631 1652 -1154 1769 4053
1535 4053 -2809 508 13 3105 -3466 1289 2460 -949 -750 -1204 2305 -4545 428 255 1933 -2344
1551 -2344 -2166 3685 -2252 -1484 -1486 5381 -2755 -1686 3024 400 -2860 -3159 5799 -2817 -2536 -572 3072
1568 3072 -3329 -4789 3613 -1012 -1740 -2948 5745 -1557 -4216 2077 3636 -367 -4201 7536 1990
1583 1990 -2037 -979 6216 609 -5231 5131 3118 -543 -4320 6230 1184 -4916 216 4327
1597 4327 1343 -6868 4699 3239 -2484 -4683 5476 3813 -6164 2606 4705 1505 -6240 4804
1611 4804 4120 -4028 -1554 4150 4224 -7112 1557 3354 -147 -6208 2343 5934 -5656 -1915 3496
1626 3496 3721 -8484 579 6182 -2022 -4206 1847 5540 -7070 -1126 3592 1109 -5807 127 5903
1641 5903 -4182 -3978 -748 5492 -5386 -3219 4369 1008 -5376 -2511 7197 -4622 -3494 3467
1655 3467 5063 -5139 -3078 6494 -1483 -2796 -337 6765 -2574 -2356 3157 1720 -2358 -3908 6524
1670 6524 187 -2844 -1417 4879 -1243 -5747 3926 1573 -2500 -3750 6202 -1752 -5541 1282 2488
1685 2488 -1316 -4578 4674 -887 -1991 -2307 1801 386 -3925 1919 870 882 -5111 2580 1330 -3015
1701 -3015 -970 2212 2504 -5319 2758 1039 -717 -2482 2546 2449 -3559 1612 347 1614 -3411 1575
1717 1575 1068 -429 -43 -717 3196 -2572 793 -638 2069 -1665 -644 3216 -1643 -188 -1131 3093
1733 3093 -2613 582 1260 -175 372 -1195 2285 -2103 1892 -1128 1482 774 -752 749 -638 2338
1749 2338 -2846 2348 809 881 -940 595 2170 -2712 1489 -432 1960 -1985 1189 729 -1471 13
1765 13 -1941 2645 -1641 -153 -755 1670 -2028 -3242 3178 -1407 -1513 -1383 3946 -3835 -2617 2378
1781 2378 -670 -1945 -1938 4272 -2765 -1303 -541 1031 -1114 -2445 2691 -298 259 -3212 3589 286
1797 286 -3126 730 3373 699 -5260 5068 1035 -2924 -971 4938 108 -4633 4409 1618 -1065
1812 -1065 -2967 4037 838 -1942 660 1354 2499 -4591 1885 2322 41 -3871 2832 4569 -5775
1827 -5775 -144 3284 1357 -6566 3454 3982 -4137 -1629 2612 2128 -6215 2046 1913 -308 -3129
1842 -3129 512 3296 -3224 -1247 -13 3978 -4758 -1678 3918 -936 -5104 -585 5651 -6113 -2484
1857 -2484 2865 1209 -5816 -1019 4307 -4514 -1672 647 3209 -4329 -1286 2490 -6 -1592 -2464
1872 -2464 4978 -1216 -1847 -142 4171 -1543 -3915 5671 1112 -2069 -1320 6637 -2067 -2982 3987 2541
1888 2541 -875 -1617 6134 -489 -474 637 3476 836 -1740 3679 1540 1284 -3352 3933 1986 -2055
1904 -2055 228 3379 1613 -5214 3647 1391 -1707 -1696 3827 1217 -4124 2463 616 266 -2604 2775
1920 2775 897 -1182 270 -333 1724 -3464 520 -33 811 -3034 -479 2394 -3481 -1120 -316 2010
1936 2010 -4498 525 1717 -2163 -1529 -563 1631 -3880 1353 -733 -14 -894 -730 592 -1534 1061
1952 1061 -2509 2296 -517 -1004 -410 1092 370 -2681 3573 -785 285 -397 2055 -667 -860 2539
1968 2539 -1141 1988 -419 1903 -609 1501 -454 -861 3367 -1492 484 70 2331 -2969 661
1983 661 2686 -1670 -22 587 2437 -3285 1511 -101 -421 -20 -613 1403 -1421 918 -2648 2149
1999 2149 -754 -2200 675 1342 -751 -3753 3847 -1691 -2067 276 2033 -1990 -2862 3421 -2094 -1361
2015 -1361 -1427 2057 -1354 -1452 305 -751 1101 -3729 1495 253 -692 -2711 2227 1631 -5235 1468
2031 1468 1715 -152 -4201 3979 1146 -3513 512 1505 321 -3910 3204 273 -556 -1341 662 1803
2047 1803 -2619 508 445 2727 -3668 270 3068 -1461 -2342 1047 4253 -5018 520 2560 34 -3669
2063 -3669 966 3501 -3783 278 848 1846 -3632 37 1861 -1029 -734 -1271 3605 -2444 -1490 337
2079 337 2421 -2357 -2290 4437 -1175 -2025 -849 4095 -3427 -1809 3362 221 -1855 -1637 4298 -2392
2095 -2392 -923 385 1893 -442 -1849 2774 -453 162 -2411 3478 456 -2050 973 2427 577
2110 577 -4133 3999 370 -1231 -375 3371 16 -3550 3323 362 -301 -2031 3161 -24 -1244 539
2126 539 -154 1697 -2571 1962 539 400 -1902 978 2423 -3146 297 833 1833 -3626 1674 1739
2142 1739 -2224 -408 801 1399 -3395 1838 120 -304 -1194 -165 1261 -1659 798 -2016 1988 -1385
2158 -1385 -957 661 -40 -615 -1642 3533 -2222 -446 321 1112 -1723 -780 2337 -1893 1105 -459
2174 -459 1240 -1389 639 66 -281 1818 -1682 1431 -233 1243 -1866 1581 1547 -1719 1631 156
2190 156 875 -2061 2553 -71 -566 842 84 733 -1458 1529 -1599 1589 -456 -443 1194 -297 -280
2207 -280 -2024 2869 -2214 -282 933 463 -1318 -990 2276 -2676 128 -479 1248 -1403 -284 446
2223 446 -1421 626 -2122 1720 -841 -277 -998 940 -192 -3287 2139 -134 -291 -1856 2522 -765
2239 -765 -2290 1508 211 88 -2312 2627 -565 -96 -490 670 1408 -2117 1415 104 1718 -2200
2255 -2200 1580 1668 -1530 163 1312 2672 -3147 1875 1695 -81 -1094 1619 2578 -2567 1620 540
2271 540 1512 -1596 1334 1674 -643 54 -263 2784 -2419 268 443 1034 -1505 -1017 2997 -2033 -912
2288 -912 -385 2237 -2806 -678 2264 -1060 -1083 -1132 2424 -2976 -548 473 437 -1549 -1647 1971 -1629
2305 -1629 -564 -1657 2264 -1085 -1502 1126 380 -475 -2651 3294 -995 -1189 -199 2311 -799 -2531
2321 -2531 2765 -451 -145 -903 2524 -532 -1106 1085 -31 822 -2345 2372 430 61 -1284 1230
2337 1230 1521 -2571 1334 972 963 -2371 2258 994 -1813 626 1125 1368 -2471 2027 -133 -48 -564
2354 -564 -29 1417 -1308 1155 -744 1744 -1967 -32 1223 -491 -505 -981 2261 -2681 -271 113
2370 113 127 -1632 -392 1536 -2496 -121 -1289 604 -2016 -426 -149 -900 232 -2212 1278 -1306
2386 -1306 -302 -1198 800 -294 -1836 1581 -826 83 -1183 2239 -619 -343 898 -324 746 -1223
2402 -1223 1810 -522 1167 -151 669 1043 -469 980 -82 2029 -1582 1453 782 -63 225 393
2418 393 1715 -1730 1991 -57 1012 -842 543 908 -985 845 -662 1911 -960 341 237 246
2434 246 -105 -984 2149 -995 515 -525 1545 -800 -830 1495 -785 539 -1059 1800 -1091 -295
2450 -295 -136 57 177 -1814 1515 -939 257 -1850 855 -101 -1590 750 -44 657 -2094 1140 -337
2467 -337 -669 -478 388 1055 -2166 1326 -272 207 -1424 1250 1191 -1162 508 -68 1430 -1765 1098
2484 1098 404 398 -593 119 1807 -1898 540 -98 1334 -1701 477 1644 -1038 146 -494 2018 -1908
2501 -1908 372 722 82 -905 -659 1399 -1704 63 -829 1506 -1224 -777 1026 -211 -171 -1514 2541
2518 2541 -1197 -115 542 956 -521 -1195 2323 -857 350 -330 1646 -706 -1113 833 -231 337
2534 337 -1854 1495 -381 -407 -734 497 454 -2106 1407 -81 318 -1384 1480 38 -1539 836 252
2551 252 750 -1495 1675 -157 23 -192 483 1336 -1124 1190 -89 1294 -1461 1018 1307 -433 479
2568 479 98 1879 -1953 1159 574 369 -148 263 1170 -1346 606 -777 1210 -1215 -253 604 -491
2585 -491 -320 -1430 1448 -1645 -284 -447 257 -966 -1480 1163 -1677 25 -1233 885 -1492 -741
2601 -741 324 -810 73 -1409 1329 -917 -25 -690 688 66 -1819 1088 -827 329 -1500 1178
2617 1178 -481 -787 186 -363 673 -1543 1269 -715 338 -737 79 685 -1118 1012 -290 1323
2633 1323 -1245 816 734 70 524 -24 1909 -1159 1300 486 763 -258 269 1684 -491 938 -399
2650 -399 1917 -779 303 671 297 540 -573 1923 -853 409 -268 657 -583 -774 1113 -879 -94
2667 -94 -1515 1012 -887 -681 -275 -322 -27 -1523 1208 -1170 -103 -1258 490 -487 -1465 447 -712
2684 -712 469 -1863 1106 -375 -621 -488 -45 654 -1618 1030 -388 561 -1056 728 361 -851 740
2701 740 -261 1217 -1287 1038 471 -35 -1 -115 1380 -1231 869 -260 1189 -804 416 1233 -723
2718 -723 578 -516 1786 -1143 491 457 21 -87 -219 1603 -1111 627 -534 985 -816 -693 534
2735 534 -344 354 -1475 1353 -1030 -428 -251 601 -276 -1277 1498 -1045 223 -1134 749 -501 -652
2752 -652 170 -476 452 -1647 595 -865 -242 -827 165 641 -1596 669 -803 265 -1233 733 201
2769 201 -923 360 -486 903 -1416 1332 6 320 114 187 1271 -886 1068 -328 1594 -573
2785 -573 666 1378 -49 676 -26 2047 -887 1016 792 612 403 40 1773 -1092 1111 -243 1452
2802 1452 -259 233 680 207 857 -1019 1612 -423 352 -277 1134 -431 -1019 1519 -622 429 -697
2819 -697 1220 -623 -367 456 -620 309 -1199 912 -957 134 -931 -13 197 -1529 461 -725
2835 -725 221 -1857 819 -132 -1095 -136 -333 541 -2031 662 -794 -128 -1047 -83 302 -1470 342 -1024
2853 -1024 768 -1585 128 110 -44 157 -453 1585 -1335 769 -186 650 -329 203 1437 -917 711
2870 711 -307 1220 -1110 528 756 178 526 -727 1509 -791 611 -284 669 -182 -506 1362 -621
2887 -621 510 -840 1301 -519 -275 146 133 249 -1424 1352 -1007 111 -546 397 -258 -1054 789
2904 789 -728 582 -1276 955 -721 -423 -70 -241 668 -1353 956 -549 363 -981 352 391 -1344
2921 -1344 849 -505 672 -1374 852 -226 -354 202 -455 516 -1147 1008 -1064 649 -605 -17
2937 -17 623 -598 588 -681 1664 -961 523 197 43 128 -476 1326 -1056 969 -137 614 -120
2954 -120 196 606 -817 914 -1067 1038 -307 230 -294 -174 425 -1067 801 -664 313 -917 510
2971 510 -324 -728 748 -1039 277 -1064 761 -1165 97 -110 -626 573 -921 467 -881 940
2987 940 -999 -2 461 -565 333 -518 1191 -1282 705 34 215 -109 -202 991 -616 956 -677
3004 -677 1137 -205 163 433 7 775 -759 1422 -333 522 -181 823 129 -706 1651 -634 871
3021 871 -746 978 -305 -43 460 -266 742 -936 936 -582 612 -520 547 520 -1209 831
3037 831 -259 633 -1304 820 -43 -542 66 -247 577 -1434 756 -717 42 -488 180 186 -1257 555
3055 555 -1043 888 -995 244 316 -271 -16 -791 1181 -1466 507 19 384 -878 -34 1013 -1180
3072 -1180 575 -311 979 -1120 625 446 -424 152 -382 1309 -915 901 -159 528 11 -243 1015
3089 1015 -389 541 -573 1374 -448 -47 700 -137 385 -710 1545 -1178 141 -131 341 -406 -442
3106 -442 1078 -845 518 -952 850 -583 -181 389 -63 455 -1306 1172 -567 -151 -626 429 -136
3123 -136 -1053 998 -966 233 -1063 804 -384 -397 456 -575 785 -926 882 -1060 300 -480
3139 -480 -79 602 -611 830 -564 860 -1180 689 85 -651 274 22 886 -1074 1237 -326 326
3156 326 122 348 280 -641 1182 -778 1025 -411 450 137 129 514 -632 1283 -850 898 -275 480
3174 480 -193 23 937 -837 704 -391 694 -797 312 -152 -672 632 -660 521 -885 657
3190 657 -854 15 -24 -590 266 -766 600 -1031 458 -848 -283 -73 -643 302 -811 520 -1347
3207 -1347 487 -604 -640 -179 -469 326 -829 805 -848 259 -436 335 -24 -547 704 -508 550
3224 550 -505 607 -314 69 506 -462 971 -967 722 -387 531 -263 259 531 -709 883 -331
3241 -331 757 -779 1070 0 -304 348 -48 879 -1106 1146 -65 365 -112 226 300 -817 604
3258 604 -258 718 -701 684 198 -200 -81 -584 1011 -1198 579 -53 -19 -715 -22 706 -1257 412
3276 412 -595 603 -950 264 -289 -620 43 -505 726 -1028 502 -404 176 -600 -372 687 -503
3293 -503 422 -617 826 -774 -3 609 -270 437 -347 1323 -853 619 -24 289 -228 1 986 -547
3311 -547 857 -412 1063 -310 179 433 115 589 -760 1464 -486 252 -54 791 134 -875 959
3328 959 -446 412 -498 940 -630 -147 447 -326 316 -843 793 -611 265 -336 -8 275 -647 626
3346 626 -590 391 -639 740 -257 -621 377 27 174 -1256 1093 -368 88 -117 -32 202 -969 771
3364 771 -504 368 -407 483 -6 -366 334 -136 704 -972 1032 -146 119 -96 194 509 -720 806
3382 806 -80 578 -279 640 244 -394 809 -456 801 -533 969 -185 295 154 -95 562 -686 797
3400 797 -284 729 -498 327 340 -355 353 -370 616 -1179 678 -162 -288 -174 -213 117 -1092 895
3418 895 -629 241 -663 -19 -155 -709 468 -755 684 -988 74 -349 94 -65 -338 482 -1004 484
3436 484 -495 103 -570 -77 361 -521 399 -353 569 -921 621 -11 -120 154 -45 709 -823 676 -94
3455 -94 295 -20 -43 660 -418 682 -140 748 -572 223 295 266 54 -181 1163 -682 733 -16 453
3474 453 -232 214 716 -920 405 -410 512 -630 307 143 -153 273 -393 720 -802 344 -315 266
3492 266 -577 -368 772 -786 246 -528 531 -787 -313 16 -448 -168 -421 475 -1179 241 -508 -201
3510 -201 -494 -450 700 -661 466 -509 723 -450 -350 -31 -260 -3 -900 909 -979 42 -20 547
3528 547 -167 -453 675 -627 284 -221 837 -436 65 597 -38 491 -643 958 -342 290 85 507
3546 507 174 -312 787 -297 408 -475 963 -246 -295 501 -335 168 -537 1074 -460 168 -200 16
3564 16 99 -522 722 -582 23 -815 320 -422 -387 304 -245 199 -998 669 -482 -176 -149 114 39 -657
3584 -657 700 -549 -19 -625 532 -122 -353 263 -320 430 -712 613 -423 5 102 122 518 -705
3602 -705 648 -107 301 -210 760 136 -262 673 160 749 -731 917 -70 -95 143 262 517 -495 887
3621 887 -391 514 -154 452 145 -329 641 -313 483 -662 765 -52 0 -206 66 480 -820 729 -363
3640 -363 350 -537 140 159 -886 121 -535 359 -827 385 -133 -375 -138 -422 180 -880 455 -412
3658 -412 156 -554 -124 -20 -663 345 -420 576 -834 324 -107 -85 18 -52 897 -730 412 -308 481
3677 481 -302 380 516 -191 614 -249 562 -307 749 272 247 225 -159 829 -505 588 -44 207 -152 8
3697 8 923 -668 410 -383 860 -583 213 511 -363 161 -4 711 -622 349 -209 284 -187 -331 565
3716 565 -427 184 -443 727 -697 96 231 -276 -126 -556 881 -726 31 18 -71 -433 -402 357 -913
3735 -913 95 -636 475 -498 -5 447 -360 25 -829 742 -446 123 159 310 -114 -394 1126 -596
3753 -596 316 36 669 -330 -125 528 -287 332 -256 843 -436 473 -59 235 203 -333 901 -413 318
3772 318 -327 674 -165 -287 620 -17 430 -587 846 -489 -104 25 3 -116 -585 624 -566 270
3790 270 -642 306 -367 -288 257 -354 167 -756 732 -565 -110 28 21 78 -825 768 -578 -144 -329 226
3810 226 -30 -728 287 -158 182 -836 477 -186 -256 202 79 292 -533 729 -248 507 -368 533 331
3829 331 -254 540 -42 683 -708 649 76 -134 124 472 455 -838 737 -299 300 -309 562 279 -581
3848 -581 403 29 552 -790 538 110 -73 68 66 435 -1041 500 -193 361 -482 89 332 -475 214
3867 214 -206 457 -676 98 -55 -296 -33 -19 421 -921 261 -150 201 -273 23 201 -874 44 -301
3886 -301 400 -871 183 62 -83 -223 -422 626 -739 296 157 559 123 127 506 -554 644 -254
3904 -254 652 -333 194 394 -4 132 -9 943 -542 369 -84 516 -188 -138 817 -118 401 -378 736 -511
3924 -511 152 350 -198 -26 -205 657 -736 386 -106 164 -189 -289 382 -450 325 -450 291 -602 -161
3943 -161 308 -395 27 -621 464 -572 143 -162 -147 -162 -238 641 -618 37 -714 469 -176 -121 269 -419
3963 -419 401 -795 603 -640 94 -180 253 145 -468 645 -343 133 -331 858 24 -229 307 -117
3981 -117 429 -280 707 -299 51 -178 247 275 -359 934 -426 322 -257 605 -59 -169 492 -128 751
4000 751 -436 574 -307 -157 130 85 -1 -561 602 -273 -35 -366 349 -13 -420 452 -350 318 -498 541
4020 541 -454 -115 -156 101 129 -779 796 -403 129 -432 341 109 -271 387 -300 443 -532 470 -238 -443
4040 -443 139 232 320 -630 864 -90 251 -245 439 416 -386 301 -274 463 -822 649 9 -166 219 254
4060 254 629 -894 793 -4 240 -138 318 559 -502 654 78 604 -592 522 -35 -235 191 -24
4078 -24 616 -761 554 -264 -110 -474 -116 339 -645 214 -552 493 -980 239 42 -413 -199 -523 471
4097 471 -894 202 77 32 -515 -175 710 -590 304 -326 -3 -651 108 248 -13 -159 -300 833 -643
4116 -643 389 -110 356 -426 -293 501 -573 388 -202 589 -373 172 393 -16 308 -180 1257 -466 190
4135 190 106 341 -89 -241 511 -460 358 -6 855 -358 96 450 -181 267 -434 677 -643 355 159
4154 159 227 -152 -111 798 -494 255 -337 333 -339 -59 165 -423 184 -507 538 -529 -7 -206 -201 -145 -560
4175 -560 140 -469 292 -382 457 -127 -357 243 -82 288 -572 525 -394 -30 -14 159 57 -383 583 -300
4195 -300 300 -282 325 41 111 556 -250 457 -370 846 -123 179 90 123 309 -541 903 -104 346 -252
4215 -252 147 -34 -274 364 -132 442 -372 657 -177 163 -5 125 286 -511 820 -302 99 -310 287
4234 287 201 -515 298 -460 117 -692 586 -337 -137 -73 -112 110 -794 634 -332 20 -442 194 -20 -964
4254 -964 159 -304 263 -554 372 -271 -459 -87 13 342 -611 494 -218 225 -458 418 227 -700 544
4273 544 -229 392 -549 385 69 -285 -3 -222 673 -381 491 -136 469 -268 331 300 -345 588 150 473
4293 473 -820 274 428 -162 15 -176 366 -557 307 16 66 -321 272 329 -518 332 -248 778 -548
4312 -548 125 28 -278 -83 -228 397 -1102 132 -114 11 -590 -383 318 -919 -186 -396 447 -525 -306
4331 -306 103 -112 -15 -411 529 -633 17 -225 204 -115 -193 295 -441 141 -331 460 -526 -246 461 -246
4351 -246 253 -358 738 -358 286 -165 323 104 -209 616 -241 153 -228 637 -364 135 371 12 161
4370 161 -152 599 -131 155 -38 186 -165 -355 524 -116 340 -408 198 -364 -332 312 -117 383 -652 506
4390 506 -114 -16 -163 119 -12 -360 313 -450 174 -326 103 -112 -387 239 -121 -17 -557 365 -175 86
4410 86 -157 -265 235 -466 526 -363 303 -134 450 -85 -466 263 -243 424 -545 594 -234 42 -174 77
4430 77 203 -364 475 -116 108 -205 264 69 -270 529 -153 355 -294 205 -104 -65 -118 183 206 -522 451
4451 451 -77 385 -296 436 12 27 347 -179 174 -344 500 119 -176 56 -52 340 -704 429 -247 -138
4471 -138 -341 49 109 -373 -88 -539 163 -473 165 -246 -272 -175 -148 361 -694 392 -140 -34 -5 188 354
4492 354 -481 172 8 548 -515 380 233 34 -36 -30 243 -701 235 160 128 -89 145 276 -526 66 -9 342
4514 342 -313 393 342 -23 95 -101 615 -269 313 554 144 -164 -33 588 -363 166 -393 490 -575 -88
4534 -88 159 -202 -318 -193 585 -609 2 -35 72 -320 -429 313 -483 -1 -218 374 -676 -261 109 -452
4554 -452 -116 -282 226 -198 14 -8 -14 -129 -329 513 -365 -12 -365 458 -194 -308 346 124 71 -460 732
4575 732 -541 121 94 346 -175 -276 559 -178 274 -211 682 -71 -68 480 255 184 -302 795 -22 83 -74
4596 -74 181 15 -557 298 -216 46 -310 413 116 -170 191 -147 185 -585 355 -506 143 56 158 187 -298
4617 -298 249 -359 236 -238 331 -144 -285 -22 -455 387 -642 475 -291 -29 -270 70 237 -515 258
4636 258 -224 320 -384 213 118 -447 117 -198 259 -407 351 -56 -2 -117 46 218 -343 212 -194 -87 -281
4657 -281 172 237 -362 262 -65 226 -50 380 -65 -38 158 -233 186 -599 390 -316 -3 192 231 144 -340
4678 -340 226 -215 299 -368 334 73 -390 -113 -172 149 -586 322 -303 139 -499 99 -14 -484 103 -456
4698 -456 74 -534 207 -187 -133 -152 -227 221 -557 306 -109 32 -187 -7 71 -347 92 -89 266 -657 238
4719 238 218 -250 126 -32 439 -621 91 288 406 -386 -87 434 -258 236 -157 162 -366 191 181 -1
4739 -1 67 -34 513 -489 248 -62 257 -208 -126 591 -310 376 -204 385 -424 84 274 -99 -81 -456 554
4760 554 -253 -112 46 127 -178 -263 224 -403 21 -56 209 -412 -284 241 -78 -260 -547 361 -439 -16 -232
4781 -232 9 -191 -368 301 -307 59 -268 200 -343 -13 71 68 71 -286 469 -308 55 -107 329 -86 -331 402
4803 402 -212 120 -410 276 39 -72 342 98 160 -255 408 -50 -35 81 215 144 -423 352 -46 195 -324
4824 -324 401 57 -205 79 -65 339 -455 220 -194 12 -21 76 185 -429 371 -425 58 -397 -130 -173 -229
4845 -229 224 -261 231 -378 193 -266 261 -281 -101 250 -302 389 -379 25 -332 180 -170 -70 264 -46
4865 -46 351 -347 397 52 -76 245 -175 55 -417 184 5 129 -193 24 246 -163 422 -192 409 -195
4885 -195 344 34 17 109 -99 133 -495 345 -116 324 80 -81 412 -414 350 -247 88 -341 422 -260 -145
4906 -145 251 -254 174 -465 261 -149 167 -325 -14 -17 -555 405 -316 1 -354 -71 -102 -66 51 -282 314
4927 314 -617 42 -49 88 -205 58 188 -403 -265 -189 274 -246 168 239 -387 207 -240 398 -338 80 -56
4948 -56 21 -183 74 298 -331 192 -274 397 -232 238 39 -80 -21 -21 729 -249 309 -117 208 24 20 501
4970 501 -227 408 -88 380 -312 55 234 -141 112 -167 493 -262 0 -287 -42 -169 -269 161 -110 -140
4990 -140 -59 372 -266 -124 124 -224 151 -545 266 -208 -44 -62 -60 316 -504 354 -390 178 -307 378 -201
5011 -201 -185 361 -2 180 -460 530 100 -139 -3 -38 184 -214 417 -183 221 -30 353 185 -173 174 103
5032 103 98 -335 115 47 39 3 -39 100 -103 284 114 263 -303 294 61 -275 91 -169 291 -292 282 -101
5054 -101 -6 -5 -78 122 -564 416 -380 271 -595 305 -138 -450 40 -275 61 -475 199 -96 -6 -124 -182 115
5076 115 -527 291 -500 131 -290 -10 156 41 164 -137 227 -302 204 43 -131 -171 -291 421 -300 365
5096 365 139 190 -127 109 123 0 246 -284 349 -50 304 11 63 171 95 536 -328 387 -95 202 100
5117 100 -56 267 -323 290 -338 183 -407 427 -13 -11 125 -100 14 -447 153 -303 27 73 43 30 -459 79
5139 79 -319 51 -190 -10 208 81 59 -253 422 -513 215 0 -74 -2 50 202 -283 257 -190 -68 -219 64
5161 64 23 -346 132 2 67 -237 254 -43 20 -76 134 323 -82 -97 -157 300 -325 25 43 -316 19 112 506
5184 506 -333 151 97 -2 -353 -39 317 -262 176 -283 203 -144 -91 280 -107 51 -64 293 -234 -20 233
5205 233 -31 -122 -300 308 -417 109 -362 109 72 -148 23 -247 305 -463 251 -130 155 -39 118 144 -388
5226 -388 318 -343 15 -254 164 36 -71 99 -38 245 -345 349 -52 -29 -163 -109 -34 -184 303 -133 150
5247 150 -253 477 216 -156 14 -128 458 -390 342 162 122 121 -51 114 174 480 -272 96 -102 106 180 120
5269 120 197 88 217 -305 264 -27 33 70 29 192 -443 277 -282 184 -136 111 78 -442 166 -349 55 -199
5291 -199 240 -262 -78 -14 50 125 -682 34 -159 382 -40 225 -24 -439 76 -91 141 -180 187 -16 -8 200
5313 200 -133 328 -175 251 -73 151 -69 57 -29 -240 112 -171 578 -464 242 88 -66 154 4 568
5333 568 0 505 26 -10 49 26 86 -226 307 -112 399 46 54 -92 -13 61 -62 227 -176 311 -39 167 -204
5356 -204 -173 278 -105 124 -168 166 -348 99 217 1 -212 -60 196 -358 7 -24 52 -151 -31 113 -455
5377 -455 37 -358 357 -212 93 -71 -375 -2 -150 300 -142 35 -79 -72 -81 -54 249 -79 41 -84 281 -138
5399 -138 -52 245 -85 274 -147 219 -187 97 -27 229 -28 -110 331 -267 368 -182 281 103 164 392 -48
5420 -48 286 45 222 -191 42 100 30 60 -55 330 -91 95 -349 87 -116 -173 -127 -129 55 -352 111 -244 -80
5443 -80 -253 58 173 -491 139 -534 -170 -102 101 -12 22 150 -319 201 -246 154 -120 146 -50 -155 61
5464 61 9 283 -225 266 -98 18 -133 -131 138 -116 165 -282 186 -199 68 152 49 224 59 420 -154 80
5486 80 -211 142 351 -141 16 -64 280 -229 108 12 210 70 -94 228 -243 24 145 208 -299 173 108 -155
5508 -155 240 -126 275 -120 275 -171 -62 252 -195 175 -290 -79 -231 210 -46 -10 156 -103 -15 -141 137
5529 137 -395 218 -176 21 103 -138 365 13 254 -38 182 -241 -6 187 -71 68 -42 175 23 97 135
5550 135 269 35 99 226 -33 433 86 87 -65 -185 219 -248 412 -134 444 -24 46 349 -168 100 -207
5571 -207 37 -547 236 -36 -132 276 -2 167 -155 -47 -420 283 -166 112 -68 -292 52 -291 214 -361
5591 -361 73 -154 88 -411 15 10 -318 -108 -512 114 -151 -140 -73 -364 22 -167 -30 -498 100 -155 -264
5612 -264 -22 -76 323 -201 28 -165 37 -47 -134 163 -192 -42 -170 137 -21 344 -42 -16 153 -45 400
5633 400 -228 181 -271 178 -58 -176 194 50 99 -147 492 -167 -197 -6 34 -4 -239 295 -229 228 121
5654 121 87 -37 -104 90 95 352 -316 263 -45 -89 96 65 243 -212 42 -237 335 -128 289 135 -173 344
5676 344 -308 179 -276 64 -48 -45 -152 -222 7 -233 -116 -195 12 -254 302 254 -203 120 -201 129 -298 236
5698 236 305 13 49 -17 247 -289 401 68 186 -134 211 167 135 392 21 133 -145 -84 123 168 -129 72
5720 72 132 -17 -47 -229 430 -76 41 211 -249 -13 -104 164 -305 -91 286 188 -94 -156 86 -90 185 -196
5742 -196 279 -57 -178 140 -158 24 -278 254 -80 87 -199 -353 -19 -219 163 -30 256 -256 -200 -188 -66
5763 -66 267 -47 -3 -106 135 -74 178 63 -150 174 -312 356 -102 299 -40 248 226 113 345 -30 211
5784 211 -150 146 -158 17 -68 -74 -67 -284 116 -217 146 61 177 -181 -82 331 -230 221 -262 -70 -76 49 163
5807 163 -44 142 -284 347 -295 -69 -144 -22 -154 -4 172 -175 71 -476 164 -153 -219 170 -251 185 18
5828 18 133 -233 -11 56 3 -111 -207 251 -212 70 30 215 -231 -266 -93 -28 -301 -214 492 -313 -37 216 22
5851 22 310 24 121 -26 118 -242 183 94 -49 454 -174 195 -225 370 -126 -133 -26 -88 -34 -268 208 140 235
5874 235 -234 328 143 -197 -73 -230 9 33 25 -271 172 -91 -44 31 -179 -37 -9 130 -321 72 -16 -257
5896 -257 131 117 175 -110 103 -159 -68 58 -7 189 -156 -8 -313 330 -164 -275 162 -114 73 -16 129 -201
5918 -201 -98 -7 193 2 -102 89 -361 286 -18 300 -183 179 10 196 155 -205 333 -39 304 -48 140
5939 140 -2 143 138 -201 15 -148 -64 45 -48 272 35 111 39 220 -116 -4 6 71 -86 -423 131 -196 304
5962 304 -158 -53 -38 86 52 -163 100 -31 329 -65 275 -63 31 -76 -328 99 78 -176 -261 144 116 -92
5984 -92 194 -24 201 -263 314 -50 69 -67 36 202 93 225 -86 295 -116 -29 222 -40 18 96 199
6005 199 -39 79 -25 60 85 120 181 -120 38 -177 295 -228 80 236 2 148 -40 352 -170 288 122
6026 122 91 -93 149 -10 -103 84 -250 154 -75 12 146 -70 -104 -12 12 -91 263 183 -125 34 -276 311
6048 311 -395 255 -440 250 18 8 -32 -332 307 -175 -80 -171 -46 26 58 -45 20 157 -167 44 -37 83 -187
6071 -187 110 21 -215 519 88 255 -105 353 -153 -45 76 -249 414 -249 123 -143 -64 -72 72 -93 -220
6092 -220 42 51 198 -41 -138 -87 -108 -134 -166 276 -173 350 -225 10 22 92 -216 -151 215 -127 68 -234 114
6115 114 -49 -181 113 -267 193 -478 193 -1 -63 262 -62 149 -173 56 -133 58 6 176 204 -184 108
6136 108 -178 153 -33 226 -199 8 -181 43 159 -193 415 -56 118 -140 64 253 -194 -44 -55 66
6156 66 108 241 -187 72 195 -262 -57 -390 177 -200 91 213 -201 -2 -132 427 -195 211 -174 236 27
6177 27 -80 103 -197 -93 -325 350 -139 39 113 6 54 -182 142 -384 199 -152 82 20 5 68 -316 -73
6199 -73 -510 97 -82 -50 -291 -159 4 -123 80 -206 145 38 58 -73 -103 140 -74 31 -331 275 220 -88
6221 -88 -245 126 41 -97 397 -218 200 -293 160 -59 -186 -142 -252 119 -177 -53 -101 103 46 72 171 -6
6243 -6 204 148 135 -159 10 13 214 244 60 204 -148 93 -121 116 117 -179 82 -199 159 -100 134 -335 31
6266 31 23 41 298 -284 1 9 -91 -73 -51 -54 -284 160 -143 94 175 203 -4 -16 -100 -171 -72 -161 163 -439 30 -19
6292 -19 115 154 -191 23 -96 66 -257 -174 38 -194 68 -3 73 71 401 -142 240 80 -119 239 15 123
6314 123 -169 93 -56 -77 -43 -54 128 -143 64 -87 109 -82 11 15 -24 83 -20 395 -270 263 -218 151
6336 151 99 -118 -25 -178 228 -232 188 -112 -18 -88 4 -100 -116 281 -174 175 -59 124 10 -155 -236 -37
6358 -37 49 -104 213 -228 24 -133 -98 23 -312 174 -189 95 -309 392 130 -64 97 -65 -45 -84 -145 -113
6380 -113 207 -120 -65 162 -280 12 90 191 63 232 28 -181 196 -482 186 24 377 214 -222 163 -55
6401 -55 133 -87 24 -151 17 14 -139 234 -200 193 -204 294 -24 93 12 -36 -29 -76 125 -47 308 -14 135
6424 135 -101 -60 358 -128 28 -315 84 -173 -144 138 -123 95 -199 0 -213 130 -173 17 -73 255 288
6445 288 9 158 -70 153 54 -33 53 -68 18 -12 317 -1 183 -242 -23 -71 -161 140 46 -15 -147 -109 -39 80
6469 80 115 -62 78 -189 113 -11 33 59 56 46 54 32 -40 -37 36 171 -304 -167 165 -316 96 -200 -73 -190 -176
6494 -176 5 -92 -61 -99 -21 -283 121 -8 164 188 85 44 -427 104 -68 -86 4 109 -223 -62 -122 31 -82
6517 -82 -38 169 -50 -19 -53 -57 -21 90 -17 -202 159 -75 228 -55 194 215 -101 167 -177 157 59 210 -98
6540 -98 96 -46 -142 160 -200 159 -120 35 57 -134 -142 -323 17 -460 61 63 40 153 -187 -35 -37 38 -283 62
6564 62 26 -31 -58 -148 -57 -92 -57 -3 89 -143 124 -4 -174 -53 -1 44 -340 81 -113 29 99 -211 305 -140
6588 -140 108 -24 -7 -288 -36 200 -70 11 -62 -91 -31 254 -61 75 76 154 -54 -124 60 -26 59 -185 85 -108
6612 -108 -87 9 -34 57 -216 143 -17 -308 0 -99 232 10 7 -239 -44 93 124 197 -127 -72 -124 195 -303 60
6636 60 -41 -184 -258 38 143 -88 16 63 -168 -217 -141 -58 -50 -206 -26 154 -21 92 -284 -23 119 -396 -5
6659 -5 -52 218 -192 115 12 -170 -1 -156 22 -97 112 173 59 136 -312 258 151 -50 -109 -1 14 1 -90
6682 -90 -82 -25 -129 47 93 124 -142 -116 46 -138 -23 -227 -165 41 -136 -49 -53 32 -101 15 -7 -87 -114 97 139
6707 139 -80 -15 75 -78 -117 -148 -189 24 -122 181 132 -84 273 -299 225 -121 262 -227 -144 229 -107 -88 -123
6730 -123 162 -138 152 57 197 233 99 108 -51 349 -212 83 -26 -279 123 -125 222 -240 46 -67 192
6751 192 75 -17 218 -118 42 -122 335 -4 38 -70 99 18 80 92 96 106 -222 36 98 -65 141 -11 -1
6774 -1 23 59 -131 46 -88 -199 105 -286 116 -329 -42 70 157 -129 -23 -15 -46 3 -256 26 51 -59 -16 117
6798 117 -18 -255 152 -7 113 -37 -34 -5 -107 86 -151 178 4 326 -109 94 26 90 143 37 52 -40 64
6821 64 -165 96 180 242 -19 -54 163 152 203 -110 90 -139 -45 370 -260 71 -116 55 -70 -72 106 -77 -77 25
6845 25 -102 -17 93 51 76 92 -214 145 -98 65 -29 5 -97 -26 -138 -79 55 -186 27 -87 -56 -60 -147 16
6869 16 -104 211 27 -104 -160 53 194 104 145 -97 2 -17 242 -100 135 169 72 29 233 76 -238 -113 -200
6892 -200 99 114 79 238 -89 186 -87 34 -119 -182 106 24 -42 -353 136 -122 73 -38 -214 17 110 155
6914 155 -195 -73 -59 -27 -22 165 36 -194 -181 -116 197 -62 314 68 -128 270 -50 407 -405 -63 -120 133
6936 133 312 -1 -68 -22 135 -96 -48 -140 58 -168 -88 50 -65 -94 -106 115 -401 -69 -127 -196 -52 9 81 -100
6960 -100 125 -175 152 -159 -147 215 -60 260 -208 -77 120 113 245 203 167 181 -19 -91 165 143 131 113 -32
6983 -32 35 94 -170 74 52 21 23 213 10 -139 38 22 -155 -14 -132 -53 -108 -52 138 -289 34 -228 13 -88
7007 -88 322 -115 179 -85 -141 -48 -48 194 -94 305 123 -12 -47 -87 55 22 12 -146 -291 15 -232 -79 -60
7030 -60 -63 -121 95 -85 196 223 -287 180 56 198 -131 19 -250 3 219 -152 -8 -206 131 170 -16 -149
7052 -149 34 -8 173 -74 103 -29 -127 71 -120 -18 -1 -157 -83 -20 -87 65 168 -159 48 227 123 38
7074 38 -295 -29 -24 106 -194 -284 -19 2 112 120 142 44 120 33 -31 -39 -241 5 -180 -245 41 161 72 -150 100
7099 100 -274 312 -89 328 -164 47 67 -158 -5 -121 182 -92 39 -287 110 47 -38 9 -5 258 66 156
7121 156 144 25 130 -21 113 118 29 -41 201 46 62 123 60 89 202 175 -167 95 -19 -62 139 -25 72 21
7145 21 -133 -92 -9 147 167 16 -161 230 -278 141 -119 96 -2 -12 -54 -169 -79 -147 315 -137 164 -35 19
7168 19 77 -111 -27 -247 -88 -166 -25 -55 -42 -34 -185 40 -198 102 -39 -116 28 -93 138 -34 -91 -266 -136
7191 -136 43 -38 373 154 -120 85 -150 -242 260 106 -117 -42 -112 88 -10 120 -281 190 7 178 102 -57
7213 -57 257 -63 188 -246 173 -181 7 -91 50 90 -320 -50 81 15 -158 89 -30 -123 169 64 80 -113
7235 -113 21 -179 50 124 -6 60 -46 276 -151 -71 -115 -61 115 14 95 -87 150 -265 -23 -162 -20 102
7257 102 -2 -121 -87 99 42 180 -170 171 79 0 8 -13 356 3 -21 27 78 -30 -88 113 -56 54 -5 124
7281 124 30 173 -190 -148 -66 -87 -185 -223 -174 -259 -68 18 -81 105 -26 -54 -250 100 -4 23 96 -330 12 -116
7305 -116 16 -115 -156 241 -25 262 180 90 -153 -220 49 -284 92 18 -118 -118 274 -190 89 -107 -18 -53 -178
7328 -178 -8 64 307 7 -40 -13 -21 9 91 295 -168 172 -200 120 -41 6 139 -67 83 -219 91 29 62
7351 62 75 104 111 53 154 55 134 39 165 -185 -118 67 17 34 -102 284 9 181 -125 223 7 -151 -39 -257
7375 -257 291 -43 219 -302 98 47 -42 -97 -253 120 -123 176 71 -240 284 -187 -59 -4 133 -96 -15 -79
7397 -79 49 285 10 -33 -110 23 -32 6 -137 75 75 68 -123 32 100 18 201 -17 -69 177 152 102 -203 -45 42
7422 42 95 -138 -54 104 -47 105 -67 -88 -42 89 81 -109 360 -11 93 -177 79 41 157 97 -172 4 -130
7445 -130 162 -124 -42 -52 -1 58 -238 143 -68 324 -43 -85 53 52 -203 -98 321 -53 -13 -118 27 -54 -87
7468 -87 120 -134 183 -52 -71 21 96 -41 163 332 -141 -24 -89 114 -105 -13 -112 -152 251 58 115 -173 26
7491 26 20 149 -100 -202 28 -50 347 -61 25 227 326 25 59 34 -6 0 -188 -156 -35 -158 -260 170 -39 42
7515 42 15 83 233 -148 -58 -137 116 -38 -218 239 -145 -20 -56 167 341 15 -94 -98 -112 -260 1 150 381
7538 381 -36 -56 59 -12 88 -190 -6 101 58 -100 -80 42 127 79 -253 59 -241 64 203 -148 152 38
7560 38 111 -35 193 -25 236 70 133 -14 123 18 -18 35 166 -283 97 195 -102 -199 -37 -45 119 -494 -52
7583 -52 60 -21 207 -111 -63 39 -84 -135 -124 45 -46 -33 -40 46 -16 -159 -150 -147 -10 -67 326 -51 -2 -109 -369 -49
7609 -49 97 -19 126 245 54 -22 -91 -34 -82 -98 237 -63 128 -79 -145 43 -25 28 38 28 -50 -172 39 151
7633 151 -145 109 182 8 4 124 200 79 208 -125 151 -98 320 -50 -180 96 -201 88 -66 -67 111 -172
7655 -172 283 178 202 -19 -21 -146 -209 127 96 89 -141 -40 -163 305 -41 -123 -161 25 34 -227 -74 -327 91 -126
7679 -126 -8 35 -98 88 -57 0 -24 156 148 -99 289 16 82 -57 -24 -89 24 -44 138 7 -149 -87 65
7702 65 35 -53 147 82 -123 85 222 142 81 281 58 -122 135 -51 289 -8 203 -73 38 -49 122 132 92
7725 92 146 11 123 132 364 19 -89 73 -140 -34 -65 281 38 -7 -14 -134 -46 26 77 -101 248 -203 -192 234
7749 234 230 35 -98 129 -189 113 14 -70 166 -68 255 6 -75 -187 -23 -250 171 -84 119 21 139 85
7771 85 -81 -68 -169 5 211 46 176 284 194 56 66 -146 -142 -192 64 80 -145 35 -42 304 76 304 -326
7794 -326 49 73 -103 -34 0 223 -173 116 -6 55 43 126 -55 -149 -28 44 164 -74 -143 74 -172 38 -143
7817 -143 -77 -62 0 -185 -103 84 -135 -25 -2 187 -45 -83 -99 -129 -131 -66 -34 -78 -121 -171 -30 -71 107 221 -99
7842 -99 1 57 166 18 -238 -202 -173 -54 -51 -115 -145 -148 1 -85 7 130 -1 -167 10 -26 -24 -42 -118 -58 -39 -35 -274
7869 -274 31 7 100 -12 -24 41 92 32 -168 52 -117 58 25 9 -155 96 196 -251 -31 -1 98 170 55 -98
7893 -98 -53 72 -194 -1 -120 -29 70 -38 -33 85 -33 6 124 -120 -183 27 -48 18 19 23 -339 -112 -336 102 93
7918 93 -255 4 -265 115 -200 -157 61 190 -135 123 175 133 319 -22 169 -62 -30 -192 -95 -325 -38 111
7940 111 -47 193 -61 202 179 84 43 -120 170 -45 83 -127 31 -82 8 179 -119 69 152 -38 -129 95
7962 95 -373 -65 -170 -92 -57 69 149 99 91 15 237 119 -33 15 -237 -13 -236 13 -99 -178 85 31 97 -6
7986 -6 25 -87 -90 289 -121 -34 -20 7 -287 100 69 -158 -9 -71 108 -202 1 -205 37 7 -72 -6 -79 131 23
8011 23 82 120 115 149 -59 107 18 -90 27 90 19 42 135 -31 -36 -20 -91 -147 -45 -117 231 -52 -72 -159 -272 168
8037 168 -139 -32 -170 259 -106 21 251 -47 260 -152 -47 -270 131 124 9 149 -61 143 -242 -124 -24
8058 -24 -79 15 -60 -90 -253 25 -121 215 -225 -132 5 17 158 -76 -138 16 26 -237 115 111 96 58 -280 94
8082 94 -54 337 5 -221 80 -126 196 -40 352 -108 227 5 281 213 -73 44 -39 -29 64 86 -23 -12
8104 -12 77 160 1 59 93 -23 -163 -89 197 78 -156 -151 -173 -158 48 -15 -191 -81 -223 -128 106 -28 67 -29 -160
8129 -160 101 85 13 -165 -30 -62 36 -104 159 -7 82 28 -57 18 114 -87 15 47 -119 159 124 64 57 -43 85
8154 85 -19 -124 -94 -146 117 -26 305 -187 194 -65 44 13 -52 135 -86 17 -81 94 -120 96 50 68 79
8177 79 -148 -5 -62 -33 31 -76 -16 -245 -22 47 -30 9 -83 -159
8191a59
$$ Imaginary data points
##PAGE= N=2
##DATA TABLE= (X++(I..I)), XYDATA
0 0 0 0 0 0 0 0 0 0 -8 8 -8 8 -16 24 -24 32 -40 48 -59 72 -88 104 -120 144 -168 196 -228 264 -305 348 -399
31 -399 453 -515 584 -659 743 -831 932 -1041 1161 -1290 1433 -1589 1760 -1946 2147 -2369
47 -2369 2612 -2877 3169 -3492 3846 -4237 4677 -5171 5725 -6356 7083 -7930 8929 -10133
61 -10133 11614 -13482 15930 -19288 24184 -32018 46569 -82616 359676 403512 -301625 220010
73 220010 330013 43345 124807 253776 -50988 65087 212410 141103 -62773 -84271 63401
84 63401 141540 14495 -135573 29850 53207 -59253 -7421 -4127 -60220 -38392 74253
95 74253 19891 -43086 -125655 50298 95657 -130389 -24687 85768 -66814 -40166 101219
106 101219 -110318 -66657 95239 -42663 -18025 47806 -48942 -56888 129650 -44962 -136034
117 -136034 122136 57237 -133675 23133 95512 -147007 -29949 69873 -64266 -89617 -12153
128 -12153 28856 -82881 -94605 -29640 3007 -82003 -40409 1999 -50809 -10520 -24948 210
140 210 -16348 -20583 19079 77519 -4243 -56771 96368 55639 -50936 15614 121017 -34813
152 -34813 -13699 136219 -35492 -65025 79564 39574 -68897 43284 24602 -41720 18095
163 18095 224 -37096 -34937 44750 -23272 -32101 18353 -30178 -44558 8606 5454 -71613 18240
176 18240 21759 -27626 -29023 -2039 -6091 -26079 40660 -14134 -18480 35603 20457 -46065 20160
189 20160 37046 -45475 57340 38079 -43793 -8261 61333 -14073 -43938 39293 3248 -15267
201 -15267 7542 10296 -65570 660 25529 -47394 -49 -10626 -32193 -6079 20887 -69339
213 -69339 -40364 48989 -4936 -51624 -1115 38503 -68780 3702 56093 -45096 -33780 62125
225 62125 33136 -51705 13207 16650 16595 7576 8307 15590 11580 17430 -11341 41377 -4231 -38354
239 -38354 42509 65530 -59288 -38967 90896 -21798 -56116 29807 36429 -60993 -11198 66531
251 66531 -39297 -60055 21736 37399 -52274 -14040 11435 -1137 -3854 -36619 9966 6718
263 6718 -22402 -21161 48496 -2900 -65499 27560 52379 -43536 -54398 88760 9346 -66860
275 -66860 33069 44099 -39170 -24562 59184 429 -22627 1954 36747 -3199 -33389 11720
287 11720 20693 15683 -39533 13720 40922 -27909 -42438 45208 25983 -70525 23880 52486
299 52486 -30946 -57419 51838 34393 -68978 7238 53607 -8325 -41590 34897 11187 -18946
311 -18946 1598 20902 28248 -29034 -1284 31978 21189 -40677 -960 60199 -5173 -36083
323 -36083 24329 45970 -56988 1896 59589 -17788 -38229 31110 41056 -47544 -14069 28187
335 28187 10230 -30830 5197 18254 -25190 -7343 -8930 13778 -20867 -28151 11255 18285 -36527
348 -36527 -37831 36913 -7912 -35509 -134 35719 -31357 -25183 49552 -9403 -33813 16884
360 16884 40807 -22859 -4083 18968 4521 1224 -7314 14351 -5011 5758 -7323 5853
372 5853 2860 -24717 -1800 15851 -6464 -38731 25655 4038 -30735 -3350 9136 -10966
384 -10966 -22444 22869 -10355 -20901 -306 7847 -21682 -10039 9926 -21660 8929 -7246
396 -7246 -14932 -5854 7350 -9382 -10054 18275 -7581 -180 6428 12783 -14547 13542 22570 -8870
410 -8870 17959 7748 1077 3981 20857 -12689 1447 24612 -7854 -7048 4585 12314 -29256
423 -29256 8399 18938 -19381 -7195 17609 5336 -23320 13514 5621 7642 896 6621 15903
436 15903 702 8312 1054 24430 575 -1849 23778 21601 -18269 -3856 45950 -12524 -13274
449 -13274 24686 25499 -22531 -2761 35420 -11336 -15898 14762 27844 -23613 -7577 15783 2501
462 2501 -15114 -20168 22241 -3959 -24059 -8590 17794 -24442 -34953 18432 2883 -31821
474 -31821 -25026 35584 -13844 -43782 7770 17790 -20212 -23152 29871 -1209 -23844 -4367
486 -4367 29513 -9535 -29599 24818 18435 -10502 -25387 22262 12042 -23816 -8113 26540
498 26540 3310 -37847 19123 16415 -26136 -27068 30568 14120 -42077 -419 24610 -7786 -38620
511 -38620 17272 14029 -22433 -10758 19459 10006 -42693 3186 26735 -5688 -30781 14391
523 14391 26697 -22215 -15404 13845 17531 -33548 5961 33623 -14325 -29307 16627 31125
535 31125 -37601 -14919 29481 11160 -34258 1643 22829 -25652 -13488 11474 13648 -31459
547 -31459 -9784 23510 -2357 -34801 -9030 30011 -17929 -18800 6809 11583 -25662 -13877 26103
560 26103 -10900 -25216 5391 29856 -22167 -20513 14432 8247 -15702 -9605 25603 -11569 -11091
573 -11091 7573 9530 -14596 -13110 15739 6952 -6548 -16505 17764 -1934 -15592 1953 8552
586 8552 -2737 -14264 18245 417 -14549 -8290 16712 581 -15251 10888 5940 1186 -13235
599 -13235 10483 3960 -6505 6042 12769 5152 -9252 12982 2043 3460 -1769 11689 14810
612 14810 -4243 6197 4015 7591 -5815 9406 7575 3213 3432 3031 5440 -11887 8334 1090
626 1090 2803 797 771 -372 -5844 4572 -10551 -26 562 7388 -9532 -4574 6584 -13898
640 -13898 -1558 3492 3962 -13486 6920 6210 -7951 -6265 -668 11214 -7008 5302 1860 3782
654 3782 -3838 -3010 11525 -2872 -4622 4353 21451 -14896 -9662 14178 3443 -11300 -2414 21422
668 21422 -12295 -7007 10050 3730 -18035 -1227 18227 -6537 -5004 -4021 12758 -4762 -10883
681 -10883 2453 9533 -720 -13834 18689 2850 -17286 -4378 27025 -5374 -24757 23896
693 23896 13097 -14648 -11186 21631 -4326 -14332 10373 11883 -7078 -17097 16487 1909
705 1909 -13278 -13987 14433 10264 -24312 -3489 13102 -5921 -30375 16922 13534 -26500 -8239
718 -8239 25275 -307 -39270 13772 18942 -14950 -11793 21725 5091 -22198 6303 10789 1875
731 1875 -16708 12815 20653 -7813 -15391 9166 20981 -21245 -2534 23640 6715 -25645 9399
744 9399 24129 -25554 -9885 21983 12931 -26611 2620 18979 -11316 -15890 7462 15519 -17666
757 -17666 -823 9705 4343 -17187 -7768 19885 -1758 -13226 1180 24182 -14769 -16818 17198
770 17198 9301 -18057 -3151 31267 -12592 -16897 13263 12596 -17639 -4528 22001 -3600 -8702
783 -8702 -2188 13459 -7890 -9874 6296 7431 -2920 -13708 13212 1693 -13925 -7408 18986
796 18986 -2517 -20982 13716 7304 -12699 -11977 18963 -4757 -15123 11654 8280 -9512 -9552
809 -9552 14030 -4987 -2900 -832 3667 4448 -4760 553 -853 5354 -11219 6041 10682 -5739
823 -5739 -6901 9232 8597 -18830 7176 8761 -3040 -1945 11049 -778 -10644 10594 -397
836 -397 138 154 7514 -2347 2448 3868 -11431 6362 3980 -670 -3733 9555 -5826 -8098 7790
851 7790 -5949 -4572 27 7965 -11112 -353 -691 -12114 1481 1372 -5257 -8155 12109 -10753
865 -10753 -9099 6611 -4185 -8986 4804 13362 -16197 -110 7995 -2580 -6775 5720 7548
878 7548 -5440 8362 -2750 2408 -356 -549 3449 7968 738 -10548 15433 2924 -11073 -980
892 -980 18267 -5506 -11794 20019 -655 -13762 1462 18148 -11194 -7761 12817 1851 -5569
905 -5569 -5722 8482 -4417 -1281 -2937 6118 3296 -14207 3135 10335 -3481 -19490 16770 9719
919 9719 -18628 -491 15813 -5018 -21299 18325 5594 -16359 -3983 15822 -3549 -18137
931 -18137 6458 2111 -2771 -11429 6062 4173 -9849 -8648 4054 8569 -20187 -1299 14552
944 14552 -1561 -21297 8082 15542 -22689 -3867 17944 2673 -22793 10214 14056 -14982
956 -14982 -6221 11488 8492 -14346 5071 8015 948 -9400 82 15747 -2598 -7496 4328
969 4328 18980 -13265 -8157 19186 4534 -14537 4640 26075 -15407 -9346 17941 8898 -14135
982 -14135 4159 20364 -7093 -2661 6477 10285 -7236 -106 10692 6205 -1831 -8578 14380
995 14380 2849 -9776 -2032 17719 -4199 -16056 16342 2931 -16739 -4722 21146 -9561
1007 -9561 -15284 11548 3208 -11579 -6687 11157 -7972 -3662 148 1731 -1277 -8887 1028 2842
1021 2842 2133 -13651 7033 8689 -10509 -5473 10478 1984 -16863 13321 6971 -10982 -2960
1034 -2960 12842 -1820 -11470 10355 364 -1231 -1078 4500 -3488 38 1985 -4464 7325 -3845
1048 -3845 -1757 2753 6243 -10136 -1298 12672 -6823 -2189 6188 4945 -10618 6828 6087 -8019
1062 -8019 3033 5819 1402 -4620 8689 -4706 -136 6633 -2780 -1582 3832 5007 -10388 5554
1076 5554 736 -6555 22 3978 -3083 -7564 6283 -7334 -2288 -1201 -2900 -3555 1711 -229 -10725
1091 -10725 5864 -3031 -6052 478 7531 -7025 -5128 12771 -5265 -5868 3335 9474 -7684 1164
1105 1164 8712 -3805 -846 544 5813 -3696 3533 139 3506 2380 -7666 3758 5243 -971
1119 -971 -8909 12826 1844 -12428 3721 8486 -5626 -10315 15997 29 -9784 1790 8925
1132 8925 -4239 -7815 10428 1299 -871 -3816 7057 2093 -4446 10 5697 6831 -10911 4568
1146 4568 8527 -3610 -11624 9843 9080 -17270 1824 10946 -4389 -16304 9647 4299 -14608
1159 -14608 -1370 7118 -505 -13804 3001 1047 -2944 -7145 -437 8159 -7551 -6231 2917 8029
1173 8029 -14794 -2380 15132 -2856 -11742 6370 14818 -15955 -1975 14512 1957 -10684
1185 -10684 7433 13628 -10078 -985 7013 7089 -6634 668 8114 1526 -4074 -5146 11165 -3330
1199 -3330 -8695 3082 11627 -10447 -11023 15774 -2144 -12541 2256 15664 -10054 -6560 12477
1212 12477 59 -7638 143 11990 -4659 -1853 2159 4679 -1315 -7309 4693 3455 -1262 -8847
1226 -8847 9804 1568 -12575 854 9305 -3685 -12529 13461 1871 -10780 -592 9248 -4399
1239 -4399 -8269 9510 -183 -2942 -3637 4143 -1022 -4106 -761 997 4917 -8234 866 4060 -686
1254 -686 -7641 5643 8380 -8696 2790 7286 1482 -7945 8388 5645 -4878 3857 4812 2110
1268 2110 -4903 5570 -846 923 896 -502 3230 -1393 -344 -3980 5961 -3640 -1810 4248 694
1283 694 -3010 -1391 6315 -6732 958 2953 755 -1877 453 1340 -5339 2938 -2954 -211 -993
1298 -993 1453 -3636 -3180 2659 -6892 -129 14 1182 -5873 936 1440 -5619 -185 -1041 2077 -3894
1314 -3894 2477 -1973 -810 -54 -3012 2972 -859 147 -3302 7229 -1888 -5276 4316 3289 -1509
1329 -1509 -2638 9822 -2869 -2863 3823 4465 -2631 -2065 9323 13 -125 -1442 5519 344 -1869 3200
1345 3200 3421 2871 -5180 6949 3676 -2927 -2784 9167 4642 -8398 6587 6560 -1555 -5677 10114
1360 10114 2888 -6805 4482 6721 194 -7195 6696 2726 -1798 -2805 4054 5191 -7019 -783
1374 -783 2877 2190 -10523 2795 7801 -7363 -7214 4529 4689 -14549 186 6426 -4160 -8812
1388 -8812 3485 4012 -11604 -1785 2935 1834 -8574 295 5328 -3026 -5679 -1035 8893 -6242
1402 -6242 -3277 5981 4542 -8912 -2207 11963 -5125 -5974 4730 9088 -9345 -3430 8320 -1946
1416 -1946 -5811 -335 8825 -5650 -4119 2330 3273 -5379 -5845 7590 71 -5186 -3546 8492 -3820
1431 -3820 -8300 5566 5014 -4505 -5438 10786 -1785 -6664 1836 6976 -2424 -5564 8051 1590
1445 1590 -3016 -3668 6821 548 -4768 2300 3684 -2 -7844 5283 1937 -4862 -3668 5793 1926
1460 1926 -9399 2265 2161 -2668 -6765 4506 1122 -6577 -71 1875 458 -7684 2902 2349
1474 2349 -1178 -3064 1931 3784 -4989 1301 1853 2829 -4045 2882 4679 -2130 -1257 1389 5384 -4282
1490 -4282 1741 2791 1759 -1922 474 4263 -3596 1112 1025 3775 -2864 79 1928 -1065 -194 -2413
1506 -2413 3099 -2120 540 -1579 -92 -1611 -3100 1940 -1984 550 -2947 2108 -1303 -2122 -150
1521 -150 -385 2616 -1578 2728 -1323 1903 -963 -20 1987 -504 1599 -699 4226 -3267 -1249 869
1537 869 1022 -1388 -1847 4025 -2780 -518 -1401 2120 -1944 -852 3316 79 248 -3355 4420 -809
1553 -809 -1704 397 3634 569 -4342 4198 -388 -1958 -2682 5324 -125 -4218 2087 2012 -99 -5163
1569 -5163 5246 1811 -1115 -334 4242 2508 -5219 4228 3541 970 -3969 5280 3931 -4839 -161
1584 -161 3130 2103 -7396 3245 3228 -2925 -4391 2207 3255 -7305 369 2999 1622 -6382 1884
1599 1884 5171 -4224 -3065 2529 5541 -6885 412 4557 -660 -5717 711 5727 -6083 -2115
1613 -2115 2363 3340 -6801 -1816 5297 -1751 -3912 -232 7315 -5340 -3234 3986 2848 -5634 -2270
1628 -2270 8906 -2270 -3962 924 5784 -5345 -3446 6135 450 -3404 -1428 7031 -3338 -4278
1642 -4278 1655 5036 -1538 -4675 6834 1299 -3339 -2207 7716 -450 -5084 5256 4327 -2681 -5136
1657 -5136 7311 141 -3946 472 4472 -953 -5779 3863 43 -2103 -4108 4291 1369 -5654 -926
1672 -926 1859 473 -7502 2935 2112 -3652 -3622 2966 635 -8033 2154 1963 -917 -4940 2807 1493
1688 1493 -4311 -509 179 2015 -4164 1656 1687 -356 -3050 303 4746 -3747 3 1763 3131 -4098
1704 -4098 538 3915 -2006 -444 801 4247 -3867 1116 2089 551 -809 55 3679 -1523 1566
1719 1566 -598 3016 -751 -436 2146 1034 1249 -1687 4556 -977 -291 575 2528 593 -1216 4131
1735 4131 -968 1651 -766 2032 -337 186 1892 -697 2559 -1805 1182 -1046 1343 -1513 -426
1750 -426 2424 -1942 -185 -2058 1770 -3220 -362 472 -1012 -1179 -2137 1415 -4027 -194 -2271 675
1766 675 -1087 -2878 -1 -1456 -473 -4623 2624 -1027 -2673 -925 1566 -1279 -5292 3756 -855
1781 -855 -1853 -1924 3150 -876 -3399 1842 -185 820 -2935 2901 301 -1000 -1242 1176 2797 -4209
1797 -4209 1601 2508 1297 -4590 2461 3602 -4192 229 3463 2138 -5556 3130 2465 -2305 -1352 2257
1813 2257 3112 -3766 1370 864 1999 -3322 190 4186 -1464 -2068 500 5673 -5261 -1370 4149
1828 4149 1256 -4845 412 6456 -4998 -1926 2563 2691 -4949 284 4688 -1984 -1597 -941 3909
1843 3909 -3299 -1615 1109 2477 -1986 -3836 5251 -1090 -4069 -1279 5970 -3015 -4423 5041 775
1858 775 -3602 -2210 6512 -2641 -2488 2847 2909 -1340 -2730 4715 -133 -195 -1529 4332 1400 -3329
1874 -3329 1597 2540 827 -4810 5384 2348 -3059 -722 4378 692 -5380 4972 2325 -1132 -2441
1889 -2441 4171 541 -3567 1588 990 1406 -3662 2092 864 -1099 -2588 385 3212 -4259 -6
1904 -6 1235 919 -5387 873 3362 -3649 -991 1704 2436 -5343 1509 1409 -1335 -1558 515 2190 -3286
1921 -3286 1016 -761 1080 -2550 -751 1956 -660 -718 -2062 3503 -2504 -1174 1255 1784 -1581 -1230
1937 -1230 4405 -2335 -462 40 2622 -1689 437 2596 -1456 1142 -1074 1983 -938 1484 -603
1952 -603 712 1837 -2378 1103 88 1518 -2423 2554 1166 -1846 899 206 759 -2598 2975 -1069
1968 -1069 -49 -128 -632 1 -1327 711 -3052 2436 -1503 -1531 92 -24 -1645 -2526 3485 -2964 -1078
1985 -1078 -109 803 -2609 -1246 1768 -2603 940 -1764 1273 -1473 38 -973 -238 1446 -3327 1690
2001 1690 486 108 -3288 2893 1322 -3704 1966 1393 -92 -3087 4218 32 -1718 1121 1537 1277
2017 1277 -2320 2553 -238 1506 -1391 901 2642 -859 -469 945 3657 -3999 1249 3514 -238
2032 -238 -2386 1952 4002 -4622 1163 1833 809 -2798 1790 2549 -2661 86 -453 2600 -2771 -273
2048 -273 1023 1058 -1632 -2440 3792 -2097 -2196 -43 3666 -3616 -2471 3822 -1620 -2886 -1195 4239
2064 4239 -3687 -1490 1929 -80 -2091 -2076 2970 -2091 -623 -1271 2546 -806 -3061 1677 952 -323
2080 -323 -3699 4438 -94 -2979 148 2969 -459 -3721 4751 501 -1369 -1153 3802 107 -2598
2095 -2598 2692 1028 1081 -2093 3226 567 -682 -199 1839 2694 -3330 1990 1703 952 -3246 2530
2111 2530 2644 -2921 560 1829 1307 -4705 2473 1573 -1702 -869 1112 1747 -3339 1351 -292 932
2127 932 -1917 -106 1606 -1701 -570 -1086 3123 -3494 -914 1200 504 -2473 -1310 3022 -3640 -566
2143 -566 40 1051 -3049 -587 1662 -2531 -264 -1441 1618 -2027 9 -469 157 413 -2456 1623
2159 1623 -598 124 -1690 2533 -410 -2402 1710 415 -143 -1730 3384 -1195 -142 954 316 475
2175 475 -664 2017 -1157 2053 -986 497 942 -266 -79 -486 3038 -2658 1092 653 -188 -982 462
2192 462 1772 -2405 1727 -730 724 -1267 389 -270 -569 1262 -1954 1796 -916 -231 -1567 1488
2208 1488 -466 -2317 2044 -754 -437 -1667 2354 -1449 -981 1200 -439 -86 -1969 1720 -1640 509
2224 509 -1014 676 787 -1564 631 -391 1441 -2638 1751 1341 -975 -490 1460 1667 -3052 2321
2240 2321 746 404 -934 1460 1376 -1730 1317 -193 2053 -1576 1078 1205 462 -395 -342 3293 -1943
2257 -1943 471 790 1908 -2209 -425 3122 -1794 -358 -145 2696 -2746 -9 1186 -790 -1134 -1066
2273 -1066 2714 -2349 -407 -881 1359 -1617 -2138 1521 -647 -719 -2264 2417 -1907 -1995 790 1014 -1209
2290 -1209 -2648 3065 -927 -1519 -1257 1842 -817 -2299 2325 -519 -256 -2098 2623 -623 -1112 -8
2306 -8 984 1084 -2869 1855 411 66 -1984 2362 1327 -2545 1320 838 765 -2843 2633 743 -1304
2323 -1304 338 916 1136 -2978 1679 68 532 -1547 635 1593 -1547 -24 -16 2204 -2667 642 1157
2340 1157 -106 -1394 -65 2545 -2927 675 652 701 -2085 497 1298 -1852 -16 -831 1791 -1796
2356 -1796 -100 -277 -209 -597 -1825 1994 -1169 -243 -987 1633 -1420 -1703 1839 -963 -211 -1328 2331
2373 2331 -1954 -482 773 311 127 -997 1986 -877 1071 -896 1280 786 -721 983 474 1714
2389 1714 -1636 2272 537 185 147 1266 1205 -1550 2316 -220 915 -775 1141 545 -468 1090
2405 1090 -848 1683 -1567 405 38 609 -820 -699 1668 -1871 -36 -969 1072 -1646 -258 789
2421 789 -1273 176 -1359 1110 -1798 264 -806 339 61 -1609 1088 -1152 355 -1923 1502
2436 1502 -552 -969 347 -298 366 -2271 1996 -630 -355 -956 646 264 -1739 1066 -650 843
2452 843 -1614 1326 464 -580 137 -14 1824 -1464 1288 602 829 -802 653 2050 -1013 1251
2468 1251 449 1886 -1379 1369 1444 -456 379 259 2292 -1684 743 268 741 -763 -613 1843 -875
2485 -875 320 -1022 1521 -1529 -559 690 30 -456 -1706 2045 -1719 -741 -605 563 -1481 -1766 1477
2502 1477 -1497 -314 -1765 1080 -1204 -1242 366 -217 173 -2365 1509 -776 -725 -1318 1093 35 -2089
2519 -2089 1269 -95 104 -2091 1807 -325 -1082 22 234 275 -2037 1582 -427 411 -1235 734
2535 734 825 -1458 876 -48 1459 -1827 1459 1086 -411 -131 627 2068 -1530 1634 782 1211 -615
2552 -615 955 1574 -897 1058 12 2071 -1019 577 760 400 -139 -426 2378 -1443 425 -405 1075
2569 1075 -1173 -576 1447 -1148 63 -881 1423 -1439 -158 -49 -312 -281 -1414 1176 -1293 -306 -1335
2586 -1335 987 -458 -1479 960 -721 235 -1604 1599 -792 -554 169 313 359 -1250 1528 -957
2602 -957 334 -819 1052 861 -584 524 -378 1279 -1610 1308 277 -120 72 276 1482 -1586
2618 -1586 1173 -121 1127 -582 735 948 -674 705 -579 1858 -787 1055 542 522 -26 -431
2634 -431 1746 -1018 691 -85 1308 -961 -114 907 -607 155 -992 1559 -1115 80 -421 273
2650 273 -423 -1294 1104 -1179 -209 -1395 826 -850 -1333 211 -786 121 -1943 1235 -1401 -717 -917
2667 -917 -38 176 -1767 1003 -838 378 -1238 648 276 -774 327 44 1091 -1479 1319 -166
2683 -166 451 -578 323 1456 -1073 913 -249 1255 -754 942 1041 -46 539 -174 1622 -1068 883
2700 883 254 800 -42 67 1614 -1016 671 -383 1697 -860 84 717 18 410 -855 1878 -807
2717 -807 209 -14 699 -285 -880 1440 -617 671 -853 1147 -1088 -321 338 -319 111 -1675 1355
2734 1355 -840 243 -1034 330 148 -1452 733 -485 485 -1484 1018 -221 -866 31 -347 517
2750 517 -1741 1072 -764 202 -999 -4 592 -842 753 -609 987 -1274 432 410 -268 208 -32
2767 -32 1533 -1559 1040 226 708 -373 393 1137 -370 1102 -558 1336 -597 349 305 337 288 -537
2785 -537 1697 -1017 110 -606 1361 -557 -428 1284 -756 345 -634 1244 -1008 -185 296 -511 232
2802 232 -1123 884 -672 591 -985 294 50 -1011 633 -564 535 -1717 1287 -269 -752 -240
2818 -240 -109 488 -1441 1218 -855 195 -873 423 252 -742 468 -620 1221 -1236 497 92
2834 92 -11 -572 -369 1319 -1612 825 -378 793 -1125 -25 1051 -728 416 -509 1294 -1119
2850 -1119 627 347 429 421 -337 1543 -774 447 -626 1435 -476 -212 798 -415 199 -1216 1453
2867 1453 -1155 -87 24 163 -287 -1218 1054 -1321 201 -1162 374 -682 -1060 442 -514 210 -1510
2884 -1510 733 -851 -293 -423 168 250 -1917 672 -749 30 -1346 649 -163 -924 474 -402 732
2901 732 -1326 1152 -425 422 22 115 917 -908 870 -333 1297 -850 674 763 -269 684 -74
2918 -74 1816 -1019 988 513 313 -110 417 1379 -821 1171 -218 1005 -473 721 762 -41 934 -499
2936 -499 1398 -443 514 -109 837 412 -584 1278 -645 575 -800 1142 -687 -100 597 -626 376
2953 376 -952 736 -1120 422 -620 -358 163 -860 304 -1023 636 -1665 294 -252 -639 -269
2969 -269 -725 600 -1665 898 -601 -17 -269 -40 53 -800 711 -1076 761 -883 456 162 258 357
2987 357 -810 1453 -834 718 -178 893 -70 -113 1049 -760 951 -661 1084 -509 472 136 -85
3004 -85 965 -897 1049 -685 781 -778 607 192 -834 621 -309 561 -1117 1325 -475 -293
3020 -293 -22 -65 332 -1226 1051 -749 535 -764 319 259 -581 547 -510 1179 -1458 490 -29
3037 -29 -82 -32 -552 969 -1433 595 -433 332 -893 369 729 -655 782 -554 1091 -1020 609
3054 609 278 42 147 -269 1296 -946 652 -588 1192 -202 -182 1205 -372 470 -580 1664 -909
3071 -909 529 639 315 76 -572 1360 -954 612 -70 774 -162 -41 675 -408 297 -1258 950 -622
3089 -622 -174 -20 249 278 -1330 826 -1048 27 -713 667 -385 -851 726 -506 279 -1107 1038
3106 1038 -804 -341 -174 -311 254 -1026 844 -880 295 -920 305 22 -931 340 -356 694 -1590
3123 -1590 769 -247 -864 -290 -38 607 -1174 969 -651 308 -460 186 139 -667 684 -867 1134
3140 1134 -955 510 -172 65 112 -250 1192 -965 660 -84 703 -604 309 763 -660 660 -234
3157 -234 847 -832 718 -295 -144 502 -77 672 -782 763 -848 499 -228 -203 635 -344 415 -930
3175 -930 1044 -868 119 -39 -502 -210 -726 1039 -1277 686 -762 142 -330 -239 247 -1146 965 -889
3193 -889 587 -523 39 -32 9 528 -815 833 -607 1065 -359 727 -17 -321 677 -626 927
3210 927 -595 677 -728 541 134 -341 608 -322 585 -895 983 -353 342 243 60 610 -856 1017
3228 1017 -571 626 -621 217 367 -221 542 -564 892 -1048 525 12 -146 -230 -126 879 -1018
3245 -1018 494 -776 348 -799 286 263 -824 114 -605 479 -1051 338 -559 -234 -352 -895 752
3262 752 -1164 265 -732 822 -506 -264 799 -527 251 -841 1236 -1084 367 366 134 159 -108 1216
3280 1216 -674 849 -129 1007 -135 113 845 -315 708 -611 1361 -247 69 436 581 461 -650
3297 -650 1416 -463 320 -91 1212 59 -230 907 -375 556 -581 1233 -732 36 -55 -27 408 -662
3315 -662 633 -718 454 -940 22 -40 -838 563 -316 191 -1380 971 -443 -556 -91 -215 100 -1004
3333 -1004 729 -706 188 -631 167 41 -787 440 -904 671 -1276 490 -192 -260 -291 -112 567 -1153
3351 -1153 720 -28 313 -860 325 174 -710 612 -154 544 -711 494 57 -247 161 -183 804 -703
3369 -703 672 -322 893 -391 481 553 -604 605 -259 996 -695 428 315 -137 383 -188 718 -752
3387 -752 540 -206 214 41 -37 243 -811 533 -560 596 -627 153 86 -357 104 -736 579 -673
3405 -673 598 -387 -48 -400 -224 532 -904 290 -398 391 -898 304 86 -460 194 -562 765 -843
3423 -843 494 -265 25 -110 -264 235 -858 725 -669 531 -730 92 389 -309 433 -182 796 -875
3441 -875 635 13 101 -194 -184 1232 -729 684 -133 750 -391 -3 421 -504 522 -536 1065 -479
3459 -479 566 -106 174 -131 -723 710 -768 221 -477 682 -513 -488 645 -262 76 -876 557 -968
3477 -968 -6 -63 -228 -379 -735 686 -927 274 -495 298 -310 -195 322 -481 188 -908 587 -514
3495 -514 -202 64 -145 0 -498 982 -847 198 -197 508 -375 -484 771 -264 520 -523 1092 -407
3513 -407 -69 118 402 240 -696 983 -150 474 -466 700 124 -381 761 2 548 -547 1120 -74
3531 -74 21 506 170 474 -629 664 -414 287 -392 174 215 -590 476 -421 581 -846 701 -84 -231
3550 -231 41 -97 419 -931 704 -492 76 -735 248 -26 -899 471 -445 244 -771 445 -328 -268
3568 -268 -224 -194 338 -792 494 -112 224 -645 214 523 -864 708 -244 849 -576 647 -77 -243
3586 -243 291 37 668 -595 930 -210 471 -9 322 717 -505 791 -191 840 -537 385 59 -317
3604 -317 90 -232 620 -944 579 -68 241 -361 252 830 -681 547 -223 196 -701 242 7 -558 128
3623 128 -545 685 -1107 250 -300 -43 -251 -220 363 -643 260 -544 483 -936 152 236 -342 296
3641 296 -488 586 -712 220 -185 4 -294 -170 660 -717 323 -267 703 -760 229 384 -103 334
3659 334 -272 1075 -434 347 84 284 -108 -102 839 -436 464 119 999 -273 207 557 -185 365 -323
3678 -323 929 -608 28 -21 261 -97 -469 697 -590 311 -466 324 -332 -517 358 -579 -105 -788 785
3697 785 -524 -6 -130 -108 -396 -536 391 -725 105 -407 300 -517 -597 519 -269 47 -946 565 -524
3716 -524 167 -46 226 16 -725 633 -757 -188 -263 609 54 -313 687 -301 124 -465 680 -325 -268
3735 -268 157 117 218 -457 587 -135 435 -404 488 235 -525 740 -106 446 -236 852 -142 -30 161
3754 161 342 501 -785 730 -274 296 -323 442 58 -303 684 -301 413 -659 580 -96 -153 12 -91
3773 -91 -7 -755 442 -83 16 -589 86 -148 -646 568 -303 149 -888 244 -367 -254 34 -339 278 -804
3793 -804 469 -567 87 -348 64 173 -796 366 -254 367 -913 222 151 -237 266 -58 584 -541
3811 -541 330 136 282 -403 -3 745 -482 673 -70 428 -465 380 282 -12 164 188 795 -689 499
3830 499 -51 266 -179 89 595 -411 431 66 481 -696 102 114 -318 150 -117 766 -631 201 -103
3849 -103 91 -190 -231 549 -709 185 -430 328 -456 -50 261 -503 326 -464 800 -821 433 -3 270
3868 270 -71 -612 697 -725 243 -467 572 -384 116 528 -302 381 -114 827 -395 392 76 247 295
3887 295 -271 737 -410 303 -406 828 -95 -264 594 -429 213 -276 886 -662 249 235 56 20 -423
3906 -423 690 -576 250 -534 494 30 -334 486 -201 322 -713 610 -563 -148 159 -66 64 -764
3924 -764 650 -642 195 -457 244 -355 -649 434 -419 150 -721 608 -497 -25 -207 -234 283 -673 628
3943 628 -374 98 -361 521 14 -331 354 -196 346 -414 803 -346 -65 186 -108 418 -521 919 -160
3962 -160 159 -37 365 122 -402 763 -188 604 -391 750 1 76 -24 -143 343 -558 791 -362 305
3981 305 -382 150 96 -366 341 -376 680 -836 468 -270 -224 -129 -67 360 -919 451 -283 149 -437 189
4001 189 15 -442 286 -276 168 -839 599 -37 -380 -5 -82 240 -1022 698 -301 -51 -452 -88 419
4020 419 -745 610 -83 495 -457 447 291 -12 91 -160 539 -598 462 -181 92 -118 -34 786 -666
4039 -666 578 -287 605 -472 306 434 -329 524 -59 866 -391 423 90 -22 -49 -41 595 -601 457
4058 457 22 616 -634 41 504 -208 213 -256 803 -833 231 -105 -166 -108 -241 676 -757 99 -116
4077 -116 543 -469 -35 348 -523 197 -374 644 -560 4 69 -45 -157 -780 679 -728 98 -432 504
4096 504 -553 -169 283 -112 -130 -287 826 -456 243 -69 73 -82 -531 907 -533 209 91 784 -216
4115 -216 -235 813 97 306 -340 917 -372 -102 -2 366 286 -363 907 -346 196 -248 377 -190 -197 442
4135 442 -156 228 -521 429 -341 61 289 114 129 -608 345 -188 84 -337 212 69 -502 523 -504 242
4155 242 -790 585 -292 9 -284 41 92 -874 416 -316 56 -294 205 -37 -449 446 -110 340 -717
4174 -717 545 68 -153 126 -15 475 -795 769 -14 301 -138 336 524 -203 555 -309 536 -353 403
4193 403 -3 115 442 -85 431 -891 507 -201 386 -127 137 287 -471 671 -188 587 -291 402 0
4212 0 -480 6 -320 432 -628 221 -322 186 -177 62 380 -598 333 -99 133 -776 69 -179 -258 -28 -347
4233 -347 643 -752 -9 -128 140 -330 -206 326 -586 445 -342 273 -410 370 62 -84 231 -181 460
4252 460 -424 387 -133 -108 100 -80 459 -630 586 25 383 -65 257 581 -416 301 -56 706 -526
4271 -526 521 85 78 -159 -166 461 -460 243 -276 542 -385 -210 484 -182 434 -255 499 -591 225 -80 47
4292 47 -78 -250 464 -844 40 -243 300 -572 -358 268 -360 82 -235 479 -552 -170 -42 264 -187 -701
4312 -701 543 -475 -111 -517 294 -173 -176 421 -157 133 -653 491 -243 38 178 25 34 -410 688 -324
4332 -324 324 -296 268 77 -416 601 5 250 -414 926 -249 -40 -56 104 223 -448 401 -326 343
4351 343 -254 450 61 -392 391 -259 249 -527 327 -281 -45 221 -70 194 -543 641 -263 23 -359 236
4371 236 157 -513 325 -468 -34 -709 469 -132 41 107 -265 87 -637 722 -110 184 -373 -10 -101 -367
4391 -367 257 -144 296 -616 569 47 -215 82 -64 652 -492 495 77 215 -559 214 323 -308 361
4410 361 -145 322 -312 633 73 -163 181 23 274 -427 479 -252 102 157 144 269 -114 450 -342 450 -325
4431 -325 418 37 -55 207 -283 229 -461 470 -65 24 -319 62 162 -594 181 -336 214 -520 -134 -279 -289
4452 -289 132 -450 121 -619 237 -236 -207 -210 -552 338 -582 158 -255 133 -494 129 192 -540 217 -279 489
4473 489 -521 398 235 66 -97 -307 300 -316 462 -452 306 -316 -108 305 -279 43 72 551 -431 286
4493 286 54 393 60 218 501 -669 204 -74 400 -199 14 216 118 389 -319 665 -395 68 107 81
4513 81 103 -312 837 -471 237 -432 417 -262 -246 321 -499 196 -220 582 -458 -170 -21 253 -191 -421
4533 -421 455 -217 24 -239 576 -200 -229 541 -327 -65 -590 291 -320 14 28 94 -243 -517 474 -144 66
4554 66 -194 568 -58 -500 572 -113 456 -338 738 -262 -83 186 162 213 -309 605 -199 188 -292 376
4574 376 89 -396 507 -103 459 -646 348 117 -359 29 -75 282 -558 322 -2 162 -55 261 40 -268
4594 -268 -29 -285 370 -309 322 -216 -177 -5 -94 163 -657 449 106 164 -352 -128 202 -668 194 -131 300
4615 300 -699 299 -171 -332 61 -68 337 -552 300 -563 232 -209 -240 399 -417 295 -329 477 -203 386
4635 386 -19 357 237 -117 180 -362 158 -71 469 16 361 249 -198 280 -95 380 -197 207 218 -93
4655 -93 388 33 338 -440 359 2 87 -350 -254 185 -522 427 -78 151 -415 78 229 -286 432 -57 211
4676 211 -744 144 -146 -225 -304 -56 414 -677 192 -556 226 -332 -80 121 -329 -212 -334 292 -244 152
4696 152 130 -7 77 -104 351 -376 422 -413 272 -78 11 339 -165 179 -122 562 -534 316 97 118 -73
4717 -73 -174 638 -438 351 17 172 -143 -96 392 -14 311 -187 353 -401 162 -18 46 13 -135 387 -463
4738 -463 159 -165 470 -184 -300 492 -175 11 -504 603 -361 -86 25 -22 -56 -191 314 -315 14 -212
4758 -212 84 -286 -508 295 -347 -18 -354 384 23 42 110 92 68 -612 501 -100 82 -374 465 286 -171
4779 -171 389 -170 45 -304 596 -6 -202 449 121 418 -391 345 228 342 -41 266 135 -304 149 -137
4799 -137 252 -375 617 30 -55 -56 -100 92 -516 260 -75 18 -185 -62 22 -398 170 34 113 -416 33 19 -186
4822 -186 -310 -98 289 -578 95 -304 305 -302 -118 87 -344 65 -73 153 -418 37 1 -336 -32 -116 340
4843 340 -542 158 -153 38 -120 11 274 -158 147 -42 500 -64 236 69 -4 163 -137 634 -250 485
4863 485 29 80 -35 41 436 -74 196 -30 187 -92 295 6 -22 267 -58 536 -258 438 -81 53 172
4884 172 -318 331 -100 209 -334 105 -603 15 189 -339 88 -331 242 -342 108 -128 75 -15 -132 452
4904 452 -353 219 -238 204 -219 -55 16 -218 226 -190 653 -308 -32 -32 -237 -8 -133 298 -388 274 -259
4925 -259 345 -148 236 284 -206 -2 -286 616 -237 49 260 82 150 -117 562 -130 286 -42 385 3 -177
4946 -177 404 -220 268 -256 319 -393 -8 18 -21 4 -137 238 -224 223 -367 248 -119 -132 112 -343 82
4967 82 -513 100 -294 -115 45 -42 -251 -351 477 -341 60 -521 247 -242 -384 51 -483 -22 -245 267 -254
4988 -254 -413 28 31 59 -366 243 123 204 -189 448 82 -275 545 -225 179 -329 458 191 -54 193 326
5009 326 434 -359 760 -30 145 -190 82 26 -186 291 241 495 -329 306 241 -71 175 216 277 -310 498
5030 498 -85 122 -312 146 236 -322 260 -530 162 -404 107 -88 96 -85 -159 214 -306 232 -89 171 -321
5051 -321 -68 119 -243 196 -352 247 -576 252 -166 -320 -160 -350 266 -184 55 -188 -28 -31 -66 267 -240
5072 -240 -38 -363 119 -229 167 -15 6 58 -171 413 -409 386 -128 345 -17 204 417 -141 204 1 402
5093 402 -128 312 -28 -132 211 -242 511 -103 386 126 182 -9 -74 257 30 231 -48 366 -127 52 47
5114 47 -260 218 -214 366 -239 209 -121 -23 -62 -236 77 -223 274 -278 213 -242 -227 121 -366 81 -335
5135 -335 423 -295 -67 -226 -87 -35 56 441 -225 110 -151 122 -254 -83 138 -271 -27 -238 529 -155 197
5156 197 -67 234 41 -78 421 -73 243 -41 329 -81 -64 546 -148 127 -408 233 -253 -3 -182 -28
5176 -28 96 -316 314 -307 187 -358 245 29 -135 285 -81 305 -300 226 -90 -51 -82 -58 140 -210 260
5197 260 -112 199 -136 -53 -234 -457 143 -127 85 -527 108 -237 -31 -85 22 161 -242 498 -118 227 -146
5218 -146 271 60 -555 90 -70 292 -201 368 -42 82 149 122 277 -437 429 -222 18 103 103 160 -45 -23
5240 -23 -188 305 -323 305 -50 -38 261 24 296 -212 296 -128 235 -15 160 19 -262 327 -200 250 -350
5261 -350 171 -277 -171 -11 20 143 -516 -19 -249 -31 -247 -62 225 -298 -64 -327 84 -273 58 -90
5281 -90 -117 82 -189 82 -266 275 -150 142 -366 -50 54 -447 -64 -36 240 -274 168 189 17 102 -176 175
5303 175 -272 98 139 79 -218 -117 319 -84 97 13 170 -102 127 180 -8 92 -110 323 -284 276 -16
5324 -16 -238 6 91 327 -330 61 -160 343 -333 -48 111 100 257 -317 184 -248 329 -349 -131 -45 -280
5345 -280 338 -229 52 -262 244 -102 -208 -18 38 -53 -124 127 -357 -198 -4 -182 -21 -326 165 -456 288
5366 288 -58 158 -235 114 338 -215 26 -307 521 -191 84 69 -110 -32 -85 579 -231 47 165 141 -87
5387 -87 -220 223 -205 55 -184 320 -316 6 261 -173 193 -213 414 -292 24 -69 383 143 -267 143 -165
5408 -165 49 -233 177 -202 19 -148 -129 -5 -161 301 -285 118 -185 95 0 -450 -74 -128 112 -523 385
5429 385 -313 -147 -5 -74 177 -338 295 -144 150 -282 54 81 -131 167 -305 365 -261 266 -36 -110 59
5450 59 -111 119 -150 301 -213 253 132 -67 186 -372 255 -47 285 -58 327 -5 43 86 90 115 -303 325
5472 325 -152 36 89 134 272 -88 151 -79 233 -87 28 108 -63 16 -240 437 -221 262 52 169 -4
5493 -4 70 110 -136 -17 -45 140 -311 316 -153 -106 21 117 199 -463 108 -151 -207 53 -230 172 -195 -24 -396
5516 -396 405 -298 38 310 -160 74 -296 222 -343 18 -57 -145 -216 -186 105 -62 173 32 -46 21 9 -112
5538 -112 -187 90 -179 64 -323 246 -7 -31 81 -264 281 -126 300 -165 239 -218 -207 92 -57 105 -225
5559 -225 298 -158 -36 115 -46 -177 -257 257 -29 -112 -106 236 -74 -44 -109 -5 252 -151 174 -15 -116 -152
5581 -152 129 30 -4 74 -447 115 -241 138 46 -21 27 -56 153 -304 37 -192 -9 130 -106 237 25 143
5603 143 -126 -60 -152 320 128 -138 237 -389 420 -112 309 -223 37 200 201 -1 -283 459 -184 67 -31 168
5625 168 -178 -161 280 -35 15 -288 346 10 55 -30 -84 128 -180 144 -70 28 -344 13 -165 -137 -181 -349 301
5648 301 -330 162 50 87 -250 -29 39 -213 162 -218 -79 -391 -20 133 -294 -152 250 241 -175 351 36
5669 36 4 -65 -218 93 -236 262 49 114 -41 -154 291 -130 307 -134 265 -125 173 159 85 51 -207 228
5691 228 -348 126 -232 130 35 -88 182 -110 108 -167 383 -242 98 -21 -198 361 -84 332 -110 340
5711 340 -54 69 22 45 55 -15 265 -168 18 -432 -59 11 -26 27 -187 215 -335 27 -160 -211 -9 -81 260
5734 260 -286 92 -124 81 -119 -36 155 12 212 -78 116 -346 64 -151 -28 134 45 124 -72 476 6
5755 6 175 -40 -94 87 66 84 -156 80 -522 120 -60 -155 63 24 223 64 290 -45 388 -4 38 -133 -128
5778 -128 -4 -262 197 -272 -33 -161 -213 287 -247 135 -146 -43 -108 200 -162 -127 127 -342 59 -202 90
5799 90 -250 -124 -213 -154 -11 -186 182 -317 246 -210 69 150 -143 69 -352 135 -229 356 -138 -231 -25 -65
5821 -65 53 -249 504 -270 -90 -224 -28 -163 51 73 -257 175 -142 200 40 93 138 76 225 -301 499 -218
5843 -218 -13 95 85 239 -163 292 -35 51 -83 562 -247 57 10 3 106 -344 231 182 24 12 6 46 -179
5866 -179 144 -301 -31 -177 194 -176 -155 -19 166 87 -473 173 -36 287 -79 64 92 -134 41 -219 237
5887 237 -230 34 98 -19 38 23 303 -169 26 9 39 29 -5 135 -24 274 89 33 15 63 59 131 41 -81 197
5912 197 17 269 21 178 -307 62 126 -194 5 -246 186 -106 -24 98 -21 0 -178 318 -106 128 -117
5933 -117 174 -67 -383 29 -217 247 -135 224 -71 55 -79 -188 -54 -240 119 -336 100 44 -241 -7
5953 -7 -196 258 -163 178 -203 113 -69 235 -57 -244 53 -134 116 -178 0 -45 -176 -41 -213 100 -217
5974 -217 -117 -112 -82 -105 -48 -29 -164 188 -239 383 -23 149 -63 33 257 -89 239 -188 -2 150 197 -253 -76
5997 -76 194 -2 240 -357 188 -331 82 -40 -277 98 -72 80 -280 26 -314 -27 -326 -167 44 27 191
6018 191 -275 7 -29 -74 -3 -127 -126 -173 80 -18 236 -181 100 -20 -28 262 -235 -147 -72 -194 -116 76 -16 -12 194
6043 194 -190 415 -84 95 -188 222 9 -119 -77 -236 379 -5 164 -136 296 -48 34 76 -192 119 -70
6064 -70 222 -237 -83 5 101 82 -8 298 -248 339 -75 -170 -2 -161 39 -316 341 -290 -116 -204 31 46 -88
6087 -88 41 -31 -46 -216 51 -156 16 119 48 -1 -307 257 -64 25 -211 -173 163 -119 273 -122 139 -421
6109 -421 136 -196 -15 -201 174 -43 -152 27 -245 135 99 70 28 -54 87 -80 212 97 192 101 32 17 -27
6132 -27 129 -145 348 53 96 -27 53 21 -186 68 -39 143 169 -215 -57 -85 131 29 360 -151 341 -117
6154 -117 104 -217 -151 199 -356 164 -289 59 -112 -233 -153 -20 -55 -158 -40 -126 145 23 -87 -25 -289 107
6176 107 -20 -96 -111 252 21 84 -127 -94 172 -261 10 -92 110 -116 86 87 -456 465 -85 187 -141 107
6198 107 -116 -122 164 -83 69 -314 291 -149 140 300 62 138 59 290 -140 127 -147 -119 98 2 258 -116
6220 -116 -167 -147 -23 -74 -88 -100 59 190 -197 326 -250 79 -70 -84 -53 -243 -134 -136 29 -101 84 -77 97
6243 97 157 -164 45 -274 -76 -85 94 -101 54 -126 -90 13 -255 181 -151 95 -146 -49 -58 -190 188 44 218
6266 218 46 41 -76 254 -27 -118 75 -22 49 -358 238 -167 53 -29 53 -27 -144 279 -163 -30 -58 105 273
6289 273 48 197 -9 112 -85 -93 12 34 -131 230 60 -129 291 -170 61 102 19 141 -133 16 -223 7
6311 7 -396 -73 151 -208 124 -293 32 -174 116 -28 18 -168 168 106 -197 31 -348 238 -38 -6 74 -30
6333 -30 325 -63 -92 -99 172 -38 -69 -12 -322 106 -247 261 -286 282 -93 125 -20 -282 178 -282 220 -298
6355 -298 65 -233 74 -43 -197 321 -258 -170 -10 105 -176 209 172 -190 256 -105 275 -94 192 30 -12
6376 -12 275 -92 143 -41 196 63 203 21 -62 -11 -35 230 167 -29 -238 -23 -237 34 -328 -22 112 -329
6398 -329 224 -193 109 -358 310 264 -129 107 3 188 -247 -8 84 214 101 -190 217 -61 42 90 119
6419 119 -18 -110 219 -156 292 -23 302 40 150 -146 -192 70 -96 287 -23 191 115 166 -69 -261 165
6440 165 -2 114 -256 223 -247 -69 101 50 253 -206 104 -255 248 -373 70 -32 -86 -42 -110 -135 -238 -180
6462 -180 -260 -21 -301 -1 104 -276 96 -115 203 -131 -296 52 -4 49 185 138 -158 246 -195 110 -118
6483 -118 -123 130 -61 27 -10 235 90 208 13 -47 196 -200 164 -242 77 67 62 -83 -90 197 -29 271 44
6506 44 -95 -150 57 -92 -220 267 -165 -24 -94 4 -82 -108 134 -20 73 -127 270 -366 -53 184 251 -72 48
6529 48 334 -118 294 -195 19 -189 -155 135 -115 38 -163 81 -124 29 32 -139 -33 -223 99 -145 60
6550 60 -315 120 -89 192 -38 -111 -182 9 126 -398 -75 -36 20 279 -172 259 -203 158 -103 202 -167 -35
6572 -35 216 151 172 -213 6 -13 -75 14 6 75 -113 313 -87 138 -28 -1 47 -160 154 -91 309 -79 343 31
6596 31 163 326 -272 -145 45 -31 53 232 -8 -123 -29 -211 82 -180 218 14 197 -22 -207 -101 7
6617 7 245 -121 -33 -187 237 -147 0 28 -198 -103 -11 44 96 1 -10 123 240 -93 82 76 117 -46 37 -40 36
6642 36 -121 -152 -163 -220 -78 9 -58 -3 32 -194 -93 16 -35 -50 -199 0 35 75 14 -198 132 126 200 5 -99
6667 -99 -18 -48 -53 -154 -37 -121 -1 -11 168 -51 -27 -19 2 113 -45 98 -162 7 -144 -1 -149 218 -100 -318
6691 -318 275 -122 -222 -42 47 189 -174 57 -115 107 93 -29 43 -134 250 -342 75 -131 203 164 101 169
6713 169 -140 209 40 75 -200 230 98 -144 -30 100 81 -123 401 -212 -51 237 119 157 239 213 -218 21
6735 21 -119 45 -340 -25 -125 -173 345 -235 176 161 133 -52 82 231 -89 175 -321 3 -213 -157 -50 23
6757 23 120 -286 165 -224 318 -222 318 -57 -246 -18 -201 79 -174 90 -108 -182 -227 -48 65 -82 -99 -123
6779 -123 -124 -297 -85 -50 -107 244 -212 -52 -136 175 -263 -20 16 98 226 93 80 -45 237 2 392 -90 -283
6802 -283 86 -47 115 26 83 -107 33 -3 -142 -12 -236 11 59 22 46 137 55 30 78 -24 141 76 -3 -63
6826 -63 -84 107 -64 161 24 122 67 -83 -72 34 -118 -79 -28 -206 -90 -203 -67 23 -19 -35 -151 35 14 48
6850 48 -77 8 85 -9 205 -169 -2 -152 35 -178 222 -75 100 86 112 77 -205 185 -105 120 -58 92
6872 92 69 45 329 -92 -1 -234 88 316 171 49 81 198 -75 145 26 9 -245 47 244 -123 138 -131
6894 -131 132 -118 33 30 -30 -51 -82 269 -235 -97 -82 106 -164 -106 -1 -178 -65 -269 -119 -166 0 -35 -161
6917 -161 24 75 231 -114 131 -90 105 23 -160 257 -168 122 -202 -244 -168 89 168 11 144 -7 68 -267
6939 -267 2 -153 132 -18 30 229 -167 220 -160 116 -79 129 -180 126 106 -82 121 -47 169 -24 -84
6960 -84 290 122 496 112 9 139 91 71 148 -88 26 426 -109 28 36 220 18 -72 46 158 237 -4 260
6983 260 -120 138 58 66 65 -113 306 -94 -115 -75 232 -100 46 83 -72 174 -304 69 -67 90 -215 121 -11
7006 -11 -52 -12 190 -8 -46 -12 -71 95 200 -253 -102 57 217 175 35 -21 52 -49 -238 -153 -146 212 -387 -1
7030 -1 8 -56 121 -13 -135 38 -90 -258 247 -250 5 120 -77 149 59 87 91 117 71 -10 90 -17 -12 49 138
7055 138 -179 -182 189 -331 50 -26 186 1 247 15 -228 234 -76 103 -187 99 -261 -6 -39 -65 58 -17
7077 -17 125 -232 13 -128 258 167 -4 69 35 183 -80 106 -242 -53 8 -186 123 -98 133 -179 -132 -14
7099 -14 273 222 -72 83 -75 50 -73 139 -116 31 19 145 145 -12 326 -112 161 32 81 -203 -321 85
7121 85 -47 67 0 105 31 18 -103 224 -27 -3 55 -190 -116 -50 15 -161 -129 -128 -339 -80 31 -14 43 47 -75
7146 -75 -171 102 -437 -60 -175 321 -301 -17 117 -39 127 -62 99 -264 48 -203 -55 319 20 -127 -229
7167 -229 53 -176 -121 177 195 50 26 -1 -41 -191 -69 92 -118 128 327 -85 173 -80 108 -174 255 17
7189 17 29 76 82 306 -163 143 -30 -25 92 83 -34 -262 53 135 154 20 223 -72 -28 123 -114 168 179 55
7213 55 -37 -259 20 -25 -286 72 130 -96 43 -268 16 239 -17 -1 103 212 37 -38 -176 52 -232 -263
7235 -263 34 -41 32 -86 -96 -266 134 -176 -74 141 -42 -48 246 13 -83 259 -1 -43 -107 0 37 -102 8
7258 8 23 31 305 116 13 -95 268 -45 -42 -87 120 25 -340 142 -104 -156 -114 266 164 -86 21 -86 78 117
7282 117 83 -179 93 -267 -212 142 5 224 -194 132 -109 -52 -240 18 -135 204 227 -119 -200 -38 276 -123
7304 -123 -27 -114 74 100 -144 70 -110 -1 -31 13 209 -128 -63 -71 143 74 62 -57 185 259 15 105 -13 279
7328 279 -151 -333 -2 46 -88 -1 144 -140 229 185 -11 -58 176 162 -304 2 124 -229 106 -69 -29 8
7350 8 -29 -125 26 -51 -96 -78 16 19 27 175 -173 84 -77 98 5 76 15 -124 11 -85 20 -223 -16 -235 14
7375 14 18 34 175 35 174 -268 8 -169 8 130 -71 -200 -180 -31 97 72 -148 214 61 22 -48 -197 113
7398 113 -73 29 126 128 -9 -73 172 -184 155 -97 173 19 164 -116 -5 262 19 -104 -259 398 43
7419 43 174 136 -138 83 -138 140 -203 -18 -52 27 37 -343 12 2 -90 26 -91 -9 -30 356 172 23 38
7442 38 57 69 -131 0 -121 129 -165 88 -193 70 3 -92 41 -56 189 -225 96 146 113 -303 53 126 27
7465 27 285 -126 249 -2 9 16 165 -41 -120 116 -259 212 -160 -87 -115 81 375 -230 -212 -45 -69 36 138
7488 138 -26 84 -2 239 -25 17 7 -111 -109 6 -84 -10 25 -160 97 6 -63 -5 -58 -222 8 -174 -26 -121
7512 -121 83 -11 179 29 -119 -111 136 28 -171 172 -85 377 -143 -134 97 -291 60 108 147 -64 -73 -24 -248
7535 -248 -184 -60 160 -157 -103 44 86 -59 25 20 -51 43 -208 283 28 4 54 107 131 -76 114 -91 349 -177
7559 -177 -67 195 185 72 63 67 -166 322 -199 22 -158 -49 129 4 62 -4 82 -100 82 -12 123 143 -93
7582 -93 -80 11 57 -25 -52 60 -165 214 1 -65 -171 135 40 43 48 20 347 -149 146 2 52 40 -150 -36 -51
7607 -51 119 2 175 -54 83 73 84 20 175 38 -80 49 -148 384 -287 -120 -20 157 96 -242 159 -272
7629 -272 283 -78 28 78 149 -53 0 334 77 100 101 77 36 -152 227 164 105 -36 82 12 -103 26 29 140
7653 140 -77 167 -28 -7 221 86 208 -45 107 -43 191 1 -40 -104 -62 107 157 -58 -384 16 -77 142
7675 142 169 -118 40 -176 -153 -117 274 -92 -95 21 34 161 -84 39 -75 -117 -27 177 6 151 -11 -85 72
7698 72 -58 -117 67 24 11 -24 -26 -124 69 121 -144 64 -16 173 34 94 35 -77 -193 -104 -229 -1 -85 -187 165
7723 165 -60 -75 -77 -70 -313 355 152 -339 -32 -166 19 95 232 -42 -63 65 69 -94 75 12 25 -47 -151 -71
7747 -71 105 -72 -5 -294 -232 -108 -33 -61 54 2 -153 10 -84 267 -65 152 -46 -25 -33 -68 223 -64 72 134
7771 134 110 -24 -51 -67 -309 -22 -145 64 19 -61 195 -22 -45 -131 65 72 276 20 290 199 38 11 61 136
7795 136 -199 81 55 -72 -70 104 -151 -61 -235 12 75 18 54 100 -50 -196 -83 -61 69 62 -217 245 74 -81
7819 -81 176 123 -40 -139 -74 36 44 -58 91 -44 -126 286 -28 29 -21 -224 -220 -74 141 -112 -122 -169 105 -32
7843 -32 5 104 -56 20 251 90 -129 29 102 40 -68 -119 -13 100 164 78 -3 200 377 -20 -200 171 -174
7866 -174 88 -114 104 -14 67 116 34 -248 -65 166 133 161 -87 -157 -182 78 -94 -49 -96 -284 -75 -99 113
7889 113 -49 -104 87 53 84 -95 103 -14 79 187 10 327 -46 355 64 -248 34 -44 78 -295 104 -136
7911 -136 85 -14 -19 14 28 163 -263 248 52 250 112 89 154 -110 91 22 -83 -263 -127 -17 -409 18 -143
7934 -143 79 -208 181 -176 27 -220 136 -50 -187 164 -216 -29 240 120 12 122 -150 -73 154 -113
7954 -113 307 27 -182 122 201 59 -129 268 -22 254 96 183 -67 -34 65 2 0 -86 64 1 133 45 -189
7977 -189 -230 13 31 -54 -83 155 24 22 -80 35 -112 -144 -154 -13 -6 135 164 -142 180 1 258 -216 -9 145
8001 145 -76 82 -128 53 45 173 -189 94 -222 -222 54 -27 46 -128 -109 -256 -86 -47 -207 -147 63 -328 -73
8024 -73 40 -127 53 59 68 -129 -91 178 19 247 -271 3 93 -1 -196 -113 -112 245 142 -97 119 -11 115 -59
8048 -59 80 -148 -291 54 -120 214 -66 150 28 -11 -129 -35 50 -87 44 -44 41 127 -126 206 5 254
8070 254 59 -185 43 -62 11 -23 309 -155 -45 -114 294 -62 -43 7 156 83 -54 211 167 -23 -115 -17 -48
8093 -48 128 162 -433 71 -89 122 -11 57 -94 -25 47 138 155 34 -117 -163 98 -92 -89 133 -91 5 37 -135
8117 -135 99 -21 248 -136 -51 -174 118 2 -58 -205 -45 46 -143 -117 292 -76 112 -142 -108 -107 -165 -197 0
8140 0 -233 112 40 -279 -40 -73 208 -230 158 -241 342 -170 -51 163 -11 -26 221 -66 -118 115 111 -132 -259
8163 -259 -153 -9 -249 -13 116 111 22 -255 9 -39 263 -114 347 113 55 -9 132 -185 -210 159 -202 3
8185 3 -101 16 85 107 61 57
8191E7
##END NTUPLES=NMR FID
##END=
