##TITLE=1H_TG-2300-B
 CDCl3, 8 sc, 
 26.8.2020
##JCAMPDX= 6.0         $$ Bruker NMR JCAMP-DX V2.0
##DATA TYPE= NMR FID
##DATA CLASS= NTUPLES
##ORIGIN= UXNMR, Bruker Analytische Messtechnik GmbH
##OWNER= root
$$ XWIN-NMR		Version 3.5
$$ Wed Aug 26 12:11:25 2020 Russian Standard Time (UT+4h)  she@DPX200
##.OBSERVE FREQUENCY= 200.1315066352
##.OBSERVE NUCLEUS= ^1H
##.DELAY= (6, 6)
##.ACQUISITION MODE= SIMULTANEOUS
##.ACQUISITION SCHEME= undefined
##.AVERAGES= 8
##.DIGITISER RES= 18
##SPECTROMETER/DATA SYSTEM= spect
##.PULSE SEQUENCE= zg30
##.SOLVENT NAME= CDCl3
##.SHIFT REFERENCE= (INTERNAL, CDCl3, 0, 15.7039)
##AUDIT TRAIL= $$ (NUMBER, WHEN, WHO, WHERE, WHAT)
$$ ##TITLE= Audit trail, XWIN-NMR		Version 3.5
$$ ##JCAMPDX= 5.01
$$ ##ORIGIN= Bruker BioSpin GmbH
$$ ##OWNER= she
$$ F:/spectra/data/she/nmr/H-F/1/audita.txt
$$ ##AUDIT TRAIL=  $$ (NUMBER, WHEN, WHO, WHERE, WHAT)
(   1,<2020-08-26 12:10:02.73 +0400>,<she>,<DPX200>,
      <created by zg, POWCHK disabled, PULCHK disabled
       configuration hash MD5:
       00 E9 B6 7A A2 85 ED C7 34 08 36 98 17 FE 4E 26
       data hash MD5: 16K
       D3 A7 AF 39 78 36 81 61 BC 59 D7 F8 FE F6 3D 5B>)
$$ ##END=
$$ 
$$ hash MD5
$$ D2 FC 9E 26 4A E4 06 01 C8 6D 6A F0 D1 7D 3B ED
##$RELAX= 
##$RELAX= 
##$RELAX= 
##$RELAX= 
##$RELAX= 
##$RELAX= 
$$ Bruker specific parameters
$$ --------------------------
##$DU= <F:/spectra>
##$EXPNO= 1
##$NAME= <H-F>
##$PROCNO= 1
##$TYPE= <nmr>
##$USER= <she>
##$AMP= (0..31)
100 100 100 100 100 100 100 100 100 100 100 100 100 100 100 100 100 100 
100 100 100 100 100 100 100 100 100 100 100 100 100 100 
##$AQSEQ= 0
##$AQ_mod= 1
##$AUNM= <au_zg>
##$AUTOPOS= <>
##$BF1= 200.13
##$BF2= 200.13
##$BF3= 200.13
##$BF4= 200.13
##$BF5= 200.13
##$BF6= 200.13
##$BF7= 200.13
##$BF8= 200.13
##$BYTORDA= 1
##$CFDGTYP= 0
##$CFRGTYP= 5
##$CHEMSTR= <none>
##$CNST= (0..31)
1 1 145 1 1 1 1 1 1 1 1 1 1 1 1 1 1 1 1 1 1 1 1 1 1 1 1 1 1 1 1 1 
##$CPDPRG= <>
##$CPDPRG1= <>
##$CPDPRG2= <>
##$CPDPRG3= <>
##$CPDPRG4= <mlev>
##$CPDPRG5= <mlev>
##$CPDPRG6= <mlev>
##$CPDPRG7= <mlev>
##$CPDPRG8= <mlev>
##$CPDPRGB= <>
##$CPDPRGT= <>
##$D= (0..31)
0 1.2 0 0 0 0 0 0 0 0.06 0 0.03 0 0 0 0 0.0002 0 0 0 0 0 0 0 0 0 0 0 0 
0 0 0 
##$DATE= 1598429402
##$DBL= (0..7)
120 120 120 120 120 120 120 120 
##$DBP= (0..7)
150 150 150 150 150 150 150 150 
##$DBP07= 0
##$DBPNAM0= <>
##$DBPNAM1= <>
##$DBPNAM2= <>
##$DBPNAM3= <>
##$DBPNAM4= <>
##$DBPNAM5= <>
##$DBPNAM6= <>
##$DBPNAM7= <>
##$DBPOAL= (0..7)
0.5 0.5 0.5 0.5 0.5 0.5 0.5 0.5 
##$DBPOFFS= (0..7)
0 0 0 0 0 0 0 0 
##$DE= 6
##$DECBNUC= <off>
##$DECIM= 32
##$DECNUC= <off>
##$DECSTAT= 4
##$DIGMOD= 1
##$DIGTYP= 9
##$DL= (0..7)
0 120 120 120 120 120 120 120 
##$DP= (0..7)
150 150 150 150 150 150 150 150 
##$DP07= 0
##$DPNAME0= <>
##$DPNAME1= <>
##$DPNAME2= <>
##$DPNAME3= <>
##$DPNAME4= <>
##$DPNAME5= <>
##$DPNAME6= <>
##$DPNAME7= <>
##$DPOAL= (0..7)
0.5 0.5 0.5 0.5 0.5 0.5 0.5 0.5 
##$DPOFFS= (0..7)
0 0 0 0 0 0 0 0 
##$DQDMODE= 0
##$DR= 18
##$DS= 0
##$DSLIST= <SSSSSSSSSSSSSSS>
$$ [...]
##$SUBNAM2= <"">
##$SUBNAM3= <"">
##$SUBNAM4= <"">
##$SUBNAM5= <"">
##$SUBNAM6= <"">
##$SUBNAM7= <"">
##$SUBNAM8= <"">
##$SUBNAM9= <"">
##$SW= 16.880792210976
##$SWIBOX= (0..15)
0 0 2 0 0 0 0 0 0 0 0 0 0 0 0 0 
##$SW_h= 3378.37837837838
##$TD= 16384
##$TD0= 1
##$TE= 0
##$TE2= 300
##$TE3= 300
##$TEG= 300
##$TL= (0..7)
0 120 120 120 120 120 120 120 
##$TP= (0..7)
150 150 150 150 150 150 150 150 
##$TP07= 0
##$TPNAME0= <>
##$TPNAME1= <>
##$TPNAME2= <>
##$TPNAME3= <>
##$TPNAME4= <>
##$TPNAME5= <>
##$TPNAME6= <>
##$TPNAME7= <>
##$TPOAL= (0..7)
0.5 0.5 0.5 0.5 0.5 0.5 0.5 0.5 
##$TPOFFS= (0..7)
0 0 0 0 0 0 0 0 
##$TUNHIN= 0
##$TUNHOUT= 0
##$TUNXOUT= 0
##$USERA1= <user>
##$USERA2= <user>
##$USERA3= <user>
##$USERA4= <user>
##$USERA5= <user>
##$V9= 5
##$VALIST= <valist>
##$VCLIST= <CCCCCCCCCCCCCCC>
##$VD= 0
##$VDLIST= <DDDDDDDDDDDDDDD>
##$VPLIST= <PPPPPPPPPPPPPPP>
##$VTLIST= <TTTTTTTTTTTTTTT>
##$WBST= 1024
##$WBSW= 4
##$XGAIN= (0..3)
0 0 0 0 
##$XL= 0
##$YL= 0
##$YMAX_a= 101014
##$YMIN_a= -119246
##$ZGOPTNS= <>
##$ZL1= 120
##$ZL2= 120
##$ZL3= 120
##$ZL4= 120
##$ABSF1= 10
##$ABSF2= 0
##$ABSG= 5
##$ABSL= 3
##$ALPHA= 0
##$AQORDER= 0
##$ASSFAC= 0
##$ASSFACI= 0
##$ASSFACX= 0
##$ASSWID= 0
##$AUNMP= <proc_1d>
##$AZFE= 0.1
##$AZFW= 0.1
##$BCFW= 1
##$BC_mod= 2
##$BYTORDP= 1
##$COROFFS= 0
##$CY= 11.3945322036743
##$DATMOD= 1
##$DC= 2
##$DFILT= <>
##$DTYPP= 0
##$F1P= 16.9975609425685
##$F2P= -3.02152046262296
##$FCOR= 0.5
##$FTSIZE= 0
##$FT_mod= 4
##$GAMMA= 1
##$GB= 0.15
##$INTBC= 1
##$INTSCL= 1
##$ISEN= 128
##$LB= 0.24
##$LEV0= 0
##$LPBIN= 0
##$MAXI= 10000
##$MC2= 0
##$MEAN= 0
##$ME_mod= 0
##$MI= 1.114404
##$NCOEF= 0
##$NC_proc= 0
##$NLEV= 6
##$NOISF1= 3.799351
##$NOISF2= 2.8
##$NSP= 1
##$NTH_PI= 0
##$NZP= 0
##$OFFSET= 15.70392
##$PC= 1
##$PHC0= -10134.05
##$PHC1= 14.40092
##$PH_mod= 1
##$PKNL= yes
##$PPARMOD= 0
##$PSCAL= 0
##$PSIGN= 0
##$REVERSE= no
##$SF= 200.130013532006
##$SI= 16384
##$SIGF1= 3
##$SIGF2= 2
##$SINO= 400
##$SIOLD= 16384
##$SREGLST= <1H.CDCl3>
##$SSB= 0
##$STSI= 0
##$STSR= 0
##$SW_p= 3612.71676300578
##$SYMM= 0
##$S_DEV= 0
##$TDeff= 0
##$TDoff= 0
##$TI= <>
##$TILT= no
##$TM1= 0
##$TM2= 0
##$TOPLEV= 0
##$USERP1= <user>
##$USERP2= <user>
##$USERP3= <user>
##$USERP4= <user>
##$USERP5= <user>
##$WDW= 1
##$XDIM= 8192
##$YMAX_p= 0
##$YMIN_p= 0
$$ End of Bruker specific parameters
$$ ---------------------------------
##NTUPLES= NMR FID
##VAR_NAME=  TIME,          FID/REAL,        FID/IMAG
##SYMBOL=    X,             R,               I
##VAR_TYPE=  INDEPENDENT,   DEPENDENT,       DEPENDENT
##VAR_FORM=  AFFN,          ASDF,            ASDF
##VAR_DIM=   8192,          8192,            8192
##UNITS=     SECONDS,       ARBITRARY UNITS, ARBITRARY UNITS
##FACTOR=    0.000296,      1,               1
##FIRST=     0,             0,               0
##LAST=      2.424536,      0,               0
##MIN=       0,             -119246,         0
##MAX=       2.424536,      101014,          0
$$ Real data points
##PAGE= N=1
##DATA TABLE= (X++(R..R)), XYDATA
$$ [...]
$$ plain form
965 58 258 2045 -415 1864 1183 147 -428 522 834 -1167 1295 -49 -194 121 344 -1734 -1126 749
983 749 -1500 62 -714 -706 -1867 -541 -939 -2534 -252 -1219 -1035 -1657 -761 -2638 -2007 -169 -2046 -1109
1001 -1109 -1148 -734 -2143 -404 -1529 -2042 70 -409 -9 -1357 574 -1114 -470 928 -415 148 940
1018 940 1552 -675 1049 239 301 1456 1411 1175 124 2331 246 880 1156 771 1197 1672 1888 -543
1036 -543 1722 822 370 1095 1498 617 324 2210 -286 471 411 953 224 751 1428 -1210 849 125 -311
1055 -311 -537 508 -339 -543 584 -1526 -1001 -1089 25 -1775 -692 14 -2260 -677 -1283 -1600 -2232 -109
1073 -109 -1195 -1757 -369 -1603 -1499 -1518 -244 -2026 -466 -64 -1406 -512 -529 -429 -1676 1206 -202
1090 -202 -427 956 78 74 39 1573 -65 1144 1633 1230 582 1214 1592 -214 2573 1203 1020 1485 1417
$$ packed form
965E8K00J787k460K279o81j036n75R50L12k001K462j344j45L15K23k078O08J875
983G49k249J562p76Qj161J326l98j595K282r67J84o22Q96j877O31J838j877R37
1001a109l9M14j409J739j125n13K112m79M00j348J931j688O44J398j343N63P92
1018I40O12k227J724q10O2J155m5k36j051K207k085O34K76l85M26M75K16k431
1036e43K265r00m52P25M03q81k93J886k496P57o0N42p29N27O77k638K059p24m36
1055c11k26J045q47k04J127k110N25q8J114j800J083P06k274J583o06l17o32K123
1073a09j086n62J388j234J04j9J274j782J560M02j342Q94j7J00j247K882j408
1090b02k25J383q78ml5J534j638J209M89m03o48O32L78j806K787j370j83M65o8
$$ plain form
1109 1417 824 364 1870 171 1244 1298 1140 -132 809 1132 -742 1357 459 377 34 886 -415 -732
1127 -732 682 -1059 124 -251 -135 -1421 -445 -265 -1839 -499 -767 -657 -1348 137 -1610 -1484 -216
1144 -216 -1254 -528 -1066 205 -1316 -590 -417 -1398 -663 -440 -173 -1221 322 -1301 -827 -249 -780 -315
1162 -315 -397 921 -919 312 131 -204 228 779 1080 62 1699 346 721 902 853 875 1115 1898 186
1181 186 1478 661 782 594 1202 1444 250 1905 555 667 700 1116 437 1057 1457 63 1114 147
1199 147 528 -276 495 310 -453 580 -816 -457 -908 -332 -1451 -546 -176 -1485 -670 -1271 -844 -1859
1217 -1859 -441 -1129 -1288 -277 -1077 -998 -1584 -125 -1547 -691 -214 -1156 -527 -629 -399 -1519 116 -566
1235 -566 -281 51 -239 -180 -577 958 -789 338 682 294 404 594 606 -551 1254 546 640 700 1055 640
$$ packed form
1109A417n93m60J506j699J073N4j58j272R41L23j874K099q98q2l43Q52j301l17
1127g32J414j741J183l75J16j286R76J80j574J340k68J10o91J485j747J26J268
1144b16j038P26n38J271j521P26J73r81P35K23K67j048J543j623M74N78n31M65
1162c15q2J318j840J231j81l35M32N51L01j018J637j353L75J81m9K2K40P83j712
1181A86J292q17J21j88O08K42j194J655j350J12L3M16o79O20M00j394J051r67
1199A47L81q04P71j85p63J033j396L59m51N76j119R05L70j309Q15o01M27j015
1217a859J418o88j59J011q00P9n86J459j422Q56M77r42O29j02K30j120J635o82
1235e66K85L32k90N9l97J535j747J127L44l88J10J90J2j157J805p08R4O0L55m15
$$ plain form
1255 640 194 1524 -104 815 1038 1226 413 834 988 -272 1398 515 651 475 1253 383 -124 951
1273 951 -211 478 319 796 -670 274 271 -1056 49 -519 -83 -638 141 -957 -1099 -394 -1015 -689 -1056
1292 -1056 -174 -1405 -436 -728 -1582 -686 -764 -430 -1231 84 -893 -792 -405 -596 -485 -586 553 -753 107
1311 107 -56 -215 -152 195 463 -348 1240 48 398 443 494 496 482 1457 213 1175 861 957 444 1012 1030 462
1333 462 1802 538 936 589 1017 622 655 1231 244 1135 472 617 -100 720 503 -31 891 -71 265 -205
1353 -205 317 -702 -169 295 -681 -82 -692 -344 -1147 -132 -719 -1114 -142 -761 -812 -1223 -270 -1364 -513
1372 -513 -451 -1035 -461 -646 -262 -1349 -76 -517 -485 87 -241 -357 -515 663 -726 91 233 109 282
1391 282 298 447 -608 918 400 377 450 828 408 288 1409 -186 589 881 997 378 729 763 -29 1214
$$ packed form
1255F40m46J330j628R19K23J88q13M21J54j260J670q83J36j76P78q70n07J075
1273I51j162O89j59M77j466R44lj327J105n68M36n55P79j098j42P05o21L26l67
1292a056Q82j231R69k92q54Q96p8L34q01J315r77J01L87j91J11j01J139j306Q60
1311A07j63j59O3L47K68q11J588j192L50M5N1Kj4R75j244R62l14R6n13N68J8n68
1333D62J340j264L98l47M28l95L3N76r87Q91o63J45p17Q20k17n34R22r62L36m70
1353b05N22j019N33M64r76N99o10L48q03J015n87l95R72o19n1m11R53j094Q51
1372e13O2n84N74j85L84j087J273m41L2N72l28j16j58J178j389Q17J42j24J73
1391B82J6J49j055J526n18k3P3L78m20j20J121j595P75K92J16o19L51L4p92J243
$$ plain form
1411 1214 435 465 220 1112 507 -61 816 -282 326 483 551 -565 364 435 -678 78 -463 -239 -557 479
1431 479 -659 -1074 -125 -807 -744 -874 -166 -1305 -399 -609 -1458 -917 -884 -702 -1354 -136 -1190 -1066 -580
1450 -580 -869 -1021 -967 113 -1167 -275 -390 -826 -577 -174 -39 -825 584 -53 -32 15 303 -52 171 1255
1470 1255 -41 813 718 673 381 958 913 341 1572 703 733 582 1131 385 500 1345 240 847 615 746
1490 746 -171 678 589 -88 841 177 395 -53 549 -403 -92 493 -173 78 -189 51 -1044 45 -444 -929
1510 -929 -12 -358 -500 -986 -188 -1164 -654 -312 -621 -583 -520 -50 -1226 -141 -541 -597 -34 17 -346 -685 268
1531 268 -861 -356 -155 -155 -314 -26 259 -1002 66 -87 -91 -14 519 164 -90 1034 -95 361 645 1036
1551 1036 554 901 1174 92 1062 941 777 487 1539 866 510 1398 269 600 772 1250 140 817
$$ packed form
1411A214p79L0k45Q92o05n68Q77j098O08J57O8j116R29P1j113P56n41K24l18J036
1431D79j138m15R49o82O3j30P08j139R06k10q49N41L3J82o52J218j054J24M86
1450e80k89j52N4J080j280Q92j15m36K49M03J35p86J409o37K1M7K88l55K23J084
1470A255j296Q54r5m5k92N77m5n72J231q69L0j51N49p46J15Q45j105O07k32J31
1490G46r17Q49q9o77R29o64K18m48O02r52L11N85o66K51k67K40j095J089m89m85
1510i29R17l46j42m86P98r76N10L42l09L8O3M70j176J085m00n6N63N1l63l39R53
1531B68j129N05K01%j59K88K85j261J068j53mP7N33l55k54J124j129M56K84L91
1551A036m82L47K73j082R70j21j64k90J052o73l56Q88j129L31J72M78j110O77
$$ plain form
1569 817 1170 91 538 361 310 -177 953 41 -407 219 -403 -542 -671 40 -1007 -440 -239 -937 -931 -748
1589 -748 -497 -1317 75 -520 -921 -312 -348 -814 -791 296 -869 -127 29 -369 -713 -175 -14 -1097 358
1608 358 -1 -329 -112 160 -579 -529 693 -340 220 315 415 -249 345 606 -360 822 628 540 192 985
1628 985 197 63 1098 265 503 641 951 -14 593 707 -40 589 679 587 -114 893 8 -187 531 18
1648 18 -47 67 580 -697 28 -69 -669 -242 -82 -217 -975 185 -838 -921 -450 -642 -825 -802 -92 -1291
1668 -1291 -610 -752 -847 -908 -390 -434 -1102 -74 -773 -659 -620 -198 -563 -421 415 -736 -67 -91 -67 -389 351
1689 351 295 -353 734 124 16 -90 729 -51 298 968 -63 548 496 540 -76 867 690 187 844 479
1709 479 442 244 1055 117 388 880 277 343 387 588 -418 555 354 -141 266 128 -22 -526 432 -518 -333
$$ packed form
1569H17L53j079M47j77n1m87J130r12m48O26o22j39j29P11j047N67K01o98OJ83
1589g48K51q20J392n95m01O09l6m66K3J087j165P42J56l98l44N38J61j083J455
1608C58l59l28K17K72p39N0J222j033N60R5J00o64N94K61r66J182j94q8l48P93
1628I85p88j34J035q33K38J38L10r65O07J14p47O29R0r2p01J007q85j95P18n13
1648A8o5J14N13j277P25r7o00M27J60j35p58J160j023q3M71j92j83K3P10j199
1668a291O81j42r5o1N18m4o68J028o99J14L9M22l65J42Q36j151O69k4K4l22P40
1689C51n6o48J087o10j08j06Q19p80L49O70j031O11n2M4o16R43j77n03O57l65
1709D79l7j98Q11r38K71M92o03O6M4K01j006R73k01m95M07j38j50n04R58r50J85
$$ plain form
1730 -333 141 -166 -489 -289 -57 -1088 33 -356 -701 -475 -92 -510 -1015 95 -794 -539 -203 -162 -799
1749 -799 -273 154 -966 -55 -138 -130 -360 312 -111 -515 480 -244 -15 118 557 -200 238 658 -269 413 493
1770 493 432 -23 880 336 20 796 280 323 258 1082 94 468 894 133 412 602 660 -177 917 336 -18
1791 -18 415 316 99 -136 798 -412 -51 246 -144 -342 -106 116 -849 171 -369 -634 -485 -279 -560 -832
1811 -832 -23 -949 -645 -517 -538 -975 -541 -230 -1120 -255 -507 -672 -715 -117 -526 -750 163 -578 -320 -320 25
1832 25 -564 7 317 -470 296 67 186 -216 577 95 26 759 248 371 232 833 8 652 761 201 597
1853 597 595 716 87 930 436 398 736 434 400 214 742 -77 417 461 182 205 272 240 -419 510 -73 -55 133
1876 133 41 -175 -341 243 -641 -121 -166 -264 -576 -297 -347 -1013 -144 -724 -558 -643 -288 -732 -765 -184 -1004 -458
$$ packed form
1730c33M74l07l23K00K32j031J121l89l45K26L83m18n05J110q89K55L36M1o37
1749g99N26M27j120R11q3Qk30O72m23m04R95p24K29J33M39p57M38M20r27O82Q0
1770D93o1m55R03n44l16P76n16M3o5Q24r88L74M26p61K79J90N8q37J094n81l54
1791a8M33r9k17k35R34j210L61K97l90j98K36K22r65J020n40k65J49K06k81k72
1811h32Q09r26L04J28k1m37M34L11q90Q65k52j65m3N98m09k24R13p41K58%L45
1832B5n89N71L10p87P66k29J19m02P93m82o9P33n11J23j39O01q25O44J09n60L96
1853E97kJ21o29Q43m94l8L38l02l4j86N28q19M94M4k79K3O7l2o59R29n83J8J88
1876A33r2k16j66N84q84N20m5r8l12K79n0o66Q69n80J66q5L55m44l3N81q20N46
$$ plain form
1898 -458 -461 -284 -774 -211 -230 -732 -20 -303 -153 -334 384 -276 -147 320 -224 151 91 441 -160 501 390
1919 390 -15 456 439 486 208 1010 264 449 778 439 525 595 969 158 849 661 308 430 558 470 84 889
1941 889 100 224 329 231 23 51 561 -289 291 42 -47 -255 63 -25 -574 326 -318 -298 -387 -201 -687 -463
1963 -463 -3 -728 -278 -472 -414 -790 -262 -426 -787 -77 -482 -391 -550 -37 -687 -352 27 -458 -118 -221 131
1984 131 -537 105 -72 -213 266 138 206 -131 534 -84 254 493 251 373 342 763 -53 580 396 456 557
2005 557 568 557 165 863 135 330 469 473 390 395 647 -128 405 105 200 49 283 283 -193 410 -289 -51 -155
2028 -155 39 -244 -137 49 -600 -102 -450 -231 -523 -117 -303 -537 -173 -676 -389 -618 -155 -670 -337 -207
2048 -207 -581 -293 -539 -228 -542 11 -331 -336 -55 -286 -130 -408 183 -295 140 164 -53 135 -55 260 -109
$$ packed form
1898d58lJ77m90N63j9n02P12k83J50j81P18o60J29M67n44L75o0L50o01O61j11
1919C90m05M71j7M7k78Q02p46J85L29l39Q6P0L74q11O91j88l53J22J28q8l86Q05
1941H89p89J24J05r8k08K8N10q50N80k49q9k08L18q8n49R00o44K0q9J86m86K24
1963d63M60p25M50j94N8l76N28j64l61P10m05R1j59N13o50L35L79m85L40j03L52
1984A31o68O42j77j41M79j28O8l37O65o18L38K39k42J22l1M21q16O33j84O0J01
2005E57J1j1l92O98p28J95J39Mq3NK52p75N33l00R5j51K34%m76O03o99K38j04
2028a55J94k83J07J86o49M98l48K19k92M06j86k34L64n03K87k29M63n15L33J30
2048b07l74K88k46L11l14N53l42nK81k31J56k78N91m78M35K4k17J88j90L15l69
$$ plain form
2069 -109 462 112 271 371 182 264 91 565 -24 494 355 275 232 176 391 -70 540 96 283 216 279 68
2091 68 -73 358 -270 228 -12 95 -148 -11 -75 -464 93 -310 -76 -341 -50 -401 -460 -129 -592 -164 -465
2112 -465 -139 -588 -210 -298 -593 -144 -423 -171 -573 -23 -472 -404 -159 -413 -184 -310 99 -435 10 -94 -220
2133 -220 61 -45 169 -168 461 -18 120 222 210 231 146 663 78 505 267 328 359 394 522 189 742 247
2155 247 500 338 449 307 321 638 90 479 185 328 116 256 222 -46 381 -30 142 -199 30 -181 -107
2176 -107 108 -397 35 -308 -73 -513 -145 -273 -391 -102 -473 -219 -537 -212 -548 -321 -322 -416 -130 -521 -152
2197 -152 -540 -161 -322 -297 -139 -330 -34 -360 51 -297 20 -75 -10 136 -89 227 -160 307 35 213 183
2218 183 207 362 93 488 36 451 331 395 324 290 470 140 504 132 440 267 302 322 129 423 23 394
$$ packed form
2069a09N71l50J59J00j89Q2j73M74n89N18j39q0m3n6K15m61O10m44J87o7O3k11
2091F8j41M31o28M98k40J07k43J37o4l89N57m03K34k65K91l51n9L31m63M28l01
2112d65L26m49L78q8k95M49k79K52m02N50m49O8K45k54K29j26M09n34M45j04j26
2133b20K81j06K14l37O29m79J38J02j2K1q5N17n85M27k38O1L1L5J28l33N53m95
2155B47K53j62J11j42J4L17n48L89k94J43k12J40l4k68M27m11J72l41K29k11P4
2176a07K15n05M32l43K35m40L68j28j18K89l71K54l18L25l36K27jr4K86l91L69
2197a52l88L79j61K5J58j91K96l26M11l48L17r5O5J46k25L16l87M67k72J78l0
2218A83K4J55k69L95m52M15j20O4p1l4J80l30L64l72L08j73L5K0j93K94m00L71
$$ plain form
2240 394 93 250 81 129 144 -114 254 -179 52 -193 40 -195 -246 -26 -407 -130 -387 -126 -388 -196 -285
2261 -285 -491 -177 -457 -268 -518 -157 -490 -334 -220 -475 -235 -386 -132 -413 -55 -225 -267 -75 -214 -33
2281 -33 -303 151 -126 70 42 56 172 21 387 -72 403 154 254 324 314 413 153 558 204 412 252 408
2303 408 369 283 506 128 454 185 358 182 286 279 123 369 -19 247 57 244 68 102 192 -142 95 -174
2325 -174 41 -228 -4 -157 -251 -55 -453 -80 -426 -88 -447 -311 -231 -457 -221 -449 -251 -538 -172 -353 -357
2346 -357 -210 -335 -175 -442 -76 -376 -62 -170 -179 -25 -171 102 -252 234 -121 106 107 112 226 13 339 4
2368 4 389 282 373 265 201 384 130 464 206 409 305 394 268 133 386 -10 393 158 240 130 230 213
2390 213 -37 282 -56 182 -6 131 -78 -99 74 -231 55 -194 37 -263 -42 -208 -315 -63 -357 -159
$$ packed form
2240C94l01J57j69M8J5k58L68m33K31k45K33k35n1K20l81K77k57K61k62J92q9
2261b85k06L14k80J89k50L61l33J56J14k55K40j51K54k81L58j70m2J92j39J81
2281c3k70M54k77J96k8J4J16j51L66m59M75k49J00P0j0R9k60M05l54K08j60J56
2303D08l9q6K23l78L26k69J73j76J04pj56K46l88K66j90J87j76L4R0l34K37k69
2325a74K15k69K24j53r4J96l98L73l46L38l59J36Q0k26K36k28J98k87L66j81m
2346c57J47j25J60k67L66l00L14j08rJ54j46K73l54M86l55K27JNJ14k13L26l35
2368DL85j07R1j08o4J83k54L34k58K03j04Q9j26j35K53l96M03k35Q2j10J00j7
2390B13k50L19l38K38j88J37k09k1J73l05K86k49K31l00K21j66j07K52k94J98
$$ plain form
2410 -159 -376 -112 -389 -297 -249 -459 -188 -369 -105 -438 -166 -289 -359 -195 -350 -148 -355 31 -336 -144 -143 -182
2432 -182 -55 -135 107 -205 241 3 42 25 108 183 -48 407 54 266 178 277 140 194 381 98 401 156 248
2455 248 147 319 259 113 405 97 248 62 239 42 155 273 39 179 -17 102 -200 89 -30 -111 82
2476 82 -198 -23 -298 2 -301 -170 -151 -290 -169 -290 -120 -416 -185 -300 -261 -144 -283 -198 -349 -62 -367
2497 -367 -161 -151 -199 -153 -190 5 -364 40 -106 -49 -22 9 87 -99 243 -92 157 133 213 189 188 312 -4 305
2521 305 120 248 135 379 254 132 375 83 294 172 281 182 253 242 115 248 26 278 29 283 40
2542 40 64 181 -109 78 -114 116 -138 35 -83 -167 -79 -217 -72 -339 15 -281 -193 -178 -297 -239 -383 -100
2564 -100 -408 -116 -287 -287 -183 -298 -181 -345 -53 -357 -158 -145 -162 -178 -176 70 -229 113 -43 44 2 87 100 -66
$$ packed form
2410a59k17K64k77R2M8k10K71j81K64l33K72j23p0J64j55K02k07L86l67J92Jl9
2432a82J27q0K42l12M46k38L9j7Q3P5k31M55l53K12q8R9j37N4J87k83L03k45R2
2455B48j01J72o0j46K92l08J51j86J77j97J13J18k34J40j96J19l02K89j19q1J93
2476H2k80J75k75L00l03J31J9j39J21j21J70k96K31j15L9J17j39Q5j51K87l05
2497c67K06J0m8M6l7J95l69M04j46N7K7L1P8j86L42l35K49k4Q0k4jJ24l16L09
2521C05j85J28j13K44j25j22K43k92K11j22J09r9P1j1j27J33k22K52k49K54k43
2542D0K4J17k90J87j92K30k54J73j18q4Q8j38J45k67L54k96Q8J5j19N8j44K83
2564a00l08K92j71%J04j15J17j64K92l04J99J3j7j6KK46k99L42j56Q7m2Q5J3j66
$$ plain form
2588 -66 319 29 231 145 254 158 150 315 26 330 186 341 205 287 266 126 373 95 345 124 341 100
2610 100 138 243 -10 227 29 224 -76 144 17 -20 83 -51 85 -95 56 -225 -43 -51 -168 -93 -185 -1
2632 -1 -300 -44 -258 -200 -180 -220 -163 -325 -38 -346 -154 -231 -164 -210 -260 -21 -352 -53 -188 -108 -141 -65 -12 -142 97
2657 97 -131 74 12 71 24 21 226 3 250 79 175 79 212 236 84 305 67 255 141 318 98 238 277
2680 277 117 313 105 261 19 229 99 33 144 43 141 -37 203 -120 52 -9 -137 2 -100 68 -228
2701 -228 -13 -129 -61 -89 -201 -115 -245 -70 -339 -150 -171 -225 -216 -196 -152 -375 -46 -266 -201 -259 -200 -126 -263 18
2725 18 -253 -70 -142 -22 -30 -23 83 -106 212 -32 135 6 164 80 70 277 17 290 103 235 92 262 210
2748 210 133 317 156 243 158 338 143 221 258 189 242 125 239 27 230 62 58 133 60 102 -88 128 -108 -52
$$ packed form
2588f6L85k90K02q6J09r6qJ65k89L04j44J55j36Q2k1j40K47k78K50k21K17k41
2610A00L8J05k53K37j98J95l00K20j27l7J03j34J36j80J51k81J82qj17P5r2J84
2632ak99K56k14N8K0m0N7j62K87l08J92p7O7m6n0K39l31K99j35Q0l3P6N3j30K39
2657I7k28K05o2N9m7lK05k23K47j71R6r6J33K4j52K21k38J88j14J77k20J40L9
2680B77j60J96k08J56k42K10j30o6J11j01R8j78K40l23J72o1j28J39j02J68k96
2701b28K15j16O8k8j12Q6j30J75k69J89k1n4RK0M4k23L29k20O5n8N9P4j37K81
2725A8k71J83p2J20qPJ06j89L18k44J67j29J58q4j0K07k60K73j87J32j43J70n2
2748B10p7J84j61Q7q5J80j95P8L7o9N3j17J14k12K03j68mP5p3M2j90K16k36N6
$$ plain form
2772 -52 -59 -55 -13 -145 53 -310 -42 -184 -104 -148 -169 -55 -338 -27 -315 -137 -245 -193 -162 -267 -52 -313 -57 -215
2796 -215 -163 -211 -59 -104 -240 -18 -197 -27 -105 1 -81 -59 97 -116 141 -29 188 24 131 187 55 214
2818 214 30 259 50 288 92 255 280 141 287 103 309 32 230 173 63 140 107 174 -51 217 3 133
2840 133 55 -25 94 -39 97 -183 70 -95 -27 -123 -123 -66 -262 25 -309 -79 -259 -145 -183 -213 -125 -359 -68
2863 -68 -290 -105 -235 -165 -184 -227 -59 -230 -62 -133 -101 -140 -61 16 -186 19 -137 77 -106 72 -14 -8 132 -43
2887 -43 202 0 205 -18 175 171 87 242 116 304 80 220 141 190 188 90 222 161 211 120 198 131 79 142 19
2912 19 174 -44 130 -46 66 -8 -66 -20 -154 62 -205 -35 -112 -88 -78 -184 -104 -259 -1 -257 -74 -208 -133
2935 -133 -177 -241 -58 -247 -66 -251 -106 -214 -131 -99 -246 -36 -194 -90 -162 -1 -76 -108 95 -107 83 -55
$$ packed form
2772e2pMM2j32J98l63K68j42Q0m4k1J14k83L11k88J78j08N2L1j05K15k61K56j58
2796b15N2m8J52m5j36K22j79J70p8J06q2K2J56k13K57j70K17j64J07N6j32J59
2818B14j84K29k09K38j96J63K5j39J46j84K06k77J98n7j10P7l3O7k25K68k14J30
2840A33p8q0J19j33J36k80K53j65O8r6%N7j96K87l34K30j80J14l8l0Q8k34K91
2863f8k22J85j30P0j9m3J68j71J68p1L2l9P9P7k02K05j56K14j83J78q6OJ40j75
2887d3K45k02K05k23J93mq4J55j26J88k24J40p9M9kr8J32o1N0r1P8o7n2O3j23
2912A9J55k18J74j76J12p4n8M6j34K16k67J70p7K4J0j06Q0j55K58k56J83j34P5
2935a33m4o4J83j89J81j85J45j08Q3L2j47K10j58J04p2J61p5l2K03k02J90j38
$$ plain form
2957 -55 73 -41 91 47 33 172 63 165 -35 162 42 90 158 117 201 83 282 46 290 121 113 172 138 168
2981 168 46 255 9 180 102 92 179 77 171 -93 158 -68 60 0 -10 21 -168 35 -185 -50 -154 -94 -160
3004 -160 -221 -49 -258 -100 -217 -81 -201 -150 -120 -264 -40 -274 -70 -242 -92 -146 -152 -113 -172 -42 -233 10 -98
3027 -98 15 -37 -89 14 -77 88 -100 128 -12 96 103 34 165 32 242 30 234 94 156 184 58 212 76
3050 76 209 66 198 102 159 135 87 187 30 206 -10 151 57 84 87 -9 145 -83 73 -49 -38 5 -65 -19 -176
3075 -176 72 -178 -69 -137 -86 -98 -142 -81 -219 -75 -230 -111 -177 -163 -147 -230 -11 -207 -24 -158 15 -152 -83
3098 -83 -40 -150 27 -80 97 -94 48 32 -39 104 -64 144 -57 149 -34 68 129 16 156 94 196 -23
3120 -23 145 74 83 168 77 154 49 222 39 178 152 63 135 86 185 -27 138 11 80 11 80 119 -98 47 -109
$$ packed form
2957e5J28j14J32m4j4J39j09J02k00J97j20M8O8m1Q4j18J99k36K44j69qN9l4L0
2981A68j22K09k46J71p8j0Q7j02R4k64K51k26J28o0j0L1j89K03k20J35j04O0o6
3004a60o1J72k09J58j17J36j20N1L0j44K24k34K04j72J50n4oL9n9J30j91K43j08
3027i8J13n2n2J03r1J65j88K28j40J08Po9J31j33K10k12K04j40O2K8j26J54j36
3050G6J33j43J32r6N7k4m8J00j57J76k16J61r4K7Lr6J54k28J56j22J1M3p0M6j57
3075a76K48k50J09o8N1j2m4O1j38J44j55J19o6J4J6q3K19j96J83j34J73j67O9
3098h3M3j10J77j07J77j91J42j6p1J43j68K08k01K06j83J02O1j13J40o2J02k19
3120b3J68p1RQ5r1P7j05J73j83J39k6q9P2m9R9k12J65j27O9o9O9L9k17J45j56
$$ plain form
3145 -109 36 -29 -5 -107 -119 24 -171 11 -177 -122 -215 -89 -100 -208 -63 -221 -82 -193 -37 -237 -154 -122 -186
3168 -186 -101 -167 -67 -180 -24 -103 -109 -26 -137 -25 -84 137 -58 45 26 18 100 47 134 0 152 84 88 119 92 199
3194 199 23 227 29 205 115 147 153 85 209 14 190 94 89 104 39 132 -15 137 -16 130 9 53 -25 -35 141
3219 141 -119 84 -117 -23 -110 -9 -81 -111 -24 -135 13 -144 -34 -179 -144 -85 -212 -47 -178 -36 -183 -90 -169
3242 -169 -130 -67 -164 -73 -165 -3 -128 -25 -37 -45 14 -66 -14 -139 108 -70 19 29 29 99 4 112 -14 157 118 85
3268 85 91 62 180 25 205 32 129 73 123 116 33 146 8 122 25 52 23 53 71 -4 135 -46 83 -20 21 -24
3294 -24 -103 22 -136 66 -137 5 -99 -58 -79 -179 -64 -111 -13 -158 -35 -194 -145 -53 -161 -103 -188 -100 -175 -47
3318 -47 -86 -140 -76 -134 -27 -137 59 -99 -5 -20 -41 -34 -73 87 -90 85 0 63 29 12 101 -6 177 36 86 123
$$ packed form
3145a09J45o5K4j02j2J43j95J82j88N5r3J26j1j08J45j58J39j11J56k00Q3L2o4
3168a86Q5o6J00j13J56p9oQ3j11J12n9K21j95J03j9qQ2n3Q7j34J52o8ML1k7J07
3194A99j76K04j98J76r0L2Oo8J24j95J76r6nJ5o5R3j47J52j53J46j21M4p8j0J76
3219A41k60K03k01R4q7J01p2l0Q7j11J48j57J10j45L5N9j27J65j31J42j47R3p9
3242a69L9O3r7R1r2J62j25J03j2qN9q0N2j25K47j78Q9J0%P0r5J08j26J71l9l3
3268H5Ok9J18j55J80j73R7n6N0pq3J13j38J14r7K7k9L0J8p5J39j81J29j03M1m5
3294b4p9J25j58K02k03J42j04M1k1j00J15m7R8j45J23j59M9R2j08N8q5Q8p5J28
3318d7l9n4O4n8J07j10J96j58R4j5k1Pl9J60j77J75q5O3l4j7Q9j07J83j41N0L7
$$ plain form
3344 123 119 94 61 171 43 157 42 79 97 62 99 6 159 20 104 12 57 34 -31 48 -75 101 -8 62 -89
3369 -89 3 -30 -91 22 -125 -40 -196 -48 -146 -82 -139 -111 -39 -152 -18 -168 -98 -142 -101 -52 -133 -63 -132 15 -161 -17
3395 -17 -81 -106 1 -86 58 -84 -32 -57 -13 5 -20 49 -34 160 -5 88 66 18 106 58 104 67 154 28 119 93 103
3422 103 123 41 200 65 184 130 145 58 84 184 23 184 17 39 15 103 45 -4 60 -48 28 -12 23 -87 -66
3447 -66 -41 -91 -3 -118 12 -141 -29 -146 -97 -52 -167 -44 -118 -11 -164 -27 -89 -94 -47 -86 -44 -157 2 -109
3471 -109 -66 -30 -14 -24 -83 58 -133 86 -40 0 18 25 104 -9 162 29 61 64 61 0 100 149 32 124 80 144 82
3498 82 83 135 35 156 61 72 30 127 22 63 110 34 81 -3 100 -60 43 -7 -51 23 -43 26 -111 37 -68 -19
3524 -19 -23 -90 -45 -53 -32 -95 -1 -85 -61 -85 -74 -48 -145 -39 -93 -80 -67 -101 -38 -120 35 -101 49 -46 -18 -40 -42 61 -50
$$ packed form
3344A23mk5l3J10j28J14j15L7J8l5L7r3J53j39Q4r2M5k3o5P9j23J76j09P0j51
3369h9R2l3o1J13j47Q5j56J48r8O4n7K8P2j13J34j50P0m4M1M9q1P0o9J47j76J44
3395a7o4k5J07q7J44j42N2k5M4J8k5O9q3J94j65R3k2m8Q8m8M6l7Q7j26R1k6J0
3422A03K0q2J59j35J19n4J5q7K6J00j61J61j67K2k4Q8n8m9O4j08P6m0L5j10K1
3447f6K5n0Q8j15J30j53J12j17M9M5j15J23p4J07j53J37o2nM7l9M2j13J59j11
3471a09M3L6J6j0n9J41j91K19j26M0J8PP9j13J71j33L2Llo1J00M9j17R2m4O4o2
3498H2JN2j00J21r5J1m2R7j05M1M7p6M7q4J03j60J03n0m4P4o6O9j37J48j05M9
3524a9mo7M5qK1o3R4q4K4k4J1K6r7J06n4J3J3l4O3q2J55j36J50r5K8k2kJ03j11
$$ plain form
3553 -50 31 -38 39 -54 69 37 15 80 -70 111 53 118 9 105 116 6 145 38 137 51 151 95 64 84 22 110
3579 110 13 69 33 87 92 -3 118 9 75 -8 29 -17 -9 -11 -22 -38 -86 -51 -100 -46 -101 -48 -40 -98 -44 -137 -8 -107 -30 -65
3609 -65 -101 -95 -130 -11 -155 16 -84 -36 -65 -70 -51 -103 53 -77 5 -43 -20 2 4 58 -31 83 15 87 -20 38 43 17
3637 17 88 -5 139 5 143 6 54 84 9 119 7 166 29 84 72 47 164 48 72 -5 82 -44 68 28
3661 28 -69 82 3 85 -35 76 -45 24 2 -60 9 -51 -23 -91 -37 -64 -82 -61 -80 -28 -167 -49 -134 -80 -83 -77 -63 -94
3689 -94 -9 -106 0 -117 -61 -41 -17 41 -57 -28 -43 97 -48 21 14 8 76 8 15 -3 87 -13 33 34 20 76 -18 128 -53
3718 -53 71 54 35 59 43 149 15 110 20 98 66 64 83 -27 61 -26 77 2 28 43 -13 71 -49 46 -56 29 -76
3745 -76 -39 -1 -9 -4 -66 -20 -114 -49 -56 -38 -49 -86 -55 -139 -20 -149 -93 -57 -71 -27 -138 -24 -37 43 -116 -30 -40 -36 13 -51
$$ packed form
3553e0Q1o9P7r3J23l2k2O5j50J81n8O5j09R6J1j10J39j07R9q6J00n6l1K0o2Q8
3579A10r7N6l6N4Nr5J21j09O6q3L7m6Qkj1j6m8L5m9N4n5N3Qn8N4r3J29r9P7l5
3609f5l6Ol5J19j44J71j00M8k9nJ9n2J56j30Q2m8K3K2KN4q9J14o8P2j07N8Nk6
3637A7P1r3J44j34J38j37M8L0p5J10j12J59j37N5j2k5J17j16K4p7Q7j26J12m0
3661B8r7J51p9Q2j20J11j21O9k2o2O9o0K8o8N4k7j8K1j9N2j39J18q5N4lOJ4l1
3689i4Q5r7J06j17N6K0K4N8r8K9j5J40j45O9poO8o8Pj8R0j00M6Jj4N6r4J46j81
3718e3J24j7j9K4j6J06j34R5r0P8l2kJ9j10Q8q7J03p5K6J5n6Q4j20R5j02Q5j05
3745g6L7L8qNo2M6r4O5pJ8j1l7L1q4J19j29N6L6j4M4j11J14j3Q0j59Q6j0MM9o4
$$ plain form
3775 -51 -5 -47 30 19 25 6 -14 68 -6 111 -17 64 -6 55 50 21 77 12 52 17 124 73 84 58 42 97 6 100 22 53
3805 53 95 16 72 36 71 3 101 1 14 15 -5 -54 -64 23 -156 -17 -61 -33 -42 -26 -21 -66 -23 -87 -66 -82 -96 -70 -119 -18
3835 -18 -108 -20 -63 -18 -12 -17 -7 -56 0 -76 -55 -66 -12 -8 30 47 -16 42 -23 47 1 -7 103 8 122 14 97 -2 89 16 89
3866 89 48 22 122 38 103 48 71 64 25 69 43 63 17 90 58 14 86 -30 82 2 60 12 61 -7 5 -14 -69 48 -67
3895 -67 -10 -80 -15 -85 -33 -12 -81 -31 -114 -15 -117 -69 -44 -61 -15 -89 -37 -125 -46 -59 -57 -80 -19 -54 -15 4 -11 -12 -20 -3 5 43
3927 43 100 -44 -19 -18 46 -26 10 35 4 87 5 50 10 71 30 59 85 38 63 -28 90 17 41 32 35 88 29 59 -50 66
3957 66 -3 36 74 -4 16 8 106 -71 -1 -49 -30 -15 -76 9 -45 15 -45 -40 -105 -46 -23 -109 -24 -77 -32 -126 -20 -63 -49 -41 -117
3988 -117 -21 -108 25 -71 -70 5 -36 -44 -44 9 -42 41 -40 33 60 -1 60 -58 29 -23 63 5 75 90 10 115 30 88 5 91
$$ packed form
3775e1M6m2P7j1Oj9k0Q2p4J17j28Q1p0O1nk9N6o5M0l5J07n1J1k6j6N5r1R4p8L1
3805E3M2p9N6l6L5o8R8j00J3Jk0m9j0Q7j79J39m4K8rJ6Nm5M3o4K1j6j4K6m9J01
3835a8r0Q8m3M5OnJ0m9N6p6K1j1N4ML8J7o3N8o5P0m6qJ10r5J14j08Q3r9R1p3P3
3866H9m1k6J00q4O5n5K3pl9M4k6K0m6P3l2m4P2j16J12q0N8m8M9o8J2j9n5J17j15
3895f7N7p0O5p0N2K1o9N0q3R9j02M8K5j7M6p4N2q8P9j3Kk3O1l5L9J9j5jqJ7QL8
3927D3N7j44K5JO4p2L6K5l1Q3q2M5m0O1m1K9K6m7K5r1J18p3K4rLN3n9L0j09J16
3957F6o9L9L8p8K0qR8j77P0m8J9J5o1Q5n4O0o0No5N9K3q6Q5n3M5r4J06m3J4Qp6
3988a17R6q7J33r6JP5m1q%N3n1Q3q1P3K7o1O1j18Q7n2Q6n8P0J5q0J05q5N8q3Q6
$$ plain form
4018 91 14 48 113 24 27 13 74 59 40 60 50 40 -8 88 -28 26 -11 26 31 -52 41 -52 11 -9 17 -55 13 46 -30 8 -56
4049 -56 -24 -75 -2 -39 -56 -35 -47 24 -103 5 -21 -26 8 -98 -11 -77 18 -64 -23 -56 -22 -60 -60 1 -38 69 -30 3 -27
4078 -27 29 8 12 39 -19 82 12 24 39 109 61 11 88 0 48 22 112 61 76 52 26 108 37 94 -30 27 -4 0 25 8
4108 8 52 -40 20 18 2 -6 -27 -1 -57 -10 -76 -18 -15 -33 -52 -111 -27 -47 21 -62 -27 -82 -55 -92 -83 -37 -62 -30 -72 -49 -52 -50 -4 -108
4142 -108 -4 -49 -35 -77 -26 51 -42 -10 -59 -20 3 39 -32 31 19 17 61 -27 26 -34 56 35 65 75 30 59 35 92 23 37
4172 37 51 73 50 30 115 28 68 27 -20 52 -15 71 9 17 6 -1 23 0 21 -61 -6 -58 1 -84 6 -95 -72 -15 -80 -53 -60
4203 -60 27 -87 4 -75 -45 -61 -82 -13 -85 25 -37 9 31 -43 -28 -80 65 -58 5 -5 30 -62 -27 -9 8 7 -22 43 -5
4232 -5 29 57 -37 77 3 25 42 65 31 7 45 23 52 -18 79 8 92 24 76 42 18 77 13 66 38 57 38 -20 3 -21
$$ packed form
4018I1p7L4O5q9Lj4O1j5j9K0j0j0m8R6j16N4l7L7Nq3R3r3O3k0K6p2O8L3p6L8o4
4049e6L2n1P3l7j7K1j2P1j27J08k6nL4j06Q7o6R5q2M1l3L4l8%O1l9J07r9L3l0
4078b7N6k1MK7n8J01p0J2J5P0m8n0P7q8M8k6R0n1J5k4k6Q2p1N7j24N7l1MK5j7
4108HM4r2O0kj6qk1K6n6M7o6N8Lj8j9n9Q4k0O8q3L5n5K7l7RM6k5L2m2K3lKM6j04
4142a08J04m5J4m2N1P7r3L2m9L9K3L6p1O3j2kM4q8N3o0R0k1L0J0m5K9k4N7o9J4
4172C7J4K2k3k0Q5q7M0m1m7P2o7Q6o2Qj1pK4k3K1q2N5n2N9q5R0j01K3N7o5K7p
4203f0Q7j14R1p9L0j6k1O9p2J10o2M6K2p4J5n2J45j23O3j0L5r2L5J8J7jk9O5m8
4232eL4K8r4J14p4K2J7K3l4k4L8k2K9p0R7p1Q4o8N2l4k4N9o4N3k8J9j9n8K3k4
$$ plain form
4262 -21 20 -30 26 -52 -26 19 -25 -35 -75 -23 -86 -22 -16 -9 -22 -93 -14 -11 -57 -73 -28 -78 -46 -50 -92 32 -43 38 -71 -58 -13
4293 -13 -28 0 -49 -6 -41 12 -34 -1 6 -9 21 -26 16 6 49 58 30 8 33 25 -31 61 34 51 18 50 69 40 56 18 84 -5
4325 -5 61 -18 75 32 23 90 16 4 24 -7 37 18 53 -70 83 -20 33 2 -23 -4 -22 42 -110 64 -71 -10 -55 -52 24
4354 24 0 0 -47 -24 -34 -52 -31 -93 -63 -57 45 -40 7 8 -4 12 2 -11 -51 54 -13 -10 32 36 52 -2 48 -6 11 -14 23 1
4386 1 12 87 0 74 -3 66 54 62 77 69 38 70 62 -57 -8 16 61 52 -29 48 1 80 2 20 7 -12 0 -21 24 -11 38 17
4418 17 -30 -71 15 -55 -56 -7 -50 3 -15 11 -70 -41 -49 -68 -4 -55 -9 -101 -55 -11 -84 14 -77 -4 -48 -4 -29 51 -9 20 45
4449 45 -51 21 10 -74 -33 3 11 11 -5 -12 62 -21 80 70 6 33 -6 76 -4 73 60 90 33 60 31 -27 51 14 11 26 60 14
4481 14 -60 67 52 60 -1 93 33 -24 10 -56 51 -41 11 -61 -37 -11 -57 -8 -49 22 -65 7 -86 -22 -45 -85 23 -66 -27
$$ packed form
4262b1M1n0N6p8K6M5m4j0m0N2o3O4OPj3p1P9Lm6j6M5n0L2mm2J24p5Q1j09J3M5
4293a3j5K8m9M3l5N3m6L3Pj5L0m7M2j0M3Rk8k2K5qn6R2k7J7l3L2J9k9J6l8O6q9
4325eO6p9R3m3rO7p4j2K0l1M4j9L5j23J53j03N3l1k5J9j8O4j52J74j35O1m5LP6
4354B4k4%m7K3j0j8K1o2L0OJ02q5M7Jj2J6j0j3m0J05o7LM2MJ6n4N0n4J7k5L7k2
4386AJ1P5q7P4p7O9j2QJ5ql1L2qj19M9K4M5rq1P7m7P9p8J8j3j9J2k1M5l5M9k1
4418A7m7m1Q6p0jM9m3N3j8K6q1K9qj9O4n1M6r2M6M4p3R8r1P3m4M4k5Q0o0K9K5
4449D5r6P2j1q4M1L6Q%j6pP4q3J01j0o4K7l9Q2q0P7j3L0n7K7k9n8P8l7lJ5L4m6
4481A4p4J27j5Qo1R4o0n7L4o6J07r2N2p2K4K6m6M9m1P1q7P2r3O4k3m0J08q9L9
$$ plain form
4510 -27 -76 -14 -36 2 -34 -70 52 -1 -31 -80 6 -30 16 -25 -35 5 -4 4 2 -22 78 27 45 36 78 42 4 26 5 37 40 32
4542 32 -26 70 -50 13 -8 -6 59 -8 81 34 26 -13 104 4 30 10 -9 67 -28 30 -3 -28 18 53 2 -1 6 -4 -30 -39 22
4573 22 -2 -67 -48 -53 -5 -67 12 -53 -40 -85 -29 -14 -70 -32 -44 -18 -72 -54 -32 30 17 3 12 -19 -11 16 28 37 -6 -16 -35 26
4605 26 7 47 17 40 66 25 55 46 12 -9 30 -9 0 35 31 9 -64 49 10 -9 34 -16 39 25 49 20 22 -14 -17 21 -32 60
4637 60 -9 -33 -41 24 2 8 -15 -17 -23 -6 26 18 21 -11 -21 -58 -75 -15 -55 19 -30 -34 35 -14 -26 -60 3 -35 33 -31 13 -1 -14 -26
4671 -26 4 33 -41 11 27 45 19 -16 56 -3 42 15 31 -7 25 -26 -13 35 32 8 12 13 33 65 53 9 57 74 39 13 32 26
4703 26 13 0 34 36 -32 38 -19 -13 7 4 91 3 38 -11 2 -39 -23 14 25 1 -5 -12 -25 -67 -15 -44 -31 -62 2 -26 -2 -30 -4
4736 -4 -67 -62 -8 -109 16 -77 -20 -68 -7 2 -4 45 -28 -43 -54 31 14 22 41 -38 11 7 78 -63 1 27 43 105 31 54 43 54
$$ packed form
4510b7m9O2k2L8l6l6J22n3l0m9Q6l6M6m1j0M0rQkk4J00n1J8rM2l6l8K2k1L2Lq
4542C2n8R6j20O3k1KO5o7Q9m7ql9J17j00K6k0j9P6r5N8l3k5M6L5n1lPj0k6rO1
4573B2k4o5J9nM8o2P9o5J3m5N6J5n6L8j2K6n4J8K2O2j3j4Rl1QK7J2Rm3j0j9O1
4605B6j9M0l0K3K6m1L0rl4k1L9l9RL5mk2p3J13l9j9M3n0N5j4K4k9Kl6lL8n3R2
4637F0o9k4qO5k2Ok3koJ7L2qLl2j0l7j7O0m0P4m9mO9m9j2l4O3l8O8o4M4j4j3j2
4671b6L0K9p4N2J6J8k6l5P2n9M5k7J6l8L2n1J3M8lk4MJK0L2j2m4M8J7l5k6J9o
4703B6j3j3L4Ko8P0n7OK0lQ7q8L5m9J3m1J6L7J1k4opj3m2N2k9J3l1O4k8K4k8K6
4736do3NN4j01J25r3N7m8O1RoM9p3j5j1Q5j7QJ9p9M9mP1j41O4K6J6O2p4K3j1J1
$$ plain form
4768 54 35 -33 27 39 -5 37 -12 24 24 16 12 36 -32 -4 -45 27 -10 34 0 -3 29 -42 5 -53 -33 -50 -16 20 -11 -25 -23 -21 -23 -37
4802 -37 -42 -18 -59 -65 13 -35 -21 -18 -23 0 30 0 -75 -75 -40 22 -49 -26 -5 -22 28 14 0 -44 41 -34 62 38 45 -19 0 -5 -20 17
4836 17 0 -8 37 46 127 -43 84 57 -17 -16 29 50 -16 25 8 5 -15 1 -13 11 17 -37 1 -72 32 -38 -47 28 -2 -8 -35 0
4868 0 -74 24 -38 -8 27 -28 2 -86 -8 -37 -9 -10 23 -54 -33 3 17 -17 -64 -21 -2 7 2 -15 9 -85 2 -28 -40 -60 1 12
4900 12 -5 4 -13 36 -55 19 9 -30 -8 4 70 -60 29 29 54 4 6 25 -8 60 26 84 22 76 -16 16 15 68 61 -17 31 21
4932 21 -9 -7 -37 -19 1 -24 3 -14 -2 -40 0 -42 -48 -43 -50 -47 -22 -46 -30 17 8 -7 -38 -19 -41 -20 -44 -3 49 -55 18 -91
4964 -91 -1 -48 80 -7 -21 20 -66 22 -14 -6 -1 -13 42 14 1 -17 41 16 12 73 23 35 28 28 10 21 1 45 9 -10 65 2
4996 2 35 0 47 26 54 14 37 67 23 5 -2 8 -22 9 -20 2 -1 -50 38 -30 -29 -33 -3 -36 -45 4 -2 8 -35 -21 -3 13 -16 -48
$$ packed form
4768E4j9o8O0J2m4M2m9L6%qmK4o8K8m1P2l7M4l4lL2p1M7n8K0j7L4L6l1j4KKkj4
4802c7nK4m1oP8m8J4LnK3L0l0p5%L5O2p1K3K1j7N0j4j4m4Q5p5R6k4Po4J9nj5L7
4836A7j7qM5RQ1j70J27k7p4JM5K1o6M1j7lk0J6j4K4On4L8p3J04p0rP5l0ok7L5
4868@p4R8o2L0L5n5L0q8P8k9K8jL3p7K1L6J4l4m7M3J9Rnj7K4r4Q7l0j2k0O1J1
4900A2j7Rj7M9r1P4j0l9K2J2O6j30Q9%K5n0KJ9l3O8l4N8o2N4r2L2jN3pp8M8j0
4932B1l0Kl0J8K0k5K7j7J2l8M0m2oNpLK5k4J6M7rj5l1J9k2K1k4M1N2j04P3j09
4964i1R0m7J28q7j4M1q6Q8l6QNj2N5k8j3j8N8k5mO1n0J2p%j8J1k0M4l6j9P5o3
4996BL3l5M7k1K8m0K3L0m4j8pJ0l0L1k9K2lm9Q8o8JmL0l3rM9oJ0m3J4J8J6k9l2
$$ plain form
5030 -48 36 -35 9 -83 -31 11 -77 -7 -39 36 -23 -34 1 -4 -66 -37 -49 40 26 2 37 4 6 1 3 31 11 44 8 -9 27 11
5062 11 35 5 88 -4 -15 -6 24 21 -15 10 51 109 37 71 32 -25 10 11 40 12 -15 -28 -37 41 -2 -21 -54 0 -86 9 -7 4
5094 4 -53 -26 -38 -20 47 -23 15 -52 -12 -1 -49 -30 -31 -16 -11 42 -67 -51 37 -18 -69 -64 -4 -14 11 -32 7 -48 -15 -12 -22 -8
5126 -8 31 -4 0 25 51 27 -23 17 28 -35 -18 14 4 22 10 -18 -2 -3 -3 10 12 -12 30 0 10 16 36 -1 -2 -22 -24 11 -41 30
5160 30 -37 15 -44 8 -9 -32 -14 -42 6 25 -5 24 -40 7 -26 6 -31 14 -21 -16 -48 -45 -8 33 35 -11 -4 -18 20 -34 -8 55
5192 55 -7 0 5 24 -4 -21 6 -44 -5 -2 36 7 60 -18 -18 1 -36 59 -31 36 51 -20 1 1 56 -36 38 13 48 -5 -4 45 -5
5225 -5 18 41 -32 14 18 -22 25 28 -9 24 56 -13 31 -25 19 -18 13 24 -1 0 17 13 11 -26 -34 23 6 16 -29 -41 5 20 34 -27
5259 -27 8 15 -6 -29 16 -43 46 -17 -45 12 -25 0 4 -1 16 9 -34 -28 38 -20 -4 -1 28 0 -34 -2 -30 1 35 18 -12 67 35
$$ packed form
5030d8Q4p1M4r2N2M2q8P0l2P5n9j1L5no2K9j2Q9j4k4L5l3KnKK8k0L3l6j7L6j6
5062A1K4l0Q3r2j1RL0ll6K5M1N8p2L4l9n7L5JK9k8k7j3rP8m3j9l3N4q6R5j6J1
5094Dn7K7j2J8O7p0L8o7M0J1m8J9jJ5NN3j09J6Q8n5n1NO0j0K5m3L9n5L3Lj0J4
5126hL9l5MK5K6k4n0M0J1o3J7L2j0J8j2k8J6j%J3Kk4M2l0J0OK0l7jk0kL5n2P1
5160C0o7N2n9N2j7k3J8k8M8J9l0K9o4M7l3L2l7M5l5Nl2LL7M1Km6Pj4L8n4K6O3
5192E5o2PNJ9k8j7K7n0L9LL8k9N3p8%J9l7R5r0O7J5p1K1%N5r2P4k5L5n3JM9n0
5225eK3K3p3M6Mm0M7Ll7L3L2o9M4n6M4l7L1J1k5JJ7mkl7qN7j7J0m5j2M6J5J4o1
5259b7L5Pk1k3M5n9Q9o3k8N7l7K5MnJ7pm3OO6n8J6LK9k8l4L2k8L1L4j7l0P9l2
$$ plain form
5292 35 2 -4 28 7 -33 23 -3 -37 6 7 39 20 13 29 34 5 67 6 -34 9 -48 -5 -35 -40 -5 -16 -8 -23 -27 -31 6 35 -39 -2
5326 -2 -19 14 -46 -7 -71 -8 -37 -60 -40 -21 -36 -31 -3 -32 41 -43 -40 11 55 10 -36 -13 11 15 13 5 34 -34 15 9 48 30 28 -2
5360 -2 2 -13 31 6 -19 19 -21 -53 12 -9 -8 20 -12 29 -22 -7 -1 -4 -53 -29 -51 3 6 17 55 -39 6 -14 60 -39 1 -9 22
5393 22 -61 -17 12 -24 -27 -11 -42 8 -46 -57 -38 -23 -16 -25 -16 -9 -45 -51 -11 -23 -45 -11 -5 -33 -58 -8 -18 44 2 -11 57 -24 -17 -38
5427 -38 -14 -16 27 -6 55 -34 47 -41 -13 12 40 13 2 5 -43 -14 -64 6 22 18 31 6 -51 -25 32 -14 -38 -11 15 -20 -18 -27 -33
5460 -33 -21 44 4 54 59 -20 -21 -3 27 -8 -11 -17 -12 -34 18 18 -52 -56 -49 -66 -29 -4 -54 -41 -13 -10 -10 -2 -53 20 -48 2 25 -7 19 -71
5496 -71 -26 -4 -15 42 -31 27 11 -23 82 22 -18 -24 47 -47 -13 -25 12 3 2 5 26 37 35 -15 33 32 28 5 16 37 54 73 1
5529 1 47 5 24 -8 16 -20 10 5 -21 -40 -1 -26 -8 38 16 -7 -6 -4 60 -16 -17 -13 30 21 49 -59 -22 -11 -10 49 -92 -6 -46
$$ packed form
5292C5l3oL2k1m0N6k6l4M3JL2j9pJ6Nk9O2o1m0M3n7M3l0nL5j1Qj5mmL7K9p4L7
5326bj7L3o0L9o4O3k9k3K0J9j5NK8k9P3q4LN1M4m5m6K3K4MkqK9o8M9oL9j8kl0
5360bMj5M4k5k5L8m0l2O5k1JK8l2M1n1J5Olm9K4k2N4LJ1L8r4M5k0P4r9M0j0L1
5393B2q3M4K9l6lJ6l1N0n4j1J9J5PrRPl6oM0j2k2L4Ok8k5N0j0O2m2j3O8q1Pk1
5427c8K4kM3l3O1q9Q1q8K8K5K8k7j1Lm8K9n0P0J6mJ3k5n7K6N7m6k4K7K6l5Kro
5460c3J2O5m0N0Np9jJ8L0l5loNk2N2%p0mPj7L7K5n0J3K8L%Qn1P3o8N0K3l2K6r0
5496g1M5K2j1N7p3N8j6l4J05o0m0oP1r4L4j2L7rjLK1J1kn0M8jmk3J1K1J7J9p2
5529AM6m2J9l2K4l6L0nk6j9L9k5J8M6k2k3JKO4p6jMM3rK8j08L7J1JN9j41Q6m0
$$ plain form
5562 -46 30 -22 3 -55 -4 -15 -81 -12 30 11 -3 34 -55 8 -24 -79 25 -27 -10 10 -8 -6 12 5 43 48 16 22 26 3 3 -19 30
5595 30 42 21 59 -7 59 -31 60 31 -57 -24 8 -3 -4 -5 31 52 25 23 -40 29 -10 3 15 -16 8 -6 -47 -22 14 -25 -10 20
5627 20 34 12 -42 -11 -21 -22 -21 -27 23 -54 -9 13 4 11 7 -18 -21 40 4 34 -2 33 33 13 -20 -4 -21 -2 -13 14 -17 -34 37 -8
5661 -8 32 41 22 9 30 25 11 31 9 -38 57 20 15 -49 14 0 65 14 -20 42 28 -43 -50 -6 -3 -52 -20 -16 27 3 -64 -17 -18 -22 -16
5696 -16 -2 8 -11 -8 -16 10 -36 33 -59 -14 -48 8 19 -35 7 -32 10 -13 3 -18 -6 -22 -17 -33 -13 11 -26 -2 -20 70 -43
5727 -43 10 -3 -22 17 -3 -19 16 19 13 -8 -21 -1 54 -27 -6 11 -16 58 39 38 -16 24 11 58 -8 -3 -5 0 20 7 50 2 -4 15
5761 15 -5 23 -30 13 -19 29 -64 -13 29 22 22 19 14 -16 51 -29 36 -57 -19 -16 -18 12 -44 9 -5 -46 23 14 6 -27 -16 -43 39 42 11
5796 11 -10 26 16 1 34 3 -8 0 -8 37 -8 -27 -9 -22 -28 12 57 2 19 -61 -23 9 66 15 -12 12 -21 4 1 14 -7 17
$$ packed form
5562d6P6n2K5n8N1j1o6O9M2j9j4L7q9O3l2n5J04n2J7K0j8KJ8pL8Nl2OMk3%k2M9
5595C0J2k1L8o6O6r0R1k9q8L3L2j1jjL6K1k7ko3O9l9J3J2l1K4j4m1K5L6l9J5L0
5627B0J4k2n4L1j0jJoN0p7M5K2rPmk5lO1l6L0l6L5%k0l3J6j7J9j1K7l1j7P1m5
5661hM0Rj9j3K1nj4K0k2m7R5l7no4O3j4O5n1l4O2j4p1pM4Lm9L2MM3k4o7M7jmO
5696a6J4J0j9LqK6m6O9r2M5l4N6J1n4M2l9M2k3J6k1J2j6Nj6K0K4l7K4j8R0j13
5727d3N3j3j9L9k0j6L5Lok1j3K0N5q1K1J7k7P4j9jn4M0j3M7o6NkNK0j3M3m8oJ9
5761A5k0K8n3M3l2M8r3N1M2p%lnl0O7q0O5r3L8LkL0n6N3j4m1O9rql3J1k7Q2Ll1
5796A1k1L6j0j5L3l1j1QqM5m5j9J8j3oM0M5n5J7q0L8L2N7n1k7K4l3K5lJ3k1K4
$$ plain form
5828 17 17 21 24 34 -2 30 11 22 66 -44 -19 -4 -25 4 35 -34 -27 35 51 -20 0 -36 -4 20 -37 25 -43 8 -4 -34 -8 8
5860 8 39 28 -1 -10 17 32 -3 8 6 -14 22 -57 7 37 -10 49 0 -7 19 -13 -31 18 22 -15 -4 14 12 16 11 33 -16 54 20 28 -17
5895 -17 23 38 64 7 -13 49 19 16 63 -18 -15 6 -33 -1 43 -16 12 28 17 24 -9 37 3 28 -63 7 -34 -9 0 20 -13 26
5927 26 6 -14 -42 5 -28 -18 16 -18 -12 -2 -15 -32 26 -7 14 -26 8 -3 2 31 11 10 7 -7 54 -11 37 -17 -24 -5 16 32 -18
5960 -18 -2 25 21 28 9 -41 -7 -13 8 32 49 9 19 -17 -22 54 20 28 44 4 -19 -5 31 -22 17 19 -29 -18 -15 -35 -54 -3 8 -36
5994 -36 -35 28 6 -4 -26 -7 45 4 -33 -25 -60 -41 -28 -3 20 -34 -24 -2 -6 -35 -31 -23 -15 -16 32 -39 -6 29 48 -16 -56 14 33 -51
6028 -51 16 57 76 11 34 78 39 3 16 -23 -26 11 13 4 28 3 -17 21 -2 2 23 31 4 34 17 22 14 5 -3 24 -36 1 4 -12 29
6063 29 63 -35 54 -33 -36 15 -17 9 -34 -37 -16 19 -27 -63 -38 -55 -39 24 -15 -17 -23 -36 2 1 -15 -9 26 41 -2 -33 18 41 -10
$$ packed form
5828A7%MLJ0l6L2j9J1M4j10K5J5k1K9L1o9PO2J6p1K0l6L2K4n7O2o8N1j2l0K6J6
5860HL1j1k9rK7J5l5J1kk0L6p9O4L0m7N9m9pK6l2j8M9Ml7J1J8kMnK2m9P0l4Qm5
5895a7M0J5K6n7k0O2l0lM7q1LK1l9L2M4n9K8J6j1Pl3M6l4K5r1P0m1K5RK0l3L9
5927B6k0k0k8M7l3J0L4l4OJ0j3j7N8l3K1m0L4j1NK9k0jlj4O1o5M8n4pJ9K1J6n0
5960a8J6K7mPj9n0L4oK1K4J7m0J0l6nP6l4QJ6m0k3J4L6n3L9Km8J1Lk0j9N1J1m4
5994c6JO3k2j0k2J9N2m1l7Ql5J9J3K5K3n4J0K2mk9MQQjM8p1L3L5J9o4m0P0J9q4
6028e1O7M1J9o5K3M4l9l6J3l9lL7KrK4k5k0L8k3MK1Qk7L0j7NqrqK7o0L7Lj6M1
6063B9L4r8Q9q7lN1l2K6m3lK1L5m6l6K5j7J6O3l9koj3L8jj6OL5J5m3l1N1K3n1
$$ plain form
6096 -10 -55 7 -34 -27 61 -39 19 0 58 0 5 2 -2 43 -19 50 -36 16 1 37 -7 13 -12 -5 -11 -19 7 3 36 39 30 37 24 -46 2
6131 2 23 54 50 -24 26 28 52 -16 42 -24 -6 -7 -18 -28 17 -3 3 -21 6 -45 -28 32 11 2 9 50 -68 17 -12 -15 -14 -1 -39 -31 -21
6166 -21 18 2 -34 -8 -20 0 51 2 -5 3 16 -16 0 -32 -28 56 46 1 -29 9 21 78 -6 12 -16 12 8 -38 55 61 -10 25 -24
6199 -24 5 14 16 -14 5 -30 69 7 19 34 10 9 -27 17 -17 65 -20 30 19 -41 0 -14 -3 17 -23 4 21 -19 17 -4 8 -42
6231 -42 -42 -36 -3 15 10 -2 -4 -29 35 41 -27 36 10 -17 -21 10 4 -46 -65 -3 23 -26 0 28 35 -37 41 39 -2 40 28 43 14 24 -14
6266 -14 -7 14 -11 40 11 64 25 -3 -2 3 44 -19 28 -23 -30 -31 -5 -3 -6 -11 -23 5 18 -12 51 -11 7 37 8 28 -14 -15 -24 -29 37 -65
6302 -65 -59 -13 19 -13 58 16 -13 -25 -29 -37 -24 7 -34 6 -20 11 -3 -22 -44 -55 -63 11 -42 -23 11 -8 5 38 16 45 14 44
6334 44 90 15 47 19 7 -1 -32 43 47 -9 -26 21 25 38 18 29 -20 4 -10 54 33 -48 8 -51 40 -7 -11 -54 -33 12 -30 -41
$$ packed form
6096a0m5O2m1PQ8j00N8j9N8n8NlmM5o2O9q6N2j5L6m4K0k5PoqK6mL3LrPj3p0M8
6131BK1L1mp4N0KK4o8N8o6J8jj1j0M5k0Ok4K7n1J7O0k1rPM1j18Q5k9lJJ3l8QJ0
6166b1L9j6l6K6j2K0N1m9pQJ3l2J6l2MQ4j0m5l0L8J2N7q4J8k8K8mm6R3Op1L5m9
6199b4K9RKl0J9l5R9o2J2J5k4jl6M4l4Q2q5N0j1o0M1j4J1K0m0K7J7m0L6k1J2n0
6231d2%OL3J8nj2kk5O4Oo8O3k6k7mL1on0j9O2K6m9K6K8Pp2P8km1M2j2J5k9J0l8
6266a4PK1k5N1k9N3l9k8JNM1o3M7n1pjK6Klnj2K8J3l0O3o2J8L0k9K0m2jrnO6j02
6302f5OM6L2l2P1m2k9j2mqJ3L1m1M0k6L1j4j9k2j1qP4n3J9L4j9J3L3k2K9l1L0
6334D4M6p5L2k8j2ql1P5Mn6j7M7MJ3k0J1m9K4j4O4k1q1N6n9R1m7mm3K1M5m2j1
$$ plain form
6366 -41 53 0 -64 15 -3 5 -7 -22 22 7 -17 -64 13 -54 26 -1 -27 -22 -42 22 14 0 -40 -14 -64 -34 1 3 -60 -2 0 -23 -30
6399 -30 28 1 14 54 6 20 27 -31 43 68 3 -34 -3 28 -12 22 50 26 6 39 9 34 40 -2 8 -5 -7 24 -17 38 3 -22
6431 -22 -40 26 -60 1 8 -35 0 -17 -19 22 -12 37 -6 -18 -25 26 -14 -43 -73 -17 -9 55 44 -5 -57 -8 -50 -2 -70 -72 -25 0 29
6464 29 -22 -58 -13 7 -1 -23 8 -14 -23 -46 -24 56 26 1 18 3 19 -6 12 28 -5 0 20 2 -4 7 -5 48 49 15 51 49 56 28
6498 28 -8 65 -21 -13 -52 -74 -7 38 -23 29 -47 -3 24 -5 23 24 20 -25 -21 31 -63 -27 8 -46 -2 -32 -56 -18 -8 34 13 -48
6530 -48 27 24 -26 -70 -12 7 -37 24 2 -37 -16 14 -27 -13 -11 41 24 -48 -46 59 -5 27 -3 23 -29 30 -23 26 -2 -20 82
6561 82 14 29 13 52 1 25 3 5 1 27 -7 20 -32 -20 -22 23 1 14 -5 3 6 37 -11 33 19 23 -34 -13 32 -17 40 -41 11
6594 11 -49 -31 -8 37 -52 -21 21 -1 10 -8 -6 12 -6 -14 -12 53 -32 -8 -15 -59 3 -1 35 52 -27 9 16 4 13 24 31 -11 9 -6
$$ packed form
6366d1R4n3o4P9j8Qj2j5M4j5k4m7P7o7Q0k7k6Nk0O4qj4m0K6n0L0L5Ko3N8Kk3p
6399c0N8k7J3M0m8J4Pn8P4K5o5l7L1L1m0L4K8k4k0L3l0K5Om2J0j3kL1m1N5l5k5
6431b2j8O6q6O1Pm3L5j7kM1l4M9m3j2pN1m0k9l0N6QO4j1m9n2M9m2M8o8kM7K5K9
6464B9n1l6M5K0qk2L1k2rk3K2Q0l0k5J7j5J6k5J8J6l3NK0j8oJ1j2N3Jl4L6kPk8
6498B8l6P3q6Ql9k2O7M5o1N2p6M4K7k9K8Jmm5MN2r4L6L5n4M4l0k4L8J0M2k1o1
6530d8P5ln0m4N8J9m4O1k2l9K1L0m1J4KN2j7p2KJ05o4L2l0K6n2N9n3M9k8j8J02
6561H2o8J5j6L9n1K4k2KmK6l4K7n2J2kM5k2J3j9QLL1m8M4j4Mn7K1M5m9N7q1N2
6594A1o0J8K3M5q9L1M2k2J1j8KJ8j8qKO5q5K4pm4O2mL6J7p9L6Pj2RJ1Pm2K0j5
$$ plain form
6628 -6 -11 14 -28 -6 36 9 58 -43 26 54 -23 -5 55 36 -9 17 41 41 88 -2 26 25 16 -47 53 -11 -15 -2 -59 34 -33 21
6660 21 -47 -31 35 2 19 16 9 -51 -58 -32 18 -27 -43 2 -5 -4 5 -9 44 7 -8 2 -12 22 -28 44 69 -49 10 45 -12 -35 -40
6693 -40 -19 14 14 3 34 -18 4 16 -29 -26 -13 27 86 27 2 -7 -21 -74 14 -7 -10 29 -15 54 -47 -30 -14 40 36 -7 0 47 20
6726 20 51 -33 -8 26 13 25 20 15 -9 -24 -11 42 -13 -7 -13 -7 -3 24 -10 -36 20 -38 -7 -37 -22 -29 -52 -11 -2 -31 -63 -67 -40 -49 -28
6761 -28 1 -4 -37 -36 5 60 11 -5 -25 13 27 23 10 19 -4 -26 -44 -7 16 47 45 39 14 -2 -7 29 30 -15 5 8 32 20 4 12 30
6796 30 2 55 76 -27 -17 101 5 -4 20 60 29 38 32 64 32 54 22 -16 -46 24 -17 10 -62 -42 14 -36 -7 -1 -22 -15 -16 -37
6828 -37 -13 -6 -17 -5 3 25 46 -10 -55 10 2 -8 -3 61 14 37 32 -5 28 -47 12 -14 13 -2 -16 12 29 15 18 45 -15 -8 27 -21
6862 -21 33 6 17 49 11 -33 26 34 7 28 -5 -16 28 29 27 44 25 19 15 -10 -10 38 -28 13 42 19 25 -33 20 -44 -14 -17 -24 26 6
$$ packed form
6628fnK5m2K2M2k7M9j01O9K8p7J8O0j9m5K6K4%M7r0K8jro3J00o4mJ3n7R3o7N4
6660B1o8J6O6l3J7lpo0pK6N0m5j6M5pJRj4N3l7j5J0j4L4n0P2K5j18N9L5n7k3n
6693d0K1L3%j1L1n2K2J2m5LJ3M0N9n9k5rj4n3Q8k1lL9m4O9j01J7J6N4mm3PM7k7
6726B0L1q4K5L4j3J2nnk4j5J3N3n5OoOMK7l4k6N6n8L1l0J5pk3M1Rk9l2mK7rK1
6761b8K9nl3JM1N5m9j6k0L8J4mj3Rk3k2j8L7K3L1kok5j6nL6Jm5K0LK4j2j6QJ8
6796C0k8N3K1j03J0J18r6rK4M0l1RoL2l2K2l2l8l0P0m1K7p2K0N6n0K9Ok1Pjk1
6828c7K4Pj1J2QK2K1n6m5O5qj0NO4m7K3nl7L3p5N9k6K7j5j4K8J7j4LK7o0PL5m8
6862b1N4k7J1L2l8m4N9Qk7K1l3j1M4JkJ7j9omk5%M8o6M1K9k3On8N3o4L0lpN0k0
$$ plain form
6897 6 -26 -17 28 -61 36 51 -4 -82 -22 -19 12 -32 21 -11 4 -37 11 -42 -59 27 -60 24 -37 -52 -18 -5 27 89 12 -12 18 -26
6929 -26 -26 3 -5 -88 30 -21 39 -12 3 39 33 40 36 25 -31 38 65 43 -11 34 15 34 -20 44 28 -32 -15 -63 -22 -42 22 8
6961 8 -39 13 -24 -11 11 -6 32 -95 49 37 -37 -3 5 0 -31 -43 -34 -14 -16 14 -51 -10 40 -27 -48 -31 -39 -24 -36 -49 24 75
6993 75 12 21 26 16 -29 81 -30 43 30 -18 36 2 -24 31 -34 -1 44 95 -33 41 -3 15 24 -13 43 0 56 2 17 54
7023 54 48 -15 12 31 10 -18 -8 21 38 0 4 -4 32 1 -37 39 -11 5 -33 -39 -23 -9 -5 7 5 -81 -16 -85 -16 -36 -18 8 -5
7056 -5 -52 -21 -35 -13 46 -2 9 -62 -30 -26 -18 -18 -3 45 -29 -40 27 3 34 -9 24 47 11 0 -9 16 14 -5 18 46 10 29 33 6
7090 6 26 12 9 5 44 7 19 23 59 -20 47 -27 -19 59 -1 19 -7 -20 -13 -1 -51 -18 -38 -14 -22 -48 -85 5 -55 -50 -20 -15 12 -24 -22
7125 -22 -57 -32 6 14 -51 -25 -47 -29 -27 1 26 -44 -26 -7 -9 -8 -44 -21 -1 34 -28 30 -9 -20 -3 11 39 -2 19 25 26 27 -19 9
$$ packed form
6897Fl2RM5q9R7J5n5p8O0LL1m4N3l2J5m1M8n3j7Q6q7Q4o1j5L4J3L2O2p7k4L0m4
6929b6%K9qq3J18n1O0n1J5L6oPmj1n6O9K7k2n4M5j9J9n4O4j6o0J7m8M1k0O4j4
6961Hm7N2l7J3K2j7L8j27J44j2p4L4Qnl1j2RK0kL0o5M1N0o7k1J7qJ5j2j3P3N1
6993G5o3RNj0m5J10j11P3j3m8N4l4k6N5o5L3M5N1j28P4m4J8Rl7N6m3N6n4J5L7
7023E4oo3K7J9k1k8J0K9J7l8MqL6l1l8P6n0J6l8oJ6J4MJ2kq6O5o9O9k0J8K6j3
7056em7L1j4K2N9m8J1p1L2MQ%J5M8p4j1O7k4L1m3L3K3l6j1rK5kj9K3K8l6J9Mk7
7090FK0j4lmL9l7J2ML6p9O7p4QP8o0K0k6j3PJ2n0L3k0K4qk6l7R0o0NL0NK7l6K
7125b2l5K5L8Qo5K6k2J8KK8K5p0J8J9kJl6K3K0L5o2N8l9j1J7J4K8m1K1OJJm6K8
$$ plain form
7159 9 21 1 47 21 -10 58 11 45 24 24 13 9 59 14 58 34 -11 -6 -14 110 16 -16 -24 5 -38 -3 3 -10 -12 -40 -5 -12 -46 8
7193 8 1 14 -29 -27 -14 -38 -37 -41 10 -26 12 -54 14 -37 24 24 -13 -3 -94 2 -41 -2 4 58 15 12 7 15 12 -41 7 -12 -53 -8 -6 4
7229 4 -6 -5 -21 60 -2 24 -2 65 15 53 37 17 6 -23 27 18 27 2 -10 2 19 -23 -7 6 -15 -60 -9 -18 22 10 -8 -10 2
7262 2 40 -34 -13 23 -18 -13 -35 -45 9 -51 -40 -36 -44 0 -62 3 -45 5 -34 -10 13 -15 -10 -8 16 -6 -9 -46 38 35 -29 -25 -13 -21 8
7297 8 28 -8 -9 -2 13 53 18 -15 -30 6 5 14 -47 -34 24 23 -20 4 34 40 -2 8 16 6 5 11 -9 30 17 13 31 -16 20 -10 49 -20
7333 -20 -14 1 -44 8 -61 -56 -10 -26 -11 -37 -6 16 -4 -9 -12 -25 -51 -33 1 13 -19 -1 -32 10 -40 -10 8 -33 -34 -24 51 0 32
7366 32 19 -46 28 8 6 -39 -19 -25 25 17 -25 17 -24 -5 26 12 1 17 -23 1 39 21 30 15 52 28 28 -43 -51 -42 42 -10 -50 4
7400 4 37 -3 7 -4 16 40 -27 47 5 28 -14 -23 -29 3 -56 -8 -11 -10 11 6 73 10 -25 -8 19 -6 -53 -24 -16 6 -37 -41 -33 -2 25
$$ packed form
7159IJ2k0M6k6l1O8m7L4k1%j1mN0m5M4k4m5NqJ24r4l2qK9m3L5Oj3kk8L5pl4N4
7193HpJ3m3KJ3k4JmN1l6L8o6O8n1O1%l7J0r1R6m3L9ON4m3lnQln3M8j9m1M5KJ0
7229Dj0Jj6Q1o2K6k6O7n0L8j6k0j1k9N0rRk5j2J2J7m2J6J3k1m5N1rM0j2j8kJ2
7262BL8p4K1L6m1Nk2j0N4o0J1MqM4o2O5m8N0l9K4K3k8NKK4k2ll7Q4lo4MJ2qK9
7297HK0l6jPJ5M0l5l3j5L6jRo1J3N8jm3K4L0Om2J0Qj0jOk0L9j3mJ8m7L6l0N9o9
7333b0OJ5m5N2o9NM6j6J5k6L1K2k0nlj3k6J8L4J2l2J8l1M2n0L0J8m1jJ0P5n1L2
7366C2j3o5P4k0km5K0oN0qm2M2m1J9L1j4j1J6m0K4L8j8Rj5L7k4%p1qRQ4n2m0N4
7400DL3m0J0j1K0K4o7P4m2K3m2roL2n9M8lJK1nO7o3l5J7K7k5m7K9QK2m3mQL1K7
$$ plain form
7435 25 -33 60 13 -38 19 48 -39 0 -8 -20 38 -24 50 12 34 6 -4 10 6 24 12 34 -32 4 24 25 29 39 6 39 -7 19
7467 19 -20 110 -34 24 -40 -2 -12 1 10 3 26 15 23 8 -45 -19 -6 27 -27 13 -38 17 -37 1 -43 -56 -22 -19 1 -55 -4
7498 -4 -74 -36 42 -7 -9 -7 -5 -6 -16 -54 -5 -61 -20 22 26 21 27 -16 -34 -11 -10 -38 26 -12 8 0 19 -40 15 -22 25 44 -1 8 26 50
7534 50 28 8 1 3 -3 8 26 -16 -9 -19 51 -3 -22 16 15 4 -5 21 -22 -40 13 56 7 -47 16 12 71 64 -3 -12 -16 2 -49 -21 -23 57
7570 57 9 40 -24 -15 0 28 26 39 6 -62 -38 -19 -8 -8 -14 -18 -67 1 -6 -13 -16 6 15 -21 -8 27 28 12 -17 -9 32 4 -42 -8 -12 -8 9
7607 9 1 25 15 -21 -24 45 11 3 24 -21 -5 26 25 -3 -3 11 40 7 -10 19 -17 -23 -15 6 -2 3 -1 -24 1 16 0 16 18 16 33 26 -29
7644 -29 44 29 12 18 -35 -45 -23 -19 -30 28 -47 -18 -3 -71 -4 15 -30 8 1 -40 -48 -23 8 36 27 9 8 39 -31 27 18 -17 -9 -25
7678 -25 -19 26 -4 25 50 8 -37 95 76 -10 31 42 -29 0 20 -11 10 20 67 15 -8 10 -15 -36 42 15 36 43 -55 -22 -28
$$ packed form
7435B5n8R3m7n1N7K9q7L9qj2N8o2P4l8K2k8j0J4mJ8j2K2o6L6K0JMJ0l3L3m6K6
7467A9l9J30j44N8o4L8j0J3RpK3j1Qj5n3K6J3L3n4M0n1N5n4L8m4j3L4LK0n6N1
7498dp0L8P8m9kKKjj0l8M9n6M1M2MnOm3j8K3Jk8O4l8K0qJ9n9N5l7M7J9m5RJ8K4
7534E0k2k0pKoJ1J8m2Pj0P0n4j9L8jj1rK6m3j8N3M3m9n4O3mN9po7rmJ8n1K8kQ0
7570E7m8L1o4RJ5K8kJ3l3o8K4J9J1%omm9O8pplK2Rl6J3L5Jj6k9QM1k8m6L4mMJ7
7607IqK4j0l6lO9l4qK1m5J6L1jk8%J4K9l3j7K9l6oQK1qNmk3K5J5j6J6KkJ7pn5
7644b9P3j5j7On3j0K2Mj1N8p5K9J5o8O7J9m5L8pm1qK5L1K8rj8jL1p0N8rl5Qj6
7678b5OM5l0K9K5m2m5J32j9q6M1J1p1K9K0l1K1J0M7n2k3J8k5k1P8k7K1Pr8L3o
$$ plain form
7709 -28 11 0 -12 -1 3 -27 -15 -11 1 -62 38 21 35 -20 -28 -51 -2 -43 -19 34 -23 -3 -26 6 7 -10 21 23 -5 -8 -21 55 15
7742 15 -5 -37 7 41 44 8 12 7 -17 35 -11 -19 -28 19 -54 2 30 4 3 7 31 25 65 -63 -5 -13 13 33 22 20 -39 19 -14 -54 -20
7777 -20 -8 -23 -31 -54 9 -4 17 -9 -28 5 -7 16 -12 -21 -13 19 16 -29 22 -44 -8 43 -78 1 9 -30 -20 -18 -7 15 12 -66 -35
7810 -35 0 -18 23 -41 -38 -20 -3 -16 0 13 -14 34 -22 -25 10 42 13 -33 30 -13 -21 18 -12 -2 28 56 65 3 11 36 -36 6 -11
7843 -11 -14 21 -49 -20 -37 15 -34 25 8 42 62 9 32 79 28 30 -13 1 3 -8 -14 20 -28 -4 -30 -12 46 7 -25 15 -33 39
7875 39 -2 -57 -25 -32 -29 -57 -33 5 -22 -1 -27 -17 21 -34 34 -10 -38 19 13 -18 -18 38 -12 33 -33 33 45 4 40 29 39 -10
7907 -10 65 21 37 8 26 38 -42 6 5 64 46 16 77 -42 10 -3 9 -30 -15 24 25 -29 -14 -16 -19 18 -22 -12 -4 2 0 -91 4
7940 4 15 -24 -25 -26 -11 40 17 -35 4 -49 -28 -31 1 22 47 -3 12 4 -31 -31 -44 -31 0 -56 30 -19 3 -8 -18 -19 42 -5 7 30
$$ packed form
7709b8L9j1j2J1Ml0J2MJ2o3J00j7J4n5qk3M9m1K4N3n7K0k3L2Jj7L1Kk8lj3P6m0
7742A5k0l2M4L4Ll6Mnk4N2m6qrM7p3N6K8k6jMK4oM0j28N8qK6K0j1kn9N8l3m0L4
7777b0J2j5qk3O3j3K1k6j9L3j2K3k8rQL2lm5N1o6L6N1j21P9Ql9J0KJ1K2lp8L1
7810c5L5j8M1o4LJ8J7j3J6J3k7M8n6lL5L2k9m6O3m3qL9l0J0L0K8Ro2QK5p2M2j7
7843a1lL5p0K9j7N2m9N9j7L4K0n3K3M7n1Km3J4Kj1oL4m8K4k6J8N8l9l2M0m8P2
7875C9m1n5L2pLk8K4L8k7K1k6J0L8n5O8m4k8N7ol1%N6n0M5o6O6J2m1L6j1J0m9
7907a0P5m4J6k9J8J2q0M8jN9j8l0O1j19N2j3J2l9J5L9Jn4J5klL7m0J0QOkr1R5
7940DJ1l9jjJ5N1k3n2L9n3K1lL2K1K5n0J5ql5%j3J3L1n6Q6m9K2j1j0jO1m7J2K3
$$ plain form
7974 30 -2 54 -7 36 -54 0 44 -35 -13 13 30 -53 7 44 -10 42 -12 -24 -64 40 7 47 25 -43 -22 -17 13 30 34 -12 -13
8005 -13 19 10 -22 -7 -9 18 1 -16 4 -9 -39 40 11 -1 21 17 -26 -17 5 6 -6 -17 25 -24 5 -9 -2 37 8 -15 19 -21 43
8038 43 2 -14 -19 -17 34 -37 8 43 40 -4 50 -5 10 -29 -3 6 30 -2 43 42 21 26 36 55 -39 22 4 31 20 25 -15 0 78 39
8072 39 9 35 -50 31 -47 12 -17 4 -19 43 10 -22 27 3 27 32 -4 -43 -46 10 -40 -9 35 -33 21 -12 -7 -21 -44 -37 -38 -38 -4
8105 -4 -13 46 17 -46 -15 -29 36 -24 -14 -4 -23 -6 2 22 -8 66 -32 19 -58 54 13 -3 -1 16 38 2 51 19 -34 42 43 -9
8137 -9 9 15 -8 30 30 26 -12 -36 -28 -2 46 26 -8 39 -24 -10 -24 70 -51 8 37 -20 6 -7 20 -20 54 -47 -12 12 0 -6
8169 -6 -25 -47 1 25 -12 -65 -6 35 28 -49 -34 9 26 12 -12 -41 0 63 -23 -7 -23 27
$$ packed form
7974C0l2N6o1M3r0N4M4p9K2K6J7q3O0L7n4N2n4j2m0J04l3M0k2o8K1NL0J7Mm6j
8005a3L2rl2J5kK7j7j7K0j3l0P9k9j2K2mm3RK2Jj2j1M2m9K9j4PL9k9k3L4m0O4
8038D3m1j6nKN1p1M5L5lm4N4n5J5l9K6RK4l2M5jk1NJ0J9r4O1j8K7j1Nm0J5P8l9
8072C9l0K6q5Q1p8N9k9K1k3O2l3l2M9k4K4Nl6l9lN6n0L1M4o8N4l3Nj4k3Pj%L4
8105drN9k9o3L1j4O5o0J0J0j9J7QK0l0P4r8N1p7J12m1j6KJ7K2l6M9l2n3P6Jn2
8137iJ8Ok3L8%ml8k4QK6M8k0l4M7o3J4j4R4j21N9K9n7K6j3K7m0P4j01L5K4j2o
8169fj9k2M8K4l7n3N9M1pp7J5M3J7j4k4k9M1O3q6J6j6N0
8191B7
$$ Imaginary data points
##PAGE= N=2
##DATA TABLE= (X++(I..I)), XYDATA
$$ plain form
0 0 0 0 0 0 0 0 0 0 0 0 0 0 0 -8 8 -8 8 -8 16 -16 16 -24 24 -32 40 -41 48 -56 64 -79 88 -97 112 -128 144
35 144 -160 182 -201 225 -251 280 -310 343 -379 419 -463 511 -563 619 -682 751 -827 914 -1007
54 -1007 1114 -1234 1372 -1530 1717 -1939 2206 -2538 2960 -3520 4293 -5435 7289 -10778 19543
69 19543 -84881 -119246 74983 -71227 -58267 -5428 -61027 -45714 -9229 -21832 -38460 -53524
81 -53524 -1113 9418 -13819 -21631 -16171 16028 -12199 -4344 24118 -27486 -2329 37694 -2770
94 -2770 -30525 15042 3920 -11608 22517 -4740 -10181 15462 -8442 9992 16332 -35758 26410
107 26410 35679 -31808 21105 18715 -19946 4998 30336 -2038 -25241 29161 17579 -29161
119 -29161 8310 11514 -22346 13931 6507 -8497 8225 -8408 9783 5432 -11345 8732 17263
$$ packed form
0@%%%%%%%%%%%%%qJ6j6J6j6K4l2L2m0M8n6P2q1Q9j04J20j43J67j85K09k40K72
35A44l04L42l83M26m76N31n90O53p22P98q82R74j074J182j301J433j578J741j921
54a007K121k348K606k902L247l656M145m744N498o480P813r728J2724j8067L0321
69A9543j04424l4365J94229j46210J2960N2839n5599J5313L6485j2603j6628j5064
81e3524N2411J0531k3237p812N460L2199k8227P855K8462n1604K5157M0023m0464
94b770k7755M5567j1122j5528L4125k7257n441K5643k3904J8434O340n2090O2168
107B6410R269o7487N2913k390l8661K4944K5338l2374k3203N4402j1582m6740
119b9161L7471L204l3860L6277p424j5004J6722j6633J8191m351j6777K0077Q531
$$ plain form
132 17263 -2245 2898 17533 -7204 3282 12234 -2681 3679 7793 -1413 1048 -6069 -11292 7876
146 7876 -11738 -14599 1493 -1338 -18475 -19495 6698 -24274 -20495 14812 -21471 -26336 12954
159 12954 -12885 -27752 1674 -9002 -8820 -5710 -3037 -4873 -13929 1420 -1847 -8105 -3747 6432
173 6432 1021 -3656 2160 699 1964 1431 8847 3031 4099 9324 6669 3700 4354 8544 7050 13191
189 13191 290 11862 13879 -7744 13562 12691 -5288 8684 16543 -2724 3423 10909 1092
202 1092 -1942 6286 14181 -7691 3696 13026 -4673 1577 6052 -1391 -374 11047 560 -3600
216 -3600 318 3848 953 -5583 3236 -1947 -203 2897 -4262 -9399 1612 731 -8863 3305 -6594
231 -6594 -5016 2490 -4867 -8536 -4000 3210 -4549 -4316 389 -2632 -9259 5894 -59 -12674 7549
$$ packed form
132A7263j9508N143J4635k4737J0486Q952j4915O360M114r206K461p117n223J9168
146G876j9614k861J6092k831j7137j020K6193l0972L779L5307l6283m865L9290
159A2954k5839j4867K9426j0676J82L110K673j836r056J5349l267o258M358J0179
173F432n411m677N816j461J265n33P416n816J068N225k655k969O54M190j494O141
189A3191j2901J1572K017k1623K1306q71j7979J3972P859j9267O147P486r817
202A092l034Q228P895k1872J1387R330j7699O250M475p443J017J1421j0487m160
216c600L918L530k895o536Q819n183J744L100p159n137J1011q81r594J2168r899
231f594J578P506p357l669M536P210p759K33M705l021o627J5153n953j2615K0223
$$ plain form
246 7549 997 -4813 907 1212 -4027 -214 6061 -925 -2143 2305 6397 -4830 3097 5559 -4608
261 -4608 5795 5829 -521 90 6169 -587 2880 5123 -277 2324 2198 6170 -2780 1636 5306 -2420
277 -2420 2853 6089 -3183 -2739 9516 -3235 -1675 3573 -1052 -44 435 2641 -6432 -801 3891
292 3891 -3549 -5709 2742 -2593 -7689 3949 -6944 -6163 584 -3065 -6021 -3930 -1297 -6811 -3927
307 -3927 -3053 -2702 -7212 -211 -1330 -9174 845 -3318 -4414 -710 -381 -4357 -446 949 -4317 -939
323 -939 -157 3079 -3052 2203 2896 -3556 4381 2561 -1394 3285 8013 -1185 4008 5962 -76 4825
339 4825 4587 5849 1695 6313 5677 659 4095 5375 1328 2041 8732 -1099 2704 3895 -1336 2040
355 2040 1982 2376 -1606 2394 1593 -812 -1910 979 -1132 -2078 5633 -4600 -2728 2103 -2083 -4011
$$ packed form
246G549o552n810N720L05n239L813O275o986j218M448M092j1227P927K462j0167
261d608J0403L4o350O11O079o756L467K243n400K601j26L972q950M416L670p726
277b420N273L236r272M44J2255j2751J560N248m625J008M79K206r073N631M692
292C891p440k160Q451n335n096J1638j0893P81O747l649k956K091K633n514K884
307c927Q74L51m510P001j119p844J0019m163j096L704L29l976L911J395n266L378
323i39P82L236o131N255O93o452P937j820l955M679M728r198N193J954o038M901
339D825k38J262m154M618o36n018L436J280m047P13O691r831L803J191n231L376
355B040n8L94l982M000q01k405j098K889k111r46P711j0233J872M831m186j928
$$ plain form
371 -4011 -983 -971 -3768 1410 -2775 -3591 -4470 -359 -1972 -5619 2055 -3276 -2714 1046 -2024 -6106
387 -6106 1115 842 -3383 2037 -1390 -199 -2176 628 -1193 -3632 3494 575 -2463 -180 2086
402 2086 -4915 948 1948 -2111 3688 1713 713 -404 4063 882 151 5084 5229 2383 1793 6195
418 6195 -1823 3454 5601 -619 3361 5157 1838 -1514 2442 -530 954 1660 2123 215 -839 4754
434 4754 -3904 -1498 2152 -384 351 2081 -1127 -3413 1633 -2730 -2767 -2756 520 -1256 -4211 -536
450 -536 -5925 -4041 -1295 -2378 -5277 393 -406 -5138 81 -3288 -2424 -1002 1843 -82 -1340 1734
466 1734 -313 -1484 -728 2585 -2292 3019 2650 -1906 2325 -1288 -420 770 2831 1097 1593 2233
482 2233 1901 963 96 3307 -414 6089 4624 -737 2671 2631 1426 429 3332 505 3316 3134 138
$$ packed form
371d011L028J2k797N178m185q16q79M111j613l647P674n331N62L760l070m082
387f106P221k73m225N420l427J191j977K804j821k439P126k919l038K283K266
402B086p001N863J000m059N799j975j000j117M467l181p31M933J45k846n90M402
418F195q018N277K147o220L980J796l319l352L956k972J484P06M63j908j054N593
434D754q658K406L650k536P35J730l208k286N046m363l7J1L276j776k955L675
450e36n389J884K746j083k899N670p99m732N219l369Q64J422K845j925j258L074
466A734k047j171P56L313m877N311l69m556M231l613Q68J190K061j734M96O40
482B233l32r38q67L211l721O503j465n361L408m0j205r97K903k827K811j82k996
$$ plain form
499 138 -1324 -1412 2657 -1308 664 768 -428 -716 -8 -2786 -4182 1781 -2140 -203 -1508 -2605 -2199
516 -2199 -3894 -2050 -4065 -2225 -1845 -2364 -4727 -2303 -5299 -5863 -1089 -6000 -2230 -2479 -4287 -5192
532 -5192 -3751 -3052 -5619 -2448 -2267 -1900 -3534 -706 -4087 -4483 675 -1707 -1297 -971 1475 -1733 -358
549 -358 -276 -1492 1512 1001 2810 -114 2227 1373 -3 2392 1932 2075 3599 4432 -189 4441 2301
566 2301 526 3904 3512 4574 1539 4603 2111 591 3518 2912 445 2864 5343 -820 1472 668
582 668 128 367 1312 1536 -1851 1824 -504 -1735 -2426 66 -754 -2120 1288 -2633 -2228 -1630 -1975 -3592
600 -3592 -641 -1227 -2635 -273 -3396 -1727 -3418 -1142 -2362 -2457 1259 -3285 -2154 -565 -1875 -3379
616 -3379 686 -1098 -1740 1070 -873 -814 -2309 1741 -549 -319 2168 414 803 663 2229 -1179 1966
$$ packed form
499A38j462q8M069l965J972J04j196k88P08k778j396N963l921J937j305j097M06
516b199j695J844k015J840L80n19k363K424k996n64M774m911L770k49j808r05
532e192J441O99k567L171J81L67j634K828l381l96N158k382M10L26K446l208J375
549c58Q2j216L004n11J809k924K341q54j376K395m60J43J524Q33m621M630k140
566B301j775L378l92J062l035L064k492j520K927o06k467K419K479o163K292q04
582F68n40K39R45K24l387L675k328j231o91K492q20j366L408l921M05N98l45j617
600c592K951n86j408K362l123J669j691K276j220r5L716m544J131J589j310j504
616c379M065j784o42K810j943N9j495M050k290K30K487j754L89j40J566l408L145
$$ plain form
633 1966 2958 1586 2257 2001 2258 840 2870 884 2756 2514 2818 2057 930 3293 -910 2786 1961
650 1961 392 2661 1692 -50 273 1839 -977 938 738 1413 -801 -314 1170 -3282 596 -129 -1028
667 -1028 -1102 -240 -1355 -2736 -447 -2715 -1522 -1760 -465 -2585 -2475 -1408 -3016 -1646 -2192 -935 -2906
684 -2906 -262 -2076 -2657 114 -3174 -589 -221 -590 -1899 -12 -20 -1444 -51 640 629 -1404 3453
701 3453 -258 -671 2662 324 1383 1698 2762 116 2313 2741 1156 1290 2326 2997 646 3712
717 3712 1240 858 2158 2206 879 869 3434 -353 1846 1166 54 127 816 1516 -1018 1298 -218 -830
735 -830 -267 546 -2319 -631 1746 -2832 -315 -1139 -1526 -2305 -490 -368 -3312 -295 -855 -2359 -2849
752 -2849 -96 -2774 -1874 545 -2674 -1777 -1471 -658 -3178 -809 -373 -1889 -244 -1121 -972 -2278 863
$$ packed form
633A966R92j372O71k56K57j418K030j986J872k42L04p61j127K363m203L696q25
650A961j569K269r69j742L23J566k816J915k00O75k214M87J484m452L878p25q99
667a028p4Q62j115j381K289k268J193k38J295k120J10J067j608J370n46J257j971
684b906K644j814n81K771l288K585L68l69j309J887qj424J393O91j1k033M857
701C453l711m13L333k338J059L15J064k646K197M28j585J34J036O71k351L066
717C712k472l82J300M8j327j0K565l787K199o80j112P3O89P00k534K316j516o12
735h30N63Q13k865J688K377m578K517q24l87p79J815J22k944L017n60j504m90
752b849K753k678R00K419l219Q97L06Q13k520K369M36j516J645q77J49j306L141
$$ plain form
769 863 -1226 -940 1412 -515 -535 485 1097 -1756 1775 1470 428 1212 1341 1629 -486 3050 929
786 929 687 2872 2058 638 1724 2575 -528 2638 1918 1175 1221 1935 1556 -585 2331 328 539 1290
804 1290 1858 -513 -127 1954 -1387 509 161 286 -469 766 -358 -1946 224 -1053 -569 -1357 346
821 346 -1975 -1358 -110 -3482 -1510 -966 -1045 -2517 -522 -1978 -2636 -861 -2070 -1523 -1635 887 -1918
838 -1918 -1096 171 -1897 -610 296 819 -1122 1642 210 -323 1000 345 727 528 3156 364 1077
855 1077 1635 838 1099 2078 2551 117 3616 1998 1072 1506 1765 1683 1597 3564 408 1206 1660 1546 -334
874 -334 823 1637 -885 2258 236 -1063 -661 731 -722 -1005 1158 -1140 -270 -300 -40 -2497 -358
891 -358 764 -1965 345 -444 -1397 -1993 187 -2010 -2097 17 -1671 -1236 -1626 -1025 -3830 -1545 -490
$$ packed form
769H63k089K86K352j927k0J020O12k853L531l05j042P84J29K88k115L536k121
786I29k42K185q14j420J086Q51l103L166p20p43M6P14l79k141K916k003K11P51
804A290N68k371L86K081l341J896l48J25p55J235j124j588K170j277M84p88J703
821C46k321O17J248l372J972N44p9j472J995j456o58J775j209N47j12K522k805
838a918Q22J267k068J287R06N23j941K764j432n33J323o55L82j99K628k792P13
855A077N58p97K61R79M73k434L499j618r26M34K59q2q6J967l156P98M54j14j880
874c34J157Q14k522L143k022j299M02J392j453k83K163k298Q70l0K60k457K139
891c58J122k729K310p89r53n96K180k197q7K114j688M35l90O01k805K285J055
$$ plain form
908 -490 -2563 -1510 -1080 -1383 -2834 47 -2518 -2291 435 -434 -842 -1184 370 -2033 -22 555 -491
925 -491 -90 1597 1159 -1589 1953 123 187 1964 1995 978 909 2877 -36 1370 1904 1710 1071 2722
943 2722 2167 -413 2328 829 831 1141 2113 294 343 2123 -870 67 156 745 -643 793 530 -1968
961 -1968 72 -362 -921 -1626 637 -1270 -959 106 -2294 -1544 -1368 -26 -2334 -767 -583 -2120 -895
978 -895 -1297 -1821 -2330 585 -1511 -1218 -527 -1640 -1282 -1213 9 -2146 162 18 -845 -484 -479 -477 -1171 1787
998 1787 -84 59 783 631 145 561 1391 -353 2268 1564 1271 530 1296 1507 246 2781 997 1096
1016 1096 1663 1966 157 675 1732 222 2014 1038 915 -305 1190 608 -717 1137 -144 659 200
1033 200 636 -1434 -369 655 -1219 166 -51 -251 -1403 512 -1147 -1669 -93 -739 -456 -1352 165
$$ packed form
908d90k073J053M30l03j451K881k565K27K726q69m08l42J554k403K011N77j046
925d91M01J687m38k748L542j830O4J777L1j017o9J968k913J406N34j94o39J651
943B722n55k580K741j499KL10R72j819M9J780k993R37Q9N89j388J436k63k498
961a968K040m34n59p05K263j907L11J065k400P50J76J342k308J567J84j537J225
978h95m02n24n09K915k096K93O91j113L58O9J222k155K308j44q63L61NKo94K958
998A787j871J43P24j52m86M16Q30j744K621p04k93p41P66K11j261K535j784R9
1016A096N67L03j809N18J057j510J792r76j23j220J495n82j325J854j281Q03m59
1033B00M36k070J065J024j874J385k17k00j152J915j659n22J576o46K83q96J517
$$ plain form
1050 165 -2238 -1181 -244 -1744 -1017 -833 -518 -1845 -208 -1708 -1684 -655 -306 -753 -1427 778 -1699
1067 -1699 -554 23 -719 -451 573 1032 -1019 1075 80 -17 435 1315 680 440 2342 91 1027 1141
1085 1141 1327 530 2031 2293 -42 2204 1078 1006 920 2046 1152 704 2085 565 453 253 1387 -544
1103 -544 999 1097 -964 530 -306 -253 -1095 406 -516 -823 179 -852 -1171 -1245 230 -1973 -491 -197
1121 -197 -1558 -957 -980 -955 -2224 -68 -1339 -1140 -487 -1217 -1230 -1409 125 -1719 -425 -62 -480 -625 -45
1140 -45 -188 -1410 946 -285 144 76 464 204 -563 950 -489 478 696 872 -72 763 639 -340 1531
1159 1531 456 1158 882 1687 703 588 1795 423 1411 1263 1706 368 1284 904 22 1163 373 806
1177 806 274 1122 -384 -14 315 -535 268 -191 720 -902 248 -122 -1104 -142 -441 -377 -908 185 -1465
$$ packed form
1050A65k403J057R37j500P27J84L15j327J637j500K4J029L49m47o74K205k477
1067a699J145N77p42K68J024M59k051K094r95r7M52Q80o35k40J902k251R36J14
1085A141J86p97J501K62k335K246j126p2q6J126q94m48J381j520j12k00J134j931
1103e44J543R8k061J494q36N3q42J501r22l07J002j031l19p4J475k203J482K94
1121a97j361O01k3K5j269K156j271J99O53p30j3j79J534j844J294L63m18j45N80
1140d5j43j222K356j231M29o8L88k60p67J513j439R67K18J76r44Q35j24r79J871
1159A531j075P02k76Q05r84j15J207j372R88j48M43j338R16l80q82J141p90M33
1177H06n32Q48j506L70L29q50Q03m59R11j622J150l70r82R62k99O4n31J093j650
$$ plain form
1196 -1465 -875 -968 -1377 -961 -1290 -363 -1867 -655 -1371 -1547 -986 -1041 -903 -1132 215 -1458 -595 -573 -527 -526
1216 -526 -185 403 -834 729 -161 -140 -270 630 492 -202 1381 -138 586 576 747 79 843 1380 352
1235 352 1377 431 878 303 1385 673 322 1751 389 771 498 882 -205 873 1116 -24 698 197
1253 197 450 -619 727 -153 -298 732 -100 -215 -750 282 -1164 -44 19 -927 -371 -439 -460 -1646 -151
1272 -151 -987 -768 -395 -635 -1150 -1325 70 -1676 -558 -512 -686 -545 -563 -428 -1452 85 -502 -212 -320
1291 -320 274 -60 -369 675 -680 540 570 718 126 778 885 -62 1177 475 964 633 1536 812 526
1310 526 1436 432 1120 893 1510 498 1398 1054 266 1254 533 1035 504 1370 393 311 806 125 286 62
1330 62 762 -417 610 -80 -684 -45 -497 -141 -865 112 -930 -527 -570 -1066 -920 -888 -279 -1476 -464
$$ packed form
1196a465N90r3m09M16l29R27j504J212p16j76N61n5J38k29J347j673Q63K2M6J
1216e26L41N88j237J563q90K1j30R00j38o94J583j519P24j0J71o68P64N37j028
1235C52J025r46M47n75J082p12l51J429j362L82k73L84j087J078K43j140P22n01
1253A97K53j069J346q80j45J030q32j15n35J032j446J120O3r46N56o8k1j186J495
1272a51q36K19L73k40n15j75J395j746J118M6j74J41j8J35j024J537n87K90j08
1291c20N94l34l09J044j355J220L0J48n92O52J07r47J239p02M89l31R03p24k86
1310E26R10j004O88k27O17j012R00l44p88R88p21N02n31Q66r77q2M95o81J61k24
1330F2P00j179J027o90o04O39m52L56p24R77j042M03m3m96J46L2O09j197J012
$$ plain form
1349 -464 -1092 -1214 -996 -1078 -1036 -1361 -111 -1379 -827 -946 -957 -908 -763 -208 -1272 118 -441 -639 -680 56
1369 56 -194 -401 666 -472 334 135 313 -140 327 897 -35 945 353 432 134 1076 419 179 1319 305
1389 305 800 457 904 -50 896 1125 83 762 452 585 -166 1005 1 -132 970 251 107 -230 461
1408 461 -633 334 163 -620 -157 23 78 -1267 -83 -710 -627 -124 -507 -963 -896 134 -1379 -594 -673 -676
1428 -676 -643 -369 -473 -1720 -42 -599 -631 -592 -77 -524 -601 319 -1066 -136 8 198 -274 313 258 -548 759
1449 759 156 315 185 1136 354 229 1134 58 699 832 1164 254 1122 1049 293 917 680 981 410 1544
1469 1544 517 423 1049 252 485 373 880 -153 772 343 -320 46 -10 107 -630 510 -525 -364 -146
1488 -146 -501 -680 -559 200 -1061 10 -428 -696 -625 -447 -492 -1004 195 -673 -612 -606 -470 -960 -541 105 -1137
$$ packed form
1349d64o28j22K18q2M2l25J250j268N52j19j1M9J45N55j064J390n59j98m1P36
1369E6k50k07J067j138Q06j99J78m53M67N70r32R80n92P9k98R42o57k40J140j014
1389C05M95l43M47r54R46K29j042O79l10J33p51J171j004j33J102p19j44l37O91
1408D61j094R67j71p83M63J80N5j345J184o27Q3N03l83m56O7J030j513P85p9l
1428f76L3K74j04j247J678n57l2L9N15m47p7R20j385R30J44J90m72N87n5q06J307
1449G59o03J59j30R51p82j25R05j076O41J33L32r10Q68p3p56O24k37L01n71J134
1469A544j027r4O26p97K33j12N07j033R25m29o63L66n6J17p37J140j035J61K18
1488a46l55j79J21P59j261J071m38k68P1J78m5n12J199q68O1OJ36m90M19O46j242
$$ plain form
1509 -1137 100 -145 -440 -616 -51 -104 -390 710 -5 215 66 620 -192 137 816 -95 818 469 308
1528 308 -207 768 264 5 973 325 527 310 923 -124 474 1132 462 787 839 963 92 1221 540 251
1548 251 1065 784 671 120 874 -289 209 577 -47 -61 323 340 -947 257 -515 -616 -134 -89 -596 -928
1568 -928 24 -1265 -846 -757 -772 -1070 -471 -537 -1705 -507 -1021 -991 -1006 -333 -714 -850 147 -904 -576 -349
1588 -349 215 -467 240 628 -600 346 138 -34 -219 900 150 -15 813 -79 -59 105 841 -322 499
1607 499 919 -146 381 459 263 -182 1167 319 258 830 327 133 55 927 -260 501 693 7 -3 188
1627 188 170 -667 625 -70 -317 3 -13 -507 -646 233 -938 -191 -122 -367 -862 -484 -374 -1425 -133 -639
1647 -639 -759 -680 -287 -1074 -1077 -137 -1131 -481 -402 -309 -969 -207 -276 -1116 14 -287 -253 -376 397 -348 -312 441
$$ packed form
1509a137J237k45k95j76N65n3k86J100p15K20j49N54q12L29O79r11R13l49j61
1528C08n15R75n04k59R68o48K02k17O13j047N98O58o70L25N2J24q71J129o81k89
1548B51Q14k81j13n51P54j163M98L68o24j4L84J7j287J204p72j01M82M5n07l32
1568i28R52j289M19Q9j5k98N99o6j168J198n14L0j5O73l81j36R97j051L28K27
1588c49N64o82P07L88j228R46k08j72j85J119p50j65Q28q92K0J64P36j163Q21
1607D99M20j065N27P8j96m45J349q48o1N72n03j94p8Q72j187P61J92o86j0J91
1627A88j8q37J292o95k47L20j6m94j39Q79j171P47O9k45m95L78J10j051J292n06
1647f39j20P9L93p87lR40r94O50P9R3o60P62o9q40J130l01L4j23P73p45L6P53
$$ plain form
1669 441 -86 235 343 766 -74 678 634 85 747 725 851 431 1333 376 402 1008 577 659 728 1183 182
1690 182 930 729 221 561 823 663 62 1162 152 203 482 301 83 262 681 -438 342 -33 -301
1709 -301 -331 79 -195 -696 222 -698 -615 -589 -330 -902 -569 -41 -1175 -511 -646 -653 -1074 -338 -599 -1053 -75
1730 -75 -678 -737 -701 -108 -914 -374 131 -793 -192 -81 -54 -715 359 108 -344 547 172 32 -35 893 -256
1751 -256 321 823 250 370 537 766 -206 918 578 286 719 712 443 182 1068 35 438 828 514 188
1771 188 554 726 -352 724 382 77 144 546 47 -405 633 -388 -170 76 78 -587 -161 91 -991
1790 -991 -96 -412 -484 -786 -84 -610 -1034 -100 -771 -730 -703 -143 -1020 -503 -288 -1068 -432 -408 -340 -857 32 -484
1812 -484 -665 47 -315 -312 -341 477 -445 -27 413 -213 97 274 388 -299 714 270 118 501 410 301 218
$$ packed form
1669D41n27L21J08M23q40P52m4n49O62k2J26m20R02r57K6O06m31Q2O9M55j001
1690A82P48k01n08L40K62j60o01J100j010N1K79j81k18J79M19j119P80l75k68
1709c01l0M10k74n01R18r20Q3K6K59n72L33N28j134O64j35pm21P36k61m54R78
1730g5o03n9L6N93q06N40N05r24O01J11K7o61J074k51m52Q91l75j40o7R28j149
1751b56N77N02n73J20J67K29r72J124l40k92M33pk69k61Q86j033M03L90l14l26
1771A88L66J72j078J076l42l05O7M02m99m52J038j021K18K46Ko65M26K52j082
1790i91Q95l16p2l02P02n26m24R34o71M1K7N60q77N17K15p80O36K4O8n17Q89n16
1812d84j81P12l62Lk9Q18r22M18M40o26L10J77J14o87J013m44j52L83r1j09q3
$$ plain form
1833 218 1047 24 490 689 403 295 564 703 -73 890 318 304 276 526 247 147 826 -107 303 285 290
1854 290 -170 203 372 -385 351 -159 -175 -344 119 -347 -504 176 -520 -291 -380 -148 -850 -146 -82 -777 -99
1875 -99 -416 -359 -717 -12 -527 -462 49 -479 -335 -396 3 -761 19 -5 -422 45 11 43 -374 470 -148 0
1897 0 460 241 149 99 679 -170 516 508 263 325 537 441 -82 857 172 388 493 486 284 203 741 -150 457 461
1921 461 374 147 521 297 -303 514 -68 45 -31 278 -303 -224 220 -671 -184 -257 -72 -651 -98 -294 -812
1942 -812 -140 -485 -402 -522 10 -617 -541 -127 -700 -401 -435 -8 -757 -13 -189 -577 -155 -240 -172 -434 435 -292
1964 -292 -75 128 -63 -87 75 570 -209 563 327 108 259 373 312 64 937 211 403 392 422 206 280 757
1986 757 41 618 421 376 72 501 372 -32 696 110 328 126 334 -142 -5 327 -274 159 -111 -23 -530
$$ packed form
1833B18Q29j023M66J99k86j08K69J39p76R63n72j4k8K50k79j00O79r33M10j8N
1854B90m60L73J69p57P36n10j6j69M63m66j57O80o96K29q9K32p02P04O4o95O78
1875i9l17N7l58P05n15O5N11n28J44o1L99p64P80k4m17M67l4L2m17Q44o18J48
1897@M60k19r2n0N80q49O86qk45O2K12r6n23R39o85K16J05pk02q1N38q91O07M
1921D61q7k27L74k24o00Q17n82J13p6L09n81P9M44q91M87p3J85n79N53j96n18
1942h12O72l45Q3j20N32o27P6M14n73K99l4M27p49P44j76l88M22q5O8k62Q69p27
1964b92K17K03j91k4J62M95p79P72k36k19J51J14o1k48Q73p26J92j1L0k16P4M77
1986G57p16N77j97m5l04M29j29m04P28n86K18k02K08m76J37L32o01M33k70Q8n07
$$ plain form
2007 -530 -44 -282 -598 -36 -446 -242 -567 -249 -758 -554 -329 -716 -422 -633 -285 -868 -323 -620 -729 -337
2027 -337 -497 -377 -642 -84 -786 -395 -257 -390 -174 -138 163 -478 111 -184 -132 53 205 212 -69 512 -83
2048 -83 297 200 341 362 362 613 76 624 275 491 393 622 550 353 792 156 514 290 514 299 483 530 85
2071 85 537 97 268 30 407 95 50 344 -204 53 -188 95 -343 9 -20 -357 -59 -464 -242 -658 -39
2092 -39 -441 -432 -207 -583 -394 -616 -167 -724 -183 -342 -503 -253 -435 -256 -669 -1 -402 -165 -124 -177 -204 -303
2114 -303 211 -420 197 63 102 67 114 185 -150 519 98 333 289 471 290 287 647 109 576 419 561 252
2136 252 541 509 238 678 308 526 310 585 260 231 496 125 439 214 469 14 275 125 -104 180 -138
2157 -138 101 -207 186 -293 -143 -92 -372 -212 -402 -93 -622 -176 -372 -508 -349 -415 -234 -578 -62 -558 -336
$$ packed form
2007e30M86k38l16N62m10K04l25L18n09K04K25l87K94k11L48n83N45k97j09L92
2027c37j60J20k65N58p02L91J38j33K16L6L01o41N89k95N2J85J52Pk81N81n95
2048h3L80r7J41K1%K51n37N48l49K16r8K29p2j97M39o36L58k24K24k15J84M7m45
2071H5M52m40J71k38L77l12m5K94n48K57k41K83m38L52k9l37K98m05K22m16O19
2092c9m02RK25l76J89k22M49n57N41j59j61K50j82J79m13O68m01K37M1n3k7r9
2114c03N14o31O17j34L9l5M7P1l35O69m21K35m4J82j81lL60n38M67j57J42l09
2136B52K89l2k71M40l70K18k16K75l25k9K65l71L14k25K55m55K61j50k29K84l18
2157a38K39l08L93m79J50N1k80J60j90L09n29M46j96j36J59o6J81l44N16m96K22
$$ plain form
2178 -336 -322 -356 -392 -424 -91 -520 -37 -324 -231 -214 -165 -41 -315 180 -212 188 -79 70 47 46 344 -62 370
2201 370 39 304 112 307 293 161 587 188 458 173 441 236 375 478 106 441 151 370 77 374
2221 374 133 114 346 -19 210 -126 240 -156 113 -38 -176 41 -227 24 -382 -9 -309 -219 -146 -377 -178
2242 -178 -387 -97 -468 -168 -370 -348 -267 -421 -210 -546 -14 -432 -236 -264 -269 -149 -266 9 -352 90 -156 -5
2264 -5 -69 15 132 -140 334 -64 191 101 269 157 180 390 27 433 152 383 161 383 382 93 557 179 395
2287 395 210 456 193 230 406 75 366 151 362 -24 307 127 -23 187 -95 172 -198 139 -256 -66
2307 -66 -27 -205 -19 -232 -25 -439 -77 -297 -266 -211 -347 -177 -443 -80 -442 -235 -340 -373 -273 -345 -72 -465
2329 -465 -105 -406 -232 -233 -261 -101 -294 -10 -232 45 -130 24 -52 17 200 -111 293 56 231 95 275 192
$$ packed form
2178c36J4l4l6l2L33m29M83k87R3J7M9J24k74M95l92M00k67J49k3jK98m06M32
2201C70l31K65j92J95j4j32M26l99K70k85K68k05J39J03l72L35k90K19k93K97
2221C74k41j9K32l65K29l36L66l96K69j51j38K17k68K51m06L73l00R0P3k31J99
2242a78k09K90l71L00k02K2Q1j54K11l36N32m18J96k8nJ20j17K75l61M42k46J51
2264eo4Q4J17k72M74l98K55r0J68j12K3K10l63M06k81K31k22K22jk89M64l78K16
2287C95j85K46k63L7J76l31K91k15K11l86L31j80j50K10k82K67l70L37l95J90
2307f6L9j78J86k13K07m14L62k20L1N5j36J70k66L63l62K07j05l3J00p2K73l93
2329d65L60l01J74jk8J60j93K84k22K77j75J54p6O9J83l11M04k37J75j36J80q3
$$ plain form
2351 192 60 382 94 330 74 331 156 305 378 123 425 87 356 85 269 158 177 261 4 225 -80
2372 -80 229 -55 105 49 -102 78 -189 -34 -345 -4 -279 -133 -164 -313 -183 -403 -126 -441 -118 -339 -266
2393 -266 -220 -311 -191 -453 -75 -399 -178 -231 -242 -201 -266 -88 -411 22 -195 -129 -76 -45 -3 -214 166 -132 127
2416 127 58 179 27 77 232 -17 373 141 319 125 306 318 113 384 189 375 280 456 204 266 398 119
2438 119 389 147 378 146 378 203 100 259 9 195 -50 287 -58 66 89 -158 -21 -163 65 -312
2458 -312 47 -198 -223 -164 -234 -220 -415 -55 -424 -277 -358 -288 -366 -379 -80 -488 -105 -337 -313 -309 -195 -222 -323 6
2482 6 -348 -57 -191 -47 -182 -47 97 -169 127 -63 119 7 184 109 42 284 115 239 164 338 108 290
2504 290 399 168 438 261 416 193 412 256 255 426 200 373 107 359 33 247 181 82 136 79 218 -116
$$ packed form
2351A92j32L22k88K36k56K57j75J49P3k55L02l38K69k71J84j11J9Q4k57K21l05
2372h0L09k84J60n6j51J80k67J55l11L41k75J46l1j49J30k20K77l15L23k21P3
2393b66M6r1J20k62L78l24K21n3j1M1o5J78l23M33k17O6N3L1M2k11L80k98K59
2416A27o9J21j52N0J55k49L90k32J78j94J81J2k05K71j95J86r5J76k52O2J32k79
2438A19K70k42K31k32K32j75j03J59k50J86k45L37l45J24K3k47J37j42K28l77
2458c12L59k45k5N9p0J4j95L60l69J47q1P0p8j3K99m08L83k32K4MJ14k7j01L29
2482Fl54K91j34J44j35J35J44k66K96j90J82j12J77p5o7K42j69J24p5J74k30J82
2504B90J09k31K70j77J55k23K19j56jJ71k26J73k66K52l26K14o6r9N4n7J39l34
$$ plain form
2526 -116 175 -36 -13 56 -45 2 -186 107 -271 -14 -169 -135 -141 -210 -82 -350 -102 -342 -224 -227 -186 -221 -342 -110
2550 -110 -424 -140 -268 -180 -255 -186 -145 -368 -8 -272 -73 -147 21 -83 -62 100 -150 131 -50 189 -13 172
2572 172 158 -8 299 42 233 146 351 117 222 351 128 336 182 370 87 318 231 142 286 129 233
2593 233 24 294 -14 67 156 32 105 -50 129 -168 118 -24 -59 -93 -182 -65 -277 60 -320 -115 -134 -172 -245
2616 -245 -261 -18 -340 -63 -251 -154 -236 -141 -134 -355 -18 -349 -88 -203 -121 -228 -127 -68 -326 22 -138 18 -195
2639 -195 32 -38 -103 161 18 127 -27 234 54 162 249 80 249 128 316 38 312 213 152 349 153 257
2661 257 121 353 73 220 194 152 202 106 210 -64 257 3 43 32 24 48 -100 96 -198 -7 -106 -124 -144 -148 -27
2686 -27 -316 -99 -242 -174 -292 -198 -160 -293 -73 -338 -79 -232 -83 -255 -163 -95 -239 -53 -266 -53 -221 -16
$$ packed form
2526a16K91k11K3O9j01M7j88K93l78K57j55L4oo9J28k68K48k40J18lM1l5j21K32
2550a10l14K84j28Q8p5O9M1k23L60k64J99p4J68j04K1J62k50K81j81K39k02J85
2572A72j4j66L07k57J91q7K05k34J05J29k23K08j54J88k83K31q7q9J44j57J04
2593B33k09K70l08Q1Q9j24P3j55J79k97K86j42l5l4q9J17k12L37l80K05j9l8p3
2616b45j6K43l22K77j88R7q2R5Pk21L37l31K61j15Q2j07J01N9k58L48j60J56k13
2639a95K27p0o5K64j43J09j54K61j80J08Q7j69J69j21J88k78K74r9o1J97j96J04
2661B57j36K32k80J47k6m2N0r6J04k74L21k54M0j1qK4j48J96k94J91r9j8k0mJ21
2686b7k89K17j43O8j18R4L8j33K20k65K59j53J49j72R2O8j44J86k13K13j68K05
$$ plain form
2708 -16 -174 -133 8 -170 54 -131 150 -113 60 90 -32 173 68 229 -19 329 112 164 236 133 249 70
2730 70 284 47 301 165 131 223 139 220 73 332 88 186 133 68 127 52 264 -121 183 -15 45 -32 -3 3 -157
2755 -157 59 -163 -99 -124 -91 -150 -253 -133 -368 -81 -256 -143 -264 -185 -152 -341 -118 -270 -130 -283 -76 -176
2777 -176 -201 -59 -242 -28 -192 -5 -169 -22 -36 -83 40 -106 105 -36 207 -49 64 156 35 139 61 224
2799 224 33 281 102 152 208 141 199 108 261 65 193 145 176 178 116 264 -33 249 120 79 92 76 132 -65 147
2824 147 -84 15 -112 -5 -88 -144 12 -219 -46 -256 -150 -252 -114 -134 -346 -98 -282 -123 -273 -168 -241 -248
2846 -248 -137 -285 -87 -264 -181 -228 -152 -148 -146 -81 -146 -50 -204 52 -174 16 21 -12 103 24 111 -77 102 82 100 156
2872 156 115 211 82 290 67 234 155 192 213 155 282 33 304 97 230 117 182 182 118 247 22 196 69
$$ packed form
2708a6j58M1J41j78K24j85K81k63J73L0j22K05j05J61k48L48k17N2P2j03J16j79
2730G0K14k37K54j36l4R2q4Q1j47K59k44R8n3o5N9p5K12l85L04j98O0p7K9Oj60
2755a57K16k22O4k5L3n9j03J20k35K87j75J13j21P9L3j89K23j52J40j53K07j00
2777a76k5J42j83K14j64J87j64J47j4m7J23j46K11j41K43k56J13R2j21J04p8J63
2799B24j91K48j79N0N6o7N8r1J53j96J28m8L1Ko2J48k97K82j29m1J3j6N6j97K12
2824A47k31R9j27J07q3n6J56k31J73k10J06j02J38k0k12K48j84J59j50J05p3p
2846b48J11j48J98j77Q3m7P6MKO5o5R6j54K56k26J90Nl3J15p9Q7j88J79k0J8N6
2872A56m1R6j29K08k23J67p9L7K1n8J27k49K71k07J33j13O5%o4J29k25J74j27
$$ plain form
2895 69 154 82 67 62 -78 103 -130 62 -43 -26 -52 -167 -4 -256 -18 -191 -79 -195 -116 -99 -295 -122 -247
2918 -247 -106 -219 -92 -170 -172 -104 -260 -67 -199 -26 -163 -23 -150 -198 4 -93 7 -98 163 -66 1 82 -5
2941 -5 129 -41 133 14 172 81 80 183 110 235 32 344 97 199 161 109 162 134 242 26 270 70 100 31
2965 31 99 196 -55 201 -4 89 8 88 23 -14 100 -144 85 -75 -20 -116 -18 -64 -176 -19 -187 -45 -225 -73
2989 -73 -167 -173 -72 -262 -116 -233 -90 -283 -110 -138 -166 -69 -165 -33 -252 51 -160 -68 -27 -49 25 -97 135 -118
3013 -118 119 -30 24 76 51 122 -46 214 5 165 108 113 121 107 259 57 278 85 175 185 199 217 55 211 46
3038 46 180 52 204 94 61 122 -49 102 -47 69 -25 25 27 -57 19 -172 30 -93 -13 -146 -104 -53 -138 8
3062 8 -197 -43 -172 -127 -153 -181 -93 -209 -63 -224 -92 -186 -148 -173 -177 -26 -215 -6 -204 25 -169 -10 -35 -46
$$ packed form
2895F9Q5p2j5nj40J81k33J92j05J7k6j15J63k52K38j73J12j16P9J7j96J73j25
2918b47J41j13J27p8kO8j56J93j32J73j37J40j27m8K02r7J00j05K61k29O7Q1q7
2941eJ34j70J74j19J58r1jJ03p3J25k03L12k47J02l8n2N3k8J08k16K44k00L0o9
2965C1O8R7k51K56k05R3q1Q0o5l7J14k44K29j60N5r6R8m6j12J57j68J42j80J52
2989g3r4oJ01j90J46j17J43j93J73k8k8R7r6J32k19L03k11R2M1k2P4j22K32k53
3013a18K37j49N4N2k5P1j68K60k09J60n7NQj4J52k02K21j93R0J0J4J8j62J56j65
3038D6J34j28J52j10l3O1j71J51j49J16r4N0Kq4P6j91K02j23Q0j33M2N1q5J46
3062Hk05J54j29M5k6k8Q8j16J46j61J32r4L8k5mJ51j89K09j98K29j94J59k5j1
$$ plain form
3086 -46 6 -69 61 -60 135 47 67 119 7 126 58 245 41 115 87 144 117 91 227 20 262 51 173 106
3110 106 162 117 59 183 -3 121 80 116 36 23 112 -105 101 -17 57 -76 15 -62 -116 9 -155 -35 -145 -11
3134 -11 -136 -114 -38 -226 -48 -136 -49 -196 -51 -166 -159 -54 -171 -69 -151 -12 -163 -84 -57 -79 -56 -121 10 -164
3158 -164 46 -62 -26 0 -11 83 -18 142 -64 101 85 113 99 21 161 5 165 109 93 97 114 174 76 181 16
3183 16 210 97 140 28 53 161 37 180 -26 93 -19 107 26 -53 69 -69 76 -133 50 -75 -21 -26 -134
3206 -134 22 -95 -14 -144 -42 -189 -87 -145 -212 -83 -138 -56 -215 -91 -154 -87 -102 -181 -77 -184 4 -95 -8 -50
3230 -50 -102 -2 -108 38 -95 64 -9 33 -5 14 122 -63 159 22 73 80 101 57 13 183 47 211 74 102
3254 102 46 125 152 53 190 40 158 36 144 61 70 117 -33 154 -40 109 -36 67 9 -37 26 -97 -20 -96
$$ packed form
3086d6N2p5J30j21J95q8K0N2j12J19o8J87k04P4k8N7k7k6J36k07K42k11J22o7
3110A06N6m5n8J24j86J24m1L6q0j3Q9k17K06j18P4j33R1p7n4J25j64J20j10J34
3134a1j25K2P6j88J78q8Q7j47J45j15PJ05j17J02q2J39j51P9K7k2K3o5J31j74
3158a64K10j08L6K6j1R4j01J60k06J65j6K8j4p8J40j56J60n6j6MJ7O0r8J05j65
3183A6J94j13M3j12K5J08j24J43k06J19j12J26q1p9J22j38J45k09J83j25N4nj08
3206a34J56j17Q1j30J02j47J02n8o7J29n5Q2j59J24o3O7j5p9J04j07J88r9Q7m2
3230e0n2J00j06J46j33J59p3M2l8J9J08j85K22j37N1PK1m4m4J70j36J64j37K8
3254A02n6P9K7r9J37j50J18j22J08q3RM7j50J87j94J49j45J03n8m6O3j23P7p6
$$ plain form
3278 -96 -10 -149 -63 -59 -134 -59 -168 -69 -248 -107 -138 -130 -79 -201 -43 -184 11 -168 -78 -70 -153 -60 -146 5 -139 23
3304 23 -88 -67 -102 -59 73 -97 41 -77 69 -2 45 49 4 125 11 117 64 124 26 106 119 95 187 70 177
3329 177 60 147 131 74 202 68 158 32 129 -33 199 26 58 119 -4 108 -14 93 -9 -10 30 -20 19 -47
3353 -47 1 -123 17 -73 -78 -30 -108 -30 -151 -23 -178 -89 -56 -81 -86 -165 -47 -185 -29 -181 -82 -70 -66 -17 -120 32
3379 32 -107 39 -30 22 -34 -18 100 -80 67 -24 106 31 73 52 33 108 -13 163 82 147 30 92 108 74 132 32
3405 32 154 53 155 98 80 152 7 94 34 85 1 64 77 11 47 -24 81 -73 1 -45 -29 72 -69 30 -74 6
3431 6 -154 0 -64 -142 -68 -127 -59 -142 -62 -122 -166 -93 -46 -97 -144 -39 -149 -8 -118 -45 -96 -23 38 -110 60 -39 -18
3458 -18 -64 16 34 12 120 -64 73 12 95 27 92 114 19 153 26 113 56 179 75 61 207 48 81 83 113 47
$$ packed form
3278i6Q6j39Q6Mp5P5j09R9j79J41l1QN1j22J58j41J95j79R0Qq3R3q6J51j44J62
3304B3j11K1l5M3J32j70J38j18J46p1M7Mm5J21j14J06n3O0r8Q0J3k4R2j17J07
3329A77j17Q7j6n7J28j34R0j26R7j62K32j73L2O1j23J12j22J07j02jM0n0L9o6
3353d7M8j24J40r0nM8p8P8j21J28j55Q9L3k5np9J18j38J56j52R9J2MM9j03J52
3379C2j39J46o9N2n6J6J18j80J47r1J30p5M2k1j9P5j21J76q1O5j17O2J6l4N8j00
3405C2J22j01J02n7j8P2j45Q7o0N1q4O3J3o6L6p1J05j54P4m6J6J01j41R9j04Q0
3431Fj60J54o4p8P4n9O8q3Q0o0m4P3M7n1m7J05j10J41j10P3n1P3O1j48J70r9K1
3458a8m6Q0J8k2J08j84J37o1Q3o8O5K2r5J34j27Q7n7J23j04j4J46j59L3KL0o6
$$ plain form
3484 47 150 102 58 143 53 133 -4 109 12 13 54 -17 13 -26 26 -115 -1 -7 -85 -12 -56 -39 -177 -45 -79 -68 -150 -94
3512 -94 -88 -156 -48 -184 -89 -114 -87 -130 -106 -69 -218 -35 -128 -8 -138 -72 -46 -73 18 -60 28 -58 29 12 48 -15 -11 50
3540 50 12 64 -15 137 88 76 81 40 107 13 111 55 117 92 40 93 25 128 33 147 42 97 86 54 111 -21 140 2
3568 2 13 -18 13 39 -4 -4 -43 10 -118 -42 -79 -11 -43 -97 -39 -126 30 -94 -60 -91 -98 -67 -117 -16 -151 -27 -98 -109 -90
3597 -90 -65 -42 -90 1 -102 4 -72 -19 -117 -75 56 -51 82 -15 77 -8 77 74 8 65 51 65 16 103 28 37 91 -22
3625 -22 82 -13 112 24 73 55 21 82 -7 65 -24 60 2 -28 55 30 21 -12 53 -67 32 3 -42 49 -59 50 -93 -2
3653 -2 -55 -84 -50 -72 -16 -143 -12 -103 -61 -143 -67 -90 -71 -33 -114 1 -147 -43 -110 -34 -81 -36 15 -83 0 -66 23 -37
3681 -37 7 16 -39 -6 -17 89 -5 14 85 60 100 39 102 -12 131 50 98 93 13 81 70 150 28 113 1 49 84 33 55
$$ packed form
3484D7J03m8m4Q5r0Q0j37J13r7JM1p1L0l9N2j41J14op8P3m4J7j38J32l4J1q2N6
3512i4Oo8J08j36R5k5K7m3K4L7j49J83r3J20j30O6K6k7R1p8Q8q6Q7j7L6o3MO1
3540E0l8N2p9J52m9j2Nm1O7r4R8n6O2k5n2N3o8J03r5J14j05N5j1l2N7j32J61j38
3568BJ1l1L1K6m3%l9N3j28P6l7O8l2n4N8q7J56j24L4l1pL1n0J01j35J24p1j1J9
3597i0K5K3m8R1j03J06p6N3r8M2J31j07J33r7R2q5Q5lo6N7j4J4m9Q7p5RN4j13
3625b2J04r5J25q8M9j8l4O1q9P2q9Q4n8l0Q3k5rl3O5j20R9k9m5R1j08J09j43R1
3653bn3k9L4k2N6j27J31r1M2q2P6k3J9L8q1J15j48J04o7P6m7M5N1r8Q3o6Q9o0
3681c7M4Rn5L3j1J06r4J9P1k5M0o1O3j14J43q1M8nq0O8j1Q0j22Q5j12M8L5n1K2
$$ plain form
3710 55 94 76 43 38 17 65 54 53 95 5 84 -38 56 7 -29 6 -22 52 -46 32 -67 -25 -40 -42 -30 -88 -45 -146 10 -94
3740 -94 -24 -108 -99 -56 -104 -3 -138 -12 -105 -72 -41 -110 -5 -97 -2 -92 7 -25 11 -20 22 104 3 46 48 54 -9 60 11
3769 11 18 126 14 137 17 22 88 86 78 41 110 16 71 38 34 77 42 55 41 39 -8 38 37 -41 37 -14 -37 -45 83 -7 -27 -20
3801 -20 -17 -11 -56 22 -59 24 -78 -74 -92 -55 -67 -105 -31 -89 -77 -114 -36 -117 -65 -2 -86 23 -74 15 -81 -21 -28 -63 46 -98
3831 -98 13 -51 47 38 -28 32 -23 81 -22 122 -14 83 29 14 90 72 95 2 127 4 95 59 73 142 44 71 -39
3858 -39 102 -6 64 12 56 7 -12 10 -13 34 -15 -8 -37 -22 26 -38 -21 -38 -42 -39 -37 -63 -96 23 -44 -41 -48 -32 -91 -96 -19 -114
3890 -114 -6 -87 -47 -42 -61 -61 -87 -64 -63 -20 -128 61 -50 2 1 -1 32 -47 30 -63 60 -32 -13 71 -7 87 -21 108 3
3919 3 57 78 78 90 21 143 21 123 56 46 58 37 134 5 87 30 143 -2 57 51 -1 91 -24 71 -28 -12 -15 -58 -52
$$ packed form
3710E5L9j8l3nk1M8j1jM2r0P9j22R4m9l6L5k8P4r8P8r9M2j5kJ2n8M3j01J56j04
3740i4P0q4RM3m8J01j35J26r3L3L1o9J05r2R5r0R9l2L6l1M2Q2j01M3KOo3O9m9
3769A1PJ08j12J23j20NO6kql7O9r4N5l3mM3l5J3j4km7M6jp8P8n1k3qJ28r0k0P
3801b0LOm5P8q1Q3j02Mj8L7j2l8P4n8J2l7P8q1N2O3q4J09r7Q9r6O0pl5J09j44
3831i8J11o4R8ro6O0n5J04j03J44j36R7n4j5P6j8K3r3J25j23R1l6J4O9r8K7j10
3858c9J41j08P0n2M4m9j9K2k3M7m9Pk9J5M8o4J7j7mLKk6l3J19o7LpJ6n9nP7r5
3890a14J08q1M0Nj9%k6K3JM3j08J89j11N2jkL3p9P7r3J23r2J9Q4p8R4j08J29j05
3919CN4K1%J2o9J22j22J02o7j0J2k1R7j29Q2n7J13j45N9on2R2j15R5r9J6lm3O
$$ plain form
3948 -52 -26 -15 -80 44 -71 -60 -75 -49 -55 -102 23 -146 21 -66 10 -50 -100 8 -88 -15 -62 -26 -101 15 -60 -90 41
3975 41 -114 12 -87 -33 -43 -5 -20 -8 34 -25 44 -36 47 59 42 46 51 36 -48 72 41 96 66 72 65 14 78 3 74 91 41
4006 41 73 74 64 10 166 28 75 -1 -7 20 40 39 -30 49 -19 16 -19 -28 13 -80 -19 -98 -59 -89 -50 -91 -153 -71 -70 -10 -66 -13
4038 -13 -116 -70 -40 -97 16 -67 0 -116 8 -61 -14 -32 -76 17 -61 -19 -28 13 -48 -76 15 -18 21 -10 47 22 50 34 61
4067 61 -8 -6 62 -37 39 22 64 29 16 57 61 50 2 58 19 60 76 43 74 22 38 2 22 7 29 12 -23 47 -68 8 -38
4098 -38 16 -13 -45 0 -58 -51 -61 5 -51 -10 -58 -68 -33 -69 -27 -44 -7 -67 -9 -21 -102 -47 -76 3 -55 15 -16 -50 -24 -88 28
4129 28 -87 11 -18 37 15 -25 -14 1 100 -54 29 -43 36 76 41 65 4 60 -19 103 21 57 82 32 57 25 68 20 92
4158 92 44 71 12 -2 97 14 50 -21 89 17 6 25 -13 -10 -38 12 -102 -3 12 -79 -37 -49 5 -52 -66 -83 -61 -5 -51 -111
$$ packed form
3948e2K6J1o5J24j15J1j5K6om7J25j69J67q7P6o0n0J08r6P3m7L6p5J16p5l0J31
3975D1j55J26r9N4j0L8j5J2M2n9O9q0Q3J2j7MNj5q4J20l1N5l0Opn1O4p5P1J7n0
4006D1L2Jj0n4J56j38M7p6oK7K0jo9P9o8L5l5rM1r3O1p9L9l0L9m1o2Q2JO0n6N3
4038a3j03M6L0n7J13q3O7j16J24o9M7j8m4R3p8M2rM1o1k8R1l3L9l1N7k5K8j6K7
4067F1o9KO8r9P6j7M2l5j3M1Mj1m8N6l9M1J6l3L1n2J6l6K0j5K2j7l5P0j15P6m6
4098c8N4k9l2M5n8Pj0O6n6M1m8j0L5l6M2j7L7o0N8j2q1N5k9P9n8P0l1l4K6o4J16
4129B8j15R8k9N5k2m0J1J5R9j54Q3p2P9M0l5K4o1N6p9J22q2L6K5n0K5l2M3m8P2
4158I2m8K7n9j4R9q3L6p1J10p2j1J9l8Lk8N0j14R9J5r1M2j2N4n7j4j7K2N6m6o0
$$ plain form
4188 -111 -103 -24 -91 -24 -89 6 -75 -57 -36 -63 -36 -61 4 -17 -10 -16 23 71 -47 18 35 -17 -37 -34 70 -13 76 -8 81 18 65
4219 65 18 63 50 -28 80 -15 53 -19 68 -8 -24 37 12 11 8 71 21 92 53 29 63 -14 37 -12 26 -19 48 38 -21 45 -76
4250 -76 34 -56 -106 -37 -56 7 -56 -5 -48 -16 -74 -52 -95 -101 -82 -17 4 -27 -61 -71 -116 -17 -56 -2 -70 8 -47 -5 15 -17
4280 -17 39 19 42 -14 53 -57 29 -13 -20 36 21 8 -30 72 36 6 72 -11 82 34 98 -14 130 12 -29 47 6 30
4308 30 -47 68 -12 42 -55 19 49 9 71 -18 39 -14 54 4 25 -25 -9 32 -5 -17 -94 -14 -41 -44 -27 -58 -1 -30 -97 -78
4338 -78 -69 -65 -72 -29 -60 -41 -63 -35 -86 -52 -28 -74 41 2 18 -29 4 -1 8 56 -36 44 10 103 -15 43 56 -25 -3 -13 102
4369 102 11 69 15 77 4 -7 58 -21 110 -29 105 42 50 4 11 16 -11 72 -12 38 26 20 6 31 71 0 65 7 40 -7
4399 -7 2 -2 -50 -41 -22 -17 -24 -58 -63 -124 -45 -64 -50 -68 -20 -17 -43 -33 -64 -17 -99 -29 -58 -89 12 -10 -50 -32 -8 -46 40 -22 -30 45
$$ packed form
4188a11QP9o7O7o5R5q1J8K1k7K7k5O5k1PoL9M8j18O5J7n2k0LJ04q3Q9q4Q9o3M7
4219F5m7M5j3p8J08r5O8p2Q7p6j6O1k5jlO3n0P1l9k4L4p7N1m9L8m5O7j0n9O6j21
4250g6J10r0n0O9j9O3o3N1m3L2n8K2m3oJ9O5K1l1l4j0m5R9l9N4o8P8n5M2K0l2
4280a7N6k0K3n6O7j10Q6m2pN6j5j3l8J02l6l0O6q3R3m8O4j12J44j18m1P6m1K4
4308C0p7J15q0N4r7P4L0m0O2q9N7n3O8n0K1n0J6M1l7j2p7Q0k7lJ7l1N7k9o7J9
4338g8RMpM3l1J9k2K8n1L4K4m6J15l9J6m7L3nRM8r2Q0l4R3j18N8J3q1K2j0J15
4369A02r1N8n4O2p3j1O5p9J31j39J34o3Qm6PNk7Q3q4N0j2oj4K5M0p1O5n8L3m7
4399gRmm8RJ9Npl4no1P9j9J4j8M8Lk6J0l1M7q2P0k9l1J01k2m0J8K4l8Q6o2qP5
$$ plain form
4433 45 13 28 -13 52 7 28 10 17 10 33 85 9 29 21 12 13 9 30 7 42 -43 84 -33 22 62 21 49 13 74 -9 55 1
4465 1 56 6 -16 24 -40 27 -62 107 -33 17 -28 -85 2 -7 -5 -73 -23 -46 3 -90 -53 -20 -78 -35 -29 -37 -35 -39 -21 -70 -35 -69 -31
4498 -31 -80 -68 -10 -56 -55 -46 1 -39 35 -33 5 50 74 43 6 10 15 57 48 85 11 53 49 8 58 0 68 21 3 27 36 27 7 57
4532 57 18 38 63 2 23 9 56 -21 20 31 -2 -19 -4 -26 -35 37 -38 -2 -38 5 -37 15 -9 -60 -13 -22 -36 -55 -28 -48 -50 -3
4564 -3 -72 -40 -34 -10 -83 -48 -37 -41 -26 -64 -46 -45 39 -36 -6 -30 -63 38 -51 -5 -13 27 8 -33 54 -2 66 -2 66 68 41 -11 19
4597 19 100 -11 52 -6 76 12 76 47 -21 35 12 47 17 4 20 12 41 -52 -9 -22 0 2 25 56 -45 7 -15 36 -10 -19 -38
4628 -38 18 -12 -41 -35 -82 -14 -11 -59 -38 -6 1 -49 2 -44 -42 -13 -34 -45 -49 -52 -8 3 -46 -27 -38 -18 2 -3 45 -59 35 46 33
4661 33 35 5 54 13 31 -24 40 27 31 34 -3 39 30 59 24 50 -31 24 19 30 13 15 -10 2 -2 -5 -14 -8 18 -12 -5 -10 -34 -16 -31 -11
$$ packed form
4433D5l2J5m1O5m5K1j8PpK3N2p6K0qrJmK1k3L5q5J27j17N5M0m1K8l6O1q3O4n4
4465AN5n0k2M0o4O7q9J69j40N0m5n7Q7rKo8N0k3M9r3L7L3n8M3OqKmJ8m9L5l4L8
4498c1m9J2N8m6JRM7m0P4o8L8M5K4l1l7MNM2rL7p4M2mm1N0n8O8m7j8K4Rrk0N0
4532E7l9K0K5o1K1j4M7p7M1J1l3j7J5k2rP2p5L6l6M3m2N2k4n1M7rj4j9K7k0kM7
4564co9L2OK4p3L5J1mJ5l8J8JQ4p5L0k4l3J01q9M6qM0j9m1Q7n6O8o8O8Kk7n2L0
4597A9Q1j11O3n8Q2o4O4k9o8N6k3L5l0j3J6qK9r3M3j3K2KK3L1j01N2k2N1m6rj9
4628c8N6l0k9Om7O8Lm8K1L2Pn0N1m6KK9k1j1mlM4J1m9J9j1K0K0nM8j04R4J1j3
4661C3Kl0M9m1J8n5O4j3MLl7M2rK9l5K6q1N5nJ1j7Kk5J2mlrOK6l0Pnk4J8j5K0
$$ plain form
4697 -11 -1 -38 -9 -6 -4 -53 -9 -13 -21 -40 -7 -56 -36 -13 -38 -13 14 -19 -15 -28 51 -7 -13 -40 -15 2 -25 15 -47 10 -29 16 -13
4730 -13 -26 8 29 52 -6 35 22 37 12 23 19 -59 20 -6 8 17 48 56 14 27 71 65 14 29 9 24 -30 -31 48 -2 20 38 42
4763 42 -19 41 -20 -20 25 -29 46 -6 -15 -20 -14 -10 -33 -5 -2 -14 -29 -35 -46 -51 11 -19 21 -33 -9 -47 16 -43 -31 -19 -12 49 -51 -38
4797 -38 4 -15 -37 -1 40 -77 66 -23 -10 -16 9 8 -30 17 9 57 6 85 -65 55 26 23 -15 -25 66 45 57 -27 51 86
4827 86 -28 57 -6 77 11 15 43 28 25 -7 25 27 53 -3 -4 4 3 -15 -56 34 -5 -18 -74 -53 -24 -53 -28 -3 -13 -55 16 -18 -2
4860 -2 -32 -31 -76 -44 -4 -44 -12 -21 -23 46 -40 -19 32 13 -18 -14 6 22 22 -4 30 23 -26 33 30 9 9 50 11 -14 -9 60 20 -6 48
4895 48 2 12 55 15 -4 27 -24 25 49 -61 95 18 67 56 -16 7 11 34 -7 30 -19 14 12 31 0 -14 -7 -32 -19 -21 21
4926 21 25 -19 7 -22 -2 -55 -33 -14 -36 -21 -73 -26 -11 -23 -14 -14 -68 -16 -30 -62 3 -40 51 -26 -19 7 -19 -56 -47 29 25 34 32 76
$$ packed form
4697a1J0l7K9LKm9M4mqj9L3m9K0K3k5K5K7l3Mj3P9n8ok7K5J7k7M0o2N7l9M5k9
4730a3j3L4K1K3n8M1j3J5k5J1mp8P9k6J4RL1Qm2J3M4on1J5k0J5n4jP9n0K2J8M
4763D2o1O0o1%M5n4P5n2rnOMk3K8Lj2j5oj1nO2l0M0n4K4l8O3n9J2J2PO1j00J3
4797c8M2j9k2L6M1j17J43q9J3oK5jl8M7qM8n1P9j50J20k9ll8j0R1k1J2q4P8L5
4827H6j14Q5o3Q3o6MK8j5ll2L2KK6n6jQjj8m1R0l9j3n6K1K9k9K5K5j0m2P1l4J6
4860bl0Jm5L2M0m0L2rkO9q6K1N1j9l1MK0J6%k6L4pm9N9lk1%M1l9k5NO9m0k6N4
4895D8m6J0M3m0j9L1n1M9K4j10J56p7M9j1p2K3MK3m1L7m9L3kJ9l1j4Pk5J3kM2
4926B1Mm4K6k9K0n3K2J9k2J5n2M7J5j2R%n4N2j4l2O5m3R1p7PK6k6l7RP6mRkM4
$$ plain form
4960 76 -16 5 -1 -26 -18 -4 -14 18 -10 23 0 28 16 67 -8 1 36 32 18 13 30 9 10 16 70 10 10 -33 -47 -11 -7 18 38 28 9
4995 9 -14 3 -7 7 -16 18 -24 -45 -67 24 -31 9 38 -66 -65 -87 -33 -19 8 10 -84 30 -41 -28 21 47 -43 -31 -16 -41 -8
5026 -8 -14 -20 -51 18 -28 -25 24 15 13 -22 15 -8 17 8 -1 47 17 27 -8 65 29 7 -26 11 43 -48 35 -13 22 -2 17 43 -4 8
5060 8 8 38 -42 8 5 -28 9 17 -14 -53 56 -25 15 57 -14 39 -47 2 -37 14 -39 -34 24 -18 18 -64 -8 -37 12 9 -57 31 -3
5093 -3 -6 -24 -24 -46 4 18 -5 80 21 -30 42 23 -28 -2 -4 -14 64 -16 51 -49 -41 72 -28 23 -75 8 -18 55 -7 65 29
5124 29 43 -7 53 0 1 59 -1 -4 -7 31 54 28 31 11 90 -18 56 -1 -28 13 -27 21 8 22 -4 -77 -35 32 41 -30 -31 -51 -42
5157 -42 -19 -11 3 -114 4 29 36 -46 -1 -61 -55 -18 -50 -7 -21 27 -57 -1 46 18 34 -14 30 -31 36 19 22 51 13 40 -10
5188 -10 24 35 -41 57 -5 -5 20 76 -56 -9 -67 15 29 -18 -21 25 63 -2 25 -50 14 7 -26 9 11 -14 -13 28 -1 14 -21 -15 41
$$ packed form
4960G6r2K1ok5QJ4j0L2k8L3k3K8j2N1p5RL5mj4nJ7k1JON4o0%m3j4L6MK5K0j0j9
4995Ik3J7j0J4k3L4m2k1k2R1n5M0K9j04Jk2N4J4K7Kr4J14p1J3M9K6r0J2J5k5L3
5026hool1O9m6LM9rkl5L7k3K5rrM8l0J0l5P3l6k2l3L7L2r1Q3m8L5k4J9K6m7J2
5060H%L0q0N0ll3L7Ql1l9J09q1M0M2p1N3q6M9l9N1n3NN8m2L6q2N6k9M9lo6Q8l4
5093clj8%k2N0J4k3Q5n9n1P2j9n1K6kj0P8q0O7j00QJ13j00N1r8Q3k6P3o2P2l6
5124B9J4n0O0n3JN8o0llL8K3k6Lk0P9j08P4n7k7M1m0M8j3J4k6p3M2O7Rp1jk0R
5157d2K3QJ4j17J18K5Pq2M5o0OL7l2M3j4M8q4N6M7k8J6m8M4o1O7j7LK9l8K7n0
5188a0L4J1p6R8o2%K5N6j32M7n8Q2J4m7lM6L8o5K7p5O4pl3L5Kk5JM1k9J5l5ON6
$$ plain form
5221 41 -20 16 -4 1 -29 8 -22 -63 -22 -22 -43 -14 31 -42 -64 -51 8 -32 -44 -11 -8 -35 3 39 -4 -5 14 -70 -16 -26 27 -4
5253 -4 51 10 -5 -12 5 13 9 8 12 44 53 -21 -16 23 55 19 9 10 23 45 31 30 -27 40 70 17 -18 -1 16 -28 -23 5 5 35 6 38
5289 38 -32 -9 34 14 -14 -19 -9 42 -36 -75 22 4 8 20 -9 -1 19 -29 -28 -3 -26 -11 17 49 -36 -46 -3 -61 30 -46 26 -43
5321 -43 -25 7 -20 -42 -57 47 20 21 29 -43 11 -42 7 6 30 -14 -9 -20 -36 18 4 26 0 28 4 28 11 28 108 -30 -11
5352 -11 -34 -20 46 -58 6 -43 27 -7 23 -40 48 -4 -22 -17 -38 49 -26 45 -21 -1 -39 -26 42 -37 -22 9 21 -40 -23 8
5382 8 -10 38 -18 -20 -20 -51 -23 22 -8 -35 6 -50 22 -21 18 -48 -72 -1 -8 28 12 -6 -34 9 -15 49 19 2 -1 29 13 21 -2
5415 -2 -1 46 10 -2 33 -2 29 53 40 69 3 48 8 35 12 -12 37 56 15 -9 45 -13 -5 29 -19 -23 -12 55 19 29 -15 32
5447 32 -11 6 -1 -52 20 -39 19 -13 14 3 -11 2 -65 -38 16 -16 -12 -28 -24 46 20 -9 20 -38 -44 -45 -20 -10 22 4 -20 43 -9
$$ packed form
5221D1o1L6k0Nl0L7l0m1M1%k1K9M5p3k2J3N9m0j2L3Lk7L8L6m3jJ9q4N4j0N3l1
5253dN5m1j5pJ7QmjML2Rp4NL9L2l6j0JJ3K2j4jn7O7L0n3l5J7J7m4NK8%L0k9L2
5289C8p0K3M3k0k8nJ0N1p8l9R7j8MJ2k9QK0m8JK5k3J5K8L2q5j0M3n8R1p6P2o9
5321d3J8L2k7k2j5J04k7JQp2N4n3M9jK4m4Nj1j6N4j4K2k6K8k4K4j7J7Q0j38J9
5352a1k3J4O6j04O4m9P0l4L0o3Q8n2j8Nk1Q7p5P1o6K0l8J3O8p9J5L1J2o1J7L1
5382Hj8M8n6k%l1K8M5l0k7M1n6P2m3L9o6k4P1pL6j6j8k8M3k4O4l0j7lL0j6Qk3
5415bJM7l6j2L5l5L1K4j3K9o6M5m0K7k3k4M9J9m1k4N4n8QL4m8mJ1O7l6J0m4M7
5447C2m3J7pn1P2n9N8l2K7j1j4J3o7K7N4l2Mj6MP0k6k9K9n8ojK5J0L2j8k4O3n2
$$ plain form
5480 -9 -39 -16 -2 -24 19 5 20 -5 -21 52 65 -24 28 49 66 -35 15 -9 -60 50 -48 -14 -27 63 20 66 -26 2 -13 23
5510 23 10 21 -27 -40 19 18 29 -42 26 13 -4 -15 -37 -63 -23 -3 26 -44 5 10 42 -4 -51 82 -3 -52 -1 -24 16 -2 -69
5541 -69 -10 -3 -19 30 -59 -20 -33 -8 -8 59 1 -29 -1 -56 -54 35 -54 -17 46 -9 5 20 -24 31 -21 -28 9 -17 4 -20 12 -14
5573 -14 11 71 40 -57 -12 -13 15 39 -32 33 22 -2 20 26 15 -44 3 31 -11 19 23 32 -44 -16 -6 -50 -38 -15 2 -16 -8 -38 -6
5606 -6 -30 5 -56 -22 -25 -17 11 -28 -2 -53 19 -44 34 30 25 18 -28 18 47 44 9 -14 26 -29 -17 -9 9 -25 3 39 28 11 49 14
5640 14 26 -34 21 17 -30 -6 -35 43 49 -9 23 29 39 60 69 46 -9 7 19 -2 22 -32 -15 19 59 32 31 23 19 30 -24 -4 13 -69
5674 -69 -34 -11 9 -48 39 -16 -13 -20 5 -29 26 36 -45 -14 63 -32 -11 -9 -45 5 35 -28 4 -23 1 -6 27 -37 9 19 -29 -4
5706 -4 -29 10 -13 7 -18 -6 -50 32 36 -6 4 58 45 -2 10 5 8 48 -39 -18 -6 15 -20 41 33 -25 19 40 -11 -3 30 30 -25 10
$$ packed form
5480il0K3J4k2M3j4J5k5j6P3J3q9N2K1J7j01N0k4n1J10r8L4j3R0m3M6r2K8j5L6
5510B3j3J1m8j3N9jJ1p1O8j3j7j1k2k6M0K0K9p0M9NL2m6m7J33q5m9N1k3M0j8o7
5541f9N9Pj6M9q9L9j3K5%O7n8l0K8n5KQ9q9L7O3n5J4J5m4N5n2pL7k6K1k4L2k6
5573a4K5O0l1r7M5jK8K4p1O5j1k4K2Oj1n9M7K8m2L0MRp6K8J0m4J2K3J7j8Ql0L2
5606fk4L5o1L4lQK8l9K6n1P2o3P8mnpm6M6K9ll5k3M0n5J2QJ8l4K8L6j1j7L8l5
5640A4J2o0N5mm7K4k9P8On8L2OJ0K1Rk3n5J6J2k1K4n4J7L4M0k7jqmJ1n4K0J7q2
5674f9L5K3K0n7Q7n5LpK5l4N5J0q1L1P7r5K1Kl6N0L0o3L2k7K4pL3o4M6J0m8K5
5706dk5L9k3K0k5J2m4Q2Mm2J0N4j3m7J2nLM0q7K1J2K1l5O1qn8M4K1n1QL3%n5L5
$$ plain form
5740 10 -2 38 2 -24 20 0 -1 -32 33 58 21 28 -24 -53 -21 -25 11 -56 8 -6 -15 -23 -27 -8 -61 -44 7 -35 30 -10 46 16 -36
5773 -36 -15 -14 11 -3 18 43 -35 -21 28 -39 54 -41 -36 47 -38 33 -15 -19 27 1 20 -26 -10 -44 36 31 23 17 -20 42 -11 -32 -10
5806 -10 47 30 26 33 2 -17 43 -17 31 -57 9 3 11 -40 25 -3 -1 18 -14 3 -19 -21 -15 -27 -9 31 -49 -58 -28 -26 -24 -11 0 -37 -26
5841 -26 -16 31 -25 -22 22 -1 -48 -34 -34 60 48 25 12 -9 50 50 35 1 -20 -8 -2 -18 19 20 54 -14 -8 -8 2 -3 21 -28 13 -9
5875 -9 -8 -17 -47 8 -15 44 -39 -6 11 25 39 -27 -2 31 -15 12 20 -54 10 31 -29 41 -29 -10 22 -7 11 -17 7 -5 18 16 -2
5908 -2 33 -22 -53 -34 -58 -43 -5 10 -52 -32 -50 -7 -48 -12 2 -20 20 -28 4 30 -31 -1 14 4 -35 75 -27 -44 17 -1
5938 -1 52 6 26 -27 40 31 -13 18 -27 22 -1 5 22 -50 -11 -22 12 -30 5 9 7 -2 -1 -19 9 35 51 17 4 -4 -8 -9 25 -50 -31
5973 -31 10 -20 -16 24 -29 -16 -41 -38 -53 -45 -30 18 27 33 58 -5 -54 -46 -49 -35 -32 -62 43 -16 4 -28 -12 3 21 -7 -17 27 -17 26
$$ packed form
5740A0j2M0l6k6M4k0jl1O5K5l7Pn2k9L2mL6o7O4j4rqmJ9n3J7N1m2O5m0N6l0n2
5773c6K1JK5j4K1K5p8J4M9o7R3r5NQ3q5P1m8mM6k6J9m6J6l4Q0nqol7O2n3k1K2
5806a0N7j7mPl1j9O0o0M8q8O6oQn1O5k8KJ9l2J7k2kOj2J8M0q0rL0KKJ3J1l7J1
5841b6J0M7n6LM4k3m7J4%R4j2k3j3k1N9%j5l4k1J2Oj6L7JL4o8O%J0nK4m9M1k2
5875iJrl0N5k3N9q3L3J7J4J4o6K5L3m6K7Qp4O4K1o0P0p0J9L2k9J8k8K4j2K3kj8
5908bL5n5l1J9k4J5L8J5o2K0j8M3m1L6J4k2M0m8L2K6o1L0J5j0l9J10j02j7O1j8
5938aN3m6K0n3O7rm4L1m5M9k3OJ7p2L9j1L4m2L5MkrJj8K8K6J6l4j3qmjL4p5J9
5973c1M1l0MM0n3J3k5Lj5QJ5M8ROK5o3m9QlJ4Ll0J05n9K0l2J6J5J8k8j0M4m4M3
$$ plain form
6007 26 -3 -27 16 44 33 -32 13 1 -14 16 62 -26 12 -21 4 21 -9 -34 -5 17 14 30 -9 -3 27 -33 41 44 -34 -27 24 37
6039 37 20 11 22 12 24 -43 -21 20 -18 16 22 -33 -15 1 -25 -13 -62 3 -58 20 -22 -6 -75 0 7 -33 -24 -50 -25 -24 -18 -24 -11 5
6073 5 -12 -6 -67 10 -29 -40 28 38 15 -5 -26 -18 5 -15 17 10 47 1 23 -11 -2 51 17 31 4 7 15 25 17 -27 44 -9 -26 33
6107 33 19 -14 -20 84 -47 12 -4 17 3 19 5 -2 -23 7 0 -30 0 33 -21 1 9 -64 -5 24 -16 -5 3 -32 -22 -44 -14 -9
6139 -9 -33 -60 -56 6 -36 -7 -22 -48 15 0 -86 16 79 23 8 -52 1 -10 2 -2 18 27 -18 25 -19 39 40 21 -11 -19 39 -12 -33
6172 -33 -53 24 69 14 24 11 26 37 8 -28 2 34 2 -7 16 -21 -16 -2 25 16 59 -45 26 -46 -14 -11 -52 -2 -21 58 5 -30
6204 -30 19 6 -13 -18 39 -40 -25 -46 -76 1 -5 -9 -5 -3 -43 21 -14 48 -47 -1 -52 -24 -31 -32 4 29 11 -36 16 -5 20 13 22 43 -25
6239 -25 -20 46 19 -40 -67 17 -11 -34 36 -4 13 50 9 38 -12 38 -1 -29 -28 33 41 17 36 -10 6 34 1 -66 56 27 18 9
$$ packed form
6007B6k9k4M3K8j1o5M5j2j5L0M6q8L8l3K5J7l0k5K9K2lJ6l9OL0o0P4Lp8PN1J3
6039C7j7rJ1j0J2o7K2M1l8L4On5J8J6k6J2m9O5o1P8m2J6o9P5Pm0Rk6K5JOoJ3J6
6073Ej7Oo1P7l9j1O8J0k3k0k1QK3k0L2pL7m6K2l4RN3l4J4k7LQJ0qm4P1n3j7N9
6107C3j4l3oJ04j31N9j6K1j4J6j4pk1L0pl0L0L3n4K2Qp3N9K9m0J1Ql5J0k2L0N
6139ik4k7MO2m2K9j5k6O3j5q6J02O3n6j5o0N3j1J2mK0Rm5M3m4N8Jj9l2qN8n1k1
6172c3k0P7M5n5J0j3J5J1k9l6L0L2l2rK3l7NJ4K7rM3j04P1p2L2Lm1N0j9P9n3l5
6204c0M9j3j9nN7p9J5k1l0P7omMKm0O4l5O2r5M6n1K8pjL6K5j8m7N2k1K5pRK1o8
6239b5NO6k7n9k7Q4k8k3P0m0J7L7m1K9n0N0l9k8JO1Qk4J9m6J6K8l3o7J22k9rr
$$ plain form
6271 9 9 1 29 -53 -2 4 31 -30 -52 -33 -4 41 -25 10 -47 -39 -41 23 31 -30 36 3 1 39 -13 -11 -98 -42 8 36 11 8 3 -24 -45 15
6307 15 -50 3 -22 7 -25 -7 14 -20 12 40 -42 2 -8 4 43 64 11 -5 -6 -14 61 87 25 35 16 60 -10 -19 29 11 4 26
6339 26 -18 40 19 1 -14 -22 -4 7 -30 9 32 -44 -46 16 47 -8 -25 -36 20 -35 -9 -8 -36 5 -26 -17 13 -46 39 52 -7 17
6371 17 23 12 -3 -56 -10 -28 -4 -11 -30 -8 -41 -28 2 50 2 15 4 -28 -21 22 24 -29 42 -16 51 40 -6 -1 35 43 18 -22 -12
6404 -12 12 -22 14 -28 -62 9 -19 10 44 10 -19 5 -10 -62 27 39 -71 19 16 -54 -16 -56 -47 5 -78 -18 -11 8 -33 14 -14
6435 -14 -4 49 -12 -2 -5 -15 -18 -19 -33 -26 27 14 29 23 -17 -49 -10 13 -4 6 15 37 -45 14 9 27 9 30 -14 10 38 16 -41 15
6469 15 -3 -16 31 22 4 29 -11 -17 12 -10 0 9 -9 35 7 -1 40 91 5 -10 61 75 12 -25 33 2 -30 -23 20 -20 -12 -4 -1 11
6503 11 -36 25 -75 -18 6 -10 9 -55 0 -56 12 56 -3 -27 -19 7 -41 -4 -4 26 -24 -29 -36 1 19 0 15 0 70 -3 -38 15
$$ packed form
6271I%qK8q2N1OK7o1k2J9K9M5o6L5n7QkO4Qo1O6l3kL8n2Kq7N6N0K8k5lnk7k1O0
6307A5o5N3k5K9l2J8K1l4L2K8q2M4j0J2L9K1n3j6jqP5K6o2J0j9M4p0rM8j8pK2
6339B6m4N8k1j8j5qJ8J1l7L9K3p6kO2L1n5j7j1N6n5K6Jk8M1l1RL0n9Q5J3n9K4
6371A7Oj1j5n3M6j8K4pj9K2l3J3L0M8m8J3j1l2PM3Kn3P1n8O7j1m6NL6Qk5m0J0
6404a2K4l4L6m2l4P1k8K9L4l4k9K4j5n2Q9J2j10R0lp0L8m0RN2q3O0PJ9m1M7k8
6435a4J0N3o1J0lj0ljj4PN3j3J5om0l2L9K3j7J0RK2q2N9nJ8j8K1m4K4K8k2n7N6
6469A5j8j3M7rj8K5m0oK9k2J0Rj8M4k8qM1N1q6j5P1J4o3l7N8l1l2PM3m0QQLJ2
6503A1m7O1j00N7K4j6J9o4N5n6O8M4n9k4QK6m8L7%L0n0npL7J8j9J5j5P0p3l5N3
$$ plain form
6535 15 -48 1 42 30 -11 22 22 58 6 0 -67 5 -19 -9 56 34 19 -6 57 4 38 -3 12 -3 -31 4 20 8 5 -3 -8 -7 13
6568 13 -14 6 44 -14 2 -22 -2 -48 12 28 -38 -46 -36 -44 -13 -25 -27 -9 -42 -43 -4 -13 -40 37 -17 -21 -8 37 -39 19 -28 -34 12 -36
6602 -36 9 41 44 -19 62 -24 62 -2 27 16 -4 20 -18 3 20 51 38 1 0 47 4 54 -12 38 -33 43 1 -28 -11 47 -1
6633 -1 14 -36 -27 -12 29 34 -52 27 9 12 9 10 -32 -32 3 -22 10 -1 -16 16 -38 -17 -6 -2 -18 -98 -30 -42 12 -19 10 -15 50 43 32
$$ packed form
6535A5o3M9M1j2m1L3%L6n2oo7P2k4J0O5k2j5k5O3n3L4m1J5j5k8L5J6j2lqnJK0
6568A3k7K0L8n8J6k4K0m6O0J6o6qJ0qL1j2kJ8l3jL9rk7P7n4mJ3M5p6N8m7oM6m8
6602c6M5L2Lo3Q1q6Q6o4K9j1k0K4l8K1J7L1j3l7jM7m3N0o6N0p1P6m2k9J7N8m8
6633aJ5n0RJ5M1Nq6P9j8LlJm2%L5k5L2j1j5L2n4K1J1Mj6q0O8j2N4l1K9k5O5pj1
$$ [...]
8191F
##END NTUPLES=NMR FID
##END=
