##TITLE=1H_TG-2300-2
 CDCl3, 8 sc, 
 26.8.2020
##JCAMPDX= 6.0         $$ Bruker NMR JCAMP-DX V2.0
##DATA TYPE= NMR FID
##DATA CLASS= NTUPLES
##ORIGIN= UXNMR, Bruker Analytische Messtechnik GmbH
##OWNER= root
$$ XWIN-NMR		Version 3.5
$$ Wed Aug 26 10:07:22 2020 Russian Standard Time (UT+4h)  she@DPX200
##.OBSERVE FREQUENCY= 200.1315066352
##.OBSERVE NUCLEUS= ^1H
##.DELAY= (6, 6)
##.ACQUISITION MODE= SIMULTANEOUS
##.ACQUISITION SCHEME= undefined
##.AVERAGES= 8
##.DIGITISER RES= 18
##SPECTROMETER/DATA SYSTEM= spect
##.PULSE SEQUENCE= zg30
##.SOLVENT NAME= CDCl3
##.SHIFT REFERENCE= (INTERNAL, CDCl3, 0, 15.7039)
##AUDIT TRAIL= $$ (NUMBER, WHEN, WHO, WHERE, WHAT)
$$ ##TITLE= Audit trail, XWIN-NMR		Version 3.5
$$ ##JCAMPDX= 5.01
$$ ##ORIGIN= Bruker BioSpin GmbH
$$ ##OWNER= she
$$ F:/spectra/data/she/nmr/H-F/1/audita.txt
$$ ##AUDIT TRAIL=  $$ (NUMBER, WHEN, WHO, WHERE, WHAT)
(   1,<2020-08-26 10:05:54.67 +0400>,<she>,<DPX200>,
      <created by zg, POWCHK disabled, PULCHK disabled
       configuration hash MD5:
       00 E9 B6 7A A2 85 ED C7 34 08 36 98 17 FE 4E 26
       data hash MD5: 16K
       8F BD 29 6C 9F AC 18 E5 E1 EA CA CE 45 BA 59 A8>)
$$ ##END=
$$ 
$$ hash MD5
$$ A8 05 DE F8 14 CE DA 62 3A F9 9D 9A 2F 5F B0 C3
##$RELAX= 
##$RELAX= 
##$RELAX= 
##$RELAX= 
##$RELAX= 
##$RELAX= 
$$ Bruker specific parameters
$$ --------------------------
##$DU= <F:/spectra>
##$EXPNO= 1
##$NAME= <H-F>
##$PROCNO= 1
##$TYPE= <nmr>
##$USER= <she>
##$AMP= (0..31)
100 100 100 100 100 100 100 100 100 100 100 100 100 100 100 100 100 100 
100 100 100 100 100 100 100 100 100 100 100 100 100 100 
##$AQSEQ= 0
##$AQ_mod= 1
##$AUNM= <au_zg>
##$AUTOPOS= <>
##$BF1= 200.13
##$BF2= 200.13
##$BF3= 200.13
##$BF4= 200.13
##$BF5= 200.13
##$BF6= 200.13
##$BF7= 200.13
##$BF8= 200.13
##$BYTORDA= 1
##$CFDGTYP= 0
##$CFRGTYP= 5
##$CHEMSTR= <none>
##$CNST= (0..31)
1 1 145 1 1 1 1 1 1 1 1 1 1 1 1 1 1 1 1 1 1 1 1 1 1 1 1 1 1 1 1 1 
##$CPDPRG= <>
##$CPDPRG1= <>
##$CPDPRG2= <>
##$CPDPRG3= <>
##$CPDPRG4= <mlev>
##$CPDPRG5= <mlev>
##$CPDPRG6= <mlev>
##$CPDPRG7= <mlev>
##$CPDPRG8= <mlev>
##$CPDPRGB= <>
##$CPDPRGT= <>
##$D= (0..31)
0 1.2 0 0 0 0 0 0 0 0.06 0 0.03 0 0 0 0 0.0002 0 0 0 0 0 0 0 0 0 0 0 0 
0 0 0 
##$DATE= 1598421954
##$DBL= (0..7)
120 120 120 120 120 120 120 120 
##$DBP= (0..7)
150 150 150 150 150 150 150 150 
##$DBP07= 0
##$DBPNAM0= <>
##$DBPNAM1= <>
##$DBPNAM2= <>
##$DBPNAM3= <>
##$DBPNAM4= <>
##$DBPNAM5= <>
##$DBPNAM6= <>
##$DBPNAM7= <>
##$DBPOAL= (0..7)
0.5 0.5 0.5 0.5 0.5 0.5 0.5 0.5 
##$DBPOFFS= (0..7)
0 0 0 0 0 0 0 0 
##$DE= 6
##$DECBNUC= <off>
##$DECIM= 32
##$DECNUC= <off>
##$DECSTAT= 4
##$DIGMOD= 1
##$DIGTYP= 9
##$DL= (0..7)
0 120 120 120 120 120 120 120 
##$DP= (0..7)
150 150 150 150 150 150 150 150 
##$DP07= 0
##$DPNAME0= <>
##$DPNAME1= <>
##$DPNAME2= <>
##$DPNAME3= <>
##$DPNAME4= <>
##$DPNAME5= <>
##$DPNAME6= <>
##$DPNAME7= <>
##$DPOAL= (0..7)
0.5 0.5 0.5 0.5 0.5 0.5 0.5 0.5 
##$DPOFFS= (0..7)
0 0 0 0 0 0 0 0 
##$DQDMODE= 0
##$DR= 18
##$DS= 0
##$DSLIST= <SSSSSSSSSSSSSSS>
$$ [...]
##$SUBNAM2= <"">
##$SUBNAM3= <"">
##$SUBNAM4= <"">
##$SUBNAM5= <"">
##$SUBNAM6= <"">
##$SUBNAM7= <"">
##$SUBNAM8= <"">
##$SUBNAM9= <"">
##$SW= 16.880792210976
##$SWIBOX= (0..15)
0 0 2 0 0 0 0 0 0 0 0 0 0 0 0 0 
##$SW_h= 3378.37837837838
##$TD= 16384
##$TD0= 1
##$TE= 0
##$TE2= 300
##$TE3= 300
##$TEG= 300
##$TL= (0..7)
0 120 120 120 120 120 120 120 
##$TP= (0..7)
150 150 150 150 150 150 150 150 
##$TP07= 0
##$TPNAME0= <>
##$TPNAME1= <>
##$TPNAME2= <>
##$TPNAME3= <>
##$TPNAME4= <>
##$TPNAME5= <>
##$TPNAME6= <>
##$TPNAME7= <>
##$TPOAL= (0..7)
0.5 0.5 0.5 0.5 0.5 0.5 0.5 0.5 
##$TPOFFS= (0..7)
0 0 0 0 0 0 0 0 
##$TUNHIN= 0
##$TUNHOUT= 0
##$TUNXOUT= 0
##$USERA1= <user>
##$USERA2= <user>
##$USERA3= <user>
##$USERA4= <user>
##$USERA5= <user>
##$V9= 5
##$VALIST= <valist>
##$VCLIST= <CCCCCCCCCCCCCCC>
##$VD= 0
##$VDLIST= <DDDDDDDDDDDDDDD>
##$VPLIST= <PPPPPPPPPPPPPPP>
##$VTLIST= <TTTTTTTTTTTTTTT>
##$WBST= 1024
##$WBSW= 4
##$XGAIN= (0..3)
0 0 0 0 
##$XL= 0
##$YL= 0
##$YMAX_a= 171788
##$YMIN_a= -217774
##$ZGOPTNS= <>
##$ZL1= 120
##$ZL2= 120
##$ZL3= 120
##$ZL4= 120
##$ABSF1= 10
##$ABSF2= 0
##$ABSG= 5
##$ABSL= 3
##$ALPHA= 0
##$AQORDER= 0
##$ASSFAC= 0
##$ASSFACI= 0
##$ASSFACX= 0
##$ASSWID= 0
##$AUNMP= <proc_1d>
##$AZFE= 0.1
##$AZFW= 0.1
##$BCFW= 1
##$BC_mod= 2
##$BYTORDP= 1
##$COROFFS= 0
##$CY= 11.3945322036743
##$DATMOD= 1
##$DC= 2
##$DFILT= <>
##$DTYPP= 0
##$F1P= 16.9975609425685
##$F2P= -3.02152046262296
##$FCOR= 0.5
##$FTSIZE= 0
##$FT_mod= 4
##$GAMMA= 1
##$GB= 0.15
##$INTBC= 1
##$INTSCL= 1
##$ISEN= 128
##$LB= 0.24
##$LEV0= 0
##$LPBIN= 0
##$MAXI= 10000
##$MC2= 0
##$MEAN= 0
##$ME_mod= 0
##$MI= 1.114404
##$NCOEF= 0
##$NC_proc= 0
##$NLEV= 6
##$NOISF1= 3.799351
##$NOISF2= 2.8
##$NSP= 1
##$NTH_PI= 0
##$NZP= 0
##$OFFSET= 15.70392
##$PC= 1
##$PHC0= -10130.1
##$PHC1= 11.20092
##$PH_mod= 1
##$PKNL= yes
##$PPARMOD= 0
##$PSCAL= 0
##$PSIGN= 0
##$REVERSE= no
##$SF= 200.130013532006
##$SI= 16384
##$SIGF1= 3
##$SIGF2= 2
##$SINO= 400
##$SIOLD= 16384
##$SREGLST= <1H.CDCl3>
##$SSB= 0
##$STSI= 0
##$STSR= 0
##$SW_p= 3612.71676300578
##$SYMM= 0
##$S_DEV= 0
##$TDeff= 0
##$TDoff= 0
##$TI= <>
##$TILT= no
##$TM1= 0
##$TM2= 0
##$TOPLEV= 0
##$USERP1= <user>
##$USERP2= <user>
##$USERP3= <user>
##$USERP4= <user>
##$USERP5= <user>
##$WDW= 1
##$XDIM= 8192
##$YMAX_p= 0
##$YMIN_p= 0
$$ End of Bruker specific parameters
$$ ---------------------------------
##NTUPLES= NMR FID
##VAR_NAME=  TIME,          FID/REAL,        FID/IMAG
##SYMBOL=    X,             R,               I
##VAR_TYPE=  INDEPENDENT,   DEPENDENT,       DEPENDENT
##VAR_FORM=  AFFN,          ASDF,            ASDF
##VAR_DIM=   8192,          8192,            8192
##UNITS=     SECONDS,       ARBITRARY UNITS, ARBITRARY UNITS
##FACTOR=    0.000296,      1,               1
##FIRST=     0,             0,               0
##LAST=      2.424536,      0,               0
##MIN=       0,             -217774,         0
##MAX=       2.424536,      171788,          0
$$ Real data points
##PAGE= N=1
##DATA TABLE= (X++(R..R)), XYDATA
0@%%%%%%%%%%%%qJ6j6J6j6K4l2M0m8N6p2Q1r0J09j32J52j75K03k31K63l00L41
$$ 0 0 0 0 0 0 0 0 0 0 0 0 0 -8 8 -8 8 -8 16 -16 24 -24 32 -40 41 -49 60 -72 80 -95 108 -123 140 -160 181
34A81l85M36m92N52o18O91p70Q57r53J057j170J293j429J577j739J915k109K325
$$ 181 -204 232 -260 292 -326 365 -405 452 -501 556 -614 679 -750 827 -912 1003 -1106 1219
52A219k562K823l115L443l812M233m717N279n946O746p727Q972j0607J2861j6201
$$ 1219 -1343 1480 -1635 1808 -2004 2229 -2488 2791 -3155 3591 -4136 4836 -5771 7090 -9111
67i111K1740l3176R9405j38273L626K27577j42219l8984Q9337n6295o2951R7775
$$ -9111 12629 -20547 78858 -59415 -55789 171788 29569 -9415 79922 23627 -39324 58451
79E8451q76p2437n0826P0459O8062m5942p9719N5173L5883o1550K2861L0019m9007
$$ 58451 57575 -14862 -65688 4771 72833 26891 -52828 2345 38228 -23322 -461 29558 -19449
92a9449L325N8588j1577o8107p621O0670K7816q5344J7015O4665o3622j3300O9102
$$ -19449 -16124 42464 30887 -37220 -44841 15829 43645 -41699 -24684 39981 -23641 -36941 32161
105C2161n7130l2964R6640k8941m4743L7194k4084m987N1403m7818l8126R5956
$$ 32161 -24969 -57933 38707 9766 -34977 2217 -21867 -26854 24549 -23269 -61395 34561
117C4561l0048p6248O9127J1631p9805N0628N4375p9310K147N4919j3344l7412
$$ 34561 4513 -71735 -2608 9023 -70782 -20154 34221 -45089 -42942 11977 -1367 -38779
129c8779J7635L9260j4811k3565K4421K1001m4124R574L3242k1114j0528J4493
$$ -38779 -21144 18116 3305 -20260 4161 25162 -18962 -9388 23854 2740 -7788 6705
141F705P164j8770j8346P283L8593l6200l5490O3883m553o8378L6375M3033p6085
$$ 6705 13869 -4901 -23247 -15964 22629 -13571 -49061 14822 10269 -58109 -21734 21299 -54786
154e4786K3023P0010o9047k4757O9415j7441m3006M6125k055j8523K4211m503
$$ -54786 -31763 38247 -30800 -55557 13858 -3583 -46589 -464 -2519 -21042 3169 -1334
166a334j9812Q210J5267p255J0704k315o530Q612O296j1162q672K5963L603r727
$$ -1334 -21146 -12936 2331 -4924 5780 3465 -3065 5547 11843 681 -7991 17972 21575 11848
180A1848j33M919j2520N863J5654k3407Q522K2384j8668j5840K5179k1500j1832
$$ 11848 11715 16634 4114 9977 25631 2224 10746 33130 14462 -1378 23801 2301 -9531
193i531N1878k3748l6693M3616J0571n3151K2386K4301l4522J8620K4435l2644
$$ -9531 42347 18599 -18094 25522 36093 -17058 5328 29629 -4893 13727 38162 5518
205E518j7694L4668p256j5692J1557n389M019J0148j5743k2263K3810L921j5432
$$ 5518 -12176 22492 15236 -456 11101 5712 9731 19879 4136 -18127 5683 9604 -5828
218e828J2347K119k2745K558L3284l0943k5525M2253J5123m0499M510K4392l0117
$$ -5828 6519 8638 -14107 -11549 21735 -9208 -34733 7520 22643 -17856 -13346 11046 -19071
231a9071P991K2814j6829j0193J9014J11o273L96j9788K3787K2207l3009j0585
$$ -19071 -11080 11734 -5095 -15288 3726 3837 -2436 -2040 -21828 1959 24166 -8843 -19428
244a9428M1423j8653l3134M9485l075m7772L0958M0838n3368j9409N2061n737
$$ -19428 21995 3342 -29792 19693 16618 -31154 -196 40642 -12726 -32135 19926 14189
256A4189l2972J5839K5054k9275o538K3637m272j6608K719K1163k310j8762q657
$$ 14189 -18783 -2944 22110 -7165 -13703 9934 5662 -10946 -8227 12936 10626 -8136 -16793
269a6793K9958k275l6156K3332L0226l7203k0030N4801j7131n0371M4863L1239
$$ -16793 13165 10890 -25266 -1934 28292 -8911 -28941 25860 8729 -41642 3221 34460
281C4460n6676l354N5081l1671k9770L2873J2315k4284M49J7668n420j0173p045
$$ 34460 -22216 -25570 29511 -2160 -31930 943 13258 -11026 -10577 7091 1671 -8502 -15547
294a5547K0055M416k1440M905K9872j7891l6697L9929J7581m3345L077M7923k5395
$$ -15547 4508 8924 -12516 -7611 22261 4370 -32327 7602 25183 -18162 -15085 32838 7443
307G443l5944M1091P037m1144J0540M4291k8477k6627K9599N193k0697k429J5619
$$ 7443 -28501 12590 19627 -21517 -10977 33314 4837 -21790 7809 13002 -7695 -10124 5495
320E495J21m382q500J1453J207k8881J4136L1457k3480l0768M3002Q282m8303
$$ 5495 5616 1234 -7266 4187 5394 -23487 -9351 22106 -1374 -32142 10860 19142 -29161
333b9161J3139L6531k7818j6466M5566j1053l5915J9854K4211k0317j1833K3182
$$ -29161 -16022 20509 -7309 -23775 21791 10738 -25177 -5323 18888 -1429 -13262 9920
345I920K076j0639n411Q489R64p127M11J3569J384k7619J4136K1447k5660j3712
$$ 9920 11996 1357 -4054 4435 5399 -1728 -1317 12252 13636 -13983 153 21600 -4060 -17772
359a7772L7666Jl6612K1778J7702k9067n216L5696j2800k3369K4100M218j9030
$$ -17772 19894 19895 -16717 5061 22763 -6304 -11520 24176 11376 -11993 12107 16325 -2705
372b705r26J2147m466J738k164k258O314r530l242J1115L186j8592J2035J5439
$$ -2705 -3631 8516 4050 5788 3624 1366 7680 -1850 -5092 6023 9209 -9383 2652 18091
386A8091k4609o419K3758m856k1954K3419L854k4051N175J2626j4196o821J9220
$$ 18091 -6518 -12937 10821 5965 -15989 7430 11284 -12767 -7592 5034 -9162 -15983 3237
399C237p408p270O417k991p694P929P51p484J5880m666j0544Q825K848j2877R331
$$ 3237 -4171 -11441 -5024 -8015 -15709 -7780 -7029 -14513 1367 -3299 -13843 -5018 -2170 -15047 -5716
414e716J4178j6411K068J1276q710j0335J4781j130r316J6945l703j3546P278
$$ -5716 8462 -7949 -5881 5395 -3315 -13650 1131 1 -9315 7630 3927 -9619 -2341
427b341P098j4754Q782J2617j4786K116J2208q951j4383J8131K160j2052J0330
$$ -2341 4757 -9997 -1215 11402 -3384 -1268 10940 1989 -12394 5737 7897 -4155 6175
440F175K516j2377J46Q839j0079L760M257m481N855m69j1857J783J7066j3700
$$ 6175 8691 -3686 -3540 5299 -4780 -1020 3237 -1244 4611 4142 -7715 -5932 11134 -2566
454b566k531J9948p884j6978J7829P812k8122J2494K1157j6111j1797J7242j319
$$ -2566 -5097 14851 6967 -10011 7818 15630 -12492 2 21159 5048 -6749 10493 9174
467I174j6834J0594N572o025l072P030p42m293m857J692J5990j0000j0602J5672
$$ 9174 -7660 2934 8506 2481 -591 6439 5697 1404 -3453 -1761 14229 4229 -6373 9299
481I299N936k3867O647K2498k1587p223K7067k128l2100J6381K0008k3087m187
$$ 9299 15235 -8632 -1985 20513 -1074 -8297 18770 16642 -15458 923 20931 -2156 -6343
494f343J9753k420j6557J0299M059p866l104O569Q784r257r886P290J3089j9373
$$ -6343 13410 10990 -5567 4732 8791 925 -2179 4390 13174 3917 -5969 1321 14410 -4963
508d963o457K4187m705k3187J3618J6335l2031j04L0832j1338k4472J9273J3302
$$ -4963 -11420 12767 8062 -15125 -1507 14828 -17203 -17307 13525 2187 -22285 -3012 10290
521A0290k6220K81J6944k920j1445R396O540j0211o023M686J3266j0299r209J5545
$$ 10290 -15930 -15649 1295 -1625 -13070 -3674 2866 -7345 -13368 -8682 4584 -5715 -14924 621
535F21Q011k3494j795K5710j4129j4539K3307R051l1145M564K6587j8322j4606
$$ 621 8632 -14862 -16657 9053 -5076 -19615 3692 12743 -18402 -13838 12749 -5573 -20179
548b0179K2483R099k2661M524J2386r185p299P956R889p577n201M948R151j2914
$$ -20179 2304 11403 -11258 -6734 5652 -3533 -10832 -2876 7013 -564 -5765 -817 8334 -4580
562d580q460J9815L618j8713N221K1618k1603j1400K5463L26k1899J1330J8923
$$ -4580 -13040 6775 10393 -8320 -3099 18519 -3084 -14484 10979 11305 -10594 736 19659
575A9659k0966o467J5938l78j3941P802J0837r603l911K258N428n078m219N757
$$ 19659 -1307 -7774 8164 7786 -6155 1647 12484 2881 -1030 1228 6656 1578 -2641 3116
589C116P444q399p470J5289l863j4533R309J5847j7181p072K1057p009j5218J1729
$$ 3116 10560 2161 -5309 9980 6117 -8416 893 16740 -441 -7513 13544 6535 -8683 3046
603C046R551j6993L931J2109r371n896M633M098l874P93k407L525J027p654K779
$$ 3046 12597 -4396 -465 11644 2273 -3623 1010 5108 1234 2027 -380 3145 4172 -3482 -703
618g03M862n299m090J4158o032j3317J0758P327j2193k081J4544q190n352Q677
$$ -703 4159 -1140 -5230 8928 2896 -10421 337 7664 -4529 -6610 7934 -256 -5608 3069
632C069j429r843P191P983j0490K046K148l143J363K569o407K794Q477r007M2
$$ 3069 1640 -8203 -1012 6971 -3519 -1473 675 -2468 -1105 1464 -4943 -2149 6328 -2679 -2637
647b637L744m536j871J0519l607r163J0970j25q298K490N012p102N897O332j1438
$$ -2637 1107 -3429 -5300 5219 1612 -7551 3419 3294 -5004 -2514 2498 -4604 1293 7625 -3813
662c813N97O515l276n157R762k288o460Q839n1j0961J228J1661p513j372O288
$$ -3813 -3216 3299 23 -5134 4628 2340 -4120 4719 4668 -6293 -5065 6596 -917 -2289 3999
677C999l831l204K737j92m354O052j217N7K326n900k714Q301J58j1878J2380N039
$$ 3999 168 -3036 -299 -491 -4845 1207 -10 47 2373 -3527 -6241 2060 2218 -9660 2720 7759
693G759j4291J651J1766j0186o594J7515l054j1130N872P672j0881k542J0353
$$ 7759 -6532 -4881 6885 -3301 -9895 7620 4566 -6564 -692 6980 -3901 -6443 3910
706C910k330k300K81K474j820j916j861N075K601r064N392O468q951p578J5285
$$ 3910 1580 -720 -439 2035 215 -1701 -3562 1513 4114 -4950 442 6910 -2041 -9619 5666
721E666Q99j5963R440J0764j2826o531J6647n350j0434J0996N446r649l546R498
$$ 5666 6565 -9398 42 10806 -2020 -8551 8096 2746 -7688 3308 8754 -895 -4441 5057
735E057j712m204j304N643K467p199j033O321j272j1383J1461O857j5979j036
$$ 5057 3345 -859 -2163 3480 5947 -1252 -2285 4036 2764 -8619 2842 9699 -6280 -7316
749g316J6624o121j7355J4796Q006j3870j086J4071p771j1296J3640L397r753
$$ -7316 9308 3187 -14168 628 8634 -5236 -6322 7749 -22 -11318 2322 5719 -4034
762d034j491J0944j102p819o37N867L249q200L376O730n710q518J1728L884j7220
$$ -4034 -5525 5419 4317 -3502 -4139 1728 4977 -3223 153 6883 1173 -7345 4383 8267 -8953
777h953N644J5746r529j4077J4922K387j4457N979R902p941p217J1930q92r500
$$ -8953 -3309 12437 2908 -11169 3753 6140 -8317 -2338 7564 -377 -7594 4336 3444 -6056
791f056O73P983J230o379N25L558R77q593M262P975p690l597J1376O44j7241P636
$$ -6056 -5383 2600 3830 -2549 -2024 1534 2511 -6082 -1820 6155 -1535 -5132 6244 6888 -10353 -2717
807b717J1839j0393o081J3940q37j4049Q278M562q530j741R732j576o471J488
$$ -2717 9122 -1271 -7352 6588 5751 -8298 -20 4542 -3988 -5729 4003 2427 -4044 -2556
821b556J056J414m595N79M780R38p333K491P326r933j271J1073m76j1560Q848
$$ -2556 -1500 -86 -4681 -4102 678 1616 -5717 -3226 4100 -5833 -7104 3969 3493 -8067 781
836G81O426j2507P11R999k703p715R161O32p125J874K940j739j618L250j831J840
$$ 781 7207 -5300 -4589 5410 2707 -5008 4153 4785 -2340 -466 2474 735 -883 2367 536 2376
852B376k918k441M900j09n015K378P049r121p53P583l679n323P851K918j0182
$$ 2376 -542 -2983 1917 1808 -3207 -829 6220 -2901 -3654 3929 250 -5073 2778 5696 -4486
867d486M832L917n149r76N749k036k080N264m066r12K388K77k111L776n64m524
$$ -4486 346 4263 -886 -1862 3887 1851 -229 5035 969 57 2445 2722 611 4387 3823 -701
883g01N220j112m451J551N262m849j59L998n578m03L550j016m228N610p95m435
$$ -701 4519 3407 -1044 507 5769 920 761 4759 -819 -1222 2328 1312 -2916 2694 1899 -2536
899b536L746j117l836K827N541p218R76N516m927k499M707L67n265N943L76m408
$$ -2536 1210 93 -3743 -916 4625 -2593 -1617 3899 -1028 -3527 1180 1547 -3718 2225 2601 -1807
915a807L6J966j074j104K440k507K987j000l907J592K728l827n47P750o072l599
$$ -1807 -1771 195 -879 -1983 457 -2050 937 -63 -3970 -2378 350 -3477 -4024 3726 -2346 -5945
931e945O449Q58q650L573Q136p357j068N453j134o376N229L128m614P23K042J659
$$ -5945 504 1362 -7288 -3715 4421 -2936 -4004 1449 315 -6061 -832 2296 -2318 -1595 447 2106
947B106l570o15J210L375k605k408O178j909n545K721O830q546j640J0449l422
$$ 2106 -1464 -2079 -869 2506 -99 -2507 3671 1762 -3783 -1062 5768 -2778 -4418 6031 2609
962B609q260N147O350r798N40P618k474n426L625L410n771P54K423J999l486j476
$$ 2609 -5651 -504 5846 -3952 -3412 4206 1732 -3694 -69 3341 -2430 -1676 747 2746 -740 -2216
978b216M030P59m784j197Q883m139n775O099L573r347L9J1400o642o131P655L712
$$ -2216 1814 2573 -2211 -3408 5475 1336 -4439 1660 5233 -4114 -4075 7325 683 -5448 2207 5919
994E919j0350J236Q224m881k836L916K863n867j92L353R64k661j608O046r01n524
$$ 5919 -4431 -3195 5029 148 -2688 1228 4091 -1776 -1968 1385 2349 -312 -1920 4126 3225 -2299
1010b299K89P872n022n060R361L85q802J849Q955q605l503R497K98p881J578O085
$$ -2299 -2010 5862 840 -4220 5141 5526 -3276 -1427 7528 -1077 -4580 4917 5215 -2666 -1088 4997
1026D997o297j137L582J322k889p72K877n84k970k303P008o11n736K805N015n890
$$ 4997 -1300 -2437 1145 2467 -422 -1194 1683 1099 -1871 -4174 2834 2223 -3513 -708 4307 -1583
1042a583m305R731k132o763N281N933q679k219Q363l381l699L393L651n004n45
$$ -1583 -5888 3843 1711 -5052 229 6162 -2517 -4736 3627 246 -3453 -60 3591 -1413 -1958
1057a958K643j086r85j265L520M31k413k183M895j290n741N504K851n032j467
$$ -1958 685 -401 -1386 -2651 869 1300 -1113 -3296 1599 309 -5432 72 2923 -2109 -3576
1072c576P488m225m981O126J703n000O56N821m971j184K884n7j495O96J856j408
$$ -3576 3912 -313 -5294 832 2535 -2465 -1809 4012 -959 -2143 741 684 -811 -115 1741 333
1088C33O60k296J896R72k173l7L062o42n082M647K81m183J249M143l407k558M774
$$ 333 993 -1303 593 1565 -608 -645 2417 1775 -3307 1340 1621 -2562 -1313 2830 -577 -3135 1639
1105A639k449j905J690K017k650R54J661k918J546J52j72J5K293k118j48K110
$$ 1639 -810 -2715 -1025 992 -1658 -704 957 -1961 -415 -263 -435 -420 1873 -245 -393 1717
1121A717k696L15J681N78k746K522k36k890J694N21r69l9K900l131J81J624k238
$$ 1717 -979 -664 1017 1595 -1151 1371 1135 -1755 -61 460 -509 -548 2352 -779 -598 1026 -1212
1138a212Q4K330J44l175L719q91l286J246K229j664j082L734k518r13N39O76r52
$$ -1212 -1128 1202 1346 -1829 1890 999 -2287 -1041 1188 -476 -1558 2176 -342 -1255 -716 -40 -992
1155i92N00J590p14J197k340O15J147j66j241K364J491m718K017J768k749k159
$$ -992 -492 1098 384 1581 -759 -144 1003 837 -404 1960 3451 -1267 750 2518 -231 -2390
1171b390N129j91m795L064J065l253j507M849j292j932J844O69p60k201J914N79
$$ -2390 2739 2548 -2247 817 1882 -1371 -2878 1971 679 -1253 591 1260 500 -1701 213 792
1187G92L47j922K129J677m287j57L304j13m880M476K219n252l25M556j596n101
$$ 792 1139 -783 1346 3023 -1264 -1421 1883 1770 -3110 1366 3585 -1667 -1992 2564 968 -4133
1203d133N619J521l942o61L851j518l385L269P41q71k266K050P20k347j474K389
$$ -4133 1486 3007 -935 -1596 2255 737 -2648 621 1362 491 -1775 275 995 -1352 -2826 -437
1219d37K126n163J671L477k847m081N349K112o541K607M103k912l625N222L46
$$ -437 1689 -3474 -1803 1674 -1173 -5254 95 2207 -4334 -1727 2376 -536 -4161 1061 1407
1234A407m197J995K766j196l488K620Q25r83j574J873K063l715l21K862O04n115
$$ 1407 -2790 -795 1971 775 -2713 -93 732 -251 -1825 48 2111 -1604 -1925 937 1541 -3574
1250c574L124M109m558j733M511L92o213M101L283l849j540L998l98m219K618
$$ -3574 -450 3659 -899 -2632 1879 2271 -3942 159 3442 -407 -1947 2051 1653 -2566 52
1265E2J280m86j894J625J265j903j370J427K916l751L86L324j267m108L014L212
$$ 52 1332 846 -1048 577 1842 -61 -1431 -4 2912 -839 -453 2871 1604 -2504 510 3722
1281C722n433Q87L977j190m324L107J416l910J013K481k06l166J834N48q72q17
$$ 3722 -1711 -824 3153 1963 -2361 746 2162 -1748 -735 1746 1540 -1626 208 756 -116 -933
1297i33M81K323j807o26J084J370l728O80L913k234j954K326J761m781J649K701
$$ -933 -452 1871 64 -562 522 1892 -1836 -1156 2757 523 -1431 895 2656 -2125 -476 2225
1313B225k386j062K608N72l421J479L97j17o27O63N60j014J03o29J680j650k74
$$ 2225 -161 -1223 1385 1957 -1464 15 412 295 -332 331 891 -123 -20 -649 1031 -619 -893
1330h93J598L78k114n2K652k779J8J706J65k263J206J232k619R11P69p8j326J494
$$ -893 705 1083 -1031 -1083 1569 -1210 -1192 514 679 -1584 -378 854 -1765 -854 -85 -163 -1489 5
1348Ep30p74J063j024N07P1N99j338R77l69q58J295p5k15n90J623j432J44P38
$$ 5 -725 -1499 -436 -1460 -953 -882 -283 -1621 -644 -1013 -1871 -576 -651 -866 -1456 167 -1265 -1121 -383
1367c83p03N68N10J74j488J656p53n65J191L13q32n0K032k411lJ368Q4j313J100
$$ -383 -1086 -518 -8 166 -1322 334 -419 -984 207 520 -312 -362 1670 -741 -744 624 708 -605 495
1386D95J080k225P68J71K25q28R51K88m65J35j016J425o49m05M94J624j535j073
$$ 495 1575 -650 118 289 514 -314 637 925 460 595 -421 1004 355 -50 444 2068 533 -540
1404e40K592j440j124J274J978k715J66K283j727j304J136J645k353O85P41n53
$$ -540 2052 612 -512 762 2740 25 191 2474 747 -557 579 2224 -129 556 1297 744
1420G44q35k84J281q14j90k92J874j489j752J897O20j765l86L460k337j503K270
$$ 744 -91 -375 906 92 -98 -390 1484 -5 -1757 140 760 -1005 -1391 2069 -268 -1771 499
1437D99N83k656N96L226k354o47J103P80j851K42J477o06j98q03J745q99j391
$$ 499 1082 -1574 -978 2248 -106 -753 350 1130 -721 -479 998 392 194 -609 1136 237 -1154
1454a154P05J931j549j858L320o74k465N72K962k407j402L346r73k208P42K512
$$ -1154 -449 1482 -67 -1925 1395 721 -1744 -1172 1790 -617 -2019 1327 354 -1854 -1112 1400
1470A400k405l63J701J17j136p73J836n68l22k28J959q08k125K022J084j842j138
$$ 1400 -1005 -1368 333 450 -686 -1459 377 -191 -513 -741 1218 410 -1715 307 1391 -451 -1589
1487a589L863j418k472J953J075k553n92L537j754j554J054J170j907n24J887
$$ -1589 2274 856 -1616 337 1412 -1141 -1733 1804 50 -1504 -450 720 -1187 -1711 176
1502A76m33k23o22J656o29j276N81J523l95j848K762k00k145K0K596j394j780
$$ 176 -257 -480 -1102 554 -75 -1351 -770 753 358 -1490 1272 1072 -1073 -1053 1543 149 -1631
1519a631K936k67j803r0K074j725o33J863J55r06o48J415q29p8k55J060J10j482
$$ -1631 1305 1038 -765 -855 1219 -506 -1139 724 879 -27 -675 740 -89 -167 -422 638 748 -734
1537g34J041K23q74j296K325j34j687R60Q86j116j229K494q23q04R99Q14q78o49
$$ -734 307 530 -344 -1640 685 551 -1136 -176 710 -406 -1635 859 36 -768 231 1045 167 -482
1555d82J323q80M25j13O84l30m35J9j95O61j401R64L24m50o53Q71j42j362J606
$$ -482 841 -39 386 273 957 627 192 211 16 677 -724 240 564 114 -539 332 190 -1172 434
1574D34O0l19n32J218o22o85J105l99L6j02O89j033M65j95m02Q17m17N0l78R22
$$ 434 494 175 -357 861 239 -446 659 260 296 194 883 -150 315 120 -282 535 118 168 -210 712
1594G12j162J78P29m71M4K31L67j263J134l31l77M28J99j56n27Q28j275O92L24
$$ 712 -450 -272 457 -14 30 261 628 -635 499 168 -209 219 418 262 -265 563 -712 -20 304
1613C04k84l14N84N3j291J363m28l23L33R53q72o28J124p96L41r4M81o10K90j81
$$ 304 20 -294 290 343 -948 415 -13 -336 -3 950 78 -550 574 -222 119 25 506 -104 186 5
1633En68Q06r24L47L86K41j368Q67M99j452O95P13j49j191J590l65j196Q31M00
$$ 5 -563 243 -681 -334 52 293 -1075 -208 291 -1161 -466 247 98 -1093 497 132 -1064 -233 167
1652A67l03n77J313q62r6j70R5M09m97K49n3P42j594N99P92r13l96J267N08k270
$$ 167 -136 -713 600 -262 -358 -528 -433 -24 -521 -272 -325 417 -1177 -578 214 -699 -1095 172 680 -1590
1672a590J359N70j075l63J550j52j385J360j14l78n05J133j70l37L35j21P38j216
$$ -1590 -231 339 -736 -1099 451 299 -1086 274 160 -218 -723 410 240 -97 238 117 855 -361
1690c61M54N91M8j060R05J002k016M94J061k21j737J750N13j807M74Q31l15j347
$$ -361 93 684 732 -328 577 1579 -437 57 1118 897 -840 910 1423 -384 90 921 606 -741
1708g41J587k11o03p1M11K24r50N19O4N32j264M06Q88r74l51R60O26k069J103
$$ -741 846 635 32 -39 372 596 -354 165 229 761 -503 -97 791 -183 -534 426 1052 -1017 86
1727H6Q37j147o81J337L66j783J092L11o05p17J062P8r37M67OM42j168L73M66
$$ 86 923 -224 -905 432 798 -985 107 418 -187 -904 158 236 -701 -234 -228 214 -954 -581 -115
1746a15r6o10L56J052j592K30P50J99j429J109R38j543J63P34R0j369J327L37
$$ -115 -211 -821 -465 587 -1005 -775 -25 174 -1255 -146 792 -751 -588 146 236 -1133 194 531
1764E31p30n7L99K33j008P29%L74o49Q9O55o96j91J21J050j250K52P73n15p93
$$ 531 -199 -256 143 376 -632 97 97 471 -178 -89 566 -130 -321 -200 850 -400 -148 625 110 -683
1784f83N60R75j579P00M80k42q68O95K60r29O87M1K74p09L98m7%L1m39J114o76
$$ -683 -123 852 -727 -27 453 211 -657 38 298 -631 56 97 371 -338 60 13 13 44 -395 719 43
1805D3r9P3N50q36NJ161r20rK39N51j288N91N13o80K21Q8K07p69P60n01J66K44
$$ 43 -56 17 567 -269 -264 897 -23 -32 207 758 -530 61 574 -106 115 203 410 -359 401 -100 66 310
1827C10l15K56k06K90p76J081m03l59L69K01m06m18J109r23K37K56L8m73O4M08
$$ 310 -5 251 45 335 -441 640 237 -122 247 448 42 -376 733 -190 47 303 341 -132 -68 340
1847C40p13P39m57J18P6R7m95M6O89j059O51J06j08o75O63l4q72Q37o5p9m41N90
$$ 340 -373 366 -91 27 103 200 -295 -249 440 -619 32 138 30 -645 18 -16 -888 -51 -116 -195 -636 -46
1869d6m56lK55l57N77m12K64k78N81p37J38Q74o14j27K34O63j328N68N85o73p8
$$ -46 -502 -505 -250 -607 -30 -442 -178 -456 125 -612 -474 400 -214 -341 -107 556 -772 -204 381 -292 -370
1890c70N83J98j065P44j50P7k48K17L43l82J53m27Q41p43RO06P7o64l0J178j375
$$ -370 213 411 -654 90 -60 17 -231 -14 329 -53 100 -327 514 -229 -220 386 463 -201 -231 947 -428
1911d28J51O90J97j016M49Q39j145J28L94M00r30N80K42l48j10j88Q40p29L3J18
$$ -428 -277 413 610 -406 43 882 -263 -135 259 659 -271 309 551 203 93 -95 745 16 49 167
1931A67N49q75k89J185o58m38K97J035j424K2J017n07o18L53R73j196K57K77J46
$$ 167 716 -159 -448 737 79 -359 -62 973 -451 -429 588 81 -537 -184 789 -407 -150 127 273
1950B73o74J30Q00o28Jk66Q82p33l24P30R0n94l20J386r71m43O06O03r25k32J323
$$ 273 -401 -271 529 -99 -98 -364 518 -215 -539 191 281 -313 -633 753 -218 -661 -55 548 -377 -609 714
1971G14q92k92K75P49r76N9P42m16j71k40Q85o12q2J21N79m11p17J165l75l39
$$ 714 -178 -470 -195 554 -422 -363 379 -37 -208 -448 437 -175 -257 -136 443 32 -685 480 105 -234
1991b34q5J157q09o42J058q3n71k13J375r20j86M00J62m94j58Q17m43N5l31N96
$$ -234 -319 838 29 -613 445 362 -209 -422 953 33 -153 247 409 -85 -243 574 131 186 -145 451
2011D51k55m37L64K25m8p86J154l89n55J27P21m73o81J202m81k93q4O45n17k52
$$ 451 196 -241 123 348 300 -486 668 279 -276 -149 572 99 -582 620 139 -154 -238 407 -110 -362
2031c62O45l25Q3l41N39l36j7j08J99K70o83L72J33op20Q67k7o91N00J06j33n62
$$ -362 283 -42 41 -300 239 -97 -114 -222 -23 247 -436 -64 69 63 -657 210 183 -508 -8 98 -35 -597
2053e97Q75l71j19J26m0J51l82M35m11N43m57P7K95k58j06J5O54r89M83K46j81
$$ -597 278 -93 -212 -86 -126 25 -357 78 -333 210 -247 -170 125 -133 -239 -224 430 -559 -76 170 -11
2074a1l61L58L06p03N87k17J29l67L13Lj50L01m44O50m62n7M2L80l83k54R19n97
$$ -11 -372 -14 292 -411 176 -41 88 -279 34 37 -113 188 -256 394 -68 -125 -83 297 -86 -340 579 -18
2096a8j78P3N65p73J11O34m18Oj69N30o34K97l3K58r6l91M59j36j7m51R12l29
$$ -18 -196 -123 442 -331 -220 414 -4 2 -167 363 -271 26 -7 251 155 -236 223 87 70 -381 531 202
2118B02n48O01J39l77m77J140o11k43M10K33m82k95Q22m54%k71O81l02l33L37
$$ 202 -346 255 394 17 -460 680 69 -174 236 469 -13 -308 514 60 60 -211 470 168 -165 172
2138A72k4J32p15Q99r0n08j15O68j71r12J011l0m36k72R51m25o87P83L2k02n12
$$ 172 148 280 -435 464 374 -134 -249 419 248 -664 347 317 -119 -391 560 135 -552 231 263 61 -451
2159d51Q59l11l46JM13J8q26P19K9j01n99O99J50q70L65N30k65r80J204k5p31
$$ -451 408 97 -249 -248 165 183 -643 76 105 4 -595 104 254 -616 -251 279 14 -966 238 213 -518
2180e18J48N62r5q62Q45j1k44l06O55O1o71K27K30K15r01O69K61l97k86N71K19
$$ -518 -370 192 97 -765 80 69 -175 -481 174 235 -436 -209 21 236 -665 4 265 -132 -418 153 372
2201C72j023O37L83l14o02Q48J46r11M48K85ro74P26Jl57o6K21L60p88M86J47
$$ 372 -651 -14 369 55 -547 301 447 -464 -16 269 260 -414 312 313 -44 -110 111 471 -317 169 316
2222C16O5o81L50N15p06ML76L49j054N96L47n90j67N49K75r75N80N4j59l09K57
$$ 316 381 -300 50 565 -141 -137 239 588 -466 130 477 -113 -280 269 544 -431 149 203 44 -265 -8
2243hK88m51J52j07M13o01J01L60q4l55N2P84r68J34L13J59o16L20M57p59K57
$$ -8 280 -171 -19 -126 287 -314 -213 147 63 -292 -240 544 -424 -290 23 182 -434 -114 343 -416 -159
2264a59Q2K41n63L16J69k09O9k67M53l61J57j42M54l57k37O06k84j33lO15n99
$$ -159 -77 164 -399 -83 86 -123 -54 -321 132 -229 -72 -214 240 -117 -354 252 -32 -165 -168 447 -152
2285a52L4L38j58j22q2N10n61L09j32J66n2j92K72j37J97n57O03j15k49Q7K45
$$ -152 -118 220 62 -60 -142 368 -193 116 -16 150 98 -94 178 41 238 -319 284 169 -80 7 252
2306B52l0n86P60k75j60q6L88j98k93M69k50J49l19L47j47n0J3K6L23o96M17L5
$$ 252 222 -364 396 121 -39 -125 263 65 -228 241 -9 140 -179 168 21 -29 -16 10 333 -363 54 89
2328H9N6m62M41J98o76L21J08J16o75O64m2l16M4J60J17n00L50oJ35l71J69K85
$$ 89 145 -317 124 322 -354 -33 75 191 -484 180 138 -178 -134 26 143 -357 -7 -13 122 -249 -80 205
2350B05l74J19MM34o84K49L92l40k62K13M83p72L28K20q7m32L28L73o14J82N1
$$ 205 -169 -50 -46 388 -296 -47 345 5 -257 -44 439 -333 -5 215 128 -304 24 397 -217 -35 16
2371A6L34o38J85K89j30k21K6N76o23MK94K05o36J09O83o07j26K63M82q80K17
$$ 16 350 -288 -103 186 56 -165 -139 437 -186 -182 112 317 -319 -210 473 -134 -260 3 485 -395 -178
2392a78M89k21k42J23N00p09J89J48J65m34o6O17l72j62oO46o08j65N81o3m59
$$ -178 311 90 -152 -29 471 -238 -49 99 264 -170 -236 381 9 -153 -159 487 -121 -286 295 232 -227
2413b27j7P98p56m6L12L17o35j5O60m94JK0M34m27j54L46nj26k83Q17m28k77J68
$$ -227 -244 554 -202 -248 64 381 -254 -269 391 -103 -102 -82 352 -75 -229 117 112 -14 -297 520 92 -185 -17
2436a7L59l91l32Q90l43l48P6O27o46j98N89p9k92k09O35m07k7mK65j44l37M52
$$ -17 342 -49 -381 509 166 -182 -106 521 -125 -323 266 187 -105 -314 321 -86 -113 -117 148 4 -333 119
2458A19p4j39l01O38j79m72L78K14k82l95P67l00k70J80L11k36l31N15k13m0j73
$$ 119 45 -94 -395 243 64 -408 -30 184 -98 -493 274 -26 -296 -116 195 -41 -372 143 -70 -110 -283
2479b83M26j40l10K18J07Q3n76N70m8j72j83M01Ko39O51n1p0k61L92ol94L16J7
$$ -283 143 3 -307 -89 18 101 -475 95 47 -125 -308 93 95 -544 107 56 -14 -275 117 111 -283 33 50
2502E0R0l41M05j23j7j38J62K40m53K95m0K27n69L69J76m00J31J13J94n70M20
$$ 50 140 -201 204 81 64 -74 88 328 -125 170 130 357 -212 157 333 -67 64 177 371 -199 221
2523B21L3j60j51K04J95m74L13j58K02l69J97J27j80M2j16M06n25J21J84O9k90
$$ 221 254 94 -57 147 342 -132 181 23 225 -144 53 180 0 42 -74 332 -193 -72 112 181 -109
2544a09lL75l96P6k0K77m01J30J77k26J0r0L91l29L6P5R8j91j70M29k88np7M92
$$ -109 -112 263 -133 -57 -77 200 -201 -71 106 -120 -110 -200 191 -138 -102 -27 71 -120 -290 139 -149 -154 -231 261
2568B61m24j59L97r0j27j01N45m34n1J50J06j36k44N23k28oj28L17k18j76K72
$$ 261 -163 -322 75 -15 -142 -243 302 -132 -183 -33 73 -63 -307 216 -12 -18 -146 171 -47 -223 49
2589D9P7q2k80M96j67k48L7L66j78l73O11k32j21j64M87k35l10L43L5p8l26M61
$$ 49 126 44 -236 260 93 -155 -118 248 70 -303 308 76 -45 -209 278 43 -267 76 111 33 -293 168
2611A68j20j75K9K49m4m06L67J5j12l13N70l9m77K91J72j17m08O09j71k58M8K35
$$ 168 48 -127 -98 151 107 -299 68 83 -29 -342 228 189 -288 3 175 58 -350 259 88 -170 -122 113
2633A13k2l93L82k8j0l16L24R4l43O0J58J56n53M31J68l78o6L41N7n00L66J33
$$ 113 91 -302 80 52 42 -274 50 144 -199 -139 19 175 -378 53 221 -157 -223 118 175 -325 41 174
2655A74j12k75L60P4l83J91O9J41m27K38Q9q3j76J45L36n07K09J18L3m49L11K34
$$ 174 62 -213 147 221 -162 29 98 239 -188 50 139 56 -120 25 361 -146 63 181 214 -235 76 310
2677C10m64J49N1K30n46L13J16j59j05J20K64m84K05k3K00l85J11L21k45j57J23
$$ 310 -154 -5 46 276 -270 43 159 0 -105 15 279 -205 0 -23 177 -208 -97 224 -21 -178 -55
2698e5L59m96N1K31o1k15J36L25m50O0J15K11l04l8K63j52l4r4M16l67qJ33O2
$$ -55 304 -192 -141 90 29 -186 -50 275 -175 -115 0 211 -93 -131 132 -20 -54 -148 268 -99 -107 26 88
2721H8j93j04M74l38RN1K73m27j4L72j65j0j94M59l45p4K25J6j16j89M81k91l3
$$ 88 -105 -209 265 -73 -64 -13 260 -167 -181 191 26 16 -178 281 -64 -138 87 103 -13 -202 279 -12 -45
2744d5o7K67j59k11L49p1q6j55L72k01j37J40J38r4k91M38j90n4l5K33r5k45K42
$$ -45 -112 155 -4 -215 134 63 -23 -178 194 -7 -144 -4 134 40 -251 187 -3 -57 -92 141 46 -199 43
2767D3n6L2k85L83r3j85N5J48K6l60L55%l3k40L28l5l25K49J4N5l44M10j0k09
$$ 43 -13 19 -266 117 24 -161 -106 42 68 -292 63 63 30 -210 118 83 -242 7 21 76 -268 142 132 -77
2791g7L7J03J71m19K88j5K7k57J84J73l55J71Q2K17n11K99N9j73m5J21J42m43
$$ -77 -40 63 234 -185 103 88 115 -142 42 215 -140 31 113 330 -181 118 177 4 -41 80 222 -221
2813b21L73o5k4j67K01J39k88J01m0K55l85J34J32q4n7J2L54n06J73J00jk96J62
$$ -221 152 87 63 -104 97 236 -52 49 9 264 -121 13 145 61 4 16 370 -136 37 137 136 -160 2
2836BK02l66J09J8J71l91K20Q4j27k7n7K87l33R2L2J42k21l1K62k80P2k2L42m29
$$ 2 204 -162 -53 -35 136 -255 -35 49 -78 -105 -162 125 -208 -116 -84 58 -163 -194 68 -212 -140 -162 180 -249
2860b49R4K22j63m0m2L52l45J34n8J02o5j47L04j58J42k60L64k68q1K02K6k7k19
$$ -249 -155 67 -96 -136 -178 174 -171 -37 -95 7 -58 -205 99 -59 83 -177 187 -81 -162 40 66 39 -180
2883a80M59l34J9J7J57j48k9K09j75Q6j50K56j58m1R1j8N3l46M16j05o6r9L11
$$ -180 279 -55 -36 -19 138 -10 -39 170 -5 81 -69 187 29 -12 79 61 114 -232 184 79 13 -86 225
2906B25q9l07L56j64M9k04L08r5o2N6k0j2j85K67q8K9j29R1R9l35K21m9J50l39
$$ 225 136 -171 185 21 70 -134 174 79 17 73 53 41 -144 123 35 64 -65 26 125 -210 11 -38 112 -227
2930b27K79M9k72J34M3J47l85L23r3J3j17J29J03k83J73k4J24k35J31P4j09j1
$$ -227 52 101 -171 -37 6 153 -232 91 -2 11 -106 23 126 -157 16 -8 116 -119 12 86 -23 -34
2952c4L5K41l97J83JL8j89J00K24k49J06o8J59l54K15R5j05o9k0K97l74J40P3
$$ -34 1 242 -155 28 29 67 -122 -22 202 -47 59 -9 150 -204 11 106 1 -68 -88 209 -165 -25 48
2975D8K3j66P7J60k49K1QK50k94J6K39k02m5l1L64l52L0J14J7k20P7K70k85N4
$$ 48 71 -95 -18 142 -107 -86 -78 172 -122 -106 133 -69 -114 -145 219 -133 -103 11 28 -192 -115 155 -130 -76
2999g6j1K00k88N7J80n0q9p3K97k55KO0P5j50j17M68l09k7M3K30k61l9K80r9j07
$$ -76 -87 113 -175 -118 62 12 -77 -150 147 -108 -106 -46 29 -121 -238 230 -79 -106 -63 167 -94 -133 147 48 -59
3024e9m5L19k80L1O2N3n0j53L13j59k3o0K27j77r3K08l6o2j15L46l32KJ64N3j25
$$ -59 -104 215 -65 -34 28 81 31 -122 191 32 9 -51 176 -1 -94 114 78 16 -99 247 -85 -83 81 134 9
3049Ij10L10k33N1j03K35r9j50J15LM9k56L26j35m1NQ5j2k37L49k17L2j25K46
$$ 9 -101 209 -24 27 -76 159 60 -90 25 28 77 -179 147 12 -29 -24 61 49 -188 161 -56 -24 -149 97
3073I7j24j22J89q7M7j06K03j53J2j5N5Q2j78J48q8O9j36J58k9j59J92p0R1j85
$$ 97 -27 -149 40 -47 0 -106 97 -56 -44 -59 -4 78 -100 48 -40 29 -107 51 22 -137 55 -15 76 -109
3097a09K00j06k5P3jN7j92K80k00J60j77J17J0n1L4r1K74l32J90j8m1j8mQ7k06
$$ -109 91 -15 -40 33 32 89 -103 177 -23 137 -40 77 87 36 70 -21 253 -79 111 93 52 34 30 117 -89
3122h9J55n4L8n7L8J7j09J57j94J72q9Mo3J29n8j36K53j79O3r0J92j33q0J50j24
$$ -89 66 12 50 -7 31 48 -61 96 -98 74 -15 -11 -74 55 -3 -139 114 -65 -2 -92 100 -33 -113 37 -87
3147h7Q6j14K14k05P7l1P1L5k14J94r1P0j72K32r8j37J44J5J05l01L50j31k4n3
$$ -87 -1 -115 99 -106 -29 -60 11 46 -168 26 -65 5 -167 65 -33 -170 -26 -11 94 -207 143 12 -12 -65
3171f5J20m2j77L01j33P1j64J54Qj71J27O4O9k52J99L8j23k3R4P7k90K89q6N3
$$ -65 55 13 -164 137 4 75 -89 65 73 -98 29 93 162 -90 109 147 24 1 95 172 -118 171 85 138
3195A38k56K22Q8l06J78j4P6k68K82o6j00L7N1M6k69K58l7m5j28Q8J66l00J44
$$ 138 -118 104 192 -114 64 50 126 -142 140 74 -26 11 62 108 -161 97 60 15 -113 -25 141 -159 -15
3218a5L7Q1l74L02M6j79nJ97Ql18K47On7j88K58M8k18O3J1J20k46K21Qj19K2R
$$ -15 22 103 -271 31 77 -102 -107 90 98 -220 27 33 -24 -212 46 94 -124 -61 -50 70 -176 45 53 -66 -44 -35
3244c5J53k79J61K8L4k74K34J02l08J50L7Q9k84K18M9r7mN7J29k96J94n6R7j37
$$ -35 118 -161 0 28 62 -212 22 124 -184 -34 3 92 -192 26 75 -22 -26 31 160 -136 58 2 99 -38
3268c8M8J48k35P9k3K24l08J24J20j66n8Q9Q5k70J96N3j9j45J05M7k48K01q0J38
$$ -38 10 158 -77 2 -21 203 -105 19 139 -27 -85 4 89 -181 15 68 49 -96 9 56 -192 9 -71 67
3292F7k12J22Om9km8K39k38P9OP4p8RJ71k79J49J4Q0k49J92oq6O6KJ15j95J18
$$ 67 -145 -23 -17 -66 -68 -116 123 -115 -36 -30 44 -34 -25 146 -133 16 30 110 -139 53 47 -39 27 29 144 -51 67
3319F7n8Pk4m1J33j41J22m9Q8j49O1Q4j12L8j9J19k33J48l4L4k6N2P9k16J78q4
$$ 67 9 16 -8 -49 84 -57 65 16 104 -45 16 100 -12 26 7 126 -107 41 7 41 15 67 146 -70 108 24
3345B4N0r7Q3j8r1J40r2J09j64J05n9j1j2l9J45j72J33r5P6q7R8Jj60J35j28J15
$$ 24 74 -23 60 42 -49 91 -1 108 -56 49 -10 -21 -33 -72 73 -99 34 -61 15 -72 26 27 -133 2 -126 -11
3371a1j23J42j02J9J17r0L8j69K57j22j4l1R3m1r0K23j48K4l4R4o6k8J05n2O8
$$ -11 -134 8 -94 -75 42 -48 -10 -179 78 -44 -58 -89 4 -37 -127 96 -52 -28 -62 32 -34 -62 43 -9 59
3396E9k31K53r5k3M9N0m3j45K36r4m6l7J53r1m8J50j10O4j45K30k40Q1P9m0Mj57
$$ 59 -172 81 -14 -37 12 62 19 -126 110 16 -30 -67 86 -5 -53 97 -13 51 -94 136 -104 -23 56 16 20 -137
3422a37K51j29J7n2K19j28j33J99j01Mj13K28j86l5J45k9o7o8K73k35L6j7J14
$$ -137 114 -15 2 -50 169 41 -92 107 6 10 -103 125 -61 -96 49 20 -47 -115 158 -77 -41 -58 56
3445E6j20p2J57m4Rr1K04j35p8J08M1o2j02K38j59k2j2J48o2j52K52q9r8M3J78
$$ 56 -64 -136 21 -23 -14 -105 99 -36 -114 -6 35 -27 -129 109 -50 -72 -84 64 2 -150 102 13 -85 -42 136
3470A36j73l4J41J4p2j38K72j41o6kK01l2k81L10p7r2r9K75j09j15J11M2l6j33
$$ 136 -37 -71 70 84 12 -126 146 5 -61 -63 138 106 -175 135 58 -34 -133 142 33 -82 29 71 35 -98
3494i8K13j30n9P4Q3k6j55J79j07L2j42K28m4j21R8M2o7j54L01j20j25Q6M0p2
$$ -98 115 -15 -74 0 83 57 -98 81 -26 6 -136 92 48 -73 25 67 0 -154 147 27 -98 -12 28 -44
3518d4j23K52j17j3j0R8l6j11J29q4N1j38J83n7l5M7%J3j71L04j43m2KJ29m1j81
$$ -44 -167 85 -32 -45 -55 43 7 -104 25 -59 -8 -146 37 -20 -55 -8 -8 5 -166 138 -5 -47 -45 84 43 -138
3544a38K73j13J4j10J80j25K8O2k8l2o5J34j23R0k8M7o1p7J76q0j7q5J47n1n1
$$ -138 135 22 36 -74 106 -19 9 71 43 11 -54 80 -43 47 19 66 5 -72 104 24 7 -78 69 18 -33
3569c3R7k6j8j32K28r6j9J7L0q7n8K29j47ql1J75j70O2P3n9l9k6J35j55P7p4P2
$$ -33 64 38 20 -112 116 20 1 18 48 -39 -97 132 -15 -23 -54 121 -49 13 86 27 -12 -38 97 -58 19 -55 17
3596A7p9%J32j40J5m5R0l7p0J69q2j7j06K41j48MJ09o5n7M2K04k72N5OJ08j35
$$ 17 -62 -62 70 -70 -55 -100 -10 -47 -117 52 -30 -47 -153 88 -60 -56 53 -12 -69 -27 177 -95 -40 -34 74 -61
3622f1K5J13j49Q9j39K24j41KJ21nr0n6K04j47k2Q6P9j85j8K00j83N7m9J24j62
$$ -61 -36 77 -72 17 -122 102 -39 -37 84 79 -11 -67 137 -10 -32 54 133 -52 -70 130 -53 4 -45 79 -83
3647h3M3J13j42R4j05J78j43j7P3K6r4n0K20j84j0J08J07j64n7J75r4o2L5J49
$$ -83 -40 73 -69 25 -80 98 -45 -62 11 37 -57 -107 113 -71 -81 27 134 -30 -87 88 -6 -68 -33 116
3671A16k37Q6R2n6o0K5R2j10j0K9N4r8jJ63j07m5j5J65j51K0M9P0j23M9J60k21
$$ 116 -121 -35 57 1 -59 -34 58 -52 -62 -33 21 -77 -78 85 -22 -67 -82 83 -68 -48 1 71 -52 -3 157 -64
3697f4K7Q1P5k20P3J61j83Q7n3R8j34M3O9K1r1j6K09k45M9Q1K5k15R2J86j51l8
$$ -64 -37 44 119 -101 -28 133 -50 37 -16 82 -52 -9 60 81 -10 -26 183 -62 -13 68 93 -122 -30 156 5 -33
3723c3pJ32k20J18P6o9q2M1J44k09P3L6N5j50J4J42j33N2k4J04j81J01Q1j51J8
$$ -33 -40 92 -128 -10 66 -3 -85 -44 100 -109 -36 0 55 -95 -81 61 -72 -20 -44 60 -121 -20 61 -90 -72
3748g2N9J04j57P9J6k6j01Q0J02j62J05MP9k08Q5O9p1pJ1J16j86N7Q8o1r3N2J73
$$ -72 -13 91 -66 13 29 3 -98 -18 84 -78 27 31 110 -98 -13 56 -15 -22 -11 105 -81 -24 64 3 -90 -38 135
3775A35k52J26J9M5j57K5J59j54L8L4O9j94J09R8l7r5J18N1k61J42K9j4j28Q7
$$ 135 -117 9 28 73 -84 -59 100 -54 -16 18 87 -107 2 100 63 -32 86 137 -124 18 47 33 -95 -8
3799hQ9j43PN0J13k04P7N6k1l3J6Q3k13J59L0k3j06J14L9j70M7P4O9k37J68L4
$$ -8 81 -62 -55 -5 108 -96 -19 37 16 -17 -1 82 -131 28 58 35 -71 43 82 -88 -41 33 102 -135 33 67
3825F7j19m3L7J13j32Q5j9K5r5N2Q6j19N1J7M5j68J21N2q2N5l1J31l02K67l1p1
$$ 67 -52 -95 -58 55 -77 8 -11 14 -81 -29 57 -62 -11 6 51 -117 4 56 -26 29 -2 129 -173 94 63 -8
3851hr3J15R3j75N3K4P2j09M5Q7q8j9M0P1k04J10J21j32o3N4J09j86Q2O6l8j06
$$ -8 -101 14 107 -68 -15 9 81 -28 17 104 16 -3 37 108 -96 14 135 3 -60 -6 103 -83 -1 65 27 -79
3877g9J41M8k12J03K2Rj49J25J7m8n1L1Q8j11M6L2Qj24N7J25j82K4P4L9j92J84
$$ -79 62 110 -102 1 23 32 -117 8 25 -23 -74 -43 45 -66 -20 12 20 -104 -47 78 -104 -80 -6 33 -159 25
3903B5K2q0m3Q9N4k35J70PJ2j10J45oj02Q3k3O2j53P2O4r3mN9J03j85J35j6Pj55
$$ 25 47 -33 -76 13 67 -168 2 9 21 -89 56 50 -52 31 8 70 -83 -11 53 -40 -44 15 118 -67 68 52 59 -96
3931i6J62Kj34J06rN0k06J91Nr2M5KJ06k51J82L9q1m2M7J1j53J21N5k2j07J26
$$ -96 66 68 -66 40 31 81 -125 66 71 -21 24 26 132 -119 63 102 21 -21 26 37 -116 5 60 38 -69 57
3957E7K0j75O5J9L3j32J01O0r8j2Q3Q7k40J46K6j9j39R6J9r4J16l6Jp2J36k4n8
$$ 57 77 -98 -33 -14 19 -113 -12 48 -50 -62 21 108 -132 14 40 21 -118 -22 -3 -97 19 -17 -16 -88 48 24 -34
3984c4%J08j4j84J40L1m5p7J32j6j58J18J0L6j64K01J9j33RQ7n3j42J79J0p7l0
$$ -34 -34 74 60 -124 16 47 2 -75 57 41 -117 1 11 47 -117 84 103 -30 -21 66 13 -129 50 60 -17 -47
4010d7P2M7j57M7J00o2m0Q7Mo2L2KJ3j56J72K0j66J21K1Lr9J23k4o7q2J77p2p7
$$ -47 25 72 -85 -38 62 0 -40 47 51 -11 21 23 36 -120 52 72 -94 27 48 51 -48 75 51 -16 -98 79 7 -70
4038g0P6l2K7j26J54m2o2O6P7j8j56Q8M4p6p6J83k1j27J47m5k0n2J52p5n3L4N5
$$ -70 6 -26 1 -125 29 -13 -75 -9 68 50 -106 -18 26 -50 -126 57 36 -91 56 11 -9 -61 91 16 -37 -3 52
4065E2l0j53J78K5l0q8R5n7p7J15K3j1j78K00q6j8L1P2n6j05K03p9Oo2J16q2m5
$$ 52 22 -131 47 72 42 -46 49 -8 -85 30 53 42 -136 64 -22 -40 -9 63 7 -98 105 26 32 -30 86 4 -41
4092d1N9O3o1j22J43ml5OQ7j15m7J65q2p3K0R0j7r1Q8k5o2j8J08l5q7Q8J3L3j05
$$ -41 18 81 20 -102 41 37 2 8 95 -20 -67 98 16 -57 -37 53 36 -55 33 8 -54 -72 36 1 -86 2 15 48 -57
4121e7J11o3n0nJ42p1j14J13lj9r0K07j45n2J46K0r3p5J98q6o0lJ22m7p6J22n3
$$ -57 54 -9 -59 -64 78 7 -107 6 3 -16 -106 101 -44 -96 50 70 -23 -98 100 14 -46 -49 73 26 -50 72 19
4148A9n1j4J38r3o0J32jo4o4J82j30j8L5N4o5q4J20l2j4qJ37j83l4J86j13J8o0
$$ 19 -32 -46 92 -1 -61 71 70 6 -58 124 -6 -24 11 65 0 -84 36 4 -10 -18 119 -64 -98 88 -25 -7 -67
4175f7J27r0k3N7K8o1p2J70p8J7k0N0r5k7J27m3on6J31o8p3N6M7Oj40J93o2o9
$$ -67 60 -30 -53 4 32 -29 -101 69 -9 8 -12 38 -57 -84 43 0 -6 -62 69 1 -72 -16 31 37 -103 90 28 -41
4203d1j8P0L9j85J77j9p3rJ19q3qQ4n8k6j7J16q1j6M7M4q8l2J46p3o3OJ28r0j4
$$ -41 -59 11 50 -135 42 23 -50 -59 60 -23 -31 53 -5 -31 -48 68 -13 -29 18 62 -26 -58 88 15 -48 -42 86 -4 -18
4232a8P8l1j21M1J42j30K8KR2j12k1R3m6Mr3J63n4j18J49j8n9l4J38j05m5J23
$$ -18 60 29 -92 -51 91 -39 -11 -9 83 -29 -50 43 -3 1 -92 71 17 -101 48 30 -29 -63 75 -30 -75 48
4258D8n7p5M3R9r6L4L6J3p3p4J37o9pl3J38r7m6P2K5l6p1J40j08j1L8P5r4l4J45
$$ 48 -9 -84 -41 58 -38 -4 32 45 -28 -102 35 -34 -41 -74 64 -33 -79 -7 18 -18 -89 51 -57 -68 -30 45 -49 -83 62
4287F2j40L9M4J04j19m7P0Jn1RR5j56N8M6K6m7l0J10p8m5M1J08j05j5Q1J0j25
$$ 62 -78 -39 5 109 -10 -57 13 14 -37 -28 67 -89 -31 15 41 -6 -36 74 -4 -49 -8 100 -5 -20 61 71 -54
4314e4K3J11p4m9PR1o6n7J25n0j5m8J07j13OJ16j9j10nJ42j01OL9O5j67M4J27
$$ -54 -31 80 6 -43 -36 55 -11 -68 57 7 -8 -56 51 -62 -56 60 41 -69 -74 68 -33 -27 12 77 -90 -46 81
4341H1p9n8NJ47j22l0J06l2p3K7O8o9jj2N9p8P4O1j63R8m0O9n6kJ04j34M7L7l
$$ 81 2 -56 -51 96 -26 -56 50 18 -55 -28 40 -29 -30 -42 17 -61 13 74 -89 9 -31 38 -18 -20 84 -50 -3 34 31
4370C1p6P5k2MJ2p0Q7r5N5M3J5r4pJ14j12K9j5Q0j41Q0O9l5l7KN7o8L1J8k6k8
$$ 31 -45 30 8 12 24 -46 41 -54 1 44 59 -35 -42 72 -40 -11 -26 54 -87 -7 62 27 -10 -8 49 -19 12 30 4 -24
4400b4j9R7q2J4j1J03j31J5N9m1l6N3K6r8O9k0M0j09N7P8m1k0J2N9q3N0jl5J1
$$ -24 -43 54 -28 -14 -25 78 -53 -38 21 -20 -56 -3 23 -75 -6 -26 14 -95 -38 40 -1 -21 -9 50 -33 17 16 -19 -8
4429hl1J08j49P9K3l0k4M5N9j07J9nN2j08J00J1o3O8k7L6r5J20j6k8o2O2M5p0
$$ -8 -39 69 -80 -1 22 -8 -32 13 72 -35 -16 -21 31 -77 23 34 -29 39 12 48 -47 73 57 29 -33 29 74 4
4457Dq9J01P2j10J7J10j18KP7k4n9K3M0j06O3k3O0n6l3P5nr1K0Q8j01NM3K0r7
$$ 4 -85 16 88 -22 -5 105 -13 -11 66 42 -17 6 46 -60 3 -20 40 -16 -49 26 21 -70 -50 38 -63 -58 -15 5 -92
4486i2O9O8p0NN5J0j48P4Q9p5m2O2J2j31J22Qlp9N9P7r7L9m8J23j38RQ1l0j4n5
$$ -92 -23 45 -25 -20 35 45 -103 -29 60 -15 -57 5 17 -114 8 16 13 -66 -7 70 -27 12 -36 87 -51 -42 39 9 -5 -60
4516f0N9m5P0n1Ml3N8K5p2M9M6k2q7P3K2m9k5M9O6j25M1MO4q4L0P7j49P9L9j1
$$ -60 -1 -46 24 -27 -23 -56 2 27 -45 4 50 28 -59 14 36 -13 -38 11 77 -48 -7 -3 61 -23 7 84 -65 14 53 42
4546D2j49J58n8Kj0K9N3j79J42m0N0j10N7M7q8J6K0O0j41J02O6p5mJ6M1j24J28
$$ 42 -107 51 -7 -5 -15 14 67 -112 30 -10 40 -70 -13 34 -54 -38 -18 42 -99 3 69 -6 -10 6 47 -77 51
4573E1l1%r3J17J6j24P7kk6p9J05K3qr4R6K0r2N3J1J3q5J05L0j37P3l1P2j75Q7
$$ 51 20 20 -73 44 60 -64 13 11 -15 -94 11 34 26 -68 28 48 -44 9 20 33 -52 53 83 -54 19 -12 60 -115 -28
4602b8P9q1K2NN5j07J06l0k2o7Q3J8p3J7M0ro4J10ml4M2k7O4j81J44q3j3MM8K0
$$ -28 51 -30 -8 -3 52 -55 51 21 -1 -68 15 33 -40 -23 17 8 -56 54 50 16 58 31 95 -86 58 -25 -38 -34 14 34
4632C4l9oJ7q7M7L3O3j53P3M8n3l2M4L9j27M4P5K4j00Q1p0j4M6L1m6J0j8Q6m4
$$ 34 -5 -11 6 -81 -34 -1 62 -91 -18 30 -23 -55 -11 28 -99 -55 20 44 -56 25 -45 -59 -13 18 -28 -18 -36 50 6
4661Fp7R5ko8O5J9m0n1N4k6j8J5Q4l3p2O6Ok6m5M0L2r4J13K5n8r3J19k3Kn5L8
$$ 6 -71 24 22 -46 19 38 -2 -53 1 -25 -43 -28 56 23 -49 17 23 -3 -48 -8 24 -70 43 68 10 -83 36 13 15 -40 -2
4692bN3j17M0R5q5%O1p7m3P1L6j7p4O2l0K3k9N9j7o6J33j7p4l5Q9l8p7O2N9l8
$$ -2 51 -66 -26 69 -16 -16 45 -32 -75 -4 32 15 -59 3 -27 -4 -33 26 9 -57 76 59 -15 -50 39 1 -76 -14 45 7
4722Gm3L8Mk1O6m7Qp9P8j0%l1Q9k3l4j7L6L8p6O1j5n5nJ5M6r1Q7L6m3o6Q7K6j04
$$ 7 -36 2 6 -15 51 4 12 -67 11 1 1 -30 59 36 2 -15 21 59 -17 44 29 -26 -31 -16 30 -61 26 62 19 -47 40 66 -38
4755c8Q2m9oj9Q0o0k3J7K7J3p1P3pr2O4O0j7o7L8pK4q2J14o0n4M0J1Qr7J29rj4
$$ -38 44 -5 -11 -30 50 -10 -33 -16 11 24 -47 26 19 -73 -9 51 34 -33 5 -2 22 -60 54 -6 -60 -20 -9 -1 -98 31 22 8
4787Hm7J17p1p7J07m3j5k1M5pm4PN3n6n2J26j9m3L1J6m4OQ4o2Nm8M7Ml9L4J4K6
$$ 8 -39 78 7 -70 37 -6 -21 -42 3 -4 -48 -41 12 -44 -96 30 11 -32 -1 15 -29 -23 61 -1 4 -44 3 7 -32 2 16 42
4819D2p6O8m5j1PP0l4j30J68k6m2j1Q9n9n8P2n9M4m3Q6m9l1rP3l8k6Q5m6n0K8
$$ 42 -34 34 -11 -22 -15 55 21 -109 59 33 -9 -20 69 10 -48 24 -35 9 -34 52 3 -28 -37 36 -2 -28 57 11 -39 -11
4849a1N1k9K5lL1m9l6R3p0m9N6nj7l3J52j24J2LO5p0rN3J0q6j1M9q0L6K8j1jJ4
$$ -11 40 11 36 33 64 15 -21 72 2 -47 9 4 -13 -46 106 -18 -6 -3 62 -8 -17 36 46 -40 -51 -2 -82 -46 -18 -29 -30 -16
4881a6J20j54NK8K5M7j15Q8k8m9N3O4o0K7K4Np5l9J12m7j9N2l1l6L1L0r6K2L1
$$ -16 104 -50 -45 -17 8 55 -60 28 0 -49 4 68 8 35 59 64 -11 -50 62 15 -4 48 17 -19 12 42 -54 -32 -1
4910aK5n1QN1k3J8k3L3o8KrQ3j08J7R0q8J6m0J61j33k8Q6k0mK1P7j73L4R3n2%
$$ -1 24 -27 -19 32 9 27 4 37 -31 -29 -38 45 -63 -46 44 -44 -28 -68 93 -40 -68 18 -2 -6 15 92 -81 -47 46 -6 -6
4941fm7J59j32MJ7Q4j39K5M1lk2j8N1J1q5J13o7n5L4R6o3l0j7P3q1J5P9p2L9n
$$ -6 -53 106 -26 -22 -5 79 -60 -35 6 3 -19 -37 14 25 -60 53 -14 -69 -35 61 -2 -32 -49 24 -57 -42 37 -35 4 -1
4971aL9k5mM0o4j9K4J22q4k6J9P3q5m3J02m5o3J3N0m5J9O5j08L1PO9o5p4O8qJ
$$ -1 38 13 9 49 -15 -34 -10 112 28 2 21 94 9 -34 68 23 -40 -27 23 -22 -3 62 -46 -15 -8 61 -4 -78 -10 -18 -17
5002a7l2R9p9J1l4J24j04m3Q1JPj8M7j22M1P2n3K7q4Q2L8o3lN6q1k5J39r5J9K6
$$ -17 -49 50 -29 -18 -52 72 -32 -75 6 7 14 -4 43 -79 -38 34 -19 8 -76 6 44 -19 -22 34 -47 -72 67 -28 -9 17
5032A7K5j23L4O6j6j6j8O5k8m3KQ4n0K7rqj3MQ5r1L2jLl1j8R2p9K9nL6o0L9K7
$$ 17 42 -81 -47 19 3 -13 -31 34 6 -37 -35 49 -1 26 17 9 -4 0 85 -6 26 25 28 -3 -21 71 -8 21 16 52 -8 31 58
5065E8p4J3N5K2p4j4K7j7J1j8M2n3L2MOp3j0Q6p7O3k5L6k7K6J1m6M9RL2r1J9P
$$ 58 -16 -3 52 74 0 -14 13 -4 7 -11 31 -22 10 14 20 -53 -63 23 -54 9 -16 20 -7 19 30 -16 33 42 74 -17 2 9
5097IK8m0j2O6q9K4L6J0j28O1Q0n0m3L7O3r3N4N1o9OOk0nP4l7J8m5L8M8j13N8
$$ 9 37 -3 -15 51 -38 -14 22 32 -96 -35 45 -5 -48 -11 52 -41 13 64 -5 1 7 -13 -18 56 19 37 -8 30 78 -35 23
5128B3j8P9j23O9j2pqkM6q1N0KL2n1qj0K8K0l9J00j34J2K5l7L7j6N3j08P2O0k2
$$ 23 5 84 -39 30 18 11 3 1 47 -34 16 18 50 -1 -9 -19 9 29 -10 90 -44 -32 -7 -44 -7 -23 30 -78 -6 54 32
5159C2o6K4M2n4j3nO1p4K5R5p3l3M9M6j16J3N8K6j02M1L2p2L5L2O7j25O2k1j3
$$ 32 -34 -10 32 -22 -35 -40 21 -53 -28 67 -6 -39 10 56 -60 -47 11 37 -65 -24 8 -64 -29 3 70 -55 7 -14 -27
5188b7k6O1k8NRO9n5m4N8Qp9M1j4N2p2M5M3p4N0k5O7r4P4K0n4q3Q7O9j30O7m4
$$ -27 -53 8 -20 -15 -6 63 8 -36 22 30 -49 -8 -22 30 -42 3 46 -28 22 -3 64 -30 44 64 10 -73 14 83 -47 20 -24
5219b4Q8j19O5L8m5nJ9N9q6l0Q8m3l7LK0k6M1Mj3n1j2M2j1J9j4L7k1LM2k0noP
$$ -24 64 -55 10 48 3 -2 17 76 -10 -40 48 5 -32 -29 -9 -35 6 10 -3 -54 -66 -24 -35 -16 -30 7 -14 -11 31 11 6 0 7
5252Gn9N1j0qj9M7O4j08L5N0p8m4Q2k7QJ1l0M1m6O7k6Oqk7M8l3J3OL0p3rN5k8
$$ 7 -52 -1 -11 -19 -38 9 73 -35 0 50 -28 -72 10 -17 -9 2 -28 13 -33 34 8 14 6 -21 27 -6 7 13 43 -30 -39 16 -12
5285a2m6L4N6n8J1L2L5p0J0M8r7Q0l5k7K4J3K1J5L1m5K5q3N3p9L5l4J04k3n2M0
$$ -12 -58 -24 32 -26 -15 17 52 -18 -8 40 -57 23 -12 -39 -15 -2 19 34 65 20 45 -38 15 -64 -29 -63 41 18 -34 6
5315Fq%n7O0J1o5R5m0Pm1L7rK9l0NM1o9qM8k3PN1L0o8kN6l7p2J18m0j06J14k9
$$ 6 -2 -2 -59 1 12 -53 42 2 9 -32 5 -4 25 -5 0 41 -28 -36 12 -11 -4 47 77 9 7 63 26 -46 72 32 -74 40 11
5348A1K5r5J29n1l9M1oLl2J6Rrq6J02k7K6m4Q9o2p7P4j1K9l9P5l7o9R6l6J3n5
$$ 11 36 -59 70 19 -20 21 15 18 -14 2 11 2 -84 18 -9 17 -27 62 0 -77 -3 -14 15 -24 51 14 -55 41 5 18 -37
5379c7J05m9j7j5K1Q3j48J02J1n2k5M8k1n2J09n7j6MjJ07j14L7kL2j10M4M9j1
$$ -37 68 19 2 -13 8 91 -57 45 56 4 -21 27 6 -46 63 6 -10 -6 -7 100 -14 23 21 53 -57 -13 36 25
5407B5JMQq3Q1K7n1%M4%q7OM3nr5J52p7l1M4J9J3r3N5jK9m6J4L5l2N2m1J4nk0
$$ 25 26 30 38 -45 36 63 12 12 56 56 -31 -25 18 13 -82 70 -7 -38 6 25 38 -55 0 -1 28 -18 -4 31 -1 51 10 24 19 -1
5441aL0o5J8M9o6m8J04LOm2M7j5l0K7o8O4r5J10o1MJ4KK9o2O9nl9k2J4N3r2P3
$$ -1 29 -36 -18 31 -35 -83 21 24 30 -12 35 20 -10 17 -51 13 -82 28 -33 -29 -15 -13 16 -46 23 18 -21 -43 -29 24 -68 5
5473Ek0J%lJ3m1O3j0L3n1KJ0mom0K5lO5Jj7p6P5k7NM2m6lm2Q5l9L4mn5MQK9j4
$$ 5 -15 -14 -14 -17 -4 -45 18 8 41 -10 -8 2 -2 -8 -48 -23 -26 39 40 23 -53 22 -5 0 42 -4 -7 -49 36 -3 31 27 -28 -24 -16 13 -1
5510aJ3k7L3j8k1J4K7n4kO4p6K5M8j9lLK6l0K6m4M9m9m2N8j3N3m2kK7ol6j7j3
$$ -1 12 -15 18 0 -21 -7 20 -34 -36 28 -48 -23 25 6 3 6 32 2 28 -16 33 -16 -58 0 -13 40 -2 -4 23 17 -19 -36 -49
5543d9N6Jm3L2l3O2mp1Q8q1J9jl1L8N3k6rM3l9k1O4o1J0k3j6M2RM4k4%K2r9Q0
$$ -49 7 8 -35 -3 -36 26 22 -49 39 -42 -23 -24 -55 -17 36 10 1 44 5 -16 48 -13 -3 -26 -42 0 9 53 29 29 51 -48 32
5576C2pJn1K7L4q1M9j0qjk2N6m1lj7L9k5LK2No1N7O8p3k5M7l6K4k1K6k5K3M1k0
$$ 32 25 26 -25 2 36 -45 4 -6 -14 -15 -37 19 -22 -25 -42 -3 -28 -25 -3 2 -59 -2 66 -7 -32 15 -21 3 -18 8 -17 6 47 27
5610B7j7k5L9K3k0l9Q1q0L6rj3k6k0R9q2M4oJ2j6l8N8l9O8r4J16n5m0K2M1m6k3
$$ 27 10 -15 24 47 27 -12 69 -11 25 16 3 -23 -43 56 -26 18 12 24 8 -30 28 -11 57 -37 79 24 -16 6 47 1 -22
5641b2R5n6l0k3J19r1l7O0j1jm7Q7k4j4JKp2N0M3k5l3k4O6L3p4M1k4L5n9J8m6
$$ -22 73 17 -13 -36 83 -8 -45 15 4 3 -44 43 19 5 6 8 -64 -14 29 4 -29 -53 13 46 -28 13 -11 24 -35 -17 -63
5672f3J4K7M1jn3L2n6L8jLmj2N4m0P5p1K1k4Qm3O0K6n7O0o3kL4K6k2n0L7oM9k0
$$ -63 -49 -22 19 18 -35 -3 -59 -21 -22 -19 -23 -35 19 -21 54 -17 4 -20 -12 -55 5 31 -26 34 -29 -31 3 29 7 -43 -6 -12 37 17
5706A7K3o0L6k4j8J2l1N8pJ6o4N7Nn4K3Lk3k0P8k6k1N1j2k7l0R2m1%Nj8LrJ2k5
$$ 17 40 -20 16 -8 -26 -14 -45 13 6 22 -42 15 20 -34 -11 -8 -31 -51 27 1 -20 31 19 -8 -38 54 13 13 18 0 3 -6 6 -19
5740a9K9MK9k8Pl2j7QJ1l5J9MK1J5q5P9k9o4J03m4K2nrm4J2R6o7OJ7L4j7k3n1
$$ -19 10 14 43 15 22 -10 -27 -19 -8 -43 -24 -20 1 16 -69 10 -19 -83 20 -24 -2 -7 -16 -60 -48 48 -19 -13 4 38 21 -2 -53
5773e3L0O7p6KK2K2j7N6J5q6K4k8%J2K2rk8M9j9N9p1k0J13o1l0m2Q7m8K5J0o2
$$ -53 -23 44 -32 -30 -8 14 -3 53 68 -18 6 -22 -22 -10 12 3 -25 24 5 64 -7 -27 86 25 -5 -47 40 -8 17 27 -35
5804c5K1J8jl3O8q1R8j12Q0k4K3l5J2M6m1L1l7M7m8oJ4Pl9nN6k0Nm9N1n6P1J2
$$ -35 -14 4 3 -30 38 -43 55 -57 23 -1 22 -13 -1 45 4 35 -2 45 -3 -9 5 12 -27 -32 24 4 9 -40 11 -45 26 38
5836C8r7M6%J9j9L0k5k5L6K6K5m2l4L4l8qJ5J5n9J01mj6k0m4P3q9Q3Mqm5ON2j06
$$ 38 -59 -13 -13 6 -13 17 -8 -33 3 29 54 12 -22 12 -26 -34 -19 -4 -63 38 34 18 -2 -46 27 -62 21 25 17 -28 -22 30 -76
5869g6L6J5Q4o7nj4L3k0j0P4p4L9n2N4o0J3R3p3l2j4O2K1J8q9J4k4L5J3J3mj8
$$ -76 -40 -25 59 -8 -13 -27 6 -14 -24 50 -24 15 -37 17 -43 -30 63 -10 -42 -56 6 27 45 -44 -30 -54 -19 -6 7 3 -15
5900a5O7q2K1rL9k8NM2p1N8k2pJ7m7K3K1nl7M3o9M7J9oj9OPl4M7k0L8m6J9J0M
$$ -15 52 -30 -9 -18 21 -7 -2 40 -31 27 5 -2 15 -32 -9 12 7 -30 13 -56 -9 10 4 -15 -9 -2 -36 11 -9 29 -17 2 12 16
5934A6m0K1QnK3j7K2J7o7N1p5J0LN6k8L4Qn0N0j2K5k8k8L2k1L7m6K5k6K1k9K4
$$ 16 -24 -3 5 0 23 6 28 45 -22 29 -46 -36 -33 23 -5 29 37 -13 37 25 50 22 -6 26 5 42 -4 21 -5 16 -13 11
5966A1K9j22R4l4Qp4J10k4k9J16r6N0m2Rk4J0k0O2k0m1J5K3Qn8K5J9k6K8l0P8
$$ 11 40 -82 12 -22 -14 -88 22 -2 -31 85 -11 39 -3 6 -18 -8 -28 34 14 -27 -12 11 19 -39 -14 5 -21 7 -23 55
5996E5r2Q2Pk9n3N6l6jM9p3M5jm6L6j1j4N5m7KMP0p0L0kK9n1N3q4Q1q8J7NL0j2
$$ 55 -37 45 52 23 -30 26 -10 -11 38 -35 10 9 -37 -1 -12 -26 29 -18 -16 -12 58 -12 18 16 45 -6 47 -37 44 -44 -27 -22 8 -4
6030dn4N4J3j4pQJ8l3N8q6K9M0K5o8K6M3p3K7K1j4M4m9n0NL2j8L2K2m1k9R5l6
$$ -4 -58 -4 9 -5 -12 -4 14 -19 39 -47 -18 22 47 -21 5 48 -25 2 23 9 53 4 -46 -41 -9 -27 5 27 -14 -43 52 16
6062A6k1J3mj6n8R5m8J0k4O7o7J8N5j8k5rpK0l8OJ3L2m1M1O3q1J4M1j5o8Q2p2
$$ 16 -5 8 4 -12 -70 25 -23 -13 -37 30 -37 -19 36 18 -7 -16 -23 -3 -41 -35 -22 10 -31 10 73 -8 6 47 32 -36 46 -26
6094b6l5O8k2L7j1l5L2O5j23Q7m1l8L1QL2r6R0n0N4l9ML2n1J0J3J4o9P1nM3p9
$$ -26 -61 7 -15 22 11 -24 8 73 -50 37 -4 -42 -11 -3 29 -67 23 -27 27 -12 -8 24 -27 -17 -4 10 -59 12 7 50 -29
6125b9L6J1m9J5O4p9ML8Kp0P8k0M9j06P7j7m0L8k2O7p7R2p2O1p5QP4l5o6L1L3
$$ -29 7 18 -31 -16 48 -31 -27 11 13 -57 21 1 50 -56 21 4 -36 2 -20 47 -30 62 -10 51 -24 -16 58 23 -43 -12 21
6156B1m4N3L6p5J2K2jn3M6k3j9O3k8J3J5m5QK7m9KN3l0Nn5J21r4L9K4p3J3J5K5
$$ 21 -23 30 66 -9 3 25 24 -29 17 -6 -25 38 10 23 38 -7 1 28 -21 -19 34 4 9 -46 75 -19 20 44 -29 -16 -1 24
6188B4j14P6ON7n6O1p4K1J1m2Q9o7l4L6K5m5NLok3L2L3J9j16OP3KK3m1J6M1p6
$$ 24 -90 -14 -8 49 -7 54 -20 1 12 -30 59 -8 -42 -6 19 -26 -21 -18 -24 -47 -15 18 37 -79 -73 0 2 25 -16 0 41 -35
6220c5M6K2Mm0j4RO0l5l5J6K6j8j6k2J9L2Rm9L1K1l9O1r8J03o2M3k2j4O0Ol2n4
$$ -35 11 33 37 -3 -17 -8 52 17 -18 -2 24 6 -10 -32 -13 19 28 -21 10 31 -8 53 -45 58 -4 39 17 3 63 69 37 -17
6252a7J0k4O0nlM8p7K1j2M9l3j5M5m0Rk7L8q7O1k4K4j0mK4m0J8j7oOM4l0M8l0
$$ -17 -7 -31 29 24 21 69 -8 13 1 50 17 2 47 7 16 -11 27 -60 1 -23 1 -9 -13 11 -29 -11 -28 -34 -28 16 -14 34 4
6285Dm3P7m4J3L3K6r7KN3j2l1K5J1MNo3K5LK7M8n0L0j7N5j11oO7Jk8j2N1o2O6
$$ 4 -39 38 -6 7 40 66 -31 -29 24 12 -19 6 17 21 26 -37 -12 -9 18 66 16 46 29 84 -27 -33 34 35 7 -5 46 -16 50
6318E0n3j1J7k0J11j40L3PJ0M5j43J19J3m6oO9j00K7M8m5KL5M6r1QPJ5k2n6Q3
$$ 50 -3 -14 3 -17 94 -46 -13 -6 4 49 -94 25 38 -8 -14 55 -45 -18 30 -15 -13 22 68 -23 -15 -8 7 -15 -71 12
6348A2J3jn7L6O1r9J1j9N3o1Q1k2J0k7J6jm4L8j5M8J8n8rk2O3P3j10l3N9L4l5
$$ 12 25 24 -33 3 64 -35 -24 -43 10 -51 30 8 18 -9 7 6 -38 0 -15 33 51 -7 -16 -38 25 98 -12 -45 14 48 13
6379A3pm9P5n0N6l9kl0QP4l9k8PJ3k4L8j2k3O5l7J5k2J1J9J7j29R0L2j6k7mM8
$$ 13 6 -43 32 -18 38 -1 -3 -33 -25 49 10 -18 -11 2 -22 16 4 -19 46 9 24 2 13 32 49 -80 10 42 26 -1 -5 43
6411D3q0O8r%l6M8p5k5N4O4o6Om0K0K2l8K6M4l7Lj4Qk0K1O0p4M3j3J5r3L5J0L0
$$ 43 -37 31 22 22 -14 34 -41 -66 -12 52 -14 -8 -48 -28 -6 -44 -18 26 -11 -8 -22 -14 -34 -13 47 -27 16 3 18 -75 -40 -30 0
6444@k2PL1m5Q2j2o5O8l7Qk3K4K7rl6n5M4j7J7L6J7j04L6J3N7l4m3M8j2oL9j3
$$ 0 -22 -15 16 -29 53 41 -24 44 7 15 -8 16 43 34 -2 -57 -13 -30 -13 23 40 -64 -28 -15 42 8 -35 13 1 -5 34 21
6476B1QRK1j03K5J2Kk7M5j9j0j7MM3j6Mk1K9kp5P3Jm6N0K6m2j7K5L7k2p3P8m5
$$ 21 29 38 59 -44 -19 -7 -5 -32 13 -6 -16 -33 -29 14 -2 2 -19 10 8 -67 6 7 -39 11 37 -5 -22 3 40 18 -55 23 -22
6509b2M6j6jJ7n3J9oM4m9L8l0K5jk0L2j26J38k6l5M2npjLm3RkM0pL3k7l1O7q2
$$ -22 24 8 7 24 -29 -10 -16 28 -21 17 -13 12 11 -9 23 -103 35 9 -26 16 11 4 3 6 -37 -28 -30 10 3 36 9 -22 45 -37
6543c7J07n7jo0N6Q8k06J08n1M1J2k2RJ2P0r4jL7Rrnk8nJ02o7p6P4J6j0j6L6m3
$$ -37 70 13 12 -48 8 96 -110 -2 -53 -12 0 -22 -13 -1 69 -25 -26 11 20 11 6 -22 -27 75 8 -68 6 22 12 -4 32 -11
6575a1m9N7L9p1O8n9j5lO9n6K9LqK8n2k1K2L0m8k9J51q6ln5P2l6J11o3l7N6p5
$$ -11 -60 -3 36 -35 33 -26 -41 -44 25 -31 -2 1 -7 21 -31 -52 -30 0 -48 -77 74 -12 -15 -70 2 -34 77 14 -23 33 -42
6606d2J23r0M6K8n8K3q8Q4k1k1J2Oj3oN8Lp7K3J2o9M7J6M2p2J7O4m7m8O7Ql9q
$$ -42 81 -9 37 65 7 30 -58 26 5 -16 -4 2 -11 -17 41 44 -33 -10 2 -67 -20 -4 38 -34 -17 47 0 -48 19 27 -12 -20
6638b0M7p0J9J7P7q3K4k2O8m7m3R1r2J2lQoJ7J7k2N7q8M2J8p6L4pL5l2qM9k0m2
$$ -20 27 -43 -24 -7 70 -13 11 -11 57 10 -33 58 -34 -22 -25 -17 -23 -6 11 -11 46 -42 0 18 -58 -24 -31 4 -28 -36 13 -7 -49
6671d9J25l8p1M6j6N7r4K0N2l9K0k2K5l4O1m8N9p0O1jj0k2J4j1j0N0j1k9j3k6
$$ -49 76 38 -33 13 -3 54 -40 -20 32 -7 13 -9 16 -18 43 -5 54 -16 45 44 34 12 26 15 5 55 44 15 2 -24
6701b4k1L8J0M6o4J2L9jo7jQ1p2m7J00l4JJ2J4K9o6N7n5J6n8L9j0M9m1M0n7K2
$$ -24 -45 -7 3 49 -15 -3 36 35 -32 -33 48 -24 -71 29 -5 -4 8 22 51 -15 42 -13 3 -55 -16 -26 23 -18 22 -35 -13
6732a3J6K0j0q7N3K8j0%j7jj0K4K7j1j5l9O6Ko0JN5k0l3J4j9M1j9L4k2RN0p6L2
$$ -13 3 23 13 -74 -21 7 -3 -3 -20 -21 -31 -7 20 9 -6 -45 21 23 -37 -36 19 -1 -34 -20 -39 2 -17 17 -5 4 54 -22 10
6765A0J8M0k4n8j4N1J8j9K7o9K3o6Q3km8P3m2m2J6N1l4lk0J0O8n4J5nj0j2J6K1
$$ 10 28 68 44 -14 -28 23 41 22 49 -20 3 -63 20 18 -30 43 1 -41 -25 26 -8 -11 -31 -21 47 -7 8 3 -7 -19 -3 18
6797A8p4O4kJ2o6L6%N3p4J08m0o5N4M0m4l5K3m8L0M4J3j0o2K3L9j09O5o5Q5m1
$$ 18 -56 8 6 18 -48 -12 -12 41 -33 75 35 -30 24 64 20 -15 8 -40 -10 34 47 37 -25 -2 37 -72 -7 -72 13 -28
6827b8QMO2q1P1n6j6O0m0L8j07J12m7mmJP1p5K2ON7j6n6K8n0L6M1L8p1K3j6or
$$ -28 -20 -16 46 -35 36 -20 -36 24 -16 22 -85 27 -20 -24 -28 -27 44 -31 -9 -3 54 38 -18 10 -40 -4 37 75 4 27 11 5 -4
6860dl7M7p0M5KJ3l2J1K3k1M3k7K4k7KK3K3j4m2L8n2P4o4J3J9k3N7p5K9p5J15
$$ -4 -41 6 -64 -19 -17 -4 -36 -25 -2 -23 20 -7 17 -10 -8 15 38 24 -18 20 -32 42 -22 -9 10 -13 44 -31 -2 -77 38
6891C8r1M9K8ln4O0L2o8J0J9K0j05O7J9p7P6K3j0o1M4mL5k7l2jqRnNnM9J8j2J0
$$ 38 -53 -4 24 21 -33 27 59 -9 1 20 40 -65 2 21 -56 20 43 33 -28 16 12 47 20 -12 -13 -21 -12 -17 -12 -17 32 50 38 48
6925D8m2M7pr4J35m7m6n3K9K9Jj2K3OnJ1j4K5p0j7O9p8M2O4q7O4L3m6Pm5J5l0
$$ 48 6 53 46 -48 87 40 -6 -59 -30 -1 0 -12 11 17 12 23 9 34 -36 -53 16 -62 -20 44 -43 21 54 8 15 -30 -15 -45
6957d5J8pL0J0k2M4Qo5N3k0Ml1J4K2n0M7K3k8p5J02o0P8l6m8Q0l4prQ1j10K1J0
$$ -45 -27 -34 -4 6 -16 28 36 -29 24 4 8 -23 -9 13 -37 10 33 5 -70 32 -28 50 14 -34 46 12 5 -4 77 -33 -12 -2
6989bO6p3O4Mj07kk5P4L0N1q3l9mRQ7p2L9mJ4n3L3lm3qL1L8q3O1%m0K6j6L3ml2
$$ -2 64 -9 55 59 -48 -50 -75 -1 29 80 -3 -42 -46 -37 50 -22 17 13 27 -26 7 4 -39 -47 -16 22 -61 0 0 -40 -14 -30 3 -1 -33
7024c3J4N8j09NN2Kj2k1N9J9o7J12r1jj6K0M1o3L3J9j4j7O7l7k2j7L3kork3L8
$$ -33 -19 39 -70 -65 -13 -11 -23 -44 15 34 -33 79 -12 -13 -29 -9 32 -31 2 21 7 -10 57 20 -2 -19 14 12 6 -3 -26 12
7056A2k1M9k3j7k4M5j1j02P0nK1l4R0p9j7K8M6Mq6J04l6JJ5k5K6p9P1l0K7l2Q
$$ 12 -9 40 17 0 -24 21 10 -92 -22 -27 -6 -40 50 -29 -46 -18 28 32 -54 50 14 15 30 5 31 -48 23 -7 20 -12 -4
7087dj2n3R3j1p2M5M2J6K7r2NJ1j9L1KJ8p4J4L9pJ4l1m6j5R8n1J3K3OJ2l7L6j9
$$ -4 -16 -69 24 13 -59 -14 28 44 71 -21 -16 -5 -24 7 9 27 -47 -33 6 -1 13 -18 -64 -79 19 -32 -19 4 10 22 -15 21 2
7120Bn4K5L5K9m5l0L5L9l9K4lk2K3m5L0m6K9J1Rj19J26L5q6K6oO1q6N5J8m9qk9
$$ 2 -52 -27 8 37 -8 -38 -3 36 -3 21 18 -4 19 -26 4 -42 -13 -2 7 -112 14 49 -37 -11 -17 44 -42 13 31 -18 -26 -55
7152e5Q8j08N2N3Nl8L8J2q5M5l1Q4n0K4j2k7M5l1Kp9N9%K2n2P4n1k0O1n2L6j6
$$ -55 33 -75 -23 30 35 -3 35 47 -38 7 -24 60 10 34 22 -5 40 9 11 -68 -9 -9 13 -39 35 -16 -36 25 -27 9 -7
7183gJ4M1o5j9k8R9K2o3n1Q2J1j16Q8Ok3m3K1M0J8l3m7O2n1L0j7K5Mm1QJ7kj8
$$ -7 7 48 -17 -36 -64 35 57 -6 -57 25 36 -80 8 14 -9 -52 -31 9 27 -6 -53 9 -42 -12 -29 -4 0 -41 -33 -16 -18 -36
7215c6N9l0QrQl3J8L5k6OoMk1J8OjK1m9K1l7Q4l5L1o9L6k0J4Kn7R9m8JQl6mM5
$$ -36 23 -7 1 -8 0 -33 -15 20 -6 0 -6 -2 -23 -5 1 0 21 -28 -7 -44 40 5 36 -33 3 -17 -3 -1 -58 41 -7 -6 2 -34 -38 7
7251GJ5m7J9km9L6Lj7l7N4N6l6J4k3M3q5M3j4O4o3L3J9m3J0l1P3l8L5J8n7R%K8
$$ 7 22 -25 -6 -8 -57 -21 -18 -35 -72 -18 38 2 16 -7 36 -49 -6 -20 44 -19 14 33 -10 0 -31 42 4 39 57 0 9 9 37
7284C7No1OP6k4l5N7o2l4K1M1j20J13l0K7k4l0P0o9O4l7L7q3L5K1j9jJ7J2j3K6
$$ 37 42 -19 -13 63 39 4 61 -1 -35 -14 27 -93 20 -10 17 -7 -37 33 -36 28 -9 28 -55 -20 1 -18 -19 -2 10 -3 23
7315B3p3P3qLM0m5k8L8J4k2l7kO1j9k2M5l9j9%L8j6m4O0j3l7l7J7N1qm1N0Om3
$$ 23 -50 23 15 18 58 13 -15 23 37 15 -22 -24 37 18 -4 41 2 -17 -17 21 5 -39 21 8 -29 -66 -49 2 -6 -47 3 9 -34
7348c4P7j4l7NL7Qn0J00l9p0J5L2k2n2K8Q2n8K0L1j16J20k9o7N3n8J5L7Rk4M2
$$ -34 43 29 -8 -3 34 42 -8 92 53 -17 -2 30 8 -44 -16 66 8 28 59 -57 63 34 -33 20 -38 -23 14 23 -1 41
7378D1r0P1k3mJ6p9M3J4m8M2K2j3lN3Kp6j4P5k6k6J2M6l6J5JpQl2N1J0r0N2k0
$$ 41 -49 22 -1 -5 11 -68 -25 -11 -59 -17 5 -8 -11 42 44 -32 -46 29 3 -23 -11 35 -1 14 15 8 16 -16 35 45 -45 7 -13
7411a3J7jPl0l9O6l1M6l0%K7l3N3l5OOm3M3j4j7jmk4L6nK1J5rJ1L8m0o1K6J7j7
$$ -13 4 3 10 -20 -59 7 -24 22 -8 -8 19 -14 39 4 10 16 -27 16 2 -15 -16 -20 -44 -8 -13 8 23 14 25 63 23 -38 -12 5 -12
7446a2l0O3o5K1N1L3m5m6O6o1J4j2PQN4p8M9ll4P1n6nM1J5j6m6J6j3M2m4J7l0
$$ -12 -42 21 -44 -23 28 61 16 -30 36 -25 -11 -23 -16 -8 46 -32 17 14 -20 51 -5 -10 31 46 30 -16 0 -13 29 -15 2 -28
7478b8J0N0j3J8p8M9%j4J1l9K5M6M8j06j2k2L1J6Mj5J2Q0j04N0pOj1J4L2p9L4
$$ -28 -18 32 19 37 -41 8 8 -6 5 -34 -9 37 85 -21 -33 -55 -24 -8 -4 -19 -7 73 -31 19 12 18 7 21 53 -26 8
7509HK2q6QL6jL2PJ0j7m1M4M6l2l5K2k1rL8nk9j1J2l1j5N9k4J8p3J7R2l5l0k6
$$ 8 30 -56 -48 -12 -13 19 26 36 19 -22 22 68 36 1 23 2 -7 31 26 -3 -14 -2 -33 -48 11 -13 5 -68 -51 41 6 -24 -50
7542e0M7Ql2K1L6q7O7NJ8n4L4M0r6M2rRK3k0M4l6Kk3L0l3LN2m7J0J1j1k5j9O9
$$ -50 -3 5 -27 -6 30 -57 10 15 33 -21 13 53 -43 -1 -10 -1 22 2 46 10 12 -11 19 -14 -11 41 -6 4 15 4 -21 -40 29
7575B9o4P1Mom6J2qM1p2NJ02o1J3j7k7MK9l8O6o1L6L5l7qQ8m9l4K1J1m3L1j5L
$$ 29 -35 36 40 34 -12 0 -8 33 -39 -34 68 7 20 3 -24 -20 9 -29 37 -24 12 47 10 2 90 41 7 28 39 -4 27 12 15
7608A5j9nM8q1mJ1L8j5k1M2M5r0K4O7m9m4L6j%k3P3l9ok9Ll4O7l4j4M6j6L4k2
$$ 15 -4 -9 39 -42 -46 -35 3 -12 -33 9 54 -36 -12 55 6 -38 -2 -3 -3 -26 47 8 2 -27 -24 -58 9 -25 -39 7 -9 25 3
7641CJ9j8L6l9KL0k5j8OQ8j06K1l3J4M0n0M4l4L4o2M5omM1Nl2nj2K6J6Qm8J5J7
$$ 3 22 4 40 1 3 33 8 -10 -4 84 -22 -1 -34 -20 20 -30 14 -20 14 -48 -3 -9 -13 28 33 1 -4 -16 10 26 34 -14 1 18
7675A8k8N8m5Pj0j4j1N2L6p8PNm4M9%m4O5p6P7m9J8PJ4p2N2M3l9Ql6M4n6pQ4k7
$$ 18 -10 48 3 10 0 -14 -25 27 63 -15 -8 -3 -47 2 2 -42 23 -53 24 -25 -7 0 14 -58 -6 37 -2 6 -30 14 -42 -49 35 8
7709Hm4L3rJ5N4o5j7M0o3R7m1j3J6m2O2p4K8jJ23j12L6m8N4p3JN4l1L4j2PK1n6
$$ 8 -36 -3 -12 3 57 -8 -25 15 -48 49 8 -5 11 -31 31 -43 -15 -16 107 -5 31 -17 37 -36 -35 19 -12 22 10 17 38 -18
7741a8j4L5k9Q0j7r8Q4k8nN6n8RN8m1pJ4m1O3m2o4M1mJ2oj9N0K2J4q9J03q2K8
$$ -18 -32 3 -26 54 37 -61 23 -5 -10 46 -12 -3 55 14 7 21 -20 43 1 -63 -22 -26 -14 -20 -39 11 33 47 -42 61 -21 7
7773Gl0J5rK2M8j02O7o6J2j3N1lj4kL8j5L5km9J3k2K9k6J9N4p5M2K2J3o6J2oj8
$$ 7 -23 -8 -17 5 53 -49 18 -48 -36 -49 2 -1 -15 -17 21 6 41 39 -10 3 -19 10 -16 3 57 -18 24 46 59 -7 5 -1 -19
7806a9N8o4L5j5Pnl3K3l0Kk6O5K7l1l9N8Rk9J9k8N8j31Q9nK7K0n5M2m6J8j7K7
$$ -19 39 -25 10 -5 2 -3 -36 -13 -43 -41 -67 -2 25 -6 -45 13 22 -7 12 -16 42 -89 0 -5 22 42 -13 29 -17 1 -16 11
7838A1jLK5n2%pN1j7l8J2J0j3jK7n7P2l7K3jj3OrJ3Kk9L1J6ql4J0m3J12l7J8l5
$$ 11 10 13 38 -14 -14 -21 30 13 -25 -13 -3 -16 -17 10 -47 25 -12 11 10 -3 3 -6 7 9 -20 11 27 19 -15 -5 -48 64 27 45 10
7873A0rL1o6N9l4j8mM4l8l8Q2k9%nN7k0j8j1j5K9k4M3k3kJ4J7m8lO7j2o4m0J05
$$ 10 1 32 -34 25 -9 -27 -31 13 -25 -63 19 -10 -10 -15 42 22 4 -7 -22 7 -17 26 3 1 15 32 -16 -19 48 36 -28 -68 37
7906C7n1MO2n6l0mRK5%n8O7J6k8J1J3l4j1K2J3m1J5M2j1k2L0l0K4Ll0l9J5N2j6
$$ 37 -14 -10 52 -4 -34 -38 -29 -4 -4 -62 5 21 -7 4 17 -17 -28 -6 7 -34 -19 23 12 -10 20 -10 14 17 -13 -52 -37 15 -1
7939aqj6J4L2n7L2K0l8N2K8p9N2j9L5m6K0k5kN6m8k0J7J0JMK5m8rJ3Pm1N0n3M
$$ -1 -9 -25 -11 21 -36 -4 16 -22 30 58 -21 31 12 47 1 21 -4 -6 50 2 -18 -1 9 10 14 39 -9 -18 -5 2 -39 11 -42 -38
7973c8P3k1K5o0K5J0k9n1N6jM1l6l3M4NqM6k2l3j4L3m6NL2jK9r2N8k0OJ1j4k2
$$ -38 35 14 39 -21 4 14 -15 -66 -10 -11 30 -6 -39 5 10 2 48 26 -7 -21 12 -34 -29 3 2 31 -61 -3 -23 -17 -6 -20 -42
8006d2J9J9rl1J0N3p3kN5k4N5Lm2k7K3KpQ2j02PK2L3k6j3N8l0K7o0k3M3M6l2K6
$$ -42 -23 -4 -13 -44 -34 19 -54 -56 -1 -25 30 33 -9 -36 -13 -11 -18 64 -38 -31 -9 24 -2 -15 43 13 40 -20 -43 0 46 14 40
8039D0l4J6j8M4rl5J7j3l4L7Qk6m9L5n5M6L5j4J5j4k6NL1l2J4m6L3k0K4N3j3k7
$$ 40 6 22 4 48 39 4 21 8 -26 11 19 -7 -56 -21 -76 -30 5 -9 6 -8 -34 -29 2 -30 -16 -62 -29 -49 -25 28 15 -12
8071a2J4K0kM1q3M2k7l6L0K4l2Ml8L2kn6O5N4j05N3%N8p7NK2j2ql7N4J6ml2rM5
$$ -12 2 22 20 61 -22 20 -7 -43 -13 11 -21 -17 -55 -23 -25 -81 -16 38 -67 -14 -14 44 -33 -28 -6 -18 -26 -63 -9 7 3 -29 -38 7
8105GN0r0L9M2l1m0J2O2p0l3P1j4O3j00O3k1m4L7k4kN5p8N5k7K6Pj1m5J1JK3k0
$$ 7 57 -33 6 48 17 -23 -11 51 -19 -52 19 5 68 -32 31 10 -34 3 -21 -23 32 -46 9 -18 8 15 4 -41 -30 -29 -6 -26
8137b6%K2k0j2N8km2L0K3J3r7P7JNk2l7O4q4J01r3K6OK2J9o3P3p8Rk0jK6jLk4
$$ -26 -26 -4 -24 -36 22 20 -22 8 31 44 -53 24 25 30 8 -29 35 -49 52 -41 -15 -9 13 32 -31 42 -36 -27 -47 -48 -22 -23 -20 -44
8171d4Q7m7J5rk3O6n8M1oLm0J9M9o5J1jK3k1K0J0
$$ -44 43 -4 11 2 -21 45 -13 28 22 25 -15 4 53 -12 -1 -2 21 0 20 30
8191C0
$$ Imaginary data points
##PAGE= N=2
##DATA TABLE= (X++(I..I)), XYDATA
0@%%%%%%%%%%%%Qj6J6j6J8k6L2m0M8n6O4p2Q8j04J20j38J62j87K11k40K73l11
$$ 0 0 0 0 0 0 0 0 0 0 0 0 0 8 -8 8 -8 10 -16 16 -24 24 -32 32 -40 48 -56 64 -74 88 -99 112 -128 145 -166
34a66L52l95M44m99N57o19O89p66Q49r41J042j152J269j399J543j697J870k063
$$ -166 186 -209 235 -264 293 -326 363 -403 446 -495 547 -605 664 -735 808 -889 981 -1082
52a082K273k506K770l067L404l790M239m770N408o187P166q446J0185j2690J6629
$$ -1082 1191 -1315 1455 -1612 1792 -1998 2241 -2529 2879 -3308 3858 -4588 5597 -7093 9536
67I536k3746M0453j46864r7153L03114j14025j09964J10603k866q6069R9096J9719
$$ 9536 -14210 26243 -120621 -217774 85340 -28685 -138649 -28046 -30912 -116981 -17885 1834
79A834p5726j9526P9684O4806n1779p5546N1394O5820n8081l691N3542m1020o948
$$ 1834 -73892 -93418 -13734 51072 -707 -76253 -24859 40961 -17120 -20811 32731 -8289 -15237
92a5237N1902p318o7556Q495O0844K5141p3455j1109Q1984m4867m1315P1016k0814
$$ -15237 36665 29347 -38209 -29714 31130 56271 -17184 -28293 53691 8824 -32491 38525 17711
105A7711n7378Q6196k28q1138M1411M774k3384M0955j8543n3321P7201O194r5475
$$ 17711 -39667 46529 46301 -34837 6574 11348 -12036 28919 10376 -42945 34256 40450 -55025
118e5025N6032M5870p5789K1604P5063p1525k3038P1950j2326m0589J4871M0835
$$ -55025 1007 46877 -28912 -7308 67755 -3770 -26808 45142 32816 -7773 7098 47933
130D7933j7397l0770J6110K2784l6261r062M2795k1821k0684J4942O042j9144
$$ 47933 30536 -234 15876 38660 2399 -6663 36132 14311 -6373 8569 14611 -4533
142d533j1745J1128K7498j7016m3939N3685J5616o8420K0090O1235n7429j2822
$$ -4533 -16278 -5150 22348 5332 -38607 15078 30694 -37726 -17636 43599 -13830 -26652
154b6652Q1444n3031m8214P2826L379o0037L6693K0557l8074J8165K002k2256
$$ -26652 54792 1761 -46453 26373 29752 -30285 6408 26965 -11109 7056 9058 -13198
166a3198O107J9500r193k503K984j2917P132K976p711r614K0306N755k0371k181
$$ -13198 -7091 12409 3216 713 3697 -9220 -2088 888 -6823 -16437 3869 9624 -10747 -12928
180a2928M570m533k608J8777j6498l618K4451j5023k0234K2554K110k2441M3578
$$ -12928 -8358 -12891 -15499 3278 -13220 -16838 7613 -7410 -27644 -5090 -2980 -25421 18157
193A8157n611m6870L6422K5029m9812O539M5406l2619N94K9755k8004k1980L5313
$$ 18157 12546 -34324 2098 27127 -22685 -16146 29260 -3359 -2765 26990 -1014 -22994 12319
206A2319O532k8394J4305J977l874O706j0563j7876K0190J6326k3002O446O125
$$ 12319 18851 -9543 4762 6739 2865 9571 -992 -18868 1322 17648 -5354 1092 7217
219G217j6920k252K9232j5935l1787L9990J9356m1811q644L5895k0248p514K9858
$$ 7217 -9703 -11955 17277 1342 -30445 9545 28901 -12910 -21554 14341 -5907 -13421 16437
232A6437j5528j5362J7556N831j6370L891q108J1387K4346l0475j7159L6649o87
$$ 16437 909 -14453 3103 8934 -7436 -3545 -11653 -266 24080 -6395 -23554 13095 12408
245A2408m1806L7950J6311n1052J9066M4731m2534l2517N7761N060m1174J1461
$$ 12408 -29398 8552 24863 -26189 -7123 37608 -4926 -37443 20318 25378 -15796 -4335
257d335K9142k2670j7045K9745j621j7465L095J9532l771j9843l509K2336O862
$$ -4335 24807 2137 -14908 14837 13216 -4249 -1154 18378 14607 -5236 -8745 13591 20453
270B0453l6120J3885L2452l0202k8322M6315L148n6887L3886M0393n1942k0340
$$ 20453 -15667 -1782 30670 468 -27854 18461 21609 -35278 -1392 39001 -12941 -33281
282c3281N8775j6768m4195L6218J8551k7701o812K1926o056j2173p27J4269Q343
$$ -33281 25494 8726 -35469 749 19300 -8401 -15213 6713 657 -11516 -12243 2026 10369
295A0369k2108J085K3479r156l6213L0302K9442m3113o250M5291j3069m5767L6257
$$ 10369 -11739 -10654 12825 3669 -32544 -2242 27200 -15913 -22163 23128 10059 -35708 549
308E49K1121m0922K879M3602j9380l8765L2596J3518k4146k848J9043O54r726
$$ 549 21670 -19252 -16373 27229 7849 -30916 1680 15198 -8948 -11796 7247 7901 -1825
321a825l696M457Q274k1799P826L0997j8115l2502L2652K2022m9027M511M3111
$$ -1825 -5521 -1064 7210 -14589 -6763 24234 6119 -26383 6269 28291 -20736 -16225 26886
334B6886j9514k8442L8425J728m4073J8221K8360j9207j9652K3085M485j7931
$$ 26886 7372 -21070 17355 19083 -24990 -6769 21591 2384 -17268 5817 10302 -7629
346g629l644P332M348q922J462P473K323k2215N298K6736k0767j6461L1510R458
$$ -7629 -11273 -3941 407 -8515 -7053 420 2743 -19472 -14174 12562 -8205 -24666 6844 16302
360A6302m0320J2545K7694k6072j0374L3118k106l2490K1670J2159k1765j485
$$ 16302 -24018 -11473 16221 -9851 -20225 12893 10787 -21703 -33 12126 -9639 -11124
372a1124J6604j453n238L535m980O690m184l908J0808M312j4181K528J9264k0792
$$ -11124 5480 4027 -1211 2324 -2656 4034 -150 -4058 6750 11062 -3119 -591 18673 -2119
386b119j0385K4093K138k4488J4404J3637k7331K312J7195q712j0700J8689q04
$$ -2119 -12504 11589 13727 -10761 3643 17280 -10051 -7739 9456 744 -9956 8733 7929
399G929j4577Q482Q35n899N386P137r538R175J676j5469Q170O118r705K109J6079
$$ 7929 -6648 1834 2669 -3230 2156 9293 -245 8930 10606 -4863 3307 9425 -280 1829 17908
414A7908j5236o454J3977o907j0421J1504P093j4681J1054J843j6628N999J0878
$$ 17908 2672 -3782 10195 3288 -7133 4371 11464 -3217 7837 9680 -6948 -949 9929
427I929j0383%J6538j4507m730J2611n869j3957J3681J0112j7755N551N424j2028
$$ 9929 -454 -454 16084 1577 -3153 9458 3589 -10368 3313 13425 -4330 1221 6645 -5383
441e383k015J1725n541k797R487o561J899P39q349J16J6083p068j1706J8513m631
$$ -5383 -7398 4327 -1214 -4011 5476 -1085 814 1553 -6796 -6680 9403 2335 -9371 9142 4511
456D511j9013J1233J4098k5092K361K6030j7022j6437J5236O035j9056P888J1067
$$ 4511 -14502 -3269 10829 -14263 -11902 14128 -2894 -19331 -4095 1940 -17116 -9228 1839
469A839q798l405N687J772o861O18J555J2478n207j4166J3630Q218j8886j214
$$ 1839 -6959 -10364 -4677 -2905 -9766 -9148 -7593 4885 -322 -14488 -858 7360 -11526 -12740
483a2740K6409j5027j4482K5026K602l0055Q814K8981k1675j0228K1588R75j8816
$$ -12740 13669 -1358 -15840 9186 11788 -18267 -9453 19528 -2147 -12375 9213 10188 -8628
496h628O956J0782j0394j096N725O661r013r311P170J1567j2400j1801K3447k99
$$ -8628 -1672 9110 -1284 -2380 3345 10006 993 -8318 -1148 10419 -1981 -13782 9665 9366
510I366k3791P614K1085k3686q740L3907p043k7244J4411K0302k4530n321K2581
$$ 9366 -14425 -6811 14274 -9412 -18152 15755 8712 -18532 -4121 16181 -8349 -13670 8911
523H911k328j3053N266R532j1813m447O413J0406o609j2274J3415P618j8730o912
$$ 8911 6583 -6470 -1204 8328 -3485 -7932 -1519 8887 2278 -9996 3419 11037 -7693 -14605
537a4605K6962o377k0103J9495J1526k7393l717L1471j2755j9388K0953J2340
$$ -14605 12357 5980 -14123 5372 16898 -10495 -14212 17259 4504 -14884 6069 18409
549A8409k3267k748J8682q679p655Q210R519q180p336N781O282p448j0234J8089
$$ 18409 -4858 -7606 11076 2397 -5258 2952 12471 4291 -3045 2736 9018 1570 -8664 9425
563I425N755j8900p00K0623j3755j8300K5709M840k3338M464K1318j8076j3354
$$ 9425 15180 -3720 -4420 16203 2448 -15852 9857 14697 -8641 -4177 17141 -935 -14289
576a4289J9280J881j4104L307J3404j0858o598N158M164k726n319O237M744n781
$$ -14289 4991 6872 -7232 -3925 9479 -1379 -7977 -2819 1345 -1381 -6700 -463 4281 -1500
590a500r430J2605J955j5208P324J5142j2348j3464K0932r30j8243J0000J2955
$$ -1500 -10930 1675 3630 -11578 -4254 10888 -1460 -14924 6008 5078 -13165 -3165 9790
603I790j4451l346J6240q800p730O790N606m317j273J214J19L411o869J719O223
$$ 9790 -4661 -8007 8233 -567 -8297 -1507 4099 -218 -1491 -277 -158 3253 -3616 -1897 4326
618D326l080n046R837q3j5511R935R747j0676n522J4304l411j0979R518Q20q552
$$ 4326 1246 -3800 6037 5954 -9557 378 10125 -551 -6073 8231 4820 -6159 3359 4179 -4373
633d373L614J0429j0578k828O670l866L06K453l178j267R061p367m621O934k894
$$ -4373 -759 9670 -908 -3736 2934 -932 -626 1827 -1351 -2618 6443 -924 -5545 1389 -1505
648a505k135P153M54j1910Q443M056j0156J806O918m215n01Q324j0672k329Q984
$$ -1505 -3640 3513 3967 -7943 500 4556 -5600 -3794 3124 -1091 -1592 6732 -3940 -6269 2715
663B715j709n715O546K576r911O680K233r659L61J2437m278p334Q288k970m054
$$ 2715 1006 -4709 1837 4413 -5498 1182 3415 -6244 -5883 6554 2276 -5058 3230 260 -3794
678c794K857K376m043M056K107m391K790m056j865O613L080j0952O147R429j5131
$$ -3794 -937 1439 -2604 1452 3559 -832 1958 -2098 -3963 2650 5730 -5222 925 10354 -4777
693d777j128J2621n063j0357J5394J256j5326M950Q569p940o108J2368j134n871
$$ -4777 -5905 6716 1653 -8704 6690 7946 -7380 -2430 6139 -1801 -7909 4459 3325 -2546
707b546J171J612q33k594Q78K419M007q163J565P736p377o770J1807N927j7012
$$ -2546 -1375 237 -596 -3190 -2312 107 4114 -4049 -2484 5252 -2125 -8895 2912 8839 -8173
722h173N194J3190j1203r143J5343J184j4682R981O768j0017n101J0025N46p034
$$ -8173 -2979 10211 -992 -10135 5208 6392 -8290 1691 8459 -1558 -6659 3366 3912 -3122
736c122J209L634K903p456j413N835Q18r176N954J0473j5219l314J5757j611j8131
$$ -3122 -1913 1721 4624 -2832 -4245 1590 2408 -6768 -814 9659 -5560 -8874 6883 5272 -12859
751a2859J1401J3349j5142l880J3322k484j3959J2354O904j1700j940R888M05
$$ -12859 -1458 11891 -3251 -7131 6191 3707 -10252 2102 9006 -2694 -4634 5254 5659
764E659j0318J368N713L123p450j26P357n152p231P544P804j5712J461J6590p859
$$ 5659 -4659 -3291 2422 5545 -1905 -2031 5326 174 -7057 487 8291 -7421 -5960 10630 2771
779B771j5474J2011R447j5954L450J1727o648r041J0330L288j1391K439Q021J317
$$ 2771 -12703 -692 8755 -7199 -3749 7978 1330 -7711 2619 5907 -5484 -3045 4976 6293
793F293p851J79M218N38n555P71R701o835n295Q614K636j5337L417J5567j0021
$$ 6293 -1558 -1379 2839 3377 -2178 -1407 8294 1459 -3836 4778 7414 -7923 -4506 11061 1040
808A040q416J1270L235j5696N237R169q980k500Q789M15r458K696K568N40k487
$$ 1040 -7376 3894 7129 -8567 -3330 5839 -3141 -5641 3148 3563 -5895 -3199 -631 -91 -2578
823b578n28N259k10n340n21Q783o749l970J1045M66j1299L973J0225j2235k004
$$ -2578 -3106 2153 1943 -3397 -3918 4865 -1884 -5854 5191 5657 -5642 -1669 8556 -3679 -5683
838e683J1213j439r327N853M550r585J692M165j181k688L072o27j135M17l343
$$ -5683 5530 4091 -5236 617 5167 -4418 -2726 1439 258 -2430 642 15 -1120 -703 -4046
853d046N069Q19m196O77O804n893m546R566k088n693N414N125j0027J289P409
$$ -4046 1023 1842 -2354 -1677 5127 -766 -5312 4254 2166 -3527 1887 7012 -3015 -1726 5683
868E683n686j654N168J35n142M627j939l311L696J36j799Q77J638n801L505J264
$$ 5683 -3 -1657 3511 3646 -1496 3131 1192 -2119 1577 1713 -86 791 2429 -3372 133 1397
884A397n135J507M644k884l996N553l915j806M656j34l844L236K615o403L368
$$ 1397 -3738 -2231 2413 -471 -4467 1086 -2829 -4635 21 -113 -3957 -721 1894 -4509 -1141
899a141J178l264K000N373m884l149P489m020l295M461K215n546K987L119o360
$$ -1141 37 -3227 -1227 4146 -738 -3887 3602 -418 -3713 748 2963 -2583 404 3523 -2837
914b837P23K440J61k156K724j241J6J278m358J995K955j662k479O542l010o106
$$ -2837 -2114 326 487 -1669 1055 -186 -170 1108 -3250 -1255 1700 38 -2441 4101 1091 -5015
930e015O891J697o852P57R738o398m424O508k74n762K866N787o068j64K505N55
$$ -5015 1876 3573 -3279 -2522 7216 818 -3606 2902 2628 -3134 -268 5519 -549 -713 1792 2347
946B347k934j433K729J456r52m087N019m95n753K046O313n221n234J0682j809
$$ 2347 -587 -2020 709 2165 1213 -2874 2145 1650 -4103 -2057 4256 -965 -6199 4483 2674
961B674r068L912P914p764l006R585k401n788K354N228n335p05M290J38k195k523
$$ 2674 -6394 -2482 5432 -2332 -5338 4247 1846 -3942 -1588 3640 -1695 -2400 1890 2028 -167 -2690
977b690M389M83l595j630P344j273q116N785L976p005k634J1510l845r020P502
$$ -2690 1699 2182 -1413 -3043 4301 3028 -5088 697 4673 -2332 -4966 6544 2699 -6321 1181
992A181M679q772j901J0525m065m841M215K678m822j824N336j44k002k070M688
$$ 1181 5860 -2912 -4813 5712 1647 -3194 1021 3699 -1123 -2947 2389 2245 243 -1827 2861
1007B861R5n806M73O548j838p558Q147K031r092K47R173n111o909J0152R91q309
$$ 2861 2956 -2850 -2377 4171 2333 -5225 2922 4953 -4139 -3892 5281 170 -6739 3413 4404 -3905
1023c905j34P552m417l473N612N24k439j734L388o98k200r46N039J609p069K269
$$ -3905 -4039 3513 -904 -4377 1235 1759 -680 -2414 974 276 -1924 -2870 2169 3778 -3291 -1022
1039a022M649l647n545Q644J186q616M169N916o756n103R616j330n605L441L393
$$ -1022 3627 -20 -5565 3079 4265 -4351 -182 5734 -1022 -6125 3491 2161 -3444 -3 3390
1054C390m020k839M497j179q57m99K465Q71l058j231L046J498o265M357M049n160
$$ 3390 -630 -3469 1028 -151 -1008 -1507 958 1829 -1229 -2460 586 2084 -4181 176 4225 -935
1070i35k321O202r81p107O196K879n064j027N815l174l757M700k71j389j24K147
$$ -935 -3256 2946 1965 -5142 1054 3933 -1131 -2158 3657 483 -3274 1426 1155 -234 -358 1789
1086A789j806l14m62R3K333k666O6J929J96m849K808L007m973J083L671j721m166
$$ 1789 -17 -331 -793 -700 1633 -1033 -967 962 1158 -3691 -883 2124 -2849 -1766 1905 184 -3982
1103c982M932l91l196K501J842j718j112L099k887N63J509q11L5R49p08k109K894
$$ -3982 950 559 -2637 -136 1706 -12 -1124 1975 -912 -349 1160 349 384 1333 625 -1484 1410
1120A410k063n63K014K38k220M51J879l776J815J349r19n09K078j499k044L241
$$ 1410 -653 -1216 798 1036 -1184 -733 1146 -2630 -815 534 -385 -894 1184 -315 -2359 882
1136H82j974LJ959M70l123J671J428m194J836K388p60k276L354j040k568K121
$$ 882 -1092 -1089 870 1340 -1783 -112 1316 -2878 -1042 1346 586 -1690 1664 624 -1944 177
1152A77M18R7n15K012j241J30r86n32K116o90o17N12J941m429L32L149k539j702
$$ 177 595 692 177 2189 948 1078 92 -440 1676 986 369 881 2822 -1607 -1275 1874 -665 -2367
1170b367L592J749o016K236K532l001j202M128O10l851K392M35q08j853J734J324
$$ -2367 1225 2974 -3042 -806 1726 -1275 -2477 1651 2261 -1590 802 1237 429 -1424 310 1634
1186A634q56p79L8K430m002n63L452L58m183K093M084n731o99M423n9n258M058
$$ 1634 778 -1 37 2467 -1535 -2098 1354 1712 -2471 -378 3706 -2025 -2724 1699 1640 -3618 440
1203D40L363n269o95L327N4m326L098J625k000j440J003J885k698n28J854K555
$$ 440 3803 -1466 -2161 1166 1220 -3106 -8 1617 -383 -1823 -820 1065 -1633 -2161 -307 2248
1219B248m145k08M640k504l338L762M027o599P76N183k781l818L864K507n480
$$ 2248 -1897 -2105 2535 31 -3307 455 4482 -2117 -1341 3842 1061 -2757 1107 3614 -1866
1234a866J575K840j308l477J870K255k208n65P52K340l293r42L008O86l813R05
$$ -1866 -291 2549 1241 -2236 -366 1889 -319 -884 -132 2208 -1085 -2027 981 1667 -2146 -1241
1250a241N245m522k561M058J493n651J913N032m555j947L378J009m735K102K641
$$ -1241 4004 -518 -3079 979 2472 -3179 -1266 3766 -789 -2736 642 1651 -3084 -982 1659
1265A659j642j254N14K121k364o96J216K629k699j488L848j288l361J539M423
$$ 1659 17 -1237 -723 1398 -966 -1662 -446 2183 -516 -2004 1844 556 -2805 -1266 3157
1280C157m875q56M789j329m010J767L506m160M66K962m13k912R46K198j800J4
$$ 3157 -1718 -2574 2215 886 -3124 -1357 2149 -2011 -1545 1417 1004 -1908 -962 1236 -564 -550
1296e50J79K187j410j375J385Q76k050q19M529j962k596J998K027l729k64M396
$$ -550 -371 1816 406 -969 416 1292 -758 -1577 2952 990 -1606 392 2419 -1310 -1574 2822
1312B822k565j400K056J212l445O01K022j145m3n5J109j475K43k34Q90l10j211
$$ 2822 257 -1143 913 2125 -1320 -719 1303 158 115 60 1169 -306 -63 -297 593 283 -928
1329i28J976j14j400q75K879j680j262K445j61j763QK297k577K68J650n08j072
$$ -928 1048 934 -466 -1341 1538 -142 -1404 1041 880 -883 -875 1422 -1155 -887 763 255 -817
1346h17N89O43j721J540o16R1M44M2n93j06R83j495J466K9m48m26R38k65j166
$$ -817 -228 415 -1306 234 -382 -291 153 195 -398 -504 479 -1016 450 479 31 -395 543 278 -888
1365h88J727r53M23K04J33j321P02O87j496J405n4n25p15J722j309j209K321l99
$$ -888 839 -114 309 513 646 -675 27 714 -782 623 569 44 -671 1051 -258 -1467 854 455
1383D55r09j0J641k187J22J133l85p6l4J046j216L41o82Q72L33j015Q41O82o33
$$ 455 -454 -464 1177 -1010 -888 245 -140 -216 -250 796 -420 -79 -761 111 444 -571 270 952 319
1402C19j968K570m75j745J466J376j750j483L085j547j515J224J681j770o87J838
$$ 319 -1649 921 446 -1299 167 1543 -207 -1690 1395 -152 -1667 -443 1238 -532 -1219 619
1418F19j224k65l50J491m61n27L02P43j99k162K175Q63j284q37K937q93k804K762
$$ 619 -605 -870 -1220 271 -190 -717 -415 328 129 -2033 142 1005 -279 -1116 1821 928 -1876 886
1436H86O70k018l28L337j749j973J888M06j190o80K126r27n09l69R13L4j777J171
$$ 886 1556 -462 -790 2547 798 -1175 713 1119 -71 -751 1375 448 -61 -430 483 517 -1260 -89
1454h9J174n59k459K735L98k934P65K623j212k712L456k31k602P37K434j447j644
$$ -89 1085 526 -1933 802 1200 -1734 -969 1654 442 -2270 1186 955 -1647 -910 1524 77 -1567
1471a567K600l93r98p52J770m5j040L86P63J14k596J799J288j771j242K842j06
$$ -1567 1033 640 -358 -1110 660 615 -425 -39 724 838 -1758 41 1329 -442 -1684 1158 1052
1488A052l694K046J365j965j184L477p40k773J773J022j137j073K530k54q21j39
$$ 1052 -2642 -596 769 -1196 -2380 1097 357 -2416 -643 379 -758 -1831 699 445 -376 -515
1504e15Q52L52j807J061J141n9k158J767Q12k705L03K207k82k720K663M29k348
$$ -515 337 689 -1118 -57 1084 1025 -1133 634 1446 -1259 -956 1251 969 -1751 912 1341 -1007
1521a007J56J876n66j659K370j07j057o27J190j53q07O79J11N98j718P72M79p83
$$ -1007 -851 1025 459 -1200 1170 1063 6 -621 569 416 -391 288 399 997 -721 51 530 -253
1539b53o93J502R78k417J001R23p58j310K117K67j876J281M38o10j200J354l32
$$ -253 -946 556 1534 -883 118 1041 283 -1027 1090 1357 -519 762 1200 590 -610 744 412
1556D12l76L86j26J23j068N45l06O48q37K11J011q93k41K70P63j537J239P27j064
$$ 412 36 422 296 419 -649 -104 -410 238 -599 -388 623 -270 -511 -241 522 -1015 224 951 -113
1575a13j81N79K50j405J297k27l68L0L01m37l99P36p78Q37k80j12j49M46k61o24
$$ -113 -294 285 535 -870 427 200 -168 -138 163 -274 -673 63 -715 122 -158 -270 -419 27 -234 -858
1595h58J415o57p8Q2M42r37L60P07j106P86p8k3p03P63m17j88J083p46m3J79N33
$$ -858 557 -100 -178 -96 346 -591 -231 476 -630 156 78 55 -648 115 -302 -490 593 -153 -196 -17 516
1616E16j222Q84M61j012P23K12k51j135J320m31j97L12l0j48m10N73q98Q86l71
$$ 516 -706 178 639 -373 350 562 311 -824 496 65 -132 180 150 2 -408 165 -733 153 -218
1635b18q1O56j26o35j34J438j569M83R59k63j063P82O15j839J010N20l47p02R34
$$ -218 -299 357 231 -404 -538 900 -669 -186 773 510 -553 229 844 -995 15 535 188 -514 420
1654D20k37q23N91l45P96o97K20k8M05p84l05J571j042k09P50P34k024N60J483
$$ 420 183 -640 -49 -394 402 -295 -75 -103 302 -482 -787 784 -258 -467 283 1017 -1007 -447 1036
1673A036j455j13J092M21j864J097N27r45k5O72L41j030O52l07M59o90j03R63
$$ 1036 -419 -532 560 981 -883 214 741 -204 -229 443 784 -246 406 99 558 -132 -235 728
1691G28m22n45O6J331j837n6J432l45j303P84J408k298M04J053k57j148R51O94
$$ 728 306 -239 -173 1158 -679 -735 697 352 -951 -167 1241 -1057 -653 400 143 -1005 -54 640
1709F40j364L68J77N18r37L15M80m1n15l29J437j041k62P11O95j588J14J735j426
$$ 640 -724 -356 -179 339 -598 -283 197 156 -359 -688 749 -292 -554 157 852 -736 -622 1113 -313
1728c13m53R71Q48j926N46J055j004l35O72P93j443N02K64J22n46j02R89m12j66
$$ -313 -766 205 1053 -873 -327 728 -276 -611 61 854 -589 -87 177 299 -247 -349 640 228 62
1747F2k19J153j178k79J226q2q53J70J532j732j24R24R0j075N04J116j397P1K55
$$ 62 -157 996 -182 -461 765 683 -170 0 1532 -200 -324 600 690 -385 119 1235 -162 -91 164
1766A64L63r77M01N19l39j49m96R44o72k09K02P09p30m85J242q09m95L45J132
$$ 164 527 -450 -49 470 131 -18 -514 430 -242 -451 -249 460 -270 -755 487 -322 -817 -472 660
1785F60j296o9J130p13l80J51Q88j122N30L63k25k09j58O21m68L52m78P89k55
$$ 660 -636 -705 425 -288 -668 -517 371 -751 -221 142 -83 -292 -450 171 -297 55 -423 366 111
1804A11n84M45J89k12o08J457p55m71N24K87o21k26J252j057K59J00K05n23K65
$$ 111 -473 -28 161 -51 -659 798 43 -428 96 383 -238 -464 788 -269 -10 90 295 -228 37
1823C7L09n31P57o66L88j99J23l55M50L57r74O27J7j38n83R75l42n32P66l59j47
$$ 37 346 -185 572 -94 294 95 218 -137 313 670 -304 323 340 202 -381 594 252 -280 486 127 -20
1844b0l36P17o26L78J14m71M23k88O0m36R38q12P5N80m82k70J08O86j094O79K18
$$ -20 -356 361 -265 113 227 -244 179 -109 -49 -485 453 -359 -284 296 -186 -456 -348 338 -756 -77 141
1865A41l34k45K58K14n52P34n12M20j31r9M1R3j02m60J164o23k60K32M32q72j05
$$ 141 -193 -438 -180 34 -518 216 -296 124 -7 -106 -65 28 -74 -534 630 7 -253 -21 411 -461 -566
1886e66J249r91K3L42L82j047L53N18m68K07j98N87o28J80j75L77j07n48R34k10
$$ -566 683 -308 -285 57 439 -608 -255 263 -205 2 -196 391 -237 -57 -232 145 38 -510 424 214
1906B14m68l21J229p97m89J120r2o53j73J250j015j57O41J63n44m4Q09p32M1k22
$$ 214 -254 -575 654 -143 -632 488 396 -257 -430 820 -195 -352 289 452 -92 -136 673 -59 -18 -240
1926b40P55k84n17N31Q2k80p37J302l33o45L84P69p86p19J511n44n27J89R90q97
$$ -240 515 231 -286 245 327 47 -690 612 279 -366 18 787 1 -718 793 249 -278 -89 901 4
1946Dl86R72l00l15k18R96o63k17J09L93j14q92J050nm65m93J168l94q95R68K37
$$ 4 -382 590 290 -25 -243 753 90 -127 -18 375 261 -631 419 414 -51 -544 624 230 -665 303 540
1967E40n44o72J443o80o23N91L86m57o24J152n85j67j12O61j71o41N30O2J0r13
$$ 540 -4 -676 767 87 -536 55 441 -16 -640 512 -73 -240 -352 309 138 -503 27 89 99 -814
1987h14J019O6o27L4O77j19j195J221p1n33k72J021l16q24Q54j31k06m29R49l18
$$ -814 205 271 -356 -322 355 236 -959 262 191 -342 -614 407 91 -733 121 -10 -216 -645 304 -14
2007a4l42J69J17K07q18O92P3ko58N81L25r44M21L37N6r67J051%p74K77L81j3
$$ -14 -356 -187 -70 137 -681 11 84 82 -576 5 330 -614 -193 144 200 -767 284 284 -490 -213 168 155
2029A55o86R02k85o2j10J29J96m16L14j07M82p66L11L59k25l71L52N46j049N15
$$ 155 -531 371 86 24 -86 43 239 -177 137 30 512 -254 57 416 191 -180 172 718 -331 184
2049A84J80j30m62N74K01p59N84k23J23l58L73j24k1J30m53O95m48qq0M82m95
$$ 184 364 234 -228 346 547 -212 372 149 272 -86 287 163 142 272 -181 514 66 58 -22 460 -35
2070c5k22P44n30l6PN92p83K54K95m22J02j67M50n66M09l11K67l1m19L53M7P7
$$ -35 -257 487 -43 -79 -72 520 -263 -9 286 -136 -34 -201 249 -317 92 -219 48 17 -402 -49 -2 75
2092G5o53R11l98m27L48K38k03m40R78n44j38LL97l08k00N25k87K97o37N23l0
$$ 75 -578 333 -65 -492 -144 94 -109 -549 429 -115 -253 -250 147 -161 -361 164 -123 174 -463 60 30
2113C0j55j26M30K21r98O77J51k24m89Q19L8q58O81jq4n64P91j34l93K65J25J54
$$ 30 -125 -251 179 400 -598 79 230 6 -483 336 374 -484 197 196 112 -452 339 205 -188 77 202 356
2135C56p69N51lP8m47M27L54q90K35L63J54r82P87L23o81q4M89J88j058Q12J34
$$ 356 -413 138 135 213 -234 193 547 -343 -108 255 409 -573 214 537 -144 -228 261 449 -609 203 337
2156C37l09l40N17J30p24L73J64K03q18M24L23l51k94L05N93j095L79N26j62p61
$$ 337 28 -312 205 335 -389 -16 148 351 -467 -43 280 -71 -365 -60 533 -562 -183 343 181 -580
2176e80N87O36j087K84M27N5r83P10L56o13k8L56L44r69M56K10P1n56J84P60q52
$$ -580 7 643 -444 -160 267 322 -661 49 405 -208 -236 120 464 -505 -49 161 232 -324 -140 620 -232
2197b32q1L64M67r97K60P84n52l41L55O63j199L66M79j63m71K71N33p81K44P7
$$ -232 -313 51 518 -479 -219 565 13 -328 27 690 -509 -143 336 173 -298 -27 506 -275 -31 46
2217D6L60o52J35M64l52k14p1Q70p51j50M61J79p27L8R90q92mK75M31q66J48N35
$$ 46 406 -246 -111 353 1 -213 -284 586 -165 -315 146 325 -402 -364 626 -266 -270 5 436 -430 -282 253
2239B53m35j6L6M97o01J53M1J83j93k85P34l45j23j43P17n91k91P57j68l34q4
$$ 253 -182 -198 -162 335 -266 -113 -72 111 -82 -367 367 22 -101 -244 473 -118 -409 348 180 -154 -238
2260b38Q09p79j4L21O4k74p6N65n50J78k24L97j08j96J80J9J09n84P67k52k55
$$ -238 571 -208 -222 99 163 -111 -187 378 -172 6 -218 179 71 -125 55 74 183 -401 366 114 -141
2281a41M3M45k71m50P37l57m0j26M48k95j75L58k67K18l60L23r1P7k83J51L57
$$ -141 -98 347 76 -374 363 6 -34 -160 288 -7 -182 176 -91 127 -233 90 -1 76 -207 -56 301
2302C01o49L10Q5J67n76M58J35n22K15J01J38n39N18j69l2q1P7K93m42L31j66
$$ 301 -348 -38 47 214 -362 96 231 -291 -76 25 163 -376 142 -27 -59 -140 -63 230 -212 119 -47
2323d7L19m71J07L91k48j06m5N58p15K00K41m3k94J93M21o68K73J0K00m77K26
$$ -47 272 -199 -92 299 51 -55 -100 458 -257 -57 184 141 -153 40 461 -207 66 76 276 -201 25
2344B5K70k41Oj86N45m53J2J67K03m38j35O72n13j22J16N71o92l9N76l40k29Q
$$ 25 295 54 60 -126 419 -34 -22 145 348 -90 -225 447 -66 -188 -72 499 -193 -232 344 4 -225 -217
2366b17O53p00O2J82J31k88j66N86l25j30q5N42l62l19M87Rk76l17R40n65k43
$$ -217 436 -264 -202 -20 111 -177 -343 243 -82 -212 -297 245 -117 -436 51 60 -216 -533 407 -158 -401
2387d01L57K16m43k06Q27m24j46KM54m34j94M77j28p6l28P39k88l16J34M21j48
$$ -401 -44 172 -271 -477 350 -74 -220 -218 236 -198 -392 85 -43 -119 -447 292 4 -312 -178 243 95
2408I5o40Q60j83l41j10P77l68n24O86P0l61k43P19l72j89K01K65j65m06N60j56
$$ 95 -545 315 132 -209 -319 458 90 -434 252 322 -39 -282 437 65 -124 77 342 177 -229 331 175
2429A75p4k78O42j22n84L96J82j33n83Q57j64n06J47M41k22o01Q23j17l36o3M29
$$ 175 101 -177 465 343 -241 155 337 204 -379 478 314 -192 -45 396 174 -427 396 279 -57 -120 309
2450C09j30m11L81J1L3m44N06o1k45j31L11K09p46M99J54k20l56N40Kn46L69O5
$$ 309 179 -232 149 160 193 -251 255 194 -51 -182 129 338 -408 91 245 25 -331 209 211 -335 34 99
2472I9kn21N77r3k56P2J13J60n09L44L5P4l65K04L12m69J15J48K44p19M58K05
$$ 99 97 -424 153 60 -196 -124 -11 149 -360 -16 19 93 -272 -68 244 -225 -110 38 282 -437 21 226
2494B26l27j10K56K11n58L62K4J7k41J58J52l23J58j45M08m36J23J76o5k55qN19
$$ 226 -101 -211 45 256 -302 60 84 101 -140 18 170 -153 5 -140 268 -168 -45 131 66 -189 -197 322
2516C22n69J06J72J68m69Q6M39m15J29p5L61m60J29J01m2J3j43M05l43P1j29K81
$$ 322 -247 -141 31 199 -270 -184 255 -160 -31 -106 255 -205 -76 25 -17 -4 -147 258 -85 -14 -143 138
2538A38k09j70M44j31p0j66M80m08l3K30N2j58j66N04l63L1p8K58j27j95L39j38
$$ 138 -71 -241 203 72 2 -164 316 -92 -125 105 157 -1 -167 337 -26 5 -73 185 58 -137 202 64
2560F4K2l41M92j35j98P9K27m4m54N51j69q5j07L97j20m01L79n2L0l77M57r1j86
$$ 64 86 -255 237 102 -96 -17 210 166 -288 263 94 9 -98 299 179 -222 157 105 135 -242 215 124 -62
2583f2J24M4N9m45L61O0m3l38L02J17m94K59K29m4n47N07P2l92N1K59M1m99M39
$$ -62 62 106 165 -280 81 141 98 -240 62 179 -315 -56 173 129 -418 89 161 -231 -180 79 120 -379 60
2606F0Oj37j83K87R1l79K38j7K27n38K86K20k66j37K76K75o16L11J31o6l57L00
$$ 60 66 -71 -254 33 124 -255 -17 -34 193 -345 -59 161 -105 -242 34 309 -307 4 135 69 -288 12
2628A2K56n12K25O1R2m42L12J20j41r4J1L96n19J41J61R7m32K15L99m63k9K37
$$ 12 268 -244 -19 42 134 -308 4 124 -17 -111 -100 296 -223 -82 79 176 -256 -41 358 -105 -134 103
2650A03K35o36L03K80k60p5K2L39n12K28P0Q9l16L7K70k34K2k7M04n35O1K43o4
$$ 103 338 -298 5 285 25 -50 -28 311 -201 27 97 186 -130 -93 177 -57 -35 -62 342 -193 -132 111 47
2673D7j99j8N03n05M4J88J6k41J1L47k90n1N1K82l44J0K23k1p9j85M64l42o8Q9
$$ 47 -152 -170 333 -172 -128 60 76 -165 -154 193 -97 -148 -97 185 -159 -149 74 53 -26 -211 253 -89 -157 -68
2697f8K43j91k52N33k61j26j4M20l32j48L58k4j19k25M52k70N3j9J71k7l09L64
$$ -68 175 -16 -268 265 4 -122 -136 284 -48 -196 162 138 19 -206 246 -24 29 10 181 154 -155 209
2719B09r1n9j95M28j61k70K15J04j26k88N30j51k10P1K30r7k94L35o6k6k45L28
$$ 209 118 59 -136 292 131 -139 76 180 54 -234 296 145 -65 6 236 139 -155 180 114 88 -157 171
2741A71m3k38O9J18J18m57L86o3q0j83K53O7m19L39nK4l63L72N4l36J40L6Q6l89
$$ 171 128 -110 -41 77 195 -262 124 61 -19 -202 51 118 -301 38 33 57 -306 66 120 -216 -76 -40 46 -343
2765c43L45n4j1j20J02J80l50J61L9J43l88J98K45k57N1nJ93m52K67J56o0k22
$$ -343 2 -52 -63 -183 -81 99 -251 -90 -51 92 -296 -98 147 -110 -59 -64 129 -323 -56 100 40 -182
2787a82J17K46l89J91pK29l64J27J90j85n5K4L30m00J24J03K6l04M7M53l89M9
$$ -182 -65 181 -208 -17 -24 205 -159 -32 158 -27 -82 -58 272 -128 -4 99 125 -179 -132 321 -68 -19
2809a9P7K28m02LL50k37k1L0K73l61J41J9P5j31j17L58k50K7j06L04k88m9K88
$$ -19 58 286 -116 -113 237 0 -21 9 282 -79 62 81 156 25 -92 266 16 43 -63 241 -47 -96 192
2832A92j16j41o6M37m23K8J67K7j15j01L38l01Q2j31L03k20m0J74l8K2k82M63
$$ 192 76 -65 -131 306 -117 -89 78 105 -10 -111 227 -74 8 -123 180 -40 -80 94 56 78 -204 259
2854B59k23j11P9K07j67k18M10k88M3pK38k18p2K03j17M6k03K62j06J3q4P2O3
$$ 259 36 -75 4 211 44 -174 236 -52 -9 -16 222 4 -68 135 18 64 -139 123 17 30 -54 18 81
2877H1k65L00n3p2j64L48j37k58K69j6J8k56K90q4q1M2K7O9k72K83j78J66k72
$$ 81 -184 116 63 -9 -173 175 38 -220 49 33 51 -205 85 1 -80 -38 -11 58 -214 69 -109 57 -215
2900b15J78Q3k11O9P8Q3l65K62Q0r7o2J16M3k90K77j47J61k11J19J36j76O6r3
$$ -215 -37 46 -165 -96 -18 65 -300 -38 42 -55 -117 -1 42 -248 29 -118 43 -168 -49 87 -89 -23 -116
2923a16L09l47J38Q6N6j54J7L30m60J76j5K46l46R4J77j70K6j06L22l97J83Q7
$$ -116 193 -154 -16 70 126 -28 -11 319 -141 35 20 266 -80 14 191 21 47 -59 263 -134 49 136
2945A36l8r6o1K98k60J06k0J80k60o5K15j42J0o7K67l05O2J59K3j21j02L02k39
$$ 136 98 2 -59 239 -21 85 65 245 -15 -80 135 -7 3 -64 203 -102 -40 119 142 21 -81 221 -18
2968a8L8n3J94k69j7K28j65N1r6L21l05j6J04O9j05j73L97k26Jj68L65j47k28
$$ -18 20 -33 161 -108 -125 103 -62 -11 -107 214 -91 -107 -3 66 -39 -212 185 -41 -40 -208 157 10 -218
2991b18K80j12kj54M08k65q2J41J17r7k18L43j48mj20L07q7k54K56m1j4k34M10
$$ -218 62 -50 -52 -206 202 -63 -145 -4 113 16 -202 141 -7 -11 -131 176 89 -165 91 50 36 -198 212
3014B12j43j73J15J20o6k70M29j52r1PJ64r2k03K73r9O8k10K59q8j49N1J17N5
$$ 212 69 -104 11 131 65 -205 224 72 -19 -12 152 60 -143 130 31 99 -111 148 60 -89 -38 79 134
3037A34l69L67l7j10j46K84n9k60K83q8mk13L40j11r2K4J2R9l01L30j24Q5j95
$$ 134 -235 132 95 -15 -161 123 64 -196 87 -1 -5 -218 122 11 -81 -57 -45 54 -247 83 -41 44 -151
3060a51Q2J31j93P7OJ27l68L72m3k22J54M1J0k17K51j17K7m5R9L0j73K28j29J31
$$ -151 -69 62 -131 -54 -48 79 -289 83 40 -182 -28 13 23 -194 57 -60 -33 -78 21 51 -122 106 -23 108
3084A08j64O2Q0o0l4m6K36l04J54J08k4j05J6J18k63K18o8Q1r3J06r4n8Q7r2J22
$$ 108 -56 6 86 26 -8 -54 182 -122 32 140 116 11 27 145 -118 100 32 113 20 126 32 -26 61 -31 91
3109I1j00N7j46J97r1o2J46j60J62j50J55k17J27Nm6Q2j38J56j98J77j31P4J1
$$ 91 -9 48 -98 99 8 -54 92 -68 94 -56 99 -118 9 14 -32 50 -88 68 -130 47 -84 -10 1
3132Aq0J50j03Q2k38K21pr7L7k3N6j72K00r7J17j32Q9M4k09J84p8J30j94J50Q
$$ 1 -79 71 -32 50 -188 33 26 -71 -34 -57 -1 -173 27 -70 47 -85 4 48 -161 23 -55 75 -119 31 39
3157C9j02M5k0J46k15J77o0L9j22J21N2k42J47rJ79k58J60l1j18P8l3J92l10K18
$$ 39 -63 -18 -38 108 -107 70 10 49 -73 48 100 -142 5 -4 175 -83 77 46 -72 6 -27 165 -145 73
3181G3n0L6k11J20J39k13P0M6J07k76J99N4j17o0M1K36l76J92J4k6j56J08J51
$$ 73 23 59 -152 -32 107 -106 -36 10 117 -159 40 94 -23 -83 -42 194 -182 10 24 -2 -158 -50 101
3204A01k70J72qL1j83J62P1n5o8RJ80l12J61O0N0k52J35K68m09J20O9J23l38J83
$$ 101 -169 3 -5 26 -157 5 76 21 -47 -38 142 -170 -9 51 101 -151 -16 252 -157 -37 32 155 -183 0
3228@J93k58LQ4J66l42K51J1l8j08rK45k54J59l9J62k42l9K01r0m6K9K34l70Q5
$$ 0 193 -65 -62 22 188 -154 97 108 70 -38 -47 198 -56 103 64 226 -16 -55 146 56 10 39 273 -97 -12
3253a2J13mj92P8J84k84J14K2J34k74J23N5j13J9%J83k31JM5R7j52k3K81k77k5
$$ -12 101 97 -95 -17 167 -117 -3 19 153 -121 2 57 -56 -37 -37 146 -85 -84 -39 58 -94 -117 164 -113 -138
3278a38O3J67k13L8J70j51kl2J82k47J19P5n1J3r5J92j98J00q5J79j39o3J75p9
$$ -138 -75 92 -121 -83 87 -64 -66 -98 84 -163 -44 31 -20 -7 -102 90 -108 -8 -93 86 -53 -116 59 -20
3302b0O3j24J94k12N5J42n6q3m4K26k42J46n7Q7j20K3J29j76J36j69K58j54K3
$$ -20 43 -81 113 -99 -44 98 42 -41 -85 141 -101 45 -12 75 -45 -22 107 -69 67 -102 156 2 25
3325B5L3o2N3q5K06j94j3M2R0j32j5K08k40O2j1Q1j93J86k7o4R3j23J82k00J16
$$ 25 58 -4 49 -36 170 -24 -37 5 95 -37 -52 156 -84 -22 -33 48 -145 41 14 -50 43 -80 102 -98 18
3350A8j5m4L0j5O2j46J54k5kp8K4R7j69J28q4J43k56K19J1j03R3n4R8k07J81n5
$$ 18 3 -41 -11 -26 36 -110 44 19 17 -61 -37 60 -109 19 -65 78 -178 41 52 -51 42 -12 86 -121 60 5
3376EPm3R3Pj01R5q9Q9j28J37k7p0K7L3Q6k06J98p8K6q8N2P9j64Q1rN8j60J75
$$ 5 12 -31 62 69 -32 63 -26 63 -65 72 45 -25 2 35 121 -85 113 35 61 -27 25 104 -60 21 12 70 -90 85
3404H5Rj55N8L6L5j69K34j35p3K1J00J8j68J88r7kj34J72Mj27P3L0Q0k57K03j
$$ 85 94 -61 -3 33 68 -101 133 -2 -75 -54 46 64 -104 84 -13 -15 -149 23 27 -100 -27 3 83 -174 29 28
3430B8q3j4J19k1k17K13j9n3l9J43k5j81J81m6L8j71K52m2o7j1N6J26l19K46m1
$$ 28 -55 -69 50 29 -188 25 6 -47 -86 57 32 -149 32 -14 24 -147 105 63 -4 -15 41 167 -152 94 53
3455E3p7j05K20pk60K22N0j2k03K17m0r6R8j2P1k30K11m9pq7J45mj18O0j1O5k24
$$ 53 -24 -129 91 84 -176 46 96 84 -119 98 58 -38 60 48 119 -111 100 51 44 -43 102 98 -20 40 29 94 -130
3482a30K00N2j67pJ33L5k66J88k4k7o6J94l4j65J49o7K7j55K43l3j14k1K8R5k49
$$ -130 70 122 -45 -52 81 116 -150 38 14 -13 -79 115 81 -84 65 -2 25 -130 113 80 -34 -55 -27 68 -181
3507a81J68L4q7o8J73L6k51K04J5o5j36K09m1j24P7Q5k4j67J78N7j16m7J03N6
$$ -181 -13 21 -66 -134 39 75 -176 28 43 -22 -158 51 10 -114 -37 48 24 -143 35 92 -24 -71 32 88
3531H8k33K22rk4j01J44Kj89Q5J9P0k14K41o7m0j9J24k3j90J77l4K4j46J60k3
$$ 88 -145 77 68 44 -57 87 89 -100 -15 4 74 -140 101 34 -6 -25 99 76 -114 63 29 53 -93 67 44
3556D4j22J31j9O3k50K54q4p3kQ7Mj37J76r1J1p1J52m5j35J22j7jj31J81n9m4
$$ 44 -78 53 34 97 -153 101 17 -56 -58 29 33 -104 72 -19 -8 -79 73 28 -107 15 -2 -3 -134 47 -12 -56
3582e6M9N4n2j44J91l9n4j0J25q2o6K05j47K6j5J00K7j83J24Jm3p9J16o0oMO2
$$ -56 -7 47 -5 -149 42 3 -51 -61 64 -18 -84 121 -26 0 -15 85 112 -71 53 54 11 -68 48 -12 -18 -14 48
3609D8j0j02J86r6Nm6J30p2m4O8m7K8n8J04o5m1J9J7l4o1J94q8m2o6J45q0o1J32
$$ 48 38 -64 122 26 31 -15 115 43 -1 67 20 48 -10 94 29 -12 7 24 -10 -71 123 35 -7 -73 72 -8 -69 63
3637F3p6j8m4K15j67o3R8N0o6p4J38j08J8k2J45o2j17J01l7k0k5J28j37rO2O0
$$ 63 -13 -31 -75 140 -27 -90 8 58 -8 -82 56 -52 -34 -56 89 27 -90 11 -26 -46 -71 57 -80 -89 -27 33
3663C3o4q6K16j00k8k0J58j59n9K12j39Oj7J13j18N1N9qj3p9J54n4l2k0J06p5
$$ 33 -31 -117 99 -1 -29 -49 109 -50 -109 103 -36 -30 -47 66 -52 -1 58 50 37 -42 112 58 26 6 112 37
3689C7r3J62n4m6m2J79j46r1K11l3q6k8J48j54K5L0j8J8n0J33r7p1l7K01j07j04
$$ 37 -56 106 52 6 -36 143 -3 -94 117 84 -2 -30 118 -36 -11 19 1 19 -31 102 5 -66 -103 98 -9 -113
3715a13J78n9J4j26K15j43p5Q6N5j01k3J91j29n6NJ65j22n6J67q9O1j23J78r4
$$ -113 65 6 20 -106 109 -34 -109 -23 32 -69 -92 99 -30 -86 -81 84 -38 -94 73 -16 45 -78 100 6
3739Fp9J50K2j10r6K02q0n5NJ44j50l2J75r8k0j4J81k22NJ70l3p6o5K02j60J7
$$ 6 -73 77 99 -11 -107 95 15 -40 -35 109 -41 -73 102 4 -16 -30 151 -71 -66 104 71 -5 -70 132 -28 -11
3765a1P0O2r2j35K03j29L6K1J00j64j8Q4L3o3l1J33j22NM5O0j81mJ84j62J6N5
$$ -11 59 121 29 -106 97 -32 4 25 125 -39 -57 27 60 -3 -34 99 -23 -18 27 87 -94 -98 86 -76 -60 -5
3791eO6j75N6J33p6m1n2J58j48L4O9K1j17p9K55j35j8kJ68j72p3K12o4l0m4J67
$$ -5 61 -114 -58 75 -1 -42 -94 64 -84 -50 19 40 -77 -156 99 -36 -54 -56 112 -60 -133 79 15 -15 -59 108
3817A08k04L0R1M8j25j0J88k03N7OJ06j33mJ36q0lm7J17o2n9J01rp3RK16k30M7
$$ 108 -96 -66 25 73 -52 -62 126 -77 -20 -14 92 -41 -45 91 11 8 -39 78 16 -43 58 49 -24 -15 201 -29 18
3844A8k5O9j18O0J17j27J4J2Q9j56L7R1q6p9L8J17j12K8k9Q8n3p1K20j84j5L4
$$ 18 -7 62 -56 4 121 -6 8 20 109 -47 -10 81 -5 -84 -46 71 -41 -13 -42 46 -7 -78 142 -42 -57 -23
3870b3J57j92j3J55p1n4K3J43k35N3J05j4j10L3J06j29K6J3P8j29Q2Q8j21n8L0
$$ -23 134 -58 -71 84 13 -41 -18 125 -110 -57 48 34 -76 -43 63 -66 -40 -27 51 -78 4 92 -29 -87 -57
3895e7J64k22Q5Q0m5q4M0Q7j10M3j2J09j74O3J06p8Qk1J35j87Q3PO9j52L9J73
$$ -57 107 -115 -30 50 5 -79 -39 48 -62 -19 -31 78 -96 -33 73 -5 3 -18 117 -70 13 20 89 -63 -24 149
3921A49k33Q1O9P0j81L6Q7j04lK5Q7k00J14O3m7m6O4M7j90N4O9K5j22O0J46j87
$$ 149 -84 -3 66 136 -45 -9 78 -26 -29 -4 83 -117 -3 60 13 -33 31 78 -112 -58 11 36 -86 -26 120 -67
3947f7K0J8J31k37J05P3q8L7l3J38j91Q1K2M3j07K1J58j62j4Q4P7k00R2O8n8P
$$ -67 -47 -29 102 -135 -30 43 -45 -8 -41 97 -94 -13 9 52 -55 -34 124 -38 -52 32 109 -91 1 69 11 18
3973A8PK8j35J39j3k0p8J21k1m5qM3J8j74J36O9j23J1j4J59k37J45M6l0q2O9J41
$$ 18 25 53 -82 57 44 24 -54 67 46 1 -7 36 54 -120 16 85 -38 -27 -41 118 -119 26 72 42 -40 29 170
4000A70k58J38J2Oj60J16M6j35L0J9J22j99Q2M2j6m7L9O7j82Q6N8M4k18J34R2
$$ 170 -88 50 62 68 -92 24 70 -65 -35 -16 106 -93 -11 31 15 -32 7 74 -108 -22 36 80 -138 -4 88
4025H8j65L8R4j7j72J10L8n3k8N9L2j11J41j14J22j07J3R5j40M9P3j7j32J00O8
$$ 88 -77 -39 55 38 -134 -24 14 -39 -67 -8 24 -87 54 -60 62 -45 -32 63 -77 -28 45 28 -104 -4 64
4050F4j03j2N2Q7j51J21j1m5o2J57p3o4K3O4K7j45R5N1j01M1L8J2j46O8M4Rp3
$$ 64 -39 -51 1 88 -63 58 47 2 -60 97 24 -40 -17 47 74 -71 24 75 -26 15 53 65 -81 -13 31 40 -33
4077c3J10L4j53R1moq7J17oj25L0L9L4j54J18K5m0l1j9J34j50Q2K1L4j53J10M4
$$ -33 77 111 -42 49 45 39 -48 69 63 -62 -32 7 41 -113 5 30 -10 -41 -60 74 -76 6 27 61 -92 18 62
4104F2j54O3K6j1j09J57j9k8k6Q1oj39R3M2l0o0Q0N6j45R3J3K3j30R3M0j09K9
$$ 62 -92 -29 -3 -14 -123 34 15 -13 -39 42 36 -103 -10 32 2 -58 22 78 -67 26 39 62 -68 25 65 -44 -15
4131a5L6J0j38J46k8J7r1J50jr1L4PJ4j67J64j4j02J06j0Q1j93J21Qn7K9K4Nj24
$$ -15 21 31 -107 39 11 28 -63 87 86 -5 29 36 50 -117 47 33 -69 37 27 108 -85 36 44 -13 16 40 45 -79
4159g9J36J0l9r6J04M2j38P1N6Oj50J32J9p1n2J11k7j38J48j6o3n7J08l7n6J08
$$ -79 57 67 28 -68 36 78 -60 11 67 73 -77 55 74 3 -49 62 35 -103 45 29 -34 -91 17 -20 -76 32
$$ [...]
8191A4
##END NTUPLES=NMR FID
##END=
