##TITLE=1H_TG-2300-1
 CDCl3, 8 sc, 
 25.8.2020
##JCAMPDX= 6.0         $$ Bruker NMR JCAMP-DX V2.0
##DATA TYPE= NMR FID
##DATA CLASS= NTUPLES
##ORIGIN= UXNMR, Bruker Analytische Messtechnik GmbH
##OWNER= root
$$ XWIN-NMR		Version 3.5
$$ Tue Aug 25 11:30:48 2020 Russian Standard Time (UT+4h)  she@DPX200
##.OBSERVE FREQUENCY= 200.1314999998
##.OBSERVE NUCLEUS= ^1H
##.DELAY= (6, 6)
##.ACQUISITION MODE= SIMULTANEOUS
##.ACQUISITION SCHEME= undefined
##.AVERAGES= 8
##.DIGITISER RES= 18
##SPECTROMETER/DATA SYSTEM= spect
##.PULSE SEQUENCE= zg30
##.SOLVENT NAME= CDCl3
##.SHIFT REFERENCE= (INTERNAL, CDCl3, 0, 15.7039)
##AUDIT TRAIL= $$ (NUMBER, WHEN, WHO, WHERE, WHAT)
$$ ##TITLE= Audit trail, XWIN-NMR		Version 3.5
$$ ##JCAMPDX= 5.01
$$ ##ORIGIN= Bruker BioSpin GmbH
$$ ##OWNER= she
$$ F:/spectra/data/she/nmr/H-F/1/audita.txt
$$ ##AUDIT TRAIL=  $$ (NUMBER, WHEN, WHO, WHERE, WHAT)
(   1,<2020-08-25 11:29:27.59 +0400>,<she>,<DPX200>,
      <created by zg, POWCHK disabled, PULCHK disabled
       configuration hash MD5:
       00 E9 B6 7A A2 85 ED C7 34 08 36 98 17 FE 4E 26
       data hash MD5: 16K
       02 B4 21 74 12 5E 1B D0 E0 BC 64 86 5F 2B 61 D7>)
$$ ##END=
$$ 
$$ hash MD5
$$ 3B AA E0 EB 86 05 26 D1 9F A5 97 04 55 1E C3 81
##$RELAX= 
##$RELAX= 
##$RELAX= 
##$RELAX= 
##$RELAX= 
##$RELAX= 
$$ Bruker specific parameters
$$ --------------------------
##$DU= <F:/spectra>
##$EXPNO= 1
##$NAME= <H-F>
##$PROCNO= 1
##$TYPE= <nmr>
##$USER= <she>
##$AMP= (0..31)
100 100 100 100 100 100 100 100 100 100 100 100 100 100 100 100 100 100 
100 100 100 100 100 100 100 100 100 100 100 100 100 100 
##$AQSEQ= 0
##$AQ_mod= 1
##$AUNM= <au_zg>
##$AUTOPOS= <>
##$BF1= 200.13
##$BF2= 200.13
##$BF3= 200.13
##$BF4= 200.13
##$BF5= 200.13
##$BF6= 200.13
##$BF7= 200.13
##$BF8= 200.13
##$BYTORDA= 1
##$CFDGTYP= 0
##$CFRGTYP= 5
##$CHEMSTR= <none>
##$CNST= (0..31)
1 1 145 1 1 1 1 1 1 1 1 1 1 1 1 1 1 1 1 1 1 1 1 1 1 1 1 1 1 1 1 1 
##$CPDPRG= <>
##$CPDPRG1= <>
##$CPDPRG2= <>
##$CPDPRG3= <>
##$CPDPRG4= <mlev>
##$CPDPRG5= <mlev>
##$CPDPRG6= <mlev>
##$CPDPRG7= <mlev>
##$CPDPRG8= <mlev>
##$CPDPRGB= <>
##$CPDPRGT= <>
##$D= (0..31)
0 1.2 0 0 0 0 0 0 0 0.06 0 0.03 0 0 0 0 0.0002 0 0 0 0 0 0 0 0 0 0 0 0 
0 0 0 
##$DATE= 1598340566
##$DBL= (0..7)
120 120 120 120 120 120 120 120 
##$DBP= (0..7)
150 150 150 150 150 150 150 150 
##$DBP07= 0
##$DBPNAM0= <>
##$DBPNAM1= <>
##$DBPNAM2= <>
##$DBPNAM3= <>
##$DBPNAM4= <>
##$DBPNAM5= <>
##$DBPNAM6= <>
##$DBPNAM7= <>
##$DBPOAL= (0..7)
0.5 0.5 0.5 0.5 0.5 0.5 0.5 0.5 
##$DBPOFFS= (0..7)
0 0 0 0 0 0 0 0 
##$DE= 6
##$DECBNUC= <off>
##$DECIM= 24
##$DECNUC= <off>
##$DECSTAT= 4
##$DIGMOD= 1
##$DIGTYP= 9
##$DL= (0..7)
0 120 120 120 120 120 120 120 
##$DP= (0..7)
150 150 150 150 150 150 150 150 
##$DP07= 0
##$DPNAME0= <>
##$DPNAME1= <>
##$DPNAME2= <>
##$DPNAME3= <>
##$DPNAME4= <>
##$DPNAME5= <>
##$DPNAME6= <>
##$DPNAME7= <>
##$DPOAL= (0..7)
0.5 0.5 0.5 0.5 0.5 0.5 0.5 0.5 
##$DPOFFS= (0..7)
0 0 0 0 0 0 0 0 
##$DQDMODE= 0
##$DR= 18
##$DS= 0
##$DSLIST= <SSSSSSSSSSSSSSS>
$$ [...]
##$SUBNAM2= <"">
##$SUBNAM3= <"">
##$SUBNAM4= <"">
##$SUBNAM5= <"">
##$SUBNAM6= <"">
##$SUBNAM7= <"">
##$SUBNAM8= <"">
##$SUBNAM9= <"">
##$SW= 24.9337058888022
##$SWIBOX= (0..15)
0 0 2 0 0 0 0 0 0 0 0 0 0 0 0 0 
##$SW_h= 4990.01996007984
##$TD= 16384
##$TD0= 1
##$TE= 0
##$TE2= 300
##$TE3= 300
##$TEG= 300
##$TL= (0..7)
0 120 120 120 120 120 120 120 
##$TP= (0..7)
150 150 150 150 150 150 150 150 
##$TP07= 0
##$TPNAME0= <>
##$TPNAME1= <>
##$TPNAME2= <>
##$TPNAME3= <>
##$TPNAME4= <>
##$TPNAME5= <>
##$TPNAME6= <>
##$TPNAME7= <>
##$TPOAL= (0..7)
0.5 0.5 0.5 0.5 0.5 0.5 0.5 0.5 
##$TPOFFS= (0..7)
0 0 0 0 0 0 0 0 
##$TUNHIN= 0
##$TUNHOUT= 0
##$TUNXOUT= 0
##$USERA1= <user>
##$USERA2= <user>
##$USERA3= <user>
##$USERA4= <user>
##$USERA5= <user>
##$V9= 5
##$VALIST= <valist>
##$VCLIST= <CCCCCCCCCCCCCCC>
##$VD= 0
##$VDLIST= <DDDDDDDDDDDDDDD>
##$VPLIST= <PPPPPPPPPPPPPPP>
##$VTLIST= <TTTTTTTTTTTTTTT>
##$WBST= 1024
##$WBSW= 4
##$XGAIN= (0..3)
0 0 0 0 
##$XL= 0
##$YL= 0
##$YMAX_a= 74721
##$YMIN_a= -114645
##$ZGOPTNS= <>
##$ZL1= 120
##$ZL2= 120
##$ZL3= 120
##$ZL4= 120
##$ABSF1= 10
##$ABSF2= 0
##$ABSG= 5
##$ABSL= 3
##$ALPHA= 0
##$AQORDER= 0
##$ASSFAC= 0
##$ASSFACI= 0
##$ASSFACX= 0
##$ASSWID= 0
##$AUNMP= <proc_1d>
##$AZFE= 0.1
##$AZFW= 0.1
##$BCFW= 1
##$BC_mod= 2
##$BYTORDP= 1
##$COROFFS= 0
##$CY= 11.3945322036743
##$DATMOD= 1
##$DC= 2
##$DFILT= <>
##$DTYPP= 0
##$F1P= 16.9975609425685
##$F2P= -3.02152046262296
##$FCOR= 0.5
##$FTSIZE= 0
##$FT_mod= 4
##$GAMMA= 1
##$GB= 0.15
##$INTBC= 1
##$INTSCL= 1
##$ISEN= 128
##$LB= 0.24
##$LEV0= 0
##$LPBIN= 0
##$MAXI= 10000
##$MC2= 0
##$MEAN= 0
##$ME_mod= 0
##$MI= 1.114404
##$NCOEF= 0
##$NC_proc= 0
##$NLEV= 6
##$NOISF1= 3.799351
##$NOISF2= 2.8
##$NSP= 1
##$NTH_PI= 0
##$NZP= 0
##$OFFSET= 15.70392
##$PC= 1
##$PHC0= -9955.41
##$PHC1= 16.20092
##$PH_mod= 1
##$PKNL= yes
##$PPARMOD= 0
##$PSCAL= 0
##$PSIGN= 0
##$REVERSE= no
##$SF= 200.130013532006
##$SI= 16384
##$SIGF1= 3
##$SIGF2= 2
##$SINO= 400
##$SIOLD= 16384
##$SREGLST= <1H.CDCl3>
##$SSB= 0
##$STSI= 0
##$STSR= 0
##$SW_p= 3612.71676300578
##$SYMM= 0
##$S_DEV= 0
##$TDeff= 0
##$TDoff= 0
##$TI= <>
##$TILT= no
##$TM1= 0
##$TM2= 0
##$TOPLEV= 0
##$USERP1= <user>
##$USERP2= <user>
##$USERP3= <user>
##$USERP4= <user>
##$USERP5= <user>
##$WDW= 1
##$XDIM= 8192
##$YMAX_p= 0
##$YMIN_p= 0
$$ End of Bruker specific parameters
$$ ---------------------------------
##NTUPLES= NMR FID
##VAR_NAME=  TIME,          FID/REAL,        FID/IMAG
##SYMBOL=    X,             R,               I
##VAR_TYPE=  INDEPENDENT,   DEPENDENT,       DEPENDENT
##VAR_FORM=  AFFN,          ASDF,            ASDF
##VAR_DIM=   8192,          8192,            8192
##UNITS=     SECONDS,       ARBITRARY UNITS, ARBITRARY UNITS
##FACTOR=    0.0002004,     1,               1
##FIRST=     0,             0,               0
##LAST=      1.6414764,     0,               0
##MIN=       0,             -114645,         0
##MAX=       1.6414764,     74721,           0
$$ Real data points
##PAGE= N=1
##DATA TABLE= (X++(R..R)), XYDATA
$$ plain form
0 0 0 0 0 0 0 0 0 0 0 0 8 -8 8 -8 8 -16 16 -16 24 -24 32 -36 40 -48 56 -64 72 -81 94 -105 118 -134 150
33 150 -167 187 -207 231 -255 286 -317 352 -387 431 -476 528 -587 650 -723 810 -906 1022
51 1022 -1157 1327 -1534 1808 -2174 2701 -3528 5020 -8551 35224 -6750 -69305 23927 74721
65 74721 32149 -27961 -4961 32438 31983 973 -9345 -939 11185 14322 13175 -772 -11947
78 -11947 -9392 5522 4709 -1304 1194 2963 -4048 -1378 9177 1465 -13942 -3995 12772 5961
92 5961 -14096 -14201 62 9577 7183 -3741 -7748 -603 3153 -5034 -7617 3054 2016 -12913
106 -12913 -16390 2460 14329 -2193 -20347 -8717 16500 6250 -27296 -22626 14900 18626 -19521
119 -19521 -31516 -3461 12881 829 -11530 -8246 -667 5059 793 -14403 -19682 -5153 12812
$$ packed form
0@%%%%%%%%%%Qj6J6j6J6k4L2l2M0m8N6o8P6q8J04j20J36j53J75j99K23k52K84
33A50l17L54l94M38m86N41o03O69p39Q18r07J004j115J237j373J533j716J928
51A022k179K484k861L342l982M875o229Q548j3571M3775m1974o2555R3232N0794
65G4721m2572o0110K3000L7399m55l1010j0318Q406J2124L137j147j3947j1175
78a1947K555J4914q13o013K498J769p011K670J0555p712j5407R947J6767o811
92E961k0057j05J4263R515k394j0924m007P145L756q187k583J0671j038j4929
106a2913l477J8850J1869j6522j8154J1630K5217j0250l3546M670L7526L726l8147
119a9521j1995K8055J6342j2052j2359L284P579N726m266j5196n279J4529J7965
$$ plain form
132 12812 9538 -8541 -16040 -3498 9590 2548 -6662 -454 5650 -2652 -9249 -3132 -2695 -6575
146 -6575 -57 6462 -954 -9970 -4229 2970 1723 -3328 -6579 -3498 1842 1131 -5866 -2951 8402
161 8402 8429 505 670 9192 9508 1007 -2324 5506 16170 10149 -4505 -2199 15400 19372 5269
176 5269 1204 7334 7914 6215 8667 7267 525 3303 9139 5584 1040 5427 12874 10090 1850
191 1850 -1942 2514 6828 833 -3578 2323 7170 360 -4384 1279 1665 -2196 159 3025 -3238
206 -3238 -8254 -3288 -2217 -6655 -7631 -2506 2200 481 -5962 -10836 -3682 4723 -955 -10375 -9210
221 -9210 -2436 -3277 -5512 -4152 -2517 -1482 -3757 -6695 -5042 -458 -3739 -11577 -8551 -2468 -3837
236 -3837 -7019 -5369 -5116 -6337 -246 2106 -5183 -9822 -4406 691 -2421 -5682 -6080 -3158 237 -547
$$ packed form
132A2812l274j8079p499J2542J3088p042r210O208O104q302o597O117M37l880
146f575O518O519p416r016N741P199j247n051l251L081N340p11o997K915J1353
161H402K7p924J65Q522L16q501l331P830J0664o021j4654K306J7599L972j4103
176E269m065O130N80j699K452j400o742K778N836l555m544M387P447k784q240
191A850l792M456M314n995m411N901M847o810m744N663L86l861K355K866o263
206c238n016M966J071m438r76N125M706j719o443m874P154Q405n678r420J165
221i210O774q41k235J360J635J035k275k938J653M584l281p838L026O083j369
236c837l182J650K53j221O091K352p289m639N416N097l112l261l98K922L395p84
$$ plain form
252 -547 -1951 -1012 -3 -2776 -2016 531 -5436 -9387 -1040 6835 -960 -9394 -3485 4200 4316 -291
268 -291 -2563 -1415 1760 2086 -2746 -2711 914 1461 1112 3533 3691 -771 524 4479 2468 -1352 -1581
285 -1581 518 962 1367 -1103 -2303 3981 7826 2403 -3619 -580 3785 3830 3037 -1269 -3948 1508
301 1508 8517 4058 -3872 836 8716 7606 45 -3209 1100 5163 2330 -5223 -2825 6091 5146
316 5146 -2556 -2735 3271 2720 168 479 -1335 -2416 310 1936 -2067 -2945 1955 4671 3552 -490
332 -490 -2949 612 5810 1887 -7578 -5348 3703 4595 -2397 -6115 -3171 2441 6896 1534 -7545 -6012
348 -6012 2509 3721 -4240 -7551 -3061 4404 6351 -2313 -8656 -993 9618 3523 -8553 -6411 2813
363 2813 4133 -3402 -8050 -4419 3249 4913 -3292 -6687 -572 3580 -895 -6285 -6241 -3405 2158 2797
$$ packed form
252e47j404R39J009k773P60K547n967l951Q347P875p795q434N909P685J16m607
268b91k272J148L175L26m832L5L625N47l49K421J58m462J295L955k011l820k29
285a581K099M44M05k470j200O284L845n423o022L039M365M5p93m306k679N456
301A508P009m459p930M708P880j110p561l254M309M063k833p553K398Q916r45
316E146p702j79O006n51k552L11j814j081K726J626m003q78M900K716j119m042
332d90k459L561N198l923r465K230R051Q92o992l718K944N612M455n362r079J533
348f012Q521J212p961l311M490P465J947q664o343P663J0611o095j2076K142R224
363B813J320p535m648L631P668J664q205l395O115M152m475n390M4K836N563O39
$$ plain form
379 2797 -5127 -8311 963 8491 1110 -7335 -4826 3203 6359 -327 -8640 -7364 3579 7047 -929
394 -929 -4566 -425 3792 2805 -916 -5300 -4280 4162 5199 -3657 -7675 -162 6355 3181 -1597 -1815
410 -1815 4092 7668 689 -7732 -3734 6850 5728 -2293 -2706 2246 4702 2745 -683 -2868 1418
425 1418 6565 2070 -5147 -4861 1463 4234 2071 -1390 -1676 5273 8446 601 -5977 -37 7471 3166
441 3166 -3423 -2980 2150 5541 3021 -2556 -3411 3912 6782 288 -4697 -3191 666 1664 -341 -4788
457 -4788 -3776 5001 6908 -1342 -6084 396 5448 1691 -2903 -3197 1658 4672 638 -4810 -1203
472 -1203 7038 5785 -183 -1520 634 1705 935 -1488 -4785 -723 6086 3358 -4308 -4839 2172 5060
488 5060 1612 -3588 -4441 1924 4339 -3040 -8940 -2353 5836 3381 -2098 -3560 -1012 1763 1239 -4175
$$ packed form
379B797p924l184R274P528p381q445K509Q029L156o686q313J276J0943L468p976
394i29l637M141M217r87l721m384J020Q442J037q856m018P513O517l174m778k18
410a815N907L576o979q421L998J0584j122q021m13M952K456j957l428k185M286
425A418N147m495p217K86O324K771k163l461k86O949L173p845o578N940P508m305
441C166o589M43N130L391k520n577q55P323K870o494m985J506L857R98k005m447
457d788J012Q777J907q250m742O480N052l757m594k94M855L014m034n448L607
472a203Q241j253n968j337K154J071p70k423l297M062O809k728p666n31P011K888
488E060l448n200q53O365K415p379n900O587Q189k455n479j462K548K775n24n414
$$ plain form
504 -4175 -7348 -1244 3580 -300 -5905 -5585 -171 3899 2840 -3775 -4759 3039 5512 -2531 -7635 -1068
520 -1068 5286 3997 -248 -2154 1136 5540 4477 -1918 -3143 2590 4143 651 -3226 -3647 55
535 55 4955 3627 -3703 -3033 5033 6045 -1857 -6021 -1483 3248 3710 -498 -3764 624 6189 4386
551 4386 -1713 -739 3784 4650 3069 -334 -2459 217 5244 3641 -1398 1154 6567 6381 1343 -1627
567 -1627 33 4135 5874 540 -2969 1747 5935 2711 -1017 1555 4185 4680 3647 -295 -3129
582 -3129 -719 3182 1180 -1821 -1009 833 2240 1282 -1616 -2631 1590 3558 -1557 -4030 -1044 917
598 917 -453 10 1269 586 1935 3317 1527 -590 246 1460 756 538 -917 -1688 1361 3107 158
615 158 -2157 815 1743 -756 -1206 -1044 -1894 -1988 -742 -1614 -2215 576 1675 770 306 -196 -1531 -435
$$ packed form
504d175l173O104M824l880n605L20N414M070j059o615r84P798K473q043n104O567
520a068O354j289m245j906L290M404j063o395j225N733J553l492l877m21L702
535E5M900j328p330O70Q066J012p902m164M538M731M62m208l266M388N565j803
551D386o099R74M523Q66j581l403k125K676N027j603n039K552N413j86n038k970
567a627J660M102J739n334l509M716M188l224l728K572K630M95j033l942k834
582c129K410L901k002l001Q12J842J407r58k898j015M221J968n115k473K986J961
598I17j370M63J259o83J349J382j790k117Q36J214p04k18j455p71L049J746k949
615A58k315K972R28k499m50J62q50r4J246q72o01K791J099r05m64n02j335J096
$$ plain form
633 -435 1806 -655 -2424 400 2138 -215 -1520 1010 2206 2912 2194 -716 -1849 214 1500 -757
649 -757 -918 436 669 2138 2306 -756 -2036 2891 5117 -401 -3664 -1362 1456 865 -509 -1098 -152
666 -152 2919 2214 -1219 -1604 736 1083 -348 -680 -2431 -2253 1504 2598 -812 -1599 2756 3465 428
683 428 -894 -187 1376 1873 164 -2639 -934 3237 2069 -881 -413 1450 414 -1083 -2055 -3428
699 -3428 -1752 226 -2147 -5206 -3189 538 -34 -1747 -2944 -2495 18 126 -4195 -6559 -1124 2745
715 2745 -1326 -4591 -2502 880 1215 122 -2090 -2880 -26 426 -2631 -4302 -1744 613 761 -222
731 -222 -2754 -1880 2359 2438 -2861 -4116 853 1519 -2280 -3718 -1622 1021 1985 445 -2899 -1911 1856
748 1856 892 -2826 -3832 -1696 -668 -720 -2448 -4206 -1139 2621 412 -4254 -2911 1001 382 -2440
$$ packed form
633d35K241k461j769K824J738k353j305K530J196P06p18k910j133K063J286k257
649g57j61J354K33J469J68l062j280M927K226n518l263K302K818n91j374n89R46
666a52L071p05l433l85K340L47j431l32j751J78L757J094l410p87M355P09l037
683D28j322P07J563M97j709k803J705M171j168k950M68J863j036j497r72j373
699c428J676J978k373l059K017L727n72j713j197M49K513J08m321k364N435L869
715B745m071l265K089L382L35j093k212p90K854M52l057j671K558K357J48r83
731b22k532Q74M239P9n299j255M969O66l799j438K096K643R64j540l344R88L767
748A856r64l718j006K136J028n2j728j758L067L760k209m666J343L912o19k822
$$ plain form
764 -2440 -4004 -2592 876 2048 -1769 -4180 1109 4817 1032 -3451 -2680 784 1870 333 -3741
779 -3741 -4606 630 3763 33 -4183 -1687 2564 2774 -1221 -5711 -3396 2989 3237 -3866 -5411 1325
795 1325 4254 620 -2833 -1895 1154 2949 339 -5454 -5019 1173 3202 -1344 -5050 -2468 1951 3414
811 3414 -1387 -6348 -2850 3530 1755 -5800 -6336 -455 3075 1350 -3083 -4418 78 4903 1091
826 1091 -5647 -4038 1776 2298 -2449 -5142 -2764 2370 4310 -1351 -6084 -1822 4243 1984 -4612
841 -4612 -5102 -484 3062 460 -5256 -4559 3031 6448 18 -4925 -1745 2219 2089 -868 -3318 -2670
857 -2670 1883 3684 -1641 -4910 -697 4353 2926 -2128 -4445 -2472 1816 1262 -3474 -3869 953 3204
873 3204 -199 -2280 -1297 1191 3232 1289 -3276 -3672 1648 2568 -1842 -2851 706 3261 1428 -1791
$$ packed form
764b440j564J412L468J172l817k411N289L708l785m483P71L464J086j537m074
779c741q65N236L133l730m216K496M251K10l995m490K315O385K48p103j545O736
795A325K929l634l453R38L049J795k610n793M35O192K029m546l706K582M419J463
811C414m801m961L498O380j775p555n36N881L530j725m433j335M496M825l812
826A091o738J609N814N22m747k693K378N134J940n661m733M262O065k259o596
841d612m90M618L546k602n716O97P590L417o430m943L180L964j30k957k450O48
857b670M553J801n325l269M213N050j427n054k317J973M288n54m736l95M822K251
873C204l403k081R83K488K041j943m565l96N320R20m410j009L557K555j833l219
$$ plain form
889 -1791 -3110 179 4111 925 -4948 -4248 1188 2478 -785 -2262 -852 2464 3107 -814 -3790 -753
905 -753 3286 1183 -2028 -2267 -1185 399 1806 768 -1580 264 2631 -243 -3580 -2168 727 587
921 587 -948 -2168 -2225 298 1312 -368 -1345 755 1511 -441 -1648 -2445 -1721 1521 2878 -527 -2946
938 -2946 609 2900 924 -435 247 782 233 -406 -2031 -1440 1392 1659 -99 50 1620 732 -320
955 -320 711 1170 1275 904 -583 -1682 735 3288 1786 701 1438 1516 864 1136 520 -1209 335 2004
973 2004 -109 -2097 -469 1528 1146 1286 1223 -123 -439 -139 -498 -439 859 354 -886 76 474 169
991 169 1219 2108 -106 -1552 635 558 -2187 -2298 217 1105 206 -529 -1770 -1061 1563 1578 -969 -2007
1009 -2007 -983 -1207 -1126 -414 -1021 -794 830 1069 -1038 -1362 -252 -514 -352 -93 -1601 -3359 -1904 -203
$$ packed form
889a791j319L289L932l186n873P00N436J290l263j477J410L316O43l921k976L037
905g53M039k103l211k39J082J584J407j038k348J844K367k874l337J412K895j40
921E87j535j220n7K523J014j680r77K100P56j952j207p97P24L242J357l405k419
938b946L555K291j976j359O82N35n49o39j625N91K832K67j758J49J570q88j052
955c20J031M59J05l71j487j099K417K553j502j085P37P8o52K72o16j729J544J669
973B004k113j988J628J997l82J40o3j346l16L00l59N9J298n05j240R62L98l05
991A69J050Q89k214j446K187p7k745j11K515Q88q99p35j241P09K624J5k547j038
1009b007J024k24Q1P12o07K27J624K39k107l24J110k62J62K59j508j758J455J701
$$ plain form
1027 -203 -783 -475 3 -1104 -1619 -470 -795 -2475 -1229 133 -1036 -1888 -1040 -172 275 1151 725 344
1045 344 1208 380 -1640 -1023 1539 1053 -656 -332 -24 164 1543 2198 -192 -1027 1228 1370 -683 -1496
1063 -1496 -612 959 2329 1803 -918 -403 2655 3115 1119 172 444 352 1027 832 -678 441 3051
1080 3051 2470 -673 -362 1956 2035 779 -712 -1227 515 2177 -321 -3161 77 4259 3061 -1036
1096 -1036 -2499 -442 2248 2691 -1393 -3979 -908 2749 1179 -2176 -2003 134 2504 2323 -1920 -4475
1112 -4475 -1279 2470 -11 -3562 -2370 349 1142 -254 -1801 -1301 1797 2430 -1781 -3708 -786 1821
1128 1821 390 -2001 -2219 -166 3059 1881 -2916 -3242 1831 3610 -1082 -4473 -2867 836 2682
1143 2682 141 -3368 -1923 3324 3494 -1265 -2712 110 2374 1494 -905 -2593 -495 3317 2313
$$ packed form
1027b03n80L08M78j107n15J149l25j680J246J362j169q52Q48Q68M47Q76m26l81
1045C44Q64q28k020O17K562m86j709L24L08J88J379O55k390q35K255J42k053q13
1063a496Q84J571J370n26k721N15L058M60j996r47K72r2O75j95j510J119K610
1080C051n81l143L11K318P9j256j491n15J742J662k498k840L238M182j198m097
1096a036j463K057K690M43m084k586L071L657j570l355J73K137K370j81m243k555
1112d475L196L749k481l551J192K719P93j396j547N00L098O33m211j927K922K607
1128A821j431k391k18K053L225j178m797l26N073J779m692l391J606L703J846
1143B682k541l509J445N247J70m759j447K822K264q80k399j688K098L812j004
$$ plain form
1158 2313 -1421 -1232 2266 2788 16 -2016 -1952 991 2664 -614 -4144 -1408 3820 2853 -1407 -2385
1174 -2385 145 2886 2229 -1518 -4017 -275 3958 1874 -2105 -1978 1606 3456 2213 -1089 -2332
1189 -2332 1211 3034 -328 -3353 -685 2241 1158 -567 -901 297 1966 1440 -1345 -2054 1229 1896
1205 1896 -1080 -2387 -616 1717 2199 783 -1755 -786 3062 2561 -1892 -3338 -136 2008 861 -1502
1221 -1502 -3004 -550 2899 1986 -2140 -2337 1013 1224 -767 -2138 -1802 -190 1497 449 -1907 -488
1237 -488 2241 1119 -1379 -1131 698 766 -171 -1933 -2183 1059 2603 -214 -2402 570 3053 1486
1253 1486 -920 -1911 -651 1729 2239 -907 -2580 882 3303 1600 -822 -934 517 1980 1148 -2310
1269 -2310 -2967 319 1173 -1667 -2598 -267 860 -26 -1634 -2967 -1771 530 -331 -3813 -3517 -117
$$ packed form
1158B313l734J89L498N22k772k032O4K943J673l278l530K736N228r67m260r78
1174b385K530K741o57l747k499L742M233k084l979J27L584J850j243l302j243
1189b332L543J823l362l025K668K926j083j725l34J198J669n26k785p09L283O67
1205A896k976j307J771K333M82j416k538R69L848n01m453j446L202K144j147k363
1221a502j502K454L449r13m126j97L350K11j991j371L36J612J687j048k356J419
1237d88K729j122k498K48J829O8r37j762k50L242J544k817k188K972K483j567
1253A486k406r91J260K380N10l146j673L462K421j703k422j12J451J463q32l458
1269b310o57L286Q54k840r31K331J127q86j608j333J196K301q61l482K96L400
$$ plain form
1285 -117 528 -1321 -2627 -1892 360 2246 238 -3654 -2753 906 1076 -1714 -2559 -863 885 1555 -565
1302 -565 -2654 -831 1788 467 -2479 -1952 -409 -307 -816 -1685 -1691 409 2303 -56 -2482 -806 1341
1319 1341 348 -1755 -2269 -1059 1340 1744 -1606 -3006 270 2740 980 -1380 -1271 -549 704 604
1335 604 -1772 -2565 433 2965 1079 -798 -445 372 1173 1023 -443 -1080 734 1312 -813 -1188 508
1352 508 1372 830 730 81 -366 585 169 -1773 -1486 816 1119 -508 -708 -496 200 1538 927 -1234
1370 -1234 -1404 1029 892 -1133 -1705 -971 48 1076 838 -1085 -1202 675 573 -1131 -1810 -1613 -1271
1387 -1271 -15 135 -2079 -2265 4 760 -821 -1043 -371 -627 -434 -730 -2035 -2006 71 815 -377 -382
1405 -382 -32 -493 -333 -410 -1252 -1147 548 -272 -2655 -2282 -286 178 -250 -472 -882 -461 767 -707 -2859
$$ packed form
1285a17O45j849j306P35K252J886k008l892R01L659J70k790q45J696J748O70k120
1302e65k089J823K619j321k946N27J543J02n09q69oK100J894k359k426J676K147
1319A341r93k103n14J210K399M04l350j400L276K470j760k360J09P22J253j00
1335F04k376p93K998K532j886j877L53Q17Q01j50j466o37J814N78k125l75J696
1352E08Q64n42j00o49m47R51m16j942K87K302L03j627k00K12O96J338o11k161
1370a234j70K433j37k025n72P34J019J028k38j923j17J877j02j704o79J97L42
1387a271J256J50k214j86K269P56j581k22O72k56J93k96j305K9K077P44j192n
1405c82L50m61J60p7q42J05J695q20k383L73J996M64m28k22m10M21J228j474k152
$$ plain form
1424 -2859 -1977 627 601 -844 -1132 -1159 -47 1299 360 -1563 -846 1200 268 -1700 -1898 -1077 298 1036
1442 1036 -121 -1640 22 2025 366 -1596 -935 468 395 146 -633 -1219 645 2033 387 -1327
1458 -1327 338 2333 1505 -237 -1650 -1218 903 1673 -514 -1573 976 2250 634 -691 -479 283
1474 283 1179 1295 -713 -1384 662 1340 -231 -339 1639 2302 1385 354 -906 -115 1770 1363 -1142
1491 -1142 -1022 1356 1544 220 -540 -182 1095 2222 688 -2036 -1180 1266 828 -976 -945 335 1289
1508 1289 1777 219 -1523 -131 2016 792 -1804 -1348 327 458 -187 -1221 -1038 683 1451 -708
1524 -708 -2059 -39 934 -748 -2273 -1822 -566 824 837 -1562 -2075 755 1902 -633 -2189 -692
1540 -692 586 274 -1019 -2488 -1253 1538 1583 -1342 -1755 754 1389 -146 -1905 -2043 -193 1780 551
$$ packed form
1424b859Q82K604k6j445k88k7J112J346r39j923P17K046r32j968j98Q21J375P38
1442A036j157j519J662K003j659j962O61J403p3k49p79n86J864J388j646j714
1458a327J665J995q28j742j413M32K121P70k187j059K549J274j616j325K12P62
1474B83Q96J16k008o71K046O78j571j08J978O63r17j031j260P91J885m07k505
1491a142J20K378J88j324p60L58J277J127j534k724Q56K446m38j804L1J280R54
1508A289M88j558j742J392K147j224k596M56J675J31o45j034J83J721P68k159
1524g08j351K020R73j682j525M51J256J390J3k399n13K830J147k535j556J497
1540f92J278l12j293j469J235K791M5k925m13K509O35j535j759j38J850J973j229
$$ plain form
1557 551 -2590 -1748 1469 1967 -85 -1023 -185 829 1220 -726 -2593 -687 2299 1267 -1943 -1421 1136
1574 1136 1966 524 -1683 -1962 426 2083 -664 -3322 -1468 1428 1599 -225 -1407 -651 1765 2445
1590 2445 -880 -2728 118 2819 1067 -1681 -1281 1097 2882 2024 -960 -1535 1602 3027 12 -2177
1606 -2177 -706 1336 1739 121 -1514 -647 2572 2534 -1023 -2012 750 2288 576 -1628 -1911 212
1622 212 2727 1620 -1793 -1657 1917 2787 32 -1612 -989 792 1665 -7 -2066 -759 2439 2003
1638 2003 -738 -1194 631 1993 1374 -746 -2261 -313 2376 938 -1956 -1246 1509 1834 240 -1219
1654 -1219 -1601 62 1221 -607 -2793 -1536 648 -80 -1602 -1687 -307 1154 880 -1539 -2916 -537
1670 -537 1294 -282 -1631 -607 784 850 352 -717 -464 1627 2055 -274 -1564 -176 669 92 -195
$$ packed form
1557E51l141Q42L217M98k052r38Q38J014L91j946j867J906K986j032l210N22K557
1574A136Q30j442k207k79K388J657k747k658J854K896J71j824j182P56K416O80
1590B445l325j848K846K701j752k748M00K378J785q58k984n75L137J425l015k189
1606b177J471K042M03j618j635Q67L219l8l557r89K762J538j712k204k83K123
1622B12K515j107l413J36L574Q70k755j644O23J781Q73j672k059J307L198m36
1638B003k741m56J825J362o19k120j515J948K689j438k894P10K755L25j594j459
1654a219l82J663J159j828k186J257K184p28j522q5J380J461k74k419j377K379
1670e37J831j576j349J024J391O6m98j069K53K091M28k329j290J388Q45n77k87
$$ plain form
1687 -195 -353 158 1372 1232 -897 -1582 339 959 60 -640 -973 -917 69 519 -639 -485 1019 782 -620
1706 -620 -743 -157 -275 -160 -204 -1082 -728 954 938 -508 -348 585 477 358 4 -347 -2 790 147 -768
1726 -768 355 1315 697 449 1161 1006 130 58 -438 -594 715 1376 211 -576 41 218 16 791 798 59
1746 59 83 110 -917 -1009 152 617 598 1149 929 -254 -91 856 627 536 927 408 -197 240 517 -121 497
1767 497 1542 1092 272 289 -192 -910 -108 642 -77 -413 -233 -241 -55 662 181 -667 -43 418 -388 -712 -267
1788 -267 -591 -946 -78 78 -488 -60 653 195 -376 -204 -878 -1002 167 503 -226 -364 173 26 -74 492
1808 492 276 408 1209 626 -1316 -1475 70 532 461 479 22 -367 59 -256 -1233 -548 669 10 -1349
1827 -1349 -1519 -1149 -1158 -323 -59 -559 -206 146 -941 -2033 -1067 -84 -217 -464 -877 -1092 -127 706 -468
$$ packed form
1687a95j58N11J214j40k129o85J921O20q99p00l33N6R86M50j158J54J504k37j402
1706f20j23N86j18J15m4q78L54J682j6j446J60R33j08j19l54l51L45P92o43r15
1726g68J123R60o18k48P12j55q76p2m96j56J309O61j165p87O17J77k02P75Pp39
1746E9K4K7j027r2J161M65j9N51k20j183J63R47k29r1L91n19o05M37K77o38O18
1767D97J045m50q20J7m81p18Q02P50p19l36J80qJ86P17m81q48O24M61q06l24M45
1788b67l24l55Q68J56n66M28P13m58n71J72o74j24J169L36p29j38N37j47j00N66
1808D92k16J32Q01n83j942j59J545M62p1J8m57l89M26l15r77O85J217o59j359
1827a349j70L70rQ35K64n00L53L52j087j092R66R83j33k47m13k15R65Q33j174
$$ plain form
1846 -468 -1379 103 1159 30 -1348 -1463 -825 315 590 -1114 -1752 283 1868 518 -1154 -999 -139
1863 -139 810 437 -1212 -1344 909 1765 -341 -1557 -91 1375 1546 459 -933 -930 584 649 -1150 -1059
1881 -1059 1089 1933 585 -649 -869 117 1743 1201 -949 -838 1096 973 -916 -1210 170 1770 2193
1898 2193 193 -1784 -788 1672 983 -1461 -1453 417 1352 356 -1449 -1962 421 2674 827 -2200 -1848
1915 -1848 728 1214 -460 -1950 -1442 1005 2029 -142 -2169 -577 1583 688 -1199 -1705 -739 604
1931 604 456 -1426 -2353 -221 1283 -178 -1790 -1188 129 132 -906 -2465 -2206 186 1023 -997 -2094
1948 -2094 -417 831 -77 -1298 -1675 -451 1126 183 -2544 -2700 201 1256 -239 -1515 -969 471
1964 471 1006 -439 -2526 -1538 1286 1254 -1233 -1969 -284 1116 1094 -220 -1186 164 1819 820 -1563
$$ packed form
1846d68r11J482J056j129j378j15O38J140K75j704o38K035J585j350j672J55Q60
1863a39R49l73j649j32K253Q56k106j216J466J466J71j087j392LJ514O5j799R1
1881a059K148Q44j348j234k20R86J626n42k150J11J934j23j889k94J380J600M23
1898B193k000j977R96K460o89k444QJ870R35r96j805n13K383K253j847l027L52
1915a848K576M86j674j490N08K447J024k171k027J592K160q95j887n06R66J343
1931F04j48j882r27K132J504j461j612O02J317Lj038j559K59K392Q37k020j097
1948b094J677J248r08j221l77J224J577r43k727j56K901J055j495j276N46J440
1964D71N35j445k087R88K824l2k487p36J685J400k2j314r66J350J655r99k383
$$ plain form
1981 -1563 -1458 409 998 559 -235 -553 269 1425 624 -861 -162 972 249 -740 -445 168 497 559 -366
2000 -366 -421 1245 1765 37 -1272 80 1150 791 -169 -972 -399 1450 1844 -239 -1157 674 1708
2017 1708 729 -577 -886 -217 1107 935 -816 -887 1071 1762 447 -193 99 472 840 362 -547 -307
2035 -307 908 683 -439 -49 962 833 145 -288 -393 173 713 -374 -1629 -529 1072 590 -839
2052 -839 -791 -35 680 699 -727 -1514 -337 798 -347 -1545 -804 236 660 120 -1097 -1220 140 963
2070 963 -761 -1964 -818 179 -71 -872 -1148 -730 593 958 -704 -1375 -230 407 -402 -947 -621 -104
2088 -104 650 347 -736 -755 907 1258 -73 -505 -118 153 177 -67 -534 -132 1130 943 -231 -123 747
2107 747 740 133 -76 -140 310 993 300 -817 -187 1270 1234 247 -196 -287 354 884 -104 -1424 -698 1011
$$ packed form
1981a563J05J867N89m39p94l18Q22J156q01j485O99J134p23r89K95O13L29O2r25
2000c66n5J666N20j728j309J352J070l59r60q03N73J849L94k083r18J831J034
2017A708r79j306l09O69J324j72j751p1J958O91j315o40K92L73L68m78r09K40
2035c07J215k25j122L90J011j29o88m33j05N66N40j087j255J100J601m82j429
2052h39M8P56P15J9j426p87J177J135j145j198P41J040M24n40j217j23J360Q23
2070I63j724j203J146R97k50q01k76M18J323L65j662o71J145O37q09n45L26N17
2088a04P54l03j083j9J662L51j331m32L87K71K4k44m67M02J262j87j174J08Q70
2107G47po07k09o4M50O83o93j117O30J457l6r87m43r1O41N30r88j320P26J709
$$ plain form
2127 1011 735 -360 -748 -344 383 925 237 -1100 -612 758 655 -423 -639 -163 573 1285 942 -243
2145 -243 -124 754 627 -41 70 156 62 541 598 -47 15 706 466 123 721 662 -147 -433 -187 -54 467 958
2167 958 157 -454 486 1136 295 -499 -373 9 705 862 -659 -1456 -205 1185 698 -196 -376 -122 419
2186 419 598 -797 -1667 -370 1004 409 -659 -797 -352 375 509 -407 -974 58 548 -658 -1558 -920
2204 -920 -109 28 -126 -704 -917 124 224 -1173 -1637 -387 288 -258 -877 -1102 -558 528 605 -589 -658
2223 -658 720 999 -143 -869 -505 207 855 591 -392 -9 1247 1070 -137 -325 526 936 711 30 -619
2242 -619 154 1209 657 -661 -40 1522 1511 416 -569 -634 489 1390 444 -884 -95 1368 1067 -52
2260 -52 -455 118 1080 1508 223 -1058 -198 896 460 -260 295 890 1130 839 44 -138 612 1179 293
$$ packed form
2127A011k76j095l88M04P27N42o88j337M88J370j03j078k16M76P36P12l43j185
2145b43J19Q78j27o68J11Q6r4M79N7o45O2O91k40l43N98n9q09k86K46J33N21M91
2167I58q01o11R40O50q41p94J26L82O96J57j521p97J251J390m87q94j80K54N41
2186D19J79j395q70J297J374n95j068j38M45P27J34r16n67J032M90j206r00O38
2204i20Q11J37j54n78k13J041J00j397m64J250O75n46o19k25N44J086P7j194o9
2223f58J378K79j142p26L64P12O48k64r83L83J256j77j207j88Q51M10k25o81o49
2242f19P73J055n52j318O21J562j1j095r85o5J123R01r46j328P89J463l01j119
2260e2m03N73R62M28j285j281Q60J094m36p20N55N95K40k91p95j82P50N67q86
$$ plain form
2279 293 -132 610 919 119 -177 194 834 1399 922 -640 -585 869 1005 -534 -1164 -208 811 1169 74
2298 74 -1269 -580 1237 1187 -569 -1053 -29 624 413 -249 -810 -235 1109 769 -402 -166 577 246 -605
2317 -605 -771 -444 67 480 -521 -1236 -170 629 -289 -1312 -414 397 240 -769 -1882 -1532 242 1009
2335 1009 -621 -1637 -497 668 232 -940 -1504 -849 715 823 -1145 -1870 -279 933 399 -260 -233
2352 -233 364 858 329 -982 -632 1162 1335 -303 -731 364 1331 1261 215 -593 157 1711 941 -922
2370 -922 -989 503 1218 334 -494 -566 568 1606 423 -1210 -563 1002 818 -405 -689 41 1037 1226
2388 1226 63 -823 335 1849 976 -502 -492 552 802 297 -581 -527 1118 1842 46 -1414 -442 1142
2406 1142 1016 -214 -1162 -895 686 1077 -514 -1471 -9 1376 726 -531 -1069 -561 461 458 -838 -1224
$$ packed form
2279B93m25P42L09q00k96L71O40N65m77j562N5J454J36j539o30R56J019L58j095
2298G4j343O89J817n0j756m84J024O53k11o62n61N75J344l40j171K36P43l31q51
2317f05j66L27N11M13j001p15J066P99r18j023Q98Q11j57j009j113L50J774P67
2335A009j630j016J140J165m36j172n64O55J564J08j968p25J591J212n34o59K7
2352b33N97M94n29j311L50J794J73j638m28J095R67p0j046q08P50J554p70j863
2370i22o7J492P15q84q28p2J134J038j183j633O47J565j84j223k84P30R96J89
2388A226j163q86J158J514q73j478J0J044K50n05q78N4J645P24j796j460R72J584
2406A142j26j230r48K67J581L91j591r57J462J385o50j257n38N08J022lj296l86
$$ plain form
2424 -1224 120 660 -342 -911 -361 281 374 -159 -1155 -1041 177 201 -909 -1068 -27 271 -95 -483 -779
2443 -779 -314 464 -14 -1399 -1284 97 254 -601 -1092 -852 -54 579 -178 -1543 -1081 203 112 -875 -1196
2462 -1196 -886 -351 250 -143 -793 -511 330 117 -719 -524 -125 -242 -211 -328 -549 -95 476 -16 -479 -64
2482 -64 246 -134 -388 -309 -431 -144 301 -89 -494 286 637 206 -69 263 161 316 486 -119 -460 267 873
2503 873 373 138 314 303 374 648 316 -188 119 340 -9 -24 370 129 105 618 502 -4 265 407 -111
2524 -111 -147 407 254 -9 276 167 -78 475 838 334 -104 168 26 -171 113 30 -144 174 509 -99 -291
2545 -291 356 250 27 104 -12 -447 -265 115 -361 -267 270 195 -234 -166 -1 -460 -282 -62 -532 -582 -229 -332
2567 -332 -773 -409 136 -87 -356 -396 -524 -367 72 -180 -802 -457 44 -160 -249 24 29 104 258 -213 -755 -198
$$ packed form
2424a224J344N40j002n69N50O42R3n33r96J14J218K4j110j59J041K98l66l88k96
2443g79M65P78m78j385J15J381J57q55m91K40P98O33p57j365M62J284r1r87l21
2462a196L10N35O01l93o50K82Q41k13q36J95L99j17L1j17k21M54N71m92m63M15
2482f4L10l80k54P9j22K87M45l90m05P80L51m31k75L32j02J55J70o05l41P27O06
2503H73n00k35J76j1P1K74l32n04L07K21l49j5L94k41k4N13j16n06K69J42n18
2524a11l6N54j53k63K85j09k45N53L63n04m38K72j42j97K84q3j74L18L35o08j92
2545b91O47j06k23P7j16m35J82L80m76R4N37p5m29O8J65m59J78K20m70n0L53j03
2567c32m41L64N45k23k69m0j28J57M39k52o22L45N01k04q9K73NP5J54m71n42N57
$$ plain form
2589 -198 322 -116 -451 -106 43 -86 109 -46 39 525 632 -301 -711 22 349 172 227 135 145 468 512 -184
2611 -184 -1 902 905 -82 -449 -153 217 658 469 -152 8 934 776 -283 -381 423 738 528 -125 -566 -23
2632 -23 1060 823 -225 15 893 860 219 -196 -106 558 1074 238 -779 -163 1221 965 14 -132 315 627
2652 627 544 -270 -708 426 1280 325 -736 -276 700 1139 681 -201 -503 529 1019 -261 -1061 52 1076
2671 1076 788 -173 -777 -448 815 1035 -391 -1083 -29 685 -214 -877 -530 404 1062 461 -876 -973 641
2690 641 1088 -197 -832 -205 506 396 -229 -1036 -66 1291 894 -705 -1201 88 775 174 -599 -951 -113
2709 -113 814 184 -1203 -698 898 896 -323 -1110 -802 138 759 -121 -1200 -460 868 429 -716 -660 228
2728 228 656 354 -708 -1229 -179 849 167 -835 -357 527 498 -93 -498 -241 705 929 -304 -1152 -126
$$ packed form
2589a98N20m38l35L45J49j29J95j55Q5M86J07r33m10P33L27j77N5r2J0L23M4o96
2611a84J83R03Lr87l67K96L70M41j89o21J60R26j58j059r8Q04L15k10o53m41N43
2632b3J083k37j048K40Q78l3o41m15R0O64N16q36j017O16J384k56r51j46M47L12
2652F27q3q14m38J134Q54r55j061M60R76M39m58q82l02J032M90j280q00J113J024
2671A076k88r61o04L29J263K20j426o92J054P14q99o63L47R34O58o01j337r7J614
2690F41M47j285o35O27P11j10o25q07R70J357l97j599m96J289O87o01p73l52Q38
2709a13R27o30j387N05J596kj219p87L08R40O21q80j079P40J328m39j145N6Q88
2728B28M28l02j062n21J050J028o82j002M78Q84k9n91m05K57R46K24j233q48J026
$$ plain form
2747 -126 877 509 -162 -246 229 700 472 -530 -700 522 968 -48 -869 -396 181 627 457 -296 -231
2766 -231 658 622 -337 -599 382 683 291 -61 -300 116 868 725 -188 45 734 556 -229 -351 50 459
2786 459 714 134 -554 -37 899 602 -123 -37 400 314 254 -117 -350 263 923 360 -365 116 595 347 132
2807 132 103 2 178 240 -415 -568 314 732 -6 -422 -65 171 154 37 -512 -556 231 432 -508 -680 74
2828 74 416 212 -105 -462 -421 200 148 -601 -599 80 76 -340 -377 -220 -83 234 -24 -736 -575 129 -75 -683 -464
2851 -464 -69 -17 97 -284 -585 -101 561 45 -765 -499 37 -37 -212 -399 -535 44 535 -80 -765 -294 377
2872 377 172 -226 -312 -509 72 436 -120 -498 104 699 195 -252 11 97 231 325 -146 -406 208 593 32
2893 32 -172 282 473 348 253 -146 -234 397 696 10 -241 342 685 493 400 113 79 683 765 -21 -303 357
$$ packed form
2747a26J003l68o71q4M75M71k28j002j70J222M46j016q21M73N77M46j70p53O5
2766b31Q89l6r59k62R81L01l92l52k39M16P52j43r13K33O89j78p85j22M01M09
2786D59K55n80o88N17R36k97p25Q6M37q6o0l71k33O13O60n63p25M81M79k48k15
2807A32k9j01J76O2o55j53Q82M18p38m16L57K36j7j17n49m4P87K01r40j72P54
2828G4L42k04l17l57M1O21n2p49KO79mm16l7J57J37L17k58p12J61P04k04o08K19
2851d64L95N2J14l81l01M84O62n16q10K66N36p4j75j87j36N79M91o15o85M71O71
2872C77k05l98q6j97N81L64n56l78O02N95n04m47K63Q6J34R4m71k60O14L85n61
2893C2k04M54J91j25r5l99q8O31K99o86k51N83L43j92r3k87l4O04Q2p86k82O60
$$ plain form
2915 357 570 395 255 119 66 552 714 -55 -388 204 348 -53 -210 -195 -175 253 338 -348 -348 276 346 -236
2937 -236 -386 -186 -126 54 -56 -563 -438 434 375 -411 -577 -171 -52 -52 -331 -852 -605 296 224 -777 -661
2958 -661 -67 168 -58 -386 -819 -574 214 -50 -890 -759 30 39 -369 -603 -599 -206 204 -217 -1034 -731 87
2979 87 -133 -784 -692 -246 80 204 -313 -934 -280 489 -27 -796 -644 42 173 82 -422 -619 163 779 68
3000 68 -723 -328 283 242 -156 -463 -411 320 638 -125 -669 191 819 278 -298 -244 132 528 475 -335 -545 493
3022 493 1057 201 -317 52 456 444 169 -532 -415 538 692 -287 -504 222 482 242 -8 -220 -53 508
3042 508 283 -581 -411 471 544 -41 -169 6 247 446 10 -592 -197 638 186 -652 -464 140 234 111 -169
3063 -169 -481 52 574 -116 -899 -442 181 110 -224 -389 -268 142 347 -337 -763 -131 447 -164 -663 -494
$$ packed form
2915C57K13j75j40j36n3M86J62p69l33N92J44m01j57J5K0M28Q5o86%O24P0n82
2937b36j50K00O0J80j10n07J25Q72n9p86j66M06J19%k79n21K47R01p2j001J16
2958f61N94K35k26l28m33K45P88k64q40J31P89Rm08k34ML93M10m21q17L03Q18
2979H7k20o51R2M46L26J24n17o21O54P69n16p69J52O86J31r1n04j97P82O16p11
3000F8p91L95O11m1l98l07N2P31L18p63n44Q60O28n41n76N4L76L96n3q10k10J038
3022D93N64q56n18L69M04j2k75p01J17R53J54r79k17P26K60k40k50k12J67N61
3042E08k25q64J70Q82P3n85j28J75K41J99m36o02L95Q35m52q38J88O04R4j23k80
3063a69l12N33N22o90p83M57O23p1l34j65J21M10K05o84m26O32N78o11m99J69
$$ plain form
3083 -494 -419 -55 14 -515 -572 141 414 -461 -858 -379 -67 -105 -284 -584 -428 222 193 -719 -562 369 451 -167
3105 -167 -514 -402 -107 283 9 -658 -252 594 343 -572 -467 110 386 259 -244 -712 -71 729 215 -698
3125 -698 -329 476 641 182 -327 -402 240 742 -90 -775 -138 802 483 -143 -300 14 458 551 -195 -549 291
3146 291 758 -55 -620 -191 458 685 465 -159 -179 546 724 -279 -483 390 825 391 -178 -374 94 933
3166 933 808 -127 -390 579 793 26 -468 -279 409 973 559 -523 -394 818 911 78 -310 23 417 572
3186 572 74 -569 -89 815 637 -145 -272 305 399 161 -263 -435 12 502 94 -623 -171 587 298 -222
3206 -222 -337 -105 369 553 -132 -806 -167 544 184 -267 -175 160 452 386 -299 -771 -137 528 110 -515 -298
3227 -298 -35 13 39 -262 -270 301 434 -321 -787 -204 183 48 -13 -244 -254 199 314 -345 -527 182 395 32
$$ packed form
3083d94P5L64O9n29n7P13K73q75l97M79L12l8j79l00J56O50k9r12J57R31Q2o18
3105a67l47J12K95L90k74o67M06Q46k51r15J05N77K76j27n03m68O41Q00n14r13
3125f98L69Q05J65m59n09p5O42N02q32o85O37R40l19o26j57L14M44R3p46l54Q40
3146B91M67q13n65M29O49K27k20o24k0P25J78j003k04Q73M35m34n69j96M68Q39
3166I33j25r35k63R69K14p67m94J89O88N64m14j082J29J212R3q33l88L33L94J55
3186E72m98o43M80R04j78p82j27N77R4k38m24j72M47M90m08p17M52P58k89n20
3206b22j15K32M74J84o85o74O39P11l60m51R2L35K92o6o85m72O34O65m18o25K17
3227b98K63M8K6l01qN71J33p55m66N83L87j35o1k31j0M53J15o59j82P09K13l63
$$ plain form
3249 32 -291 -356 -400 115 357 -74 -306 156 318 -50 -81 6 -86 49 253 -119 -234 170 296 -37 53 233
3271 233 85 3 187 -32 -196 186 56 -291 -96 301 215 -19 80 -62 -60 306 194 -269 -134 379 274 51
3293 51 20 20 189 731 589 -114 -193 214 328 145 285 116 104 488 486 21 -9 426 375 190 163 24 -66 229
3317 229 313 42 51 372 209 1 91 155 -138 -11 88 -104 -18 48 -227 -363 197 260 -61 -278 -226 -215 -4 162
3341 162 -276 -565 -41 218 -57 -235 -57 -169 -12 171 -126 -397 -127 90 -346 -232 14 -47 -115 -96 -188
3362 -188 -344 22 -63 -487 -508 -74 -160 -403 -307 -133 -139 -35 -121 -464 -314 193 -117 -619 -392 -98 -46 -15 -170
3385 -170 -418 -183 303 31 -455 -238 95 -108 -282 -185 -208 56 225 -151 -445 146 459 -79 -541 -327 25
3406 25 345 263 -354 -660 199 708 84 -367 -110 170 239 53 -395 -437 293 603 -17 -305 142 433 159
$$ packed form
3249C2l23o5m4N15K42m31k32M62J62l68l1Q7r2J35K04l72j15M04J26l33R0J80
3271B33j48q2J84k19j64L82j30l47J95L97q6k34R9j42KL66j12m63J35N13j05k23
3293E1l1%J69N42j42p03p9M07J14j83J40j69j2L84km65l0M35n1j85k7j39r0K95
3317B29Q4k71RL21j63k08R0O4k93J27R9j92Q6O6k75j36N60O3l21k17N2J1K11J66
3341A62m38k89N24K59k75j78J78j12J57J83k97k71K70K17m36J14K46o1o8J9r2
3362a88j56L66q5m24k1M34q6k43R6J74oJ04q6l43J50N07l10n02K27K94N2L1j55
3385a70k48K35M86k72m86K17L33k03j74R7k3K64J69l76k94N91L13n38m62K14L52
3406B5L20q2o17l06Q59N09o24m51K57K80O9j86m48m2P30L10o20k88M47K91k74
$$ plain form
3427 159 31 -110 110 610 402 -423 -407 448 633 116 -8 125 311 375 -43 -568 -105 837 477 -489 -594
3448 -594 96 578 442 -158 -586 -48 883 394 -706 -643 183 553 296 -185 -368 18 621 214 -556 -221
3468 -221 400 192 -306 -485 -246 290 381 -283 -738 17 687 140 -538 -450 -169 49 7 -477 -402 293 496
3489 496 -363 -856 -295 373 218 -268 -757 -484 201 228 -692 -882 69 702 159 -452 -700 -385 238 316 -403
3510 -403 -469 169 266 -398 -517 -34 429 538 -21 -623 -439 316 320 -353 -337 127 389 158 -181 -406 -102 489
3532 489 210 -417 -255 292 222 -214 -230 21 277 494 56 -367 -19 535 223 -265 -165 -46 234 355 188
3553 188 -177 55 289 28 -129 332 464 174 -158 -300 -87 535 760 123 -193 249 459 132 -78 -46
3573 -46 137 476 526 -74 -307 75 311 29 174 375 175 -84 -185 -311 -86 461 400 -177 -175 113 79 -16
$$ packed form
3427A59j28j41K20N00k08q25J6Q55J85n17j24J33J86O4m18n25M63R42l60r66j05
3448e94O90M82j36o00m28N38R31m89j100O3Q26L70k57m81j83L86O03m07p70L35
3468b21O21k08m98j79K39N36R1o64m55P55O70n47o78Q8K81K18m2m84P5O95K03
3489D96q59m93N61O68j55m86m89K73O85K7r20j90R51O33n43o11k48L15O23P8p19
3510d03o6O38R7o64j19M83M63J09n59o02J84P55Mo73J6M64K62k31l39k25L04N91
3532D89k79o27J62N47p0m36j6K51K56K17m38m23L48N54l12m88J00J19K80J21j67
3553A88l65K32K34k61j57M61J32k90l32j42K13O22K25o37l16M42K10l27k10L2
3573d6J83L39N0o00k33L82K36k82J45K01k00k59j01j26K25N47o1n77KK88l4r5
$$ plain form
3595 -16 47 69 66 176 -24 -350 -3 337 64 -218 -54 165 196 196 -192 -463 -54 333 6 -302 -162 46 40
3618 40 60 -43 -251 -22 293 20 -244 88 89 -239 -253 -20 134 305 279 -303 -548 -34 205 -60 -138 -67 -158
3641 -158 -191 -162 -315 -220 231 232 -236 -345 -80 -118 -256 -226 -191 -70 293 122 -422 -395 67 211 135 -57 -214
3664 -214 -331 -52 155 -188 -107 258 176 -9 76 56 -11 223 217 -212 -86 395 215 -24 108 159 181 412 293
3687 293 -50 -21 296 189 -119 116 290 187 321 214 10 159 476 222 -148 70 416 407 171 76 -238
3708 -238 131 654 523 -41 -10 210 213 159 144 -58 241 517 234 -195 34 392 272 73 110 76 258 372
3730 372 -73 -296 173 618 352 29 -41 166 291 265 -55 -251 182 321 -18 -361 -88 257 206 61 -289
3751 -289 -307 169 322 -295 -642 -124 263 116 -107 -355 -271 128 313 -302 -553 -3 251 -121 -382 -261 -135
$$ packed form
3595a6O3K2lJ10k00l26L47L40k73k82J64K19L1%l88k71M09L87l27l08J40K08o
3618D0K0j03k08K29L15k73k64L32Jl28j4K33J54J71k6n82k45N14K39k65p8P1r1
3641a58l3K9j53R5M51Jm68j09K65l8j38L0L5J21L63j71n44K7M62J44p6j92j57
3664b14j17K79K07l43Q1L65q2j85Q5k0o7K34om29J26M81j80k39J32N1K2K31j19
3687B93l43K9L17j07l08K35J74j03J34j07k04J49L17k54l70K18L46rk36r5l14
3708b38L69N23j31n64L1K20Ln4j5k02K99K76k83m29K29L58j20j99L7l4J82J14
3730C72m45k23M69M45k66l23p0K07J25k6l20j96M33J39l39l43K73L45n1j45l50
3751b89j8M76J53o17l47N18L87j47k23k48Q4L99J85o15k51N50K54l72k61J21J26
$$ plain form
3772 -135 145 35 -482 -435 197 279 -302 -529 -211 67 156 12 -506 -214 311 252 -375 -367 111 191 -19 -221
3794 -221 -346 -89 422 97 -391 -174 369 370 -1 -212 -119 162 373 47 -342 8 472 239 -71 119 284
3815 284 306 240 -45 -180 350 586 93 -310 138 439 314 138 -52 -58 369 557 -85 -402 40 432 229
3836 229 -23 -45 23 302 359 -34 -175 231 385 -19 -85 -4 140 128 174 80 100 438 226 -266 -111 388 270
3859 270 -24 -167 -51 205 393 64 -385 -54 535 316 -153 -325 -126 139 226 -29 -456 -123 398 116
3879 116 -382 -273 -60 -36 -103 -219 -298 -100 133 -277 -457 -6 196 -109 -247 -247 -192 38 -15 -425 -375 282 336
3902 336 -301 -478 -159 139 206 -68 -394 -372 156 75 -461 -482 24 218 75 -141 -380 -251 162 77 -395 -368
3924 -368 232 235 -105 -299 -231 80 359 80 -290 -167 372 144 -283 -257 86 309 239 -54 -282 72 419 129
$$ packed form
3772a35K80j10n17M7O32Q2n81k27L18K78Q9j44n18K92N25n9o27QM78Q0k10k02
3794b21j25K57N11l25m88K17N43Jl71k11R3K81K11l26l89L50M64k33l10J90J65
3815B84K2o6k85j35N30K36m93m03M48L01j25j76j90oM27J88o42l17M42L92k03
3836B29k52k2O8K79N7l93j41M06J54m04o6Q1J44j2M6r4K0L38k12m92J55M99j18
3859B70k94j43J16K56J88l29m49L31N89k19m69j72J99K65Q7k55m27L33N21k82
3879A16m98J09K13K4o7j16p9J98K33m10j80M51K02l05j38%N5K30n3m10N0O57N4
3902C36o37j77L19K98O7k74l26K2N28q1n36k1N06J94j43k16k39J29M13q5m72K7
3924c68O00Ll40j94O8L11K79k79l70J23N39k28m27K6L43K23p0k93k28L54L47k90
$$ plain form
3946 129 -320 -83 307 255 34 -189 -289 159 512 133 -266 15 309 49 -240 -177 -20 206 287 -146 -387
3967 -387 96 434 14 -270 -47 205 269 119 -352 -364 267 564 62 -233 -7 268 271 22 -256 -231 344 397
3989 397 -160 -386 -68 133 113 -6 -161 -192 203 186 -222 -360 -137 -7 -91 -4 76 -134 -96 -28 -373 -153 204
4012 204 7 -247 -175 -26 -113 -103 -184 -326 19 375 130 -454 -330 -28 146 36 -54 -295 -114 201 33 -328
4034 -328 -212 180 210 94 -121 -369 -202 209 146 -180 -168 31 -72 -67 -52 -270 -181 142 119 -212 -215 -29 -87 -38
4058 -38 92 69 19 182 61 -186 -19 164 26 -114 105 135 168 286 74 -149 59 315 116 -20 122 156
4080 156 15 108 106 -8 273 432 144 -116 113 262 157 108 217 62 191 208 20 -105 205 345 205 130
4102 130 -30 -82 71 222 -16 -90 279 292 36 -44 49 185 259 200 -37 -161 119 185 -22 44 132 106 96 178
$$ packed form
3946A29m49K37L90n2k21k23j00M48L53l79l99K81K94k60k89O3J57K26Q1m33k41
3967c87M83L38m20k84K23K52O4j50m71j2O31K97n02k95K26K75Lk49k78K5N75N3
3989C97n57k26L18K01k0j19j55l1L95j7m08j38K23J30q4Q7Q0k10L8O8l45K20L57
4012B04j97k54P2J49q7J0q1j42L45L56k45n84J24L02J74j10r0k41J81L15j68l61
4034c28J16L92L0j16k15k48J67M11o3l26J2J99j03NJ5k18Q9L23k3l31lJ86n8M9
4058c8J30k3n0J63j21k47J67J83j38j40K19L0L3J18k12k23K08K56j99j36J42L4
4080A56j41R3kj14K81J59k88k60K29J49j05m9J09j55J29J7j88j25L10J40j40p5
4102A30j60n2J53J51k38p4L69J3k56q0R3J36P4n9k37j24K80O6k07O6Q8k6j0Q2
$$ plain form
4126 178 52 -46 37 107 -158 -21 175 -31 -137 64 75 -48 29 -39 -211 25 213 -81 -351 -140 12 -27
4148 -27 -30 -159 -239 13 147 -182 -424 -199 121 -29 -143 -202 -257 -47 111 -166 -214 0 67 -160 -225 -87 -93 -50
4172 -50 54 -60 -133 125 27 -259 -125 208 186 -70 -191 -109 49 305 168 -269 -41 443 261 -62 -94 89
4194 89 296 376 52 -249 25 565 362 -48 -32 221 309 321 105 -136 180 565 212 -160 105 426 312 178
4216 178 84 -48 294 438 132 -240 192 426 215 -6 22 110 372 405 -75 -178 270 490 47 -184 -9
4237 -9 278 273 138 -184 -96 369 390 -201 -319 101 326 117 -169 -332 -43 406 272 -345 -379 103 361 71
4259 71 -348 -270 -17 291 54 -404 -385 194 187 -148 -352 -179 -54 65 -83 -445 -226 244 97 -394 -299 89
4281 89 51 3 -197 -366 -69 203 -104 -428 -130 250 119 -146 -208 -211 108 266 -61 -354 6 271 -12 -290
$$ packed form
4126A78j26r8Q3P0k65J37J96k06j06K01J1j23P7o8j72K36J88k94k70K11J52l9
4148b7lj29q0K52J34l29k42K25L20j50j14n9n5K10J58k77m8K14O7k27o5J38oM3
4172e0J04j14p3K58r8k86J34L33k2k56j21Q2J58K56j37m37K28M84j82l23l2J83
4194H9K07Q0l24l01K74N40k03m10J6K53Q8J2k16k41L16L85l53l72K65L21j14j34
4216A78r4j32L42J44l06l72M32K34k11k21K8Q8K62L3m80j03M48K20m43k31J75
4237iK87nj35l22Q8M65K1n91j18M20K25k09k86j63K89M49j34o17l4M82K58k90
4259G1m19P8K53L08k37m58J9N79pl35k04J73J25J19j48l62K19M70j47m91R5L88
4281H9l8m8k00j69K97K72l07l24K98L80j31k65o2lL19J58l27k93L60K65k83k78
$$ plain form
4303 -290 -141 53 236 188 -177 -293 95 267 8 -213 -26 124 179 127 -59 -100 239 371 -16 -164 -6
4324 -6 207 105 58 6 -45 245 280 -38 -5 236 273 74 -11 120 81 202 242 21 84 245 150 -2 156 289
4348 289 176 35 -19 -68 74 293 189 -49 52 195 97 -114 -8 31 130 259 -18 -240 -57 147 -2 -14
4370 -14 166 26 -56 -49 -100 -188 -17 138 -35 -99 -102 -147 -148 -33 30 -108 -97 -102 -272 -186 28 -70 -250 -169 -60 -124 -122
4397 -122 -111 -229 -188 51 -85 -300 -261 -16 -54 -78 -89 -251 -217 67 46 -252 -203 -64 -139 -170 -137 -82 -23 152 24
4422 24 -234 -92 8 -7 -60 144 -43 -121 -49 -52 -178 113 275 4 -101 45 1 -28 4 75 -18 89 220 -38
4446 -38 -132 71 164 116 93 92 -102 42 300 93 -13 188 137 42 138 170 54 221 335 50 -72 169 170 94 129
4471 129 157 101 261 245 25 -142 228 304 40 -36 42 66 248 269 52 -96 207 284 48 -91 70 177 189
$$ packed form
4303b90J49J94J83m8l65j16L88J72k59k21J87J50N5n2j86m1L39J32l87j48J58
4324fK13j02m7n2n1K90L5l18L3K41L7j99q5J31l9J21M0k21O3J61r5j52J58J33
4348B89j13j41n4m9J42K19j04k38J01J43r8k11J06L9R9J29k77k22J83K04j49j2
4370a4J80j40q2Pn1q8J71J55j73o4lm5jJ15O3j38J1nj70Q6K14r8j80Q1J09o4K
4397a22J1j18M1K39j36k15L9K45l8k4j1j62L4K84k1k98M9J39p5l1L3N5N9J75j28
4422B4k58J42J00j5n3K04j87p8P2lj26K91J62k71j05J46m4k9L2P1r3J07J31k58
4446c8r4K03R3m8k3jj94J44K58k07j06K01n1r5R6L2j16J67J14k85j22K41Jp6L5
4471A29K8n6J60j6k20j67L70P6k64p6P8K4J82K1k17j48L03P7k36j39J61J07J2
$$ plain form
4494 189 119 -179 -188 172 318 -4 -99 -6 34 -27 -11 -130 -96 119 115 -315 -257 8 41 -115 -104 -119 -150 31 -81
4519 -81 -386 -245 181 78 -192 -273 -146 -29 137 -61 -370 -226 161 84 -253 -332 -63 84 96 -157 -309 -116
4541 -116 213 47 -375 -224 -22 -22 -15 -121 -225 34 252 -98 -381 -151 176 26 -157 -97 -130 44 150 -59
4563 -59 -254 114 295 17 -193 -99 92 276 166 -95 -158 201 379 25 -140 132 255 332 104 -17 -30 399
4585 399 397 83 -52 248 335 183 121 168 115 385 326 -19 44 304 335 36 64 194 218 247 111 -44 118 358
4609 358 237 -77 23 254 187 214 72 -27 116 233 127 -142 -8 181 146 26 13 -56 75 163 11 -166
4631 -166 25 197 -32 -132 0 11 3 -11 -88 -153 112 189 -167 -228 36 85 -91 -155 -208 -171 82 22 -265 -263 -7
4656 -7 44 -178 -222 -157 -142 -71 -92 -291 -194 75 -45 -255 -157 0 -89 -62 -138 -221 -97 53 -79 -373 -119 118 30
$$ packed form
4494A89p0k98rL60J46l22r5R3M0o1J6j19L4K15mm30N8K65L3j56J1j5l1J81j12
4519h1l05J41M26j03k70q1J27J17J66j98l09J44L87p7l37p9K69J47J2k53j52J93
4541a16L29j66m22J51K02%Pj06j04K59K18l50k83K30L27j50j83O0l3J74J06k09
4563e9j95L68J81k78k10R4J91J84j10k61o3L59J78l54j65K72J23P7k28j21j3M29
4585C99kl14j35L00Q7j52o2M7n3K70n9l45O3K60L1k99K8J30K4K9j36j55J62K40
4609C58j21l14J00K31o7K7j42r9J43J17j06k69J34J89l5j20j3o9J31Q8j52j77
4631a66J91J72k29j00J32J1qj4p7o5K65P7l56o1K64M9j76o4n3L7K53o0k87KK56
4656gN1k22m4O5J5P1k1j99R7K69j20k10R8J57q9K7p6q3J24J50j32k94K54K37q8
$$ plain form
4681 30 -168 -112 -67 16 93 -81 -225 42 163 -2 -158 34 69 90 175 33 -100 152 324 20 -138 162 206
4704 206 152 180 37 39 291 315 30 -58 191 263 180 111 52 174 248 254 -16 11 287 363 44 -64 126 211 263 164
4730 164 -74 62 354 258 14 -25 186 227 149 22 -64 52 290 182 -69 2 206 158 80 -51 -29 -8 201
4753 201 64 -147 -45 164 113 -72 -97 -27 -16 56 -31 -196 -61 77 -7 -172 -97 18 43 -38 -125 -279 -40 52
4777 52 -115 -288 -91 28 -61 -77 -77 -218 -87 86 -80 -208 -156 -10 -85 -114 -117 -151 -5 55 -76 -197 -154 50
4801 50 -21 -66 -143 -53 -34 113 -14 -226 9 114 -68 -94 -3 11 -2 48 -56 -97 87 196 -47 -19 42 60 119
4826 119 110 -48 -94 146 203 -32 -111 71 104 182 158 -30 1 141 182 -20 -81 82 143 96 125 85 -17 139 190
4851 190 77 6 249 197 23 16 166 78 181 127 -6 35 258 161 -30 36 113 148 106 59 -90 43 257 187 -120
$$ packed form
4681C0j98N6M5Q3P7j74j44K67J21j65j56J92L5K1Q5j42j33K52J72l04j58L00M4
4704B06n4K8j43KK52K4k85q8K49P2q3o9n9J22P4Ok70K7K76P6l19j08J90Q5N2r9
4730A64k38J36K92r6k44l9K11M1p8j27q6J16K38j08k51P1K04m8p8j31K2K1K09
4753B01j37k11J02K09n1j85k5P0J1P2q7j65J35J38q4j65P5J15K5q1q7j54K39R2
4777E2j67j73J97J19q9j6%j41J31J73j66j28N2J46p5k9ll4J46O0j31j21M3K04
4801E0p1m5p7R0J9J47j27k12K35J05j82k6R1J4j3N0j04m1J84J09k43K8O1J8N9
4826A19rj58m6K40N7k35p9J82L3P8k4j88L1J40M1k02o1J63O1m7K9m0j02J56N1
4851A90j13p1K43n2j74pJ50q8J03n4j33M1K23r7j91O6P7L5m2m7j49J33K14p0l07
$$ plain form
4876 -120 -32 44 81 156 66 -115 12 96 28 -120 -16 143 24 -35 21 -71 -128 23 -53 -55 -69 51 -202 -153 -12
4901 -12 2 -21 -69 -121 -254 -5 35 -156 -167 -35 16 -84 -89 -125 -161 60 116 -144 -248 -76 -7 -102 19 -51 -60 -53 -34
4928 -34 -108 -164 7 46 -123 9 59 -87 -155 -41 -57 60 83 7 -201 -102 101 30 -12 -72 -36 -7 139 -11 -213
4953 -213 39 184 20 -75 -12 21 27 112 34 -77 140 243 5 -25 209 171 73 -17 -26 10 206 203 -21 -72 148 251
4979 251 52 -23 22 118 191 47 -121 -140 223 301 86 -58 -10 93 196 85 -78 12 230 193 -25 -85 132
5002 132 51 131 87 -16 28 183 52 -123 33 134 113 -110 -47 23 123 226 7 -173 68 307 37 -188
5024 -188 -19 55 133 138 -143 -235 54 257 85 -281 -152 -21 99 52 -180 -207 42 210 -50 -229 -4 165
5046 165 -18 -80 -38 -35 3 74 -67 -131 91 226 -153 -134 -29 84 126 54 -202 -183 177 129 -123 -188 -64 76
$$ packed form
4876a20Q8P6L7P5r0j81J27Q4o8j48J04J59j19n9N6r2n7J51p6kj4J20k53M9J41
4901a2J4k3m8n2j33K49M0j91j1J32N1j00nl6l6K21N6k60j04J72O9r5J21p0rPJ9
4928c4p4n6J71L9j69J32N0j46o8J14j6J17K3p6k08R9K03p1m2o0L6K9J46j50k02
4953b13K52J45j64r5O3L3OQ5p8j11K17J03k38l0K34l8r8r0rL6J96lk24n1K20J03
4979B51j99p5M5R6P3j44j68j9L63P8k15j44M8J03J03j11j63R0K18l7k18o0K17
5002A32q1Q0m4j03M4J55j31j75J56J01k1k23O3P0J00J03k19j80K41K39k70k25
5024a88J69P4P8Nk81r2K89K03j72l66J29J31J20m7k32k7K49J68k60j79K25J69
5046A65j83o2M2LL8P1j41o4K22J35l79J9J05J13M2p2k56J9L60m8k52o5J24J40
$$ plain form
5070 76 77 -87 -182 -141 162 141 -147 -166 -26 83 2 -51 -58 -17 111 41 -152 -45 112 101 -1 5 79 36 125 147 -108
5097 -108 36 232 114 -28 -31 170 131 125 97 -109 59 260 88 -19 39 90 45 101 105 -56 51 170 120 88 114
5122 114 124 -56 85 159 54 102 121 43 94 98 135 34 -1 112 125 119 88 59 18 189 173 -25 -52 104 28 29 106
5149 106 -3 -39 75 171 -8 -80 50 -26 13 90 33 -47 -90 70 17 81 4 -113 -95 59 58 -36 -82 -8 -26 -30 27
5176 27 -96 -115 0 90 -76 -76 -95 -111 -80 26 -17 -100 2 -1 -150 -114 -75 -2 -83 31 28 -141 -65 -10 -27 31 35 -55
5204 -55 -177 8 56 -56 -65 80 -116 -10 111 5 -97 22 -3 -2 50 -26 -60 -94 86 54 -19 56 -31 -5 79 113
5230 113 -37 10 74 100 -4 58 83 -16 110 55 -11 13 156 75 -38 45 71 25 52 90 49 -6 194 129 -119 3
5256 3 117 157 99 107 -21 -26 85 -7 -109 11 119 153 -11 -48 -58 -50 159 130 -48 5 42 0 -73 -27 -40 13 9 -17
$$ packed form
5070G6Jj64r5M1L03k1k88j9J40J09q1n3pM1J28p0j93J07J57j1j02OP4m3Q9K2k55
5097a08J44J96j18j42lK01l9ok8k06J68K01j72j07N8N1m5N6Mj61J07J19n0l2K6
5122A14J0j80J41P4j05M8J9p8N1ML7j01l5J13J3ol1k9m1J71j6j98k7J56p6JP7
5149A06j09l6J14R6j79p2J30p6L9P7n7q0m3J60n3O4p7j17J8J54jr4m6P4j8mN7
5176B7j23j9J15R0j66%j9j6L1J06m3q3J02lj49L6L9P3q1J14lj69P6N5j7N8Mr0
5204e5j22J85M8j12rJ45j96J06J21j06j02J19k5JN2p6l4l4J80l2p3P5q7K6Q4L4
5230A13j50M7O4K6j04O2K5r9J26n5o6K4J43q1j13Q3K6m6K7L8m1n5K00o5k48J22
5256CJ14M0n8Qj28nJ11r2j02J20J08L4j64l7j0QK09k9j78N3L7m2p3M6j3N3mk6
$$ plain form
5284 -17 -154 -32 60 -25 -44 29 114 27 -50 -132 -110 57 113 -62 -155 24 123 15 -65 -169 -131 43 109 -46 -138 -28
5310 -28 92 -73 -152 -167 -82 92 89 -153 -267 6 22 -127 -125 -50 -6 11 -105 -174 -214 76 84 -67 -139 -50 -36 -87 -72
5337 -72 -89 11 107 7 -274 -185 52 64 -88 -140 -116 34 91 -88 -200 -29 216 89 -85 -111 59 69 108 -7
5361 -7 -116 68 172 52 -98 -61 -2 118 111 3 -68 51 209 41 -69 61 129 121 113 13 77 108 126 6 -39
5386 -39 105 186 90 31 14 8 67 100 14 -11 140 140 -11 -80 63 90 65 83 17 -22 115 17 -19 -20 50 112 -55 -59 -82
5415 -82 -30 77 54 -77 -107 96 28 -99 -39 -125 -3 38 -24 -134 -95 39 65 -149 -23 -45 -104 -35 -39 -90 -74 13
5441 13 -151 -147 -40 61 -168 -118 -41 -53 -103 -8 -165 -153 -66 -5 -168 -192 2 -31 -22 -58 -167 -89 -5 -50 -161 -95 -2
5468 -2 -35 -104 -9 -64 38 19 14 -143 -63 72 13 -70 -30 64 75 81 -34 -41 -32 87 22 -55 -5 73 84 79 44 -50 11 198
$$ packed form
5284a7j37J22R2q5j9P3Q5q7p7q2K2J67N6j75r3J79R9j08q0j04L8J74O6j55r2J10
5310b8J20j65p9j5Q5J74lk42j14K73J6j49KP5M4J7j16o9m0K90Qj51p2Q9J4n1J5
5337g2j7J00R6j00k81Q9K37J2j52n2K4J50N7j79j12J71K45j27j74k6J70J0L9j15
5361gj09J84J04j20j50L7N9J20pj08p1J19J58j68j10J30O8qqj00O4L1J8j20m5
5386c9J44Q1r6n9j7oN9L3q6k5J51%j51o9J43K7k5J8o6l9J37r8l6jP0O2j67mk3
5415h2N2J07k3j31l0K03o8j27O0q6J22M1o2j10L9J34K6k14J26k2n9O9mn1J6Q7
5441A3j64MJ07J01k29N0P7j2n0R5j57J2Q7O1j63k4J94l3Rl6j09P8Q4m5j11O6R3
5468bl3o9R5n5J02j9nj57Q0J35n9q3M0R4J1Oj15pRJ19o5p7N0P8J1nl5r4O1J87
$$ plain form
5498 198 33 -55 113 170 6 -20 15 40 92 116 10 -42 190 143 87 -43 4 52 137 123 -41 -7 84 208 25
5523 25 -54 53 19 12 58 -37 -75 70 181 -5 -52 36 76 1 54 17 -84 45 78 -106 -24 -14 -35 -58 -13 44 -85
5550 -85 -18 43 -157 -95 62 13 -106 -46 -34 -35 -6 -19 -125 -140 -62 7 -106 -185 -84 -130 -23 -54 -173 -137 59 51 -157
5577 -157 -121 30 -98 -29 -65 -169 -168 -29 2 -99 -165 -74 -130 -58 -26 -139 -31 -4 -28 -172 -57 7 -8 -68 13 -44
5603 -44 -68 22 20 -114 4 44 -6 -89 -52 19 -10 64 4 -38 -20 104 37 -34 20 26 64 74 43 -107 24 125 82 -48
5631 -48 44 126 60 45 93 -48 22 106 80 -71 28 175 40 17 18 57 41 157 -24 -61 64 96 10 -11 36 56 51 157
5659 157 -90 -72 61 72 41 -43 -42 -32 -32 -17 -134 -56 -3 76 -44 -99 -6 -30 -64 -33 -34 -116 -1 10 -83 -70 -22 -57 -144
5688 -144 -39 -34 -69 31 -14 -124 -73 20 -4 -118 -27 -11 -101 -63 -18 -140 -81 -18 -50 -139 -74 -5 -62 -84 -33 -50 -108 -6
$$ packed form
5498A98j65q8J68N7j64k6L5K5N2K4j06n2K32m7n6j30M7M8Q5j4j64L4R1J24j83
5523B5p9J07l4pM6r5l8J45J11j86m7Q8M0p5N3l7j01J29L3j84Q2J0k1k3M5N7j29
5550h5O7O1k00O2J57m9j19O0J2jK9j3j06j5P8O9j13p9J01m6J07l1j19L6J96qk08
5577a57L6J51j28O9l6j04JJ39L1j01o6R1n6P2L2j13J08K7k4j44J15O4j5o0Q1n7
5603d4k4R0kj34J18M0n0q3L7P1k9P4o0m2J8J24o7p1N4OL8J0l1j50J31J01m3j30
5631d8R2Q2o6j5M8j41P0Q4k6j51R9J47j35k3JL9j6J16j81l7J25L2q6k1M7K0nJ06
5659A57k47J8J33J1l1q4JJ0%J5j17P8N3P9j20n5R3k4l4L1jq2J15J1r3J3M8l5q7
5688a44J05Nl5J00m5j10N1R3k4j14R1J6r0L8M5j22N9O3l2q9O5O9n7k2N1j7n8J02
$$ plain form
5716 -6 -177 -54 -16 22 -60 -124 29 -97 -88 -98 -26 -7 -35 12 -132 -129 -71 39 -64 -21 42 -7 28 51 -76 -8 44 12
5744 12 -20 10 29 44 -3 -4 -66 38 197 65 -43 45 93 86 36 42 23 121 142 0 -15 62 103 -21 90 54 72 112
5772 112 87 -48 -117 122 228 66 -38 -36 83 76 87 9 17 118 193 10 -55 71 70 39 101 30 15 112 96 -121 -56
5799 -56 72 93 40 -50 -78 -96 26 24 -62 -7 49 57 -106 -80 14 -6 11 -31 -129 -66 85 -19 -138 -138 -22 -25 -1 -64 -138
5828 -138 -43 8 -29 -117 -68 -35 40 -56 -54 -105 -86 46 -71 -119 -64 79 -48 -149 -103 -21 -7 94 -19 -76 5 -44 3
5855 3 -101 50 36 48 16 -102 -127 58 128 -16 -69 133 60 -4 23 -5 -6 122 144 40 -21 92 91 28 71 69 4 113
5883 113 91 11 22 68 -2 5 65 142 33 61 155 -29 -64 72 104 13 76 79 -7 36 61 30 52 106 93 40 112 89 29
5912 29 -17 91 45 -22 -15 59 53 37 34 17 66 55 -30 -140 15 32 40 -32 30 -64 -87 -27 43 -57 -44 9 -34 -60 24 -31
$$ packed form
5716fj71J23L8L8q2o4J53j26Rj0P2J9k8M7j44LN8J10j03M3O3m9L5K3j27O8N2l2
5744A2l2L0J9J5m7jo2J04J59j32j08Q8M8pn0Oj9R8K1j42j5P7M1j24J11l6J8M0
5772A12k5j35o9K39J06j62j04KJ19pJ1p8QJ01P5j83o5J26jl1O2p1j5R7j6k17O5
5799e6J28K1n3r0k8j8J22kq6N5N6Qj63K6R4k0J7m2r8O3J51j04j19%J16lK4o3p4
5828a38R5N1l7q8M9L3P5r6Kn1J9J32j17m8N5J43j27j01M6Q2J4J01j13n7Q1m9M7
5855Cj04J51j4J2l2j18k5J85P0j44n3K02p3o4K7k8jJ28K2j04o1J13jo3M3ko5J09
5883A13k2q0J1M6p0PO0P7j09K8R4j84l5J36L2r1O3Lq6M3K5l1K2N4j3n3P2k3o0
5912B9m6J08m6o7PP4oj6lj7M9j1q5j10J55J7Qp2O2r4k3O0P0j00J3N3m3k6Q4n5
$$ plain form
5942 -31 -72 15 23 -60 38 -44 -72 -128 54 -39 -106 -8 -97 -57 -17 -9 -70 -126 -26 -4 -12 -71 5 -47 -35 -2 -102 -90 -47 51
5972 51 -40 13 -86 -85 54 82 -85 -79 -24 -11 -71 81 -67 -57 -73 63 -19 -74 -30 -67 -93 30 22 -44 -18 4 -21 -54 96
6001 96 46 -76 -37 68 -14 4 15 -5 9 52 13 -16 -9 39 -39 -44 74 -19 -14 80 67 -48 1 117 78 37 80 14 -2
6030 -2 73 129 20 -47 91 48 -9 67 25 23 65 87 -55 6 49 -23 15 62 44 35 41 21 -62 -19 84 78 2 -34 -82 16 88
6061 88 95 -79 -56 46 50 3 -61 -11 6 68 -4 -117 -27 31 1 -88 -70 -48 -58 -21 -59 -84 -45 -18 -50 -80 -77 60 -53
6090 -53 -45 4 -80 -37 56 -55 -143 20 38 -58 -136 -102 -43 46 40 -83 -211 -64 77 16 -50 -105 -62 -28 96 6 -137
6117 -137 -88 43 45 -82 -58 -39 -41 5 -17 -37 -18 84 -63 -90 -16 22 -11 -4 -18 -44 0 13 -106 -77 190 76 -43
6144 -43 -41 -31 77 79 48 -64 -52 19 39 -48 -26 5 -2 81 78 18 -70 51 65 52 22 52 -45 9 -12 -25 -24 73 19 -27 6
$$ packed form
5942c1m1Q7Qq3R8q2k8n6J82r3o7R8q9M0M0Qo1n6J00K2qn9P6n2J2L3j00J2M3R8
5972E1r1N3r9JJ39K8j67ON5J3o0J52j48J0j6J36q2n5M4l7k6J23qo6K6K2k5l3J50
6001I6n0j22L9J05q2J8J1k0J4M3l9k9PM8p8nJ18r3NR4j3j15M9J16l9m1M3o6j6
6030bP5N6j09o7J38m3n7P6m2kM2K2j42O1M3p2L8M7j8rOk0q3M3J03op6l6m8R8P2
6061H8Pj74K3J02Mm7o4N0J7O2p2j13R0N8l0q9J8K2j0L7l8k5L9K7l2l0LJ37j13
6090e3QM9q4M3R3j11q8J63J8r6p8L4N9Q9oj23j28J47J41o1o6n5M3L4J24r0j43
6117a37M9J31Kj27K4J9kM6k2k0J9J02j47k7P4L8l3Pj4k6M4J3j19K9K67j14j19
6144d3KJ0J08Kl1j12J2P1K0q7K2L1pQ3lo0q8J21J4j3l0L0r7N4k1j3JR7n4m6L3
$$ plain form
6175 6 89 32 27 13 -11 -63 -1 7 -83 -18 76 -50 -95 -44 -17 15 -5 38 -71 -51 18 -44 5 85 6 -23 15 -58 -46 -34 37
6206 37 58 -34 62 -31 -183 -35 79 12 -18 -13 -125 1 -8 -67 -86 -151 12 -103 42 -37 -84 -119 -31 -4 -141 -86 -89
6233 -89 -87 -127 -11 -51 -153 -96 1 -76 -63 -7 -122 -76 -19 -64 -119 -124 -39 -26 31 17 -79 -130 51 32 -26 -46 -43 -91 12
6262 12 47 -38 -16 77 35 20 14 29 28 -14 0 -15 -17 49 1 -49 40 99 1 29 45 28 78 75 54 -26 37 77 43 3 45 95
6294 95 32 56 68 -54 54 110 79 -10 17 45 24 73 74 -23 -34 56 79 -47 82 76 -54 43 37 -75 52 40 -3 24
6322 24 43 103 -38 -22 26 -8 29 6 -18 -82 84 69 30 -41 -41 -36 40 42 -16 -108 -76 14 -81 -65 -30 -130 -120 19 8 -98
6352 -98 -30 -58 -37 -53 -3 -47 -75 -58 -69 -44 -81 -3 -15 -32 -24 -25 -23 -1 -16 0 16 43 -88 -38 70 29 -31 13 -67 -58 28
6383 28 78 11 -80 10 28 -8 68 -3 6 49 7 -49 6 116 17 30 63 -11 -77 31 55 -22 3 73 75 93 37 69 82 16
$$ packed form
6175FQ3n7nj4k4n2O2Qr0O5R4j26m5N1K7L2k0M3j09K0O9o2M9Q0p9k9L8p3J2J2P1
6206C7K1r2R6r3j52J48J14o7l0Nj12J26rn9j9o5J63j15J45p9m7l5Q8K7j37N5l
6233h9Km0J16m0j02N7R7p7J3N6j15M6N7m5n5nQ5J3N7j4r6n1J81j9n8k0Lm8J03
6262A2L5q5K2R3m2j5oJ5jm2J4j5kO6m8n0Q9N9r8K8J6j7N0lk1q0O3M0l4m0M2N0
6294I5o3K4J2j22J08N6l1q9K7K8k1M9Jr7j1R0K3j26J29oj30R7oj12J27j2m3K7
6322B4J9O0j41J6M8l4L7k3k4o4J66j5l9p1%NP6Kn8r2L2R0r5J6L5j00J0J39j1j06
6352i8O8k8K1j6N0m4k8J7j1K5l7P8j2j7QjKK2j5J6J6K7j31N0J08m1o0M4q0RQ6
6383B8N0o7r1R0J8l6P6p1RM3m2n6N5J10r9J3L3p4o6J08K4p7K5P0KJ8n6L2J3o6
$$ plain form
6413 16 42 62 40 77 41 24 64 76 25 67 110 21 43 101 196 7 44 160 22 75 52 15 42 98 36 4 13 106 75
6442 75 -3 69 -30 16 114 85 -19 2 99 55 -5 44 35 -7 46 26 -92 -26 67 0 -18 9 8 -5 7 24 -56 20 42 100
6472 100 -79 27 -23 -31 42 8 -95 -47 -7 -6 -113 -18 -64 -101 -51 -113 -38 -95 -44 -60 -113 -14 -19 -60 -57 17 -23 -102 -34 -40
6502 -40 -36 -14 12 -24 -62 67 6 -5 -17 -9 14 -4 51 -55 28 -2 -50 -60 16 54 -87 -20 4 -35 -18 12 -22 -1 116
6531 116 30 -97 -65 38 69 84 32 -15 26 93 37 -61 19 73 90 57 62 68 7 158 27 25 19 92 112 35 36 53 -13 68
6561 68 10 24 18 87 42 -35 56 48 23 50 15 2 55 105 79 33 76 74 44 -20 -46 -92 18 102 3 -83 50 53 2 -35 -51
6592 -51 -63 55 91 -35 -52 -20 51 -49 -79 -103 -69 25 0 -131 -33 32 45 -87 -63 0 -76 -97 -14 -60 -72 -24 -51 -105
6620 -105 -83 -78 -40 -16 -56 -8 -42 -20 -12 -68 9 26 -74 -89 -24 38 -40 13 9 -76 -19 60 -25 -41 38 -11 0 28 -19 -20 -17 51
$$ packed form
6413A6K6K0k2L7l6j7M0J2n1M2M3q9K2N8R5j89L7J16j38N3k3l7K7N6o2l2RR3l1
6442G5p8P2r9M6R8k9j04K1R7m4o0M9rm2N3k0j18O6R3o7j8K7jj3J2J7q0P6K2N8
6472A00j79J06n0qP3l4j03M8M0Jj07R5m6l7N0o2P5n7N1j6n3R9nm1LP4m0p9O8o
6502d0MK2K6l6l8J29o1j1j2QK3j8N5j06Q3l0m8j0P6L8j41O7K4l9J7L0l4K1J17
6531A16q6j27L2J03L1J5n2m7M1O7n6r8Q0N4J7l3NOo1J51j31koP3K0p7JJ7o6Q1
6561F8n8J4oO9m5p7R1qk5K7l5j3N3N0k6m6M3kl0o4k6m6J10Q4r9q6J33Ln1l7j6
6592e1j2J18L6j26j7L2P1j00l0k4L4R4k5j31R8O5J3j32K4O3p6k1Q3m6j2M8k7n4
6620a05K2NL8K4m0M8l4K2Qn6P7J7j00j5O5O2p8N3mq5N7P9q5j6P9m9J1K8m7jLO8
$$ plain form
6652 51 -14 -45 31 6 -22 87 59 -56 -2 74 6 -16 69 52 36 33 31 -9 -6 24 29 37 63 66 45 37 63 33 45 42 83 49 102
6685 102 60 6 31 102 -3 -47 80 81 -11 25 92 53 7 61 -8 -47 95 48 -62 22 24 21 -13 35 -8 -51 45 21 -97
6714 -97 7 20 48 -35 19 -38 -79 64 -12 -83 -37 -21 -33 -41 -67 -107 -61 17 -17 -110 -32 74 -30 -44 -13 -52 -59 1 -33
6743 -33 -128 -38 -31 -28 -26 3 -55 -26 -1 -55 -30 -33 46 -36 -70 -25 -15 21 -41 -7 -78 -7 -6 -64 -50 46 13 -13 -39 -13 -7 -7 26 32
6777 32 -75 0 43 -23 -2 61 59 44 78 2 7 3 49 -61 -11 121 36 9 67 74 -6 63 69 -10 18 61 45 -13 58 63 -16 28
6809 28 99 -14 18 22 23 81 24 102 -12 72 48 29 61 40 77 -4 94 88 55 63 77 35 41 43 78 -41 16 8 -38 -36 38 40 -7
6842 -7 7 66 -66 -52 -2 -4 -8 67 35 -6 37 15 -43 -35 27 -17 23 40 -59 -6 -13 -17 -65 -57 -36 -9 -38 -47 -25 -89 7 -42 -59 -95
6876 -95 -30 -9 -31 -46 -53 -52 -63 -7 -41 8 -14 14 -66 -39 1 -24 -1 24 -85 -71 8 -24 -24 -55 7 -33 -13 7 -92 -57 11
$$ packed form
6652E1o5l1P6k5k8J09k8j15N4P6o8k2Q5j7j6lkm0LL0NQK6Lk1qK6l0J2lM1l4N3
6685A02m2n4K5P1j05m4J27Jr2L6O7l9m6N4o9l9J42m7j10Q4Kll4M8m3m3R6k4j18
6714i7J04J3K8q3N4n7m1J43p6p1M6J6j2qk6m0M6P8l4r3P8J06j04j4L1l9pO0l4
6743c3r5R0PLKK9n8K9K5n4K5lP9q2l4M5J0L6o2L4p1P1Jn8J4R6l3k6k6K6O%L3O
6777C2j07P5M3o6K1O3kj5L4p6NmM6j10N0J32q5k7N8Pq0O9Op9K8M3j6n8P1Np9M4
6809B8P1j13L2MJN8n7P8j14Q4k4j9L2k1L7q1R8ol3QJ4m2OKL5j19N7qm6KP4Km7
6842gJ4N9j32J4N0kmP5l2m1M3k2n8QO2m4M0J7r9N3pmm8QK1K7k9rK2o4R6m9j7l6
6876i5O5K1k2j5pJj1N6l4M9k2K8q0K7M0k5K3K5j09J4P9l2%l1O2m0K0K0r9L5O8
$$ plain form
6907 11 -36 -27 -34 -4 24 13 91 42 6 63 90 -56 59 31 26 70 104 -11 -4 25 63 16 60 90 19 58 93 -5 57 70 15
6938 15 17 9 74 45 56 68 58 61 60 84 -71 41 80 48 29 55 57 5 159 63 27 38 56 -28 48 6 65 26 32 101 20 -2
6970 -2 128 24 5 128 4 -47 13 36 0 80 -29 -54 -39 23 5 -33 1 -32 -19 23 28 4 -11 -53 16 -37 2 -90 -48
6999 -48 -37 48 12 -94 -68 -34 -10 -18 -46 -61 -34 -54 -93 -108 -16 0 -44 55 -20 -55 -25 -7 -51 -30 4 24 -32 -13 29 -61
7029 -61 -2 98 -14 -93 29 -26 -12 -20 30 51 37 51 -57 -68 28 66 69 7 -1 33 22 41 80 -12 40 111 65 26 50 72
7059 72 56 31 35 -21 61 90 15 18 103 65 -38 16 17 2 24 6 -25 8 104 37 -43 12 44 38 87 43 -18 16 80 41 -41 -61
7091 -61 42 34 -41 -7 -101 -46 -40 34 -17 -64 24 -60 17 44 -86 24 57 22 -41 -26 11 -44 -45 15 -54 8 4 -56 -109 -16 -7
7122 -7 -101 -17 24 -1 -118 -12 0 28 -33 15 -25 -38 -54 -25 30 -21 -22 0 -15 50 -66 -15 -41 15 -32 53 12 7 -83 24
$$ packed form
6907A1m7RpL0K8j1P8m9l6N7K7j46J15k8nM4L4j15PK9L8m7M4L0p1L9L5r8O2J3n5
6938A5KqO5k9J1J2j0LjK4j55J12L9l2j9K6Kn2J54r6l6J1J8q4P6m2N9l9OO9q1k2
6970bJ30j04j9J23j24n1O0K3l6Q0j09k5J5O2j8l8L4l3J3M2Nk4j5m2O9n3L9r2M2
6999d8J1Q5l6j06K6L4K4qk8j5K7k0l9j5R2J6m4R9p5l5L0J8m4K1L4K0n6J9M2r0
7029f1N9J00j12p9J22n5J4qN0K1j4J4j08j1R6L8Lo2qL4j1J9L9r2N2P1m6l9K4K2
7059G2j6k5Mn6Q2K9p5LQ5l8j03N4Jj5K2j8l1L3R6o7q0N5L2oM9m4o1L4O4l9q2k0
7091f1J03qp5L4r4N5OP4n1m7Q8q4P7K7j30J10L3l5o3J5L7n5jO0o9O2mo0n3R3R
7122gr4Q4M1k5j17J06J2K8o1M8m0j3j6K9N5n1jK2j5O5j16N1k6N6m7Q5m1nr0J07
$$ plain form
7152 24 47 17 11 -38 -25 -7 16 -22 16 47 -6 -41 33 30 -79 -2 -31 -41 -22 -18 -4 -58 79 26 55 112 -7 -36 -72 74
7182 74 13 -23 6 121 43 49 44 -41 19 62 76 42 31 68 80 48 88 10 11 88 80 17 -9 5 -26 49 41 44 -22 39 -29 22 74
7215 74 92 -35 -37 19 -45 61 44 13 -36 10 39 11 -46 77 62 -20 -1 31 -74 47 30 -27 15 11 12 -41 9 3 -70 36
7245 36 49 37 -59 43 -41 -11 49 -4 -60 -2 25 -60 -37 17 -7 -86 -1 41 -7 0 54 -63 -38 17 22 -48 22 55 -19 30
7275 30 -16 -23 -59 70 14 -62 -42 -24 -65 -37 -9 -93 -13 45 40 21 -55 43 -20 -3 34 -32 -11 33 36 32 12 -33 46 -45 67
7306 67 61 7 82 76 32 20 57 69 -6 49 69 37 4 16 -47 -31 59 22 -45 35 66 43 99 131 -7 62 86 94 98 53 38 -26
7338 -26 57 88 19 29 110 81 10 16 41 19 28 55 -22 -7 30 -7 -21 52 52 -6 -5 86 -10 1 52 -9 -20 27 102 4 57 5
7370 5 -17 38 8 -21 -98 -24 37 -44 -44 4 -56 -15 62 -34 -62 19 27 20 -62 47 -30 14 -27 32 -43 11 -10 -68 -81 -23 -18 -99
$$ packed form
7152B4K3l0om9J3J8K3l8L8L1n3l5P4lj09P7k9j0J9MJ4n4J37n3K9N7j19k9l6J46
7182G4o1l6K9J15p8Onq5O0M3J4l4j1L7J2l2M0p8JP7qo3k6J4l1P5qLo6O1o8N1N2
7215G4J8j27kN6o4J06j7l1m9M6K9k8n7J23j5q2J9L2j05J21j7n7M2mJn3N0op3J06
7245C6J3j2r6J02q4L0O0n3n6N8K7q5K3N4k4p9Q5M2m8PN4j17K5N5Np0P0L3p4M9
7275C0m6pl6J29n6p6K0J8m1K8K8q4Q0N8nj9p6R8o3J7L7o6K1M4Lmk0m5P9r1J12
7306F7on4P5om4j2L7J2p5N5K0l2l3J2o3J6R0l7o7Q0L1k3N6L2j38O9K4QMm5j5o4
7338b6Q3L1o9J0Q1k9p1OK5k2RK7p7J5L7l7j4P3%n8JR1r6J1N1o1j1M7P5r8N3n2
7370Ek2N5l0k9p7P4O1q1%M8o0M1P7r6k8Q1Qpq2J09p7M4m1N9p5N4k1n8j3N8Nq1
$$ plain form
7402 -99 3 15 -58 -36 -3 -88 -81 39 -41 -43 -54 21 -37 -55 38 -61 -1 82 3 -28 51 -36 -9 44 96 16 44 73 43 -5
7432 -5 43 62 -26 -15 89 14 -12 0 52 53 104 61 -18 -3 23 106 29 70 42 -22 72 59 20 -5 40 12 22 125 52 10
7462 10 -24 44 -6 73 60 0 -29 47 74 -27 70 37 -54 -22 58 17 -46 50 6 4 18 -18 25 0 41 -48 -91 -16 42 -40
7492 -40 -59 -6 -40 -53 19 -19 -26 102 11 -77 -55 34 -31 -37 -40 -48 -39 3 38 -115 -95 37 23 -18 -79 -1 -84 31 57 -138
7522 -138 -70 26 62 -22 20 0 10 24 -14 -30 63 102 -13 0 -17 31 5 -51 21 -35 20 44 -17 -27 55 55 40 16 52 16
7552 16 84 26 -1 -48 61 34 -9 11 10 33 46 72 -54 -76 35 83 -22 -10 11 10 -6 91 57 -24 47 75 11 11 79 -39
7582 -39 -30 25 35 31 41 26 -5 -12 48 -22 -62 -14 52 70 13 30 -21 -12 79 56 -18 1 67 -36 21 43 -38 22 27 25 -48 -28 53
7615 53 -41 -3 122 -53 -34 -25 -46 -7 33 16 -43 -18 15 -66 -34 -39 25 -18 -5 62 11 -31 0 -67 -71 84 14 -25 7 77
$$ packed form
7402i9J02J2p3K2L3q5PJ20q0kj1P5n8j8R3r9O0Q3p9l1P9q7K7N3N2q0K8K9l0m8
7432eM8J9q8J1J04p5k6J2N2JN1m3p9J5K6Q3p7M1k8o4R4j3l9k5M5k8J0J03p3m2
7462A0l4O8n0P9j3o0k9P6K7j01R7l3r1L2Q0m1o3R6m4kJ4l6M3k5M1q9m3P5N8q2
7492d0j9N3l4j3P2l8pJ28r1q8K2Q9o5olqRM2L5j53K0J32j4m1o1P8q3J15K6j95
7522a38O8R6L6q4M2k0J0J4l8j6R3L9j15J3j7M8k6n6P2n6N5K4o1j0Q2%j5k4L6l6
7552A6O8n8k7m7J09k7m3K0jK3J3K6j26k2J11M8j05J2K1jj6R7l4q1P1K8o4%O8j18
7582c9RN5J0mJ0j5l1pO0p0m0M8O6J8n7J7n1RR1k3p4J9O6j03N7K2q1O0Nkp3K0Q1
7615E3r4L8J25j75J9Rk1L9M0j7n9K5L3q1L2nO4m3J3O7n1m2L1o7mJ55p0l9L2P0
$$ plain form
7645 77 -10 1 99 -10 -32 -25 24 -64 -111 -24 -23 -9 19 14 -36 4 85 -13 15 38 -16 15 44 -7 -45 -40 -18 -41 -23 81 -49
7676 -49 -21 52 -9 -35 22 -12 -78 -6 7 -37 -62 8 -16 16 43 50 -58 0 36 17 -5 46 -6 -33 37 59 35 -36 89 -6
7706 -6 72 67 13 35 20 -30 5 -8 40 30 54 26 -15 -1 80 60 -15 -21 -40 18 -59 -86 62 -10 6 11 17 9 7 4 15 40 -4 -23
7740 -23 -10 21 -10 -53 41 9 -33 21 12 -11 8 31 -44 46 18 -17 -80 -57 22 -15 -43 23 6 -18 36 -1 -71 -23 36 15 -42
7771 -42 -48 -64 -54 39 -22 -85 -51 -12 -12 51 -32 -7 34 -12 24 -53 7 41 -13 -67 -5 16 -6 48 -1 -24 -32 57 -50 -5 7
7802 7 65 -62 15 40 16 -7 30 65 -50 42 44 -39 -78 22 3 2 70 -19 -47 69 47 26 -29 7 56 -3 17 -7 48 106
7832 106 101 73 26 15 9 -3 45 -44 9 41 55 59 2 51 -29 -10 27 8 -29 -25 24 -60 2 65 50 -4 38 13 -5 -32 -33 -5
7864 -5 -38 38 13 -22 -15 -8 -6 6 12 -51 23 8 43 -16 -11 43 -65 -30 70 13 -50 56 33 -65 -31 -54 -39 -55 -12 -81 -24 -19
$$ packed form
7645G7q7J1R8j09k2PM9q8m7Q7JJ4K8nn0M0Q1r8K8K3n4L1K9n1l8NK2k3J8J04j30
7676d9K8P3o1k6N7l4o6P2J3m4k5P0k4L2K7Pj08N8L6j9k2N1n2k7P0K2k4p1J25r5
7706fP8nn4K2j5n0L5j3M8j0K4k8m1J4Q1k0p5oj9N8p7k7J48p2J6NOqklJ1K5m4j9
7740b3J3L1l1m3R4l2m2N4rk3J9K3p5R0k8l5o3K3P9l7k8O6j7k4N4l7p0M8N9k1n7
7771d2oj6J0R3o1o3L4L9%O3q3K5M1m6L6p7O0L4n4n4O2K1k2N4m9k3qQ9j07M5J2
7802GN8j27P7K5k4k3L7L5j15R2Kq3l9J00j9jO8q9k8J16k2k1n5L6M9n9K0k4N5N8
7832A06nk8m7j1oj2M8q9N3L2J4Mn7M9q0J9L7j9l7MM9q4O2O3j5n4M2k5j8k7jK8
7864el3P6k5l5PPKJ2Oo3P4j5L5n9NN4j08L5J00n7o3J06k3r8L4k3J5j6M3o9N7N
$$ plain form
7896 -19 -36 -39 -1 -4 -43 -15 -5 -51 -30 -1 -11 -41 -7 39 -76 -31 43 -19 -81 -5 -13 -64 38 15 -35 33 94 -8 -61 34
7926 34 2 -27 -18 -8 -32 4 51 67 -48 39 21 4 -33 -18 -33 12 75 23 -21 -3 38 53 13 34 0 6 44 23 -48 47 85
7957 85 -24 24 76 62 25 -15 38 3 -7 65 -12 -66 20 56 -40 -83 -40 -20 -44 44 -36 11 31 66 10 18 -2 48 2 54
7987 54 -17 -10 107 34 1 82 40 -37 -13 14 -6 -23 38 29 -59 -62 68 -58 39 10 -84 -17 72 7 -58 6 -7 -12 -23 34 -24
8018 -24 -15 52 -3 -36 -22 -12 -66 -66 2 26 -39 15 -2 -89 -22 38 -18 -8 34 -16 19 -31 -52 -74 29 48 -2 -35 -1 34 -45
8049 -45 11 -21 -47 25 123 73 -76 22 28 5 32 31 -5 71 53 29 -52 3 31 24 -40 51 -4 80 22 -68 16 34 3 -5 -8 65
8081 65 -13 45 10 -4 -72 101 55 27 -1 0 9 54 -18 -56 7 45 55 -25 58 53 40 -19 25 -56 31 82 53 -37 24 47 -26
8112 -26 -5 51 -19 3 69 37 -27 61 67 50 34 20 18 -20 63 59 -15 17 51 8 -52 -2 54 -53 -10 56 -15 35 -5 27 5
$$ packed form
7896a9j7lL8ll9K8J0m6K1K9j0l0L4M6j15M5P4o2o2P6qn1J02k3n0O8O1j02n3R5
7926C4l2k9RJ0k4L6M7J6j15Q7j8j7l7J5j5M5O3n2m4J8M1J5m0K1l4OL8k1p1R5L8
7957H5j09M8N2j4l7m0N3l5j0P2p7n4Q6L6r6m3M3K0k4Q8q0M7K0L5n6Qk0N0m6N2
7987E4p1PJ17p3l3Q1m2p7K4K7k0j7O1rq8lJ30j26R7k9r4O7Q9o5o5O4j3nj1N7n8
8018b4RO7n5l3J4J0n4%O8K4o5N4j7q7O7O0n6J0M2n0L5n0k1k2J03J9n0l3L4L5p9
8049d5N6l2k6P2R8n0j49R8Ok3K7jl6P6j8k4q1N5K8po4R1n5Q4n8r0Q4J8l1qlP3
8081F5p8N8l5j4o8J73m6k8k8JRM5p2l8O3L8J0q0Q3nj3n9M4q1Q7N1k9r0O1K3p3
8112b6K1N6p0K2O6l2o4Q8Oj7j6j4kl8Q3mp4L2L4m3o0N0N6j07M3O6p1N0m0L2k2
$$ plain form
8143 5 -49 82 0 -67 -6 -28 -20 96 40 45 20 29 -24 -15 -22 -42 -16 55 -54 -37 16 58 -22 -64 -26 -91 -66 -38 -25 -91 21
8174 21 44 -86 -15 16 -21 19 -44 -23 -85 9 49 -67 3 6 -44 -29 -82
$$ packed form
8143En4J31q2o7O1k2QJ16n6Nk5Rn3Rpk0K6P1j09J7N3M2q0m2L8o5K5K8J3o6J12
8174B1K3j30P1L1l7M0o3K1o2R4M0j16P0Ln0J5n3
8191h2
$$ Imaginary data points
##PAGE= N=2
##DATA TABLE= (X++(I..I)), XYDATA
$$ plain form
0 0 0 0 0 0 0 0 0 0 0 0 -8 8 -8 8 -8 13 -16 16 -23 24 -29 32 -40 43 -48 56 -64 72 -83 96 -106 120 -134 150
34 150 -167 187 -207 230 -255 282 -313 346 -384 425 -470 522 -581 647 -725 814 -920 1048 -1205
53 -1205 1408 -1671 2040 -2586 3481 -5213 9783 -46807 -114645 -1397 47985 -11734 -73652
66 -73652 -36988 8351 1959 -35064 -37385 -18432 -3075 -4746 -11018 -20345 -24481 -14316 2819
79 2819 2324 -5762 -5276 450 -4940 -3333 5553 365 -11754 -2775 14129 5369 -13425 -8535 8942
94 8942 15450 5823 -4856 -7239 1124 5868 -2470 -5035 3342 4078 -8467 -9248 9013 15416 -2010
109 -2010 -18155 -4307 17385 5531 -22968 -15978 20928 20056 -18725 -26052 7657 24114 3551
122 3551 -10990 -4242 4826 6420 -934 -10848 -11085 5684 18125 7677 -11253 -15100 891 11290
$$ packed form
0@%%%%%%%%%%qJ6j6J6j6K1k9L2l9M7n3O1p2Q3r1J04j20J36j55J79k02K26k54K84
34A50l17L54l94M37m85N37n95O59p30Q09q95R92j103J228j372J539j734J968k253
53a205K613l079L711m626O067q694J4996n6590o7838J13248M9382n9719o1918
66g3652L6664M5339o392l7023k321J8953J5357j671o272r327m136J0165J7135
79B819m95q086M86N726n390J607Q886n188j2119Q979J6904q760j8794M890J7477
94H942O508r627j0679k383Q363M744q338k565Q377P36j2545p81J8261O403j7426
109b010j6145J3848K1692j1854k8499O990L6906q72l8781p327L3709J6457k0563
122C551j4541O748R068J594p354r914k37J6769J2441j0448j8930l847J5991J0399
$$ plain form
136 11290 1491 -10583 -5988 1585 -7280 -13528 -6463 -2532 -6426 -4111 1470 -7207 -15086 -8306 -319
151 -319 -3259 -10137 -10264 -6496 -1310 -2168 -8223 -5176 3802 2999 -7244 -7562 533 -290 -8000 -9997
167 -9997 -893 5951 -1089 -13168 -9232 8417 8830 -7449 -12176 -2507 750 -3498 -1705 -2025 -6467
182 -6467 -3626 2749 718 -4909 -89 5275 748 -7398 -9030 -1941 1927 -2493 -6743 -1066 4056
197 4056 -3297 -7732 -2037 845 -3925 -3656 -54 -5604 -8967 -3375 237 -3632 -4507 1465 3558 129
213 129 -6140 -7956 -421 5684 -253 -10175 -6353 2318 1698 -1820 -1277 1112 141 -1788 -3833 -2492
229 -2492 1941 -1220 -6775 -3476 4320 2980 -2095 374 1755 1134 3812 5007 -1790 -6228 1013
244 1013 5484 1503 -2669 -1648 2206 3708 2422 -995 -554 425 -2373 -2293 -409 -3213 -6318 1388
$$ packed form
136A1290r799j2074M595P573q865o248P065L931l894K315N581q677p879O780P987
151c19k940o878j27L768N186q58o055L047Q978q03j0243l18Q095q23p710j997
167i997R104O844p040j2079L936J7649M13j6279m727R669L257m248J793l20m442
182f467K841O375k031n627M820N364m527q146j632P089L868m420m250N677N122
197D056p353m435N695K882m770K69L602n550l363N592L612l869q75N972K093l429
213A29o269j816P535O105n937r922L822Q671o20l518N43K389r71j929k045J341
229b492M433l161n555L299P796j340n075K469J381o21K678J195o797m438P241
244A013M471l981m172J021L854J502j286l417M41R79k798Q0J884k804l105P706
$$ plain form
260 1388 7775 -1055 -8563 -2021 6721 3606 -2927 -4191 -2243 1277 672 -3077 -2988 1444 2622 102
276 102 1562 1255 -2501 -1832 2006 827 -3855 -2221 978 1594 1565 32 259 4294 7090 655 -4952
293 -4952 -13 4854 4049 743 -1106 -1735 3150 8796 3072 -4142 -47 7562 4193 -4683 -5553 -425
309 -425 3701 141 -5606 -2411 5546 4463 -4688 -4242 2669 2049 -1921 -2118 -1413 -2419 412 2281
325 2281 -1335 -1743 2438 4512 717 -3028 -3686 -711 3633 -820 -7922 -4654 4991 4873 -3814 -5494
341 -5494 -722 4574 5292 -1144 -7972 -5100 4787 4475 -3548 -5342 880 7026 5080 -2972 -7721 379
357 379 9180 1395 -10009 -6514 4754 4328 -4139 -6508 -1167 5874 4539 -3565 -6524 398 4681
372 4681 -1414 -5586 -3210 1545 4940 3655 -2629 -5013 4335 9518 561 -7471 -3004 5853 5522
$$ packed form
260A388O387q830p508O542Q742l115o533j264J948L520o05l749Q9M432J178k520
276A02J460l07l756O69L838j179m682J634L199O16k9j533K27M035K796o435n607
293d952M939M867q05l306j849o29M885N646n724p214M095P609l369q876q70N128
309d25M126l560n747L195P957j083r151M46O911o20l970j97P05j006K831J869
325B281l616m08M181K074l795l745o58K975M344m453p102L268R645j18q687j680
341e494M772N296P18o436o828K872R887l12q023j794O222O146j946q052m749Q100
357C79Q801p785j1404L495J1268m26q467k369N341P041j335q104k959O922M283
372D681o095m172K376M755L395j285o284k384R348N183q957q032M467Q857l31
$$ plain form
387 5522 -1759 -7657 -3460 7265 8269 -1004 -5484 597 4475 1349 -2384 -4582 -1523 5038 5229
402 5229 -3386 -6247 3121 8275 3220 -2719 -1648 3591 4506 -1810 -8312 -2152 7981 5353 -3734
417 -3734 -4041 2908 3921 447 -2450 -3040 1297 4402 180 -6448 -3648 4052 5272 1715 -1892 -823
433 -823 4019 5098 -2372 -8255 -708 6177 1059 -6097 -3930 2494 3500 -53 -5056 -4379 2297 3617
449 3617 -3343 -8012 -3441 1263 1382 -833 -3673 -1290 5192 5938 -3131 -6831 1167 5742 1145 -3991
465 -3991 -1929 2989 4532 728 -3811 615 7422 4894 -2745 -3636 734 1372 450 -1253 -2330 1719
481 1719 6430 3268 -4688 -3279 4200 5614 433 -4376 -2817 2551 4307 -2402 -6717 1127 8074
496 8074 3717 -4004 -4005 -17 1564 386 -4205 -5076 959 5203 392 -5298 -2305 3249 5419 2028
$$ packed form
387E522p281n898M197J0725J004r273m480O081L878l126l733k198L059O561J91
402E229q615k861R368N154n055n939J071N239R15o316o502O160J0133k628r087
417c734l07O949J013l474k897n90M337L105m222o628K800P700J220l557l607J069
433h23M842J079p470n883P547O885n118p156K167O424J006l553n003O77O676J320
449C617o960m669M571M704J19k215k840K383O482P46r069l700P998M575m597n136
465c991K062M918J543l804m539M426O807k528p639q91M370O38r22j703j077M049
481A719M711l162p956J409P479J414n181m809J559N368J756o709m315P844O947
496H074m357p721jL988J581j178m591q71O035M244m811n690K993N554K170l391
$$ plain form
512 2028 -3848 -3698 3050 5200 -3196 -6773 1241 7041 3523 -2422 -2749 478 3526 1337 -4975 -4762
528 -4762 950 2638 -2213 -5045 -2850 849 4279 1431 -4881 -3908 3477 3784 -5122 -7263 -832 3938
544 3938 2349 -2439 -3955 -52 4836 1320 -4935 -3402 1450 1664 -2152 -4192 -4433 -1360 3138 736
560 736 -3944 -2129 3108 1440 -4453 -5491 -2405 1702 1854 -2848 -5204 -238 4440 238 -3562 -450
576 -450 2620 1695 -1010 -3055 -4166 -488 3514 1364 -1505 -278 2759 2798 1474 -547 -986 3064
592 3064 4191 -269 -2690 1653 4334 2021 1745 2659 2018 1601 2099 175 -2535 -1172 -19 -878 -1747
609 -1747 -2482 -2461 -716 770 -2688 -4986 -2160 -1030 -3601 -4811 -3263 -3489 -3519 -1781 -2244 -2517 -697
626 -697 306 -1817 -3015 -2628 -3588 -2301 -769 -2351 -4097 -1513 638 -2398 -3464 -1122 68 -1016
$$ packed form
512B028n876J50O748K150q396l577Q014N800l518n945l27L227L048k189o312K13
528d762N712J688m851k832K195L699L430k848o312R73P385L07q906k141O431M770
544C938j589m788j516L903M888l516o255J533M852K14l816k040k41L073M498k402
560G36m680J815N237j668n893j038L086M107J52m702k356M966M678m202l800L112
576d50L070r25k705k045j111L678M002k150k869J227L037L9j324k021m39M050
592C064J127m460k421M343K681k313k76R14o41m17M98j924k710J363J153q59q69
609a747p35K1J745J486l458k298K826J130k571j210J548k26l0J738m63k73J820
626f97J003k123j198L87r60J287J532j582j746K584K151l036j066K342J190j084
$$ plain form
642 -1016 -2726 -4537 -5311 -2355 -1065 -3203 -3490 -2043 -1352 -1807 -1811 -4136 -5191 -1102 162 -5015 -8314
659 -8314 -4088 -651 -2214 -3628 -3913 -2506 -723 -1665 -4979 -5096 -1699 -1492 -3083 -3307 -3133 -2152 788
676 788 1908 -1862 -2499 1473 1981 -1651 -3046 -673 551 604 -714 -2553 -272 3122 1946 -1968
692 -1968 -1432 978 -337 -1725 -1979 -1596 -106 1647 -19 -2775 116 3526 2382 -560 -1225 2
708 2 1280 1289 -2366 -3574 1783 4806 149 -3921 -652 2579 1370 -964 -3025 -2860 -659 96 -2903
725 -2903 -3953 -493 1279 391 -1618 -3087 -2216 911 684 -4760 -5171 -133 898 -3259 -4356 -765
741 -765 952 656 -1722 -4373 -2969 232 -543 -4651 -4496 -1362 -336 -961 -2423 -2889 -516 2368 -300
758 -300 -5099 -3087 990 238 -3263 -3547 -1079 1398 1725 -2260 -3930 584 3348 -1260 -6182 -3528
$$ packed form
642a016j710j811p74K956J290k138k87J447O91m55mk325j055M089J264n177l299
659h314M226L437j563j414k85J407J783r42l314j17L397K07j591k24J74R81K940
676G88J120l770o37L972N08l632j395K373J224N3j318j839K281L394j176l914
692a968N36K410j315j388k54L83J490J753j666k756K891L410j144k942o65J227
708BJ278Rl655j208N357L023m657m070L269L231j209k334k061J65K201P55k999
725b903j050L460J772q88k009j469Q71L127k27n444m11N038J031m157j097L591
741g65J717k96k378k651J404L201p75m108J55L134J026o25j462m66K373K884k668
758c00m799K012M077p52l501k84K468K477L27l985j670M514K764m608m922K654
$$ plain form
774 -3528 310 644 -1726 -4526 -3630 1143 3695 -1103 -4736 -1366 2640 1745 -2837 -4900 -1453 4455
790 4455 3833 -3214 -3603 3338 5936 573 -2972 -430 2332 2981 -248 -4057 -2128 4060 5399 -396
806 -396 -2994 554 4597 4069 -1120 -4161 -264 5682 2988 -4180 -3154 3694 6117 1955 -2103 -2093
822 -2093 2162 5365 605 -5271 -2846 3732 3282 -2191 -3451 44 4386 3972 -1826 -5377 -555 5336
838 5336 1580 -4723 -3746 2079 4476 686 -3583 -1997 5025 6358 -1357 -5835 -1311 3592 1653
853 1653 -1765 -2834 -1289 2688 3000 -1888 -4658 279 4661 1139 -4092 -4929 -1219 2477 1347 -2893
869 -2893 -3008 2275 3404 -770 -2923 -982 1446 1556 -635 -4290 -3427 1829 2516 -2029 -3139 1127
885 1127 2695 -235 -3076 -3060 555 3081 -128 -5134 -3070 3400 3769 -222 -1714 639 3119 2516
$$ packed form
774c528L838L34k370k800Q96M773K552m798l633L370M006q95m582k063L447N908
790D455o22p047l89O941K598n363l545K542K762O49l229l809J929O188J339n795
806c96k598L548M043n28n189l041L897N946k694p168J026O848K423m162m058J0
822b093M255L203m760n876K425O578m50n473j260L495M342m14n798l551M822N891
838E336l756o303R77N825K397l790m269J586P022J333p715m478M524M903j939
853A653l418j069J545L977L12m888k770M937M382l522n231q37L710L696j130m240
869b893j15N283J129m174k153J941K428J10k191l655Q63N256O87m545j110M266
885A127J568k930k841J6L615K526l209n006K064O470L69l991j492K353K480o03
$$ plain form
901 2516 -1089 -3350 605 4063 1599 -2102 -1284 1413 2246 2783 1285 -859 524 2472 75 -2873
917 -2873 -486 2889 2092 125 -597 533 2357 3132 984 -408 1687 2066 18 -1119 -377 1002
933 1002 3022 3649 -156 -2121 1391 3609 937 -1488 -74 537 -86 -594 -1196 -100 2095 2445 -187
950 -187 -383 1306 433 -684 -53 935 217 -349 -870 -1346 1068 2817 944 -1324 -601 49 -1184 -883
968 -883 -1060 -2014 -858 845 -732 -2675 -368 1663 709 -278 -465 -1217 -1663 -623 -506 -546 626 104
986 104 -823 -350 778 198 211 872 -1300 -2467 -434 298 -1898 -1805 1270 1623 -45 -910 -1218 -322 1443
1005 1443 1217 -1831 -2392 -598 -86 -132 319 266 -158 993 946 -1386 -1577 -195 -61 -768 -449 -1312 -2379
1024 -2379 -419 1431 740 -114 409 -391 -1172 264 159 -1120 -142 1506 506 -711 678 1640 1488
$$ packed form
901B516l605k261L955L458k464l701Q18K697Q33N37j498k144J383J948k397k948
917b873K387L375p97j967p22J130J824P75k148j392K095L79k048j137P42J379
933A002K020O27l805j965L512K218k672k425J414O11o23n08o02J096K195L50k632
950a87j96J689q73j117O31R88p18n66n21m76K414J749j873k268P23O50j233L01
968h83j77r54J156J703j577j943K307K031r54r87j87p52m46J040J17m0J172n22
986A04r27M73J128n80J3O61k172j167K033P32k196R3L075L53j668q65l08Q96J765
1005A443k26l048n61J794N12m6M51n3m24J151m7k332j91J382J34p07L19q63j067
1024b379J960J850o91q54N23q00p81J436j05j279R78J648j000j217J389R62j52
$$ plain form
1041 1488 1498 761 34 210 62 -1521 -725 1899 1197 -805 -599 670 599 1097 1442 -902 -1562 592
1059 592 1251 -904 -1292 657 1825 2379 1113 -908 -430 2488 2628 -471 -1151 -130 230 721 695 105
1077 105 519 2862 1773 -1371 -743 1720 1771 -282 -1001 -630 921 2404 189 -1651 1200 4746 2389
1094 2389 -2272 -2333 526 2800 1801 -1792 -3152 371 3830 1273 -2272 -1461 1287 2358 508 -2795
1110 -2795 -4288 -430 3065 30 -3497 -1760 1712 1375 -798 -1993 -1342 1029 717 -2995 -4532 -798
1126 -798 1812 -611 -2858 -2516 -140 1628 -358 -4395 -4189 977 1989 -3055 -5583 -2261 1894 2125
1142 2125 -925 -3659 -1653 3040 2115 -2926 -3988 -9 1822 13 -2095 -2664 -62 2776 1350
1157 1350 -2689 -2191 1598 1407 -1684 -3062 -1416 1281 2098 -682 -3412 235 4715 2834 -1968 -2225
$$ packed form
1041A488J0p37p27J76j48j583P96K624p02k002K06J269p1M98L45k344o60K154
1059E92O59k155l88J949J168N54j266k021M78K918J40l099o80J021L60M91k6n90
1077A05M14K343j089l144O28K463N1k053p19L71J551J483k215j840K851L546k357
1094B389m661o1K859K274r99l593j360L523L459k557l545Q11K748J071j850l303
1110b795j493L858L495l035l527J737L472l37k173j195O51K371l12l712j537L734
1126g98K610k423k247L42K376J768j986m037K06N166J012n044k528L322M155K31
1142B125l050k734K006M693r25n041j062L979J831j809k108n69K602K838j426
1157A350m039M98L789j91l091j378J646K697Q17k780k730L647M480j881m802k57
$$ plain form
1173 -2225 1521 3179 1740 -1664 -2615 1600 5145 2467 -1995 -745 3249 3973 1543 -1500 -1494 1821
1189 1821 3587 181 -2410 1029 3889 2355 -163 91 1601 2328 1584 -1043 -1103 1919 2584 -474
1205 -474 -1645 1163 2784 2078 -7 -2020 -764 2057 1181 -3399 -3917 114 1828 -363 -2871 -2971
1221 -2971 -595 1968 199 -4144 -3654 -142 41 -2690 -3526 -2075 -612 414 -1073 -3126 -1962 404
1237 404 -816 -3681 -2883 -815 -911 -2141 -3104 -2317 201 1349 -1712 -3642 -582 1668 -637 -3387
1253 -3387 -3007 -1020 763 694 -2338 -3212 116 2304 -366 -3159 -2292 -584 307 -994 -3526 -3347 104
1270 104 1338 -1836 -2554 143 1246 -377 -2009 -1968 -583 1510 682 -2207 -1326 2233 2837 192 -710
1287 -710 691 2524 3171 591 -2352 -856 3035 2821 -542 -733 1431 2936 2309 92 -1261 472
$$ packed form
1173b225L746J658j439l404r51M215L545k678m462J250L994P24k430l043OL315
1189A821J766l406k591L439K860j534k518K54J510P27p44k627o0L022O65l058
1205d74j171K808J621p06k085k013J256K821q76m580n18M031J714k191k508j00
1221b971K376K563j769m343M90L512J83k731q36J451J463J026j487k053J164K366
1237D04j220k865P98K068r6j230r63P87K518J148l061j930L060K250k305k750
1253c387L80J987J783o9l032q74L328K188k670k793Q67J708Q91j301k532J79L451
1270A04J234l174p18K697J103j623j632M1J385K093q28k889Q81L559O04k645r02
1287g10J401J833O47k580k943J496L891k14l363j91K164J505o27k217j353J733
$$ plain form
1303 472 3086 1188 -1646 -624 1516 1640 573 363 555 2058 3017 467 -1718 -42 2385 908
1319 908 -1267 -950 670 2392 1777 -1215 -2220 1107 3148 254 -2156 -1511 -4 610 222 -1336
1335 -1336 -1941 1168 2807 239 -2130 -1391 134 94 -353 -1529 -1914 -65 355 -1528 -1979 134 769
1352 769 -497 -946 -1318 -1546 -811 -680 -1996 -1556 952 894 -988 -1315 -369 249 531 -25 -2038 -1773 567
1371 567 505 -1707 -1948 -162 617 801 168 -1645 -1536 121 235 -1725 -1921 -755 -208 622 430 -1160
1389 -1160 -1316 1142 1756 -394 -767 113 215 -128 -148 -687 -415 1618 2021 318 -224 356 168 -128 213
1408 213 -357 -193 1195 565 -1226 -551 1998 2029 837 561 299 652 1260 414 -1098 13 2785 2212
1426 2212 378 17 827 1574 2149 1118 -801 91 1950 983 -986 -600 1116 1946 1985 651 -578
$$ packed form
1303D72K614j898k834J022K140J24j067k10J92J503R59k550k185J676K427j477
1319I08k175L17J620J722o15k992j005L327K041k894k410O45J507O14l88j558
1335a336o05L109J639k568k369P39J525m0m47j176l85J849M20j883m51K113O35
1352G69j266m49l72k28P35J31j316M40K508n8j882l27R46O18K82n56k013K65K340
1371E67o2k212k41J786P79J84o33j813J09J657J14j960j96J166N47Q30j92j590
1389a160j56K458O14k150l73Q80J02l43k0n39K72K033M03j703n42N80j88k96L41
1408B13n70J64J388o30j791O75K549L1j192k76k62L53O08q46j512J111K772n73
1426B212j834l61Q10P47N75j031j919Q92J859r67j969L86J716Q30L9j334j229
$$ plain form
1443 -578 951 2446 759 -1495 -201 1534 1125 405 -58 -69 1220 2228 460 -1335 464 2067
1459 2067 697 -1446 -1751 -491 1314 1763 -536 -1356 1077 2157 10 -1597 -505 446 834 564
1475 564 -1117 -1352 700 1613 -254 -457 1274 1333 -230 -1440 -1513 -660 975 473 -1862 -1506 913 1007
1493 1007 -948 -1459 -525 399 847 -887 -2796 -1578 1082 733 -1476 -1060 556 988 555 -938 -2005
1510 -2005 -786 1346 -101 -2598 -1572 562 680 -664 -966 -454 754 1216 -978 -2039 9 1257
1526 1257 -586 -1755 -381 1071 1861 1177 -850 -1117 1416 2404 -510 -1847 117 1628 823 -634
1542 -634 -963 382 2650 2089 -1046 -1266 1342 1864 -374 -1507 -742 1077 2393 795 -1675 -703 2556
1559 2556 2500 -419 -1168 105 991 729 -803 -1840 164 2818 1088 -1930 -1149 1584 1835 -437 -1957
$$ packed form
1443e78J529J495j687k254J294J735m09p20m63j1J289J008j768j795J799J603
1459B067j370k143l05J260J805M49k299q20K433J080k147j607J092R51L88k70
1475E64j681k35K052R13j867k03J731N9j563j210p3Q53J635n02k335L56K419R4
1493A007j955n11R34R24M48j734j909J218K660l49k209M16J616M32m33j493j067
1510b005J219K132j447k497J026K134J18j344l02N12J208M62k194j061K048J248
1526A257j843j169J374J452P90o84k027k67K533R88k914j337J964J511q05j457
1542f34l29J345K268n61l135k20K608N22k238j133P65J819J316j598k470R72L259
1559B556n6k919p49J273Q86k62j532j037K004K654j730l018P81K733K51k272j520
$$ plain form
1576 -1957 -1405 967 2168 -544 -2559 -123 2998 2168 -340 -866 205 2087 1937 -1049 -2238 826
1592 826 3362 832 -1766 -665 2015 2758 868 -1686 -1772 1414 2273 -904 -2712 -428 2010 1380
1608 1380 -440 -1485 -323 2239 1580 -1898 -2508 727 2039 -428 -2104 -1419 984 2436 739 -2367
1624 -2367 -1810 1887 1932 -1208 -2687 -986 934 984 -593 -2107 -488 2144 1196 -1895 -2028 344 1011
1641 1011 -270 -2006 -2598 -292 1842 218 -2688 -1563 1295 962 -1218 -2393 -1670 -44 802 -876
1657 -876 -2571 -779 1541 737 -1024 -589 977 1596 899 -1264 -1821 935 2699 879 -917 572
1673 572 1907 1494 552 -188 214 1623 1752 -823 -1818 161 1261 427 -206 105 475 1070 731 -1234
1691 -1234 -1394 577 1346 -20 -806 -404 -41 953 1104 41 -74 1125 1043 -654 -612 373 402 293 376
$$ packed form
1576a957N52K372J201k712k015K436L121q30k508n26J071J882j50k986j189L064
1592H26K536k530k598J101K680P43j890k554q6L186Q59l177j808K284K438o30
1608A380j820j045J162K562o59l478o10L235J312k467j676O85K403J452j697l106
1624b367N57L697M5l140j479J701J920N0j577j514J619K632r48l091j33K372O67
1641A011j281j736n92K306K134j624k906J125K858l33k180j175P23J626Q46j678
1657h76j695J792K320q04j761M35J566O19o97k163n57K756J764j820j796J489
1673E72J335m13r42p40M02J409J29k575r95J979J100q34o33L11L70N95l39j965
1691a234j60J971P69j366p86M02L63R94J51j063j15J199q2j697M2R85K9j09Q3
$$ plain form
1710 376 -18 304 1745 1503 -212 -113 944 827 101 117 -51 181 952 382 -493 413 1420 509 -369
1729 -369 291 -33 -864 -885 -665 -545 232 866 -653 -1478 -483 -49 -235 -100 0 -885 -1011 -589 -1044 -803
1749 -803 436 842 213 210 -11 -1019 -780 218 143 -397 -229 -480 -1188 -446 -3 -487 -221 604 -63 -1323
1769 -1323 -1060 -973 -1241 -500 285 -349 -970 -317 -105 -186 286 -92 -944 -489 209 -514 -1015 -136 -203 -391 277
1790 277 596 -86 32 722 -28 -646 -428 -384 -395 573 987 -114 -333 404 320 97 398 322 -49 263 -312
1811 -312 -1742 -1384 519 1114 279 -123 -351 -772 -381 -401 -1043 -439 659 15 -1460 -1043 -86 202 658
1830 658 839 237 -17 388 -509 -1204 25 1171 691 -14 -56 -170 610 1192 34 -875 331 1323 -219
1849 -219 -1484 -939 137 963 704 -631 -1150 810 2019 33 -1662 -969 349 867 203 -945 -949 1198
$$ packed form
1710C76l94L22J441k42j715R9J057j17p26J6j68K32P71n70q75R06J007r11q78
1729c69O60l24q31k1K20J20P77O34j519q25R95M34j86J35J00q85j26M22m55K41
1749h03J239M06o29lk21j008K39R98p5n40J68k51p08P42M43m84K66Q25o67j260
1769a323K63Q7k68P41P85o34o21O53K12q1M72l78q52M55O98p23n01Q79o7j88O68
1790B77L19o82J18O90p50o18K18M4j1R68M14j101k19P37q4k23L01p6l71L12n75
1811c12j430L58J903N95q35m02k28m21L91k0o42O04J098o44j475M17R57K88M56
1830F58J81o02k54M05q97o95J229J146m80p05m2j14P80N82j158r09J206R92j542
1849b19j265N45J076Q26k59j335n19J960J209j986j695O93J318N18o64j148mK147
$$ plain form
1867 1198 1648 -612 -1587 196 1642 795 -540 -1561 -987 645 733 -726 -727 1453 1720 -236 -1287
1884 -1287 -886 348 1400 558 -1380 -1239 849 730 -996 -1093 638 1666 870 -1019 -2472 -938 1396
1901 1396 493 -1879 -1496 894 1208 -239 -1519 -1292 988 2321 63 -2801 -1656 1295 1349 -571
1917 -571 -1585 -323 1704 2028 -316 -2054 -174 1860 599 -1575 -1229 335 1164 797 -826 -1248
1933 -1248 885 2139 301 -1452 -308 1075 794 -372 -1242 -293 1760 2157 -138 -1149 700 1856
1949 1856 541 -837 -621 666 1534 482 -1797 -1280 1700 2428 214 -1120 -41 1177 1124 -432
1965 -432 -1705 -351 2159 1682 -1004 -1300 920 1931 1122 -355 -795 433 1663 437 -1764 -1014
1981 -1014 1138 1596 428 -306 -255 449 1358 349 -859 -211 1095 366 -666 -4 850 996 586 136
$$ packed form
1867A198M50k260r75J783J446q47j335j021N74J632Q8j459jK180K67j956j051
1884a287M01J234J052q42j938J41K088j19j726r7J731J028p96j889j453J534K334
1901A396r03k372L83K390L14j447j280K27K280J333k258k864J145K951N4j920
1917e71j014J262K027L24k344j738J880K034j261k174L46J564Q29l67j623m22
1933a248K133J254j838j753J144J383k81j166q70R49K053L97k295j011J849J156
1949A856j315j378K16J287Q68j052k279N17K980P28k214j334J079J218n3j556
1965d32j273J354K510m77k686k96K220J011q09j477m40J228J230j226k201P50
1981a014K152M58j168p34N1P04R09j009j208O48J306p29j032O62Q54J46m10m50
$$ plain form
1999 136 50 1165 1424 -433 -1345 221 1457 715 -459 -557 305 1617 1510 -660 -1219 663 1595 166
2017 166 -1099 -705 248 1304 798 -646 -496 1348 1715 -40 -676 -74 478 484 -46 -607 -296 930 612
2036 612 -554 -235 836 491 -601 -718 -469 -12 378 -492 -1271 -94 1455 641 -908 -621 326 657
2054 657 217 -934 -1335 -74 1051 -200 -1330 -335 902 728 -277 -984 -999 419 895 -795 -1673
2071 -1673 -273 1014 461 -421 -378 192 1144 1006 -522 -1161 320 1124 87 -354 225 875 1156 729
2089 729 -267 -136 1351 1387 -38 -585 188 673 461 391 60 474 1422 996 -288 -271 840 593 -205 -187
2109 -187 40 414 687 180 -808 -107 1251 788 -538 -935 -429 17 210 -448 -1412 -303 1249 780 -642
2128 -642 -800 95 520 682 -61 -1029 -422 993 772 -516 -448 417 989 1231 502 -656 -541 469 425
$$ packed form
1999A36q6J115K59j857r12J566J236p42j174r8Q62J312j07k170n59J882R32j429
2017A66j265L94R53J056n06j444J50J844L67j755o36O02N52On30n61L11J226l18
2036F12j166L19J071l45j092j17K49M57L90q70p79J177J549q14j549K87R47L31
2054F57m40j151m01J261J125j251j130R95J237j74j005p07j5J418M76j690q78
2071a673J400J287n53q82M3N70R52j38j528o39J481Q04j037m41N79O50K81m27
2089G29r96J31J487L6j425n47P73M85k12p0l31M14R48m26j284J7J111k47p98J8
2109a87K27L74K73n07r88P01J358m63j326l97N06M46J93o58r64J109J552m69j422
2128f42j58Q95M25J62p43r68O07J415k21j288O8Q65N72K42p29j158J15J010m4
$$ plain form
2147 425 -456 -216 133 96 317 415 -183 -239 475 244 -231 49 80 -651 -736 -61 209 415 603 -106 -691 54
2169 54 683 -303 -1038 -497 88 453 156 -886 -1303 144 1365 456 -785 -724 -152 185 155 -905 -1330
2188 -1330 195 1432 452 -802 -620 202 581 435 -444 -849 85 579 -532 -1272 -114 790 614 212
2206 212 -335 -272 450 599 -678 -925 643 1262 419 -316 -56 637 1334 1147 -168 -190 1096 1117 -272
2225 -272 -714 88 753 1027 655 -290 -6 1080 799 -676 -679 431 718 145 -408 -657 94 1055 384 -878
2245 -878 -187 1194 724 -765 -1271 -669 393 1039 -39 -1160 -185 1228 642 -793 -747 99 851 769
2263 769 -531 -1386 -325 1146 551 -346 283 859 544 -34 -467 -475 339 804 -210 -721 146 575 -298
2282 -298 -515 59 508 561 -233 -1359 -1039 411 554 -974 -1288 125 967 669 -460 -1343 -509 1159
$$ packed form
2147D25q81K40L49l7K21R8n98n6P14k31m75K80L1p31q5O75K70K06J88p09n85P45
2169E4O29r86p35N41N85L65k97j042m17J447J221r09j241O1N72L37l0j060m25
2188a330J525J237r80j254J82Q22L79j46q79m05R34M94j111p40J158R04j76m02
2206B12n47O3P22J49j277k47J568O19q43p35K60O93O97j87j315k2J286K1j389
2225b72m42Q02O65K74l72r45K84J086k81j475lJ110K87n73n53k49P51R61o71j262
2245h78O91J381m70j489n06O02J062O46j078j121R75J413n86j435M6Q46P52q2
2263G69j300q55J061J471n95q97O29N76l15n78m33qQ14M65j014n11Q67M29q73
2282b98k17N74M49N3p94j126L20J450J43j528l14J413Q42k98j129q83Q34J668
$$ plain form
2300 1159 847 -1080 -1338 47 669 8 -683 -859 -126 824 280 -1123 -974 -44 -371 -1241 -968 -422 -37
2319 -37 -6 -789 -1226 -305 606 -531 -1435 -477 391 -230 -1131 -1412 -642 1007 1290 -471 -1342 55 1239
2338 1239 357 -734 -857 173 1402 1012 -664 -1105 849 1890 837 -159 35 637 807 195 -616
2355 -616 -171 1369 1282 -454 -775 546 1271 596 -602 -974 -170 1064 218 -1492 -1249 581 1051 -176
2373 -176 -917 -543 474 937 -257 -1587 -781 1034 646 -788 -758 280 991 619 -470 -1115 171 1256
2391 1256 109 -1466 -990 229 413 -348 -904 -620 711 968 -901 -2039 -590 961 314 -1045 -1581
2408 -1581 -751 647 718 -873 -1671 89 1127 42 -1437 -1410 -418 367 148 -1026 -1229 211 681 -488
2426 -488 -1102 -239 285 96 -559 -1206 -760 397 453 -778 -735 455 617 -29 -496 -434 -23 575 -77 -1193
$$ packed form
2300A159l12j927k58J385O22o61o91j76P33R50n44j403J49R30l27q70K73N46L85
2319c7L1p83m37R21R11j137r04R58Q68o21r01k81P70J649K83j761q71J397J184
2338A239q82j091j23J030J229l90j676m41J954J041j053r96J94O02J70o12q11
2355f16M45J540q7j736l21J321P25o75j198l72Q04J234q46j710K43J830M70j227
2373a76p41L74J017M63j194j330Q06J815l88j434L0J038P11l72j089o45J286J085
2391A256j147j575M76J219J84p61n56K84J331K57j869j138J449J551o47j359n36
2408a581Q30J398P1j591p98J760J038j085j479K7R92P85k19j174k03J440M70j169
2426d88o14Q63N24j89o55o47M46J157N6j231M3J190J62o46m67O2M11N98o52j116
$$ plain form
2446 -1193 -690 759 884 -318 -621 -37 665 777 -52 -1071 -418 869 717 -460 -547 119 641 871
2464 871 346 -351 -56 799 393 -458 -219 386 245 73 70 -13 188 706 195 -346 -5 520 -34 -287 3
2485 3 18 293 575 259 -143 557 929 269 -67 286 365 311 337 0 -188 547 1015 434 -53 211 296 202 399
2508 399 97 -339 26 433 58 84 445 403 232 499 335 -128 16 294 -162 -179 463 344 -67 86 287
2529 287 36 291 507 -40 -494 -180 -67 -281 -36 123 -59 100 432 -183 -330 170 250 -212 -200 -119 -519
2550 -519 -244 191 -7 -153 316 283 -367 -329 -51 -286 -249 18 -215 -483 3 143 -356 43 434 131 -374
2571 -374 -227 -248 -108 237 -2 -550 -212 489 276 -146 205 213 -33 64 -202 -550 -117 587 33 -403 101
2592 101 326 204 234 261 155 494 467 -226 -473 432 900 466 358 419 308 505 534 106 28 880 786 -261
$$ packed form
2446a193N03J449J25j202l03N84P02J12q29j019O53J287j52j177q7O66N22K30
2464H71n25o97K95Q55m06q51K39O05j41j72lq3K01N18n11n41L41N25n54k53K90
2485CJ5K75K82l16m02P00L72o60l36L53P9n4K6l37j88P35M68n81m87K64Q5r4J97
2508C99l02m36L65M07l75K6L61m2j71K67j64m63J44K78m56j7O42j19m11J53K01
2529B87k51K55K16n47m54L14J13k14K45J59j82J59L32o15j47N00Q0m62J2Q1m00
2550e19K75M35j98j46M69l3o50L8K78k35L7K67k33k68M86J40m99L99L91l03n05
2571c74J47k1J40L45k39n48L38P01k13m22L51Qk46R7k66l48M33P04n54m36N04
2592A01K25j22L0K7j06L39k7o93k47R05M68m34j08O1j11J97K9m28p8Q52r4j047
$$ plain form
2614 -261 -474 200 670 800 637 17 60 943 642 -437 -267 693 864 256 -133 -242 337 1219 798 -307
2634 -307 -214 754 590 -304 -404 -90 551 710 -45 -907 -147 1148 608 -499 -554 151 283 28 -541 -662
2654 -662 402 1025 -117 -1152 -389 752 681 -116 -972 -936 52 459 -631 -1332 -132 851 82 -1048
2672 -1048 -1196 -460 479 440 -1004 -1556 -260 398 -475 -1128 -457 463 572 -230 -1339 -1062 495 709 -738
2691 -738 -1287 -348 359 8 -584 -920 -113 983 352 -1346 -1293 276 778 -82 -806 -675 246 860 157
2710 157 -971 -211 1218 917 -568 -1067 -230 756 950 24 -788 -5 1271 750 -536 -287 733 891
2728 891 298 -614 -641 409 1345 593 -462 22 1015 716 -51 -232 171 795 869 -335 -901 348 1261
2747 1261 608 -284 -170 326 549 250 -561 -567 623 983 -243 -859 -42 658 747 316 -257 -215 530 454 -540
$$ packed form
2614b61k13O74M70J30j63o20M3Q83l01j079J70R60J71o08l89j09N79Q82m21j105
2634c07R3R68j64q94j00L14O41J59p55q62P60J295n40j107n5P05J32k55n69j21
2654f62J064O23j142j035P63J141p1p97q56L6R88M07j090p01J200R83p69j130
2672a048j48P36R39l9j444n52J296O58q73o53O71R20J09q02j109K77J557K14j447
2691g38n49R39P07l51n92l36Q07J096o31j698N3J569N02q60p24J31R21O14p03
2710A57j128P60J429l01j485m99Q37R86J94r26q12P83J276n21j286K49J020J58
2728H91n93r12k7J050R36p52j055M84R93k99p67j81M03O24P4j204n66J249R13
2747A261o53q92J14M96K23k99q11oJ190L60j226o16Q17P00Q9m31n73M2P45p6r94
$$ plain form
2768 -540 -605 339 740 36 -414 -334 19 596 236 -657 -583 331 54 -887 -709 -77 173 171 -333 -855 -394 556
2790 556 63 -807 -634 -46 -169 -451 -516 -522 12 444 -106 -842 -428 209 -171 -504 -340 -341 -292 -151 -494 -597
2812 -597 250 603 -279 -701 -196 102 60 -230 -470 -353 393 450 -475 -547 407 708 139 -279 -464 -205 291
2833 291 163 -435 -443 420 381 -200 -127 117 189 275 86 -514 -299 461 261 -405 -76 483 435 194 -35 -229
2855 -229 240 759 125 -542 -287 508 352 -1 21 17 378 679 138 -534 -12 715 260 -229 -181 0 354
2876 354 512 75 -344 200 660 38 -540 -230 28 52 -30 -294 -448 108 494 -152 -571 -48 126 -200 -309
2897 -309 -460 -430 133 391 -364 -526 132 395 -81 -248 -253 -294 77 226 -472 -718 63 359 -92 -272 -205 -243
2919 -243 122 215 -457 -695 -65 177 -312 -372 -156 -20 140 181 -348 -484 178 273 -472 -552 -159 0 -22 -86
$$ packed form
2768e40o5R44M01p04m50Q0L53N77l60q93P4R14k77r41J78O32K50kn04n22M61R50
2790E56m93q70J73N88j23k82o5oN34M32n50p36M14O37l80l33J64jM9J41l43j03
2812e97Q47L53q82m22N05K98m2k90k40J17P46N7r25p2R54L01n69m18j85K59M96
2833B91j28n98qQ63l9n81P3K44P2Q6j89o00K15P60k00o66L29N59m8k41k29j94
2855b29M69N19o34o67K55P95j56l53K2mL61L01n41o72N22P27m55m89M8J81L54
2876C54J58m37m19N44M60o22n78L10K58K4q2k64j54N56L86o46m19N23J74l26j09
2897c09j51L0N63K58p55j62O58K63m76j67nm1L71J49o98k46P81K96m51j80O7l8
2919b43L65R3o72k38O30K42m89o0K16J36J60M1n29j36O62R5p45q0L93J59k2o4
$$ plain form
2941 -86 -415 -344 395 395 -485 -625 -22 135 -137 -319 -529 -216 459 289 -578 -505 376 464 -102 -373 -545 -209
2963 -209 419 102 -640 -350 452 376 -206 -373 -86 89 309 -114 -715 -347 498 265 -416 -282 279 393
2983 393 313 -217 -619 -27 671 62 -763 -319 363 381 74 -318 -388 299 756 -134 -886 -321 512 297 -253
3004 -253 -348 -64 482 625 -155 -658 228 902 165 -468 -154 328 593 417 -279 -282 728 1039 28 -486
3024 -486 134 570 360 -60 -327 -53 726 778 -206 -399 442 745 197 -101 -158 20 506 235 -509 -221 725
3045 725 657 -166 -274 46 218 173 -152 -555 -147 542 116 -689 -321 357 341 28 -219 -388 15 414 -238
3066 -238 -902 -266 444 159 -336 -255 -85 212 204 -351 -727 17 447 -243 -746 -317 104 154 22 -319 -363 293
3088 293 404 -459 -774 -86 378 -1 -180 -289 -86 394 328 -430 -312 509 511 -337 -452 -226 241 383 44
$$ packed form
2941h6l29P1P39%q80j40O03J57k72j82k10L13O75j70q67P3Q81Q8n66k71j72L36
2963b09O28l17p42K90Q02p6n82j67K87J75K20m23o01L68Q45k33o81J34N61J14
2983C93q0n30m02N92O98o09q25M44O82J8l07l92p0O87M57q90p52N65Q33k15n50
3004b53r5K84N46J43p80n03Q86O74p37o33L14M82K65j76o96lJ010L11j011n14
3024d86O20M36k10m20k67K74P79N2r84j93Q41L03n48k98n7J78M86k71p44K88R46
3045G25o8q23j08L20J72m5l25m03M08O89m26q05L68O78j6l13k47j69M03L99o52
3066b38o64O36P10k85m95Q1J70K97qn55l76P44M30o90n03M29M21N0j32l41m4O56
3088B93J11q63l15O88M64l79j79j09K03M80o6p58J18Q21Kq48j15K26M67J42l39
$$ plain form
3109 44 -322 90 827 405 -517 -260 462 618 258 -183 -298 380 993 449 -386 167 949 774 131 -211
3129 -211 -21 543 819 165 -447 315 1174 605 -122 -62 407 689 589 -42 -329 534 964 93 -395 202
3149 202 854 741 319 -223 -89 551 650 -245 -464 575 799 212 -357 -280 201 842 501 -498 -572 453
3169 453 604 -296 -670 -117 485 694 49 -852 -569 564 598 -395 -716 -169 188 60 -393 -751 -272 488
3189 488 266 -777 -678 36 -11 -417 -675 -559 -176 254 -220 -865 -306 383 35 -639 -603 -211 109 200 -505
3210 -505 -942 -223 529 44 -557 -304 129 97 -78 -572 -756 1 555 -7 -604 -231 94 172 87 -38 -106
3231 -106 264 335 -347 -701 0 541 238 17 -24 -51 278 369 -181 -341 317 558 -3 -315 -144 29 358
3252 358 481 108 -222 285 444 4 -146 86 112 146 284 43 -94 307 454 29 14 250 80 -85 104
$$ packed form
3109D4l66M12P37m22r22K57P22J56l60m41j15O78O13n44q35N53P82j75o43l42
3129b11J90N64K76o54o12P62Q59n69p27O0M69K82j00o31k87Q63M30q71m88N97
3149B02O52j13m22n42J34O40R9q95k19J039K24n87n69P7M81O41l41r99p4J025
3169D53J51r00l74N53O02K09o45r01K83J133L4r93l21N47L57j28m53l58M79P60
3189D88k22j043R9P14m7m06k58J16L83M30m74o45N59O89l48o74L6L92L20R1p05
3210e05m37P19P52m85o01K53M33l2j75m94j84P57N54n62n97L73L25P8q5j25o8
3231a06L70P1o82l54P01N41l03k21m1k7L29R1n50j60O58K41n61l12J71J73L29
3252C58J23l73l30N07J59m40j50K32K6L4J38k41j37M01J47m25j5K36j70j65J89
$$ plain form
3273 104 11 -121 128 134 -209 13 471 221 -134 24 -29 -21 292 163 -283 -64 412 311 -32 4 41 60 482
3296 482 302 -452 -470 69 163 -69 -86 -137 -237 97 106 -413 -384 107 46 -336 -378 -315 -358 -100 97 -304 -335 -15
3320 -15 -73 -516 -274 -189 -396 -352 -125 -249 -259 -6 -211 -325 11 114 -353 -498 -228 -165 -109 -12 -265 -537 6
3343 6 333 -62 -302 -164 -97 -52 14 -191 -460 -152 139 -228 -326 58 40 -235 -129 -151 -245 -54 53 -368 -257
3366 -257 174 131 -187 -41 157 78 101 30 -242 -51 383 174 -373 -126 266 272 123 14 -165 118 467 174
3388 174 -371 -132 275 42 -81 39 61 186 312 -73 -267 228 520 -139 -532 -157 331 467 148 -300
3408 -300 -428 394 807 90 -433 -6 351 333 97 -181 -19 526 825 75 -205 425 569 277 -7 86 318
3429 318 596 316 -294 -185 647 720 132 -130 150 322 204 -166 -494 64 748 312 -701 -530 375 636
$$ packed form
3273A04r3j32K49Ol43K22M58k50l55J58n3QL13j29m46K19M76j01l43L6L7J9M22
3296D82j80p54j8N39R4k32j7n1j00L34Rn19K9M91o1l82m2O3m3K58J97m01l1L20
3320a5n8m43K42Q5k07M4K27j24j0K53k05j14L36J03m67j45K70O3N6R7k53k72N43
3343FL27l95k40J38O7M5O6k05k69L08K91l67r8L84j8k75J06k2r4J91J07m21J11
3366b57M31m3l18J46J98p9K3p1k72J91M34k09n47K47L92Oj49j09j79K83L49k93
3388A74n45K39M07k33j23J20K2J25J26l85j94M95K92o59l93L75M88J36l19m48
3408c00j28Q22M13p17n23M27L57j8k36k78J62N45K99p50k80O30J44k92k84R3K32
3429C18K78k80o10J09Q32P3n88k62K80J72j18l70l28N58O84m36j013J71R05K61
$$ [...]
8191F6
##END NTUPLES=NMR FID
##END=
