##TITLE=1H_TG-2296
 CDCl3, 8 sc, 
 7.8.2020
##JCAMPDX= 6.0         $$ Bruker NMR JCAMP-DX V2.0
##DATA TYPE= NMR FID
##DATA CLASS= NTUPLES
##ORIGIN= UXNMR, Bruker Analytische Messtechnik GmbH
##OWNER= root
$$ XWIN-NMR		Version 3.5
$$ Fri Aug  7 13:11:05 2020 Russian Standard Time (UT+4h)  she@DPX200
##.OBSERVE FREQUENCY= 200.1314999998
##.OBSERVE NUCLEUS= ^1H
##.DELAY= (6, 6)
##.ACQUISITION MODE= SIMULTANEOUS
##.ACQUISITION SCHEME= undefined
##.AVERAGES= 8
##.DIGITISER RES= 18
##SPECTROMETER/DATA SYSTEM= spect
##.PULSE SEQUENCE= zg30
##.SOLVENT NAME= CDCl3
##.SHIFT REFERENCE= (INTERNAL, CDCl3, 0, 15.7039)
##AUDIT TRAIL= $$ (NUMBER, WHEN, WHO, WHERE, WHAT)
$$ ##TITLE= Audit trail, XWIN-NMR		Version 3.5
$$ ##JCAMPDX= 5.01
$$ ##ORIGIN= Bruker BioSpin GmbH
$$ ##OWNER= she
$$ F:/spectra/data/she/nmr/H-F/1/audita.txt
$$ ##AUDIT TRAIL=  $$ (NUMBER, WHEN, WHO, WHERE, WHAT)
(   1,<2020-08-07 13:09:57.17 +0400>,<she>,<DPX200>,
      <created by zg, POWCHK disabled, PULCHK disabled
       configuration hash MD5:
       00 E9 B6 7A A2 85 ED C7 34 08 36 98 17 FE 4E 26
       data hash MD5: 16K
       1F 89 25 90 BF 21 14 12 0F 18 37 38 86 E0 B8 CC>)
$$ ##END=
$$ 
$$ hash MD5
$$ 1E 33 85 2D BE 47 7C 70 3B 6F 99 3A D4 25 3E DA
##$RELAX= 
##$RELAX= 
##$RELAX= 
##$RELAX= 
##$RELAX= 
##$RELAX= 
$$ Bruker specific parameters
$$ --------------------------
##$DU= <F:/spectra>
##$EXPNO= 1
##$NAME= <H-F>
##$PROCNO= 1
##$TYPE= <nmr>
##$USER= <she>
##$AMP= (0..31)
100 100 100 100 100 100 100 100 100 100 100 100 100 100 100 100 100 100 
100 100 100 100 100 100 100 100 100 100 100 100 100 100 
##$AQSEQ= 0
##$AQ_mod= 1
##$AUNM= <au_zg>
##$AUTOPOS= <>
##$BF1= 200.13
##$BF2= 200.13
##$BF3= 200.13
##$BF4= 200.13
##$BF5= 200.13
##$BF6= 200.13
##$BF7= 200.13
##$BF8= 200.13
##$BYTORDA= 1
##$CFDGTYP= 0
##$CFRGTYP= 5
##$CHEMSTR= <none>
##$CNST= (0..31)
1 1 145 1 1 1 1 1 1 1 1 1 1 1 1 1 1 1 1 1 1 1 1 1 1 1 1 1 1 1 1 1 
##$CPDPRG= <>
##$CPDPRG1= <>
##$CPDPRG2= <>
##$CPDPRG3= <>
##$CPDPRG4= <mlev>
##$CPDPRG5= <mlev>
##$CPDPRG6= <mlev>
##$CPDPRG7= <mlev>
##$CPDPRG8= <mlev>
##$CPDPRGB= <>
##$CPDPRGT= <>
##$D= (0..31)
0 1.2 0 0 0 0 0 0 0 0.06 0 0.03 0 0 0 0 0.0002 0 0 0 0 0 0 0 0 0 0 0 0 
0 0 0 
##$DATE= 1596791396
##$DBL= (0..7)
120 120 120 120 120 120 120 120 
##$DBP= (0..7)
150 150 150 150 150 150 150 150 
##$DBP07= 0
##$DBPNAM0= <>
##$DBPNAM1= <>
##$DBPNAM2= <>
##$DBPNAM3= <>
##$DBPNAM4= <>
##$DBPNAM5= <>
##$DBPNAM6= <>
##$DBPNAM7= <>
##$DBPOAL= (0..7)
0.5 0.5 0.5 0.5 0.5 0.5 0.5 0.5 
##$DBPOFFS= (0..7)
0 0 0 0 0 0 0 0 
##$DE= 6
##$DECBNUC= <off>
##$DECIM= 24
##$DECNUC= <off>
##$DECSTAT= 4
##$DIGMOD= 1
##$DIGTYP= 9
##$DL= (0..7)
0 120 120 120 120 120 120 120 
##$DP= (0..7)
150 150 150 150 150 150 150 150 
##$DP07= 0
##$DPNAME0= <>
##$DPNAME1= <>
##$DPNAME2= <>
##$DPNAME3= <>
##$DPNAME4= <>
##$DPNAME5= <>
##$DPNAME6= <>
##$DPNAME7= <>
##$DPOAL= (0..7)
0.5 0.5 0.5 0.5 0.5 0.5 0.5 0.5 
##$DPOFFS= (0..7)
0 0 0 0 0 0 0 0 
##$DQDMODE= 0
##$DR= 18
##$DS= 0
##$DSLIST= <SSSSSSSSSSSSSSS>
$$ [...]
##$SUBNAM2= <"">
##$SUBNAM3= <"">
##$SUBNAM4= <"">
##$SUBNAM5= <"">
##$SUBNAM6= <"">
##$SUBNAM7= <"">
##$SUBNAM8= <"">
##$SUBNAM9= <"">
##$SW= 24.9337058888022
##$SWIBOX= (0..15)
0 0 2 0 0 0 0 0 0 0 0 0 0 0 0 0 
##$SW_h= 4990.01996007984
##$TD= 16384
##$TD0= 1
##$TE= 0
##$TE2= 300
##$TE3= 300
##$TEG= 300
##$TL= (0..7)
0 120 120 120 120 120 120 120 
##$TP= (0..7)
150 150 150 150 150 150 150 150 
##$TP07= 0
##$TPNAME0= <>
##$TPNAME1= <>
##$TPNAME2= <>
##$TPNAME3= <>
##$TPNAME4= <>
##$TPNAME5= <>
##$TPNAME6= <>
##$TPNAME7= <>
##$TPOAL= (0..7)
0.5 0.5 0.5 0.5 0.5 0.5 0.5 0.5 
##$TPOFFS= (0..7)
0 0 0 0 0 0 0 0 
##$TUNHIN= 0
##$TUNHOUT= 0
##$TUNXOUT= 0
##$USERA1= <user>
##$USERA2= <user>
##$USERA3= <user>
##$USERA4= <user>
##$USERA5= <user>
##$V9= 5
##$VALIST= <valist>
##$VCLIST= <CCCCCCCCCCCCCCC>
##$VD= 0
##$VDLIST= <DDDDDDDDDDDDDDD>
##$VPLIST= <PPPPPPPPPPPPPPP>
##$VTLIST= <TTTTTTTTTTTTTTT>
##$WBST= 1024
##$WBSW= 4
##$XGAIN= (0..3)
0 0 0 0 
##$XL= 0
##$YL= 0
##$YMAX_a= 292358
##$YMIN_a= -544752
##$ZGOPTNS= <>
##$ZL1= 120
##$ZL2= 120
##$ZL3= 120
##$ZL4= 120
##$ABSF1= 10
##$ABSF2= 0
##$ABSG= 5
##$ABSL= 3
##$ALPHA= 0
##$AQORDER= 0
##$ASSFAC= 0
##$ASSFACI= 0
##$ASSFACX= 0
##$ASSWID= 0
##$AUNMP= <proc_1d>
##$AZFE= 0.1
##$AZFW= 0.1
##$BCFW= 1
##$BC_mod= 2
##$BYTORDP= 1
##$COROFFS= 0
##$CY= 11.3945322036743
##$DATMOD= 1
##$DC= 2
##$DFILT= <>
##$DTYPP= 0
##$F1P= 16.9975609425685
##$F2P= -3.02152046262296
##$FCOR= 0.5
##$FTSIZE= 0
##$FT_mod= 4
##$GAMMA= 1
##$GB= 0.15
##$INTBC= 1
##$INTSCL= 1
##$ISEN= 128
##$LB= 0.24
##$LEV0= 0
##$LPBIN= 0
##$MAXI= 10000
##$MC2= 0
##$MEAN= 0
##$ME_mod= 0
##$MI= 1.114404
##$NCOEF= 0
##$NC_proc= 0
##$NLEV= 6
##$NOISF1= 3.799351
##$NOISF2= 2.8
##$NSP= 1
##$NTH_PI= 0
##$NZP= 0
##$OFFSET= 15.70392
##$PC= 1
##$PHC0= -9952.803
##$PHC1= 14.00092
##$PH_mod= 1
##$PKNL= yes
##$PPARMOD= 0
##$PSCAL= 0
##$PSIGN= 0
##$REVERSE= no
##$SF= 200.130013532006
##$SI= 16384
##$SIGF1= 3
##$SIGF2= 2
##$SINO= 400
##$SIOLD= 16384
##$SREGLST= <1H.CDCl3>
##$SSB= 0
##$STSI= 0
##$STSR= 0
##$SW_p= 3612.71676300578
##$SYMM= 0
##$S_DEV= 0
##$TDeff= 0
##$TDoff= 0
##$TI= <>
##$TILT= no
##$TM1= 0
##$TM2= 0
##$TOPLEV= 0
##$USERP1= <user>
##$USERP2= <user>
##$USERP3= <user>
##$USERP4= <user>
##$USERP5= <user>
##$WDW= 1
##$XDIM= 8192
##$YMAX_p= 0
##$YMIN_p= 0
$$ End of Bruker specific parameters
$$ ---------------------------------
##NTUPLES= NMR FID
##VAR_NAME=  TIME,          FID/REAL,        FID/IMAG
##SYMBOL=    X,             R,               I
##VAR_TYPE=  INDEPENDENT,   DEPENDENT,       DEPENDENT
##VAR_FORM=  AFFN,          ASDF,            ASDF
##VAR_DIM=   8192,          8192,            8192
##UNITS=     SECONDS,       ARBITRARY UNITS, ARBITRARY UNITS
##FACTOR=    0.0002004,     1,               1
##FIRST=     0,             0,               0
##LAST=      1.6414764,     0,               0
##MIN=       0,             -544752,         0
##MAX=       1.6414764,     292358,          0
$$ Real data points
##PAGE= N=1
##DATA TABLE= (X++(R..R)), XYDATA
0 0 0 0 0 0 8 -8 8 -8 16 -16 17 -24 32 -40 48 -56 68 -80 96 -113 134 -158 182 -210 241 -276 316 -359
28 -359 407 -459 519 -581 651 -731 817 -907 1011 -1125 1247 -1383 1532 -1695 1877 -2080
44 -2080 2304 -2553 2838 -3158 3527 -3953 4456 -5057 5790 -6710 7905 -9522 11852 -15517
58 -15517 22167 -38087 155507 1732 -346382 -19843 292358 239789 -67788 -108627 60053
69 60053 141642 -43359 -195671 -126037 55072 73375 -29142 -112935 -134388 -167068 -150193
80 -150193 -42129 73948 16393 -186263 -285604 -108529 103735 33640 -202759 -195841 61895
91 61895 157610 -79035 -291289 -149039 172690 237867 -30543 -247773 -121195 128959 145103
102 145103 -26172 -82206 24628 81933 5955 -59666 -12037 59956 44837 -6054 9696
113 9696 33799 -39308 -105873 -1189 155588 105386 -111163 -190379 -24658 152492 106091
124 106091 -84877 -144038 9166 129589 21081 -141716 -91330 103639 155470 -3347
134 -3347 -148050 -96109 60803 112647 28602 -35965 -13366 364 -29314 -15182 44465 46785
146 46785 -11857 -29417 11568 22226 -34344 -73953 -7123 105432 93297 -66462 -162128 -51719
158 -51719 105772 96794 -32870 -87141 -13418 57228 17705 -64174 -48064 58014 99649 20863
170 20863 -59483 -48528 12366 56076 64886 43133 10226 -7964 -5078 19105 57290 64859 22207
183 22207 -2986 35649 62244 12683 -36721 5376 90542 98560 5796 -76178 -38693 66146
195 66146 90626 11996 -43440 -12792 29169 21476 -9521 -20892 -709 28871 25107 -15000
207 -15000 -38938 -21084 7626 24904 26512 -2003 -42494 -38656 10544 40576 18628 -21583
219 -21583 -33999 -3898 29597 11607 -35285 -30067 26619 43976 -7564 -57622 -46581 9042
231 9042 44292 14133 -45275 -56511 -18374 1045 -14308 -24473 -22414 -25891 -28042 -28733 -41384
244 -41384 -49908 -31926 -7624 -7131 -32441 -65084 -71813 -32646 10928 2425 -39728 -56050 -38110
257 -38110 -16140 -8370 -17914 -26707 -8160 16406 -217 -38189 -34586 8325 37085 30352 4528
270 4528 -16577 -10998 15906 31105 26505 22420 19631 12163 13573 21422 15828 11704 30726 46804
284 46804 29377 -675 -10898 6749 38671 50880 21772 -11678 -4990 19379 21168 10104
296 10104 9377 13748 17275 14684 -2076 -14980 3382 30853 28652 6614 -6355 -7925 355 18201
310 18201 25929 14337 3470 1785 2976 10277 17781 10338 4340 19239 27163 4274 -14315 1846
324 1846 26844 31093 16403 -3832 -9899 6996 20775 11874 2521 7648 7938 -1276 -3220 -992
338 -992 -2008 2979 8700 -48 -12719 -14560 -13600 -9963 2743 5184 -15557 -31509 -22021 -7778
352 -7778 -6533 -13303 -22518 -23966 -12923 -10973 -28481 -33821 -13109 -1783 -15887 -29267 -28304 -21719
366 -21719 -13234 -8326 -14321 -20269 -17357 -17266 -17868 -8057 -2539 -13161 -17299 -5292 -1226 -10058 -11590
381 -11590 -4665 1118 5166 864 -12623 -12087 7565 15430 2294 -6518 -2600 2267 6065 6299 30
396 30 -126 8712 5947 -6355 -3707 7932 6315 47 2566 1647 -5489 -5282 1320 5230 6869 1305
412 1305 -11329 -10714 5058 8634 -2420 -2949 4277 1241 -4197 -1859 1990 6659 13127 8936 -3003
427 -3003 -1273 9805 12456 11754 15915 14724 8649 9560 12626 13568 20638 26651 18430 10468 16025 18907
443 18907 13804 17685 27012 23802 13734 9209 8803 13299 21340 19070 9165 8993 11102 1882 -3065
458 -3065 8299 15385 7823 228 -3997 -7770 -3885 4248 3374 -1253 -669 -4594 -12472 -9158 -49
473 -49 994 -74 377 -6473 -13141 -7263 -662 -1805 692 3772 -5970 -15454 -10068 -2471 -2275 -2814
489 -2814 -4777 -11450 -13971 -13102 -17195 -16595 -6725 -7054 -21288 -27603 -23969 -24123 -23542 -17518 -18097 -25965
505 -25965 -29333 -30554 -32042 -25103 -16142 -19189 -25197 -23133 -23142 -25681 -18196 -8244 -7918 -8725 -6967 -10810
521 -10810 -12155 -652 9640 8312 7080 9059 6365 6236 13754 18529 19551 22615 20594 12239 13521
536 13521 21802 21402 18824 24004 23796 13433 9557 13766 15459 17130 19680 13684 5430 6042 8067
551 8067 6282 10014 14060 8027 2163 4451 3868 1548 7582 13686 8852 4357 5101 2900 2564 11034
567 11034 15655 10182 6684 5933 3237 6094 13191 11504 5725 7560 7694 7 -1079 5952 6859 3320
583 3320 2789 -1444 -7852 -5821 -483 -1594 -2736 -2700 -8277 -12284 -7181 -4585 -7720 -5047 -888 -6400
599 -6400 -11664 -7064 -3388 -3480 636 3233 -1841 -4380 -1272 -231 2138 8523 7867 1366 1277 3432
615 3432 492 2184 9197 8104 698 -1011 -1784 -5119 -2631 2184 -1434 -6929 -7374 -11293 -16689 -13668
631 -13668 -8750 -10879 -13509 -15590 -23031 -26039 -17692 -13194 -18259 -19675 -17639 -20925 -23447 -19552 -16363
646 -16363 -14289 -9853 -10721 -17024 -16136 -10200 -8945 -5973 1822 822 -7889 -7018 572 2989 4282 7470
662 7470 6304 4659 7364 6131 1797 7137 16740 15828 9163 6055 4357 6252 14414 16896 10308
677 10308 8753 11602 7499 4393 11092 16254 13496 12113 12024 7428 6203 11553 15692 17839 19434
692 19434 12975 3727 7994 19321 20081 15314 15595 15175 11573 10677 11253 11755 17147 20854 11761 1369
708 1369 3043 7477 7807 9813 10001 2946 -3114 -3576 -5090 -4822 2010 3209 -5971 -11520 -10620 -13295
724 -13295 -14305 -7283 -2032 -5209 -11965 -19069 -21788 -12756 -2265 -4549 -10189 -8345 -9513 -17508 -16286
739 -16286 -5046 1912 1840 -2408 -11441 -15986 -8401 -120 1040 2562 3117 -5703 -13997 -10882 -3431
754 -3431 1152 4098 1310 -7974 -12561 -10823 -10902 -7631 2695 4211 -8727 -18825 -17046 -11568 -5489
769 -5489 -1189 -4360 -9735 -10001 -12334 -17807 -12420 814 3417 -4262 -9755 -12053 -12270 -5794 2367
784 2367 4193 2844 -740 -8425 -9891 1294 9391 6363 3763 4862 1616 -1913 1225 6018 10639
799 10639 15751 11614 -1474 -4220 7144 14938 13740 11896 8677 4384 4765 7568 8850 13316 17271
814 17271 11572 3374 4740 7944 6999 11279 18411 14626 4104 -664 1266 8281 17267 16330 4693
829 4693 -72 4781 5048 2182 6384 12133 10923 5728 -734 -6303 -1704 10223 13370 6769 1867
844 1867 -2225 -6573 -2670 7096 9469 5272 1596 -3170 -6412 -2475 1683 734 3571 7769 -390
859 -390 -13514 -12686 -1656 5054 4440 -1312 -9544 -11466 -7146 -6627 -7257 -2160 -304 -7476 -13417 -13202
875 -13202 -12798 -10105 -3473 -2364 -9022 -13601 -14949 -16411 -10985 -1914 -2992 -11799 -14272 -12110 -11869
890 -11869 -9929 -6494 -6045 -5751 -5394 -11238 -16040 -8973 469 -521 -5163 -6571 -8506 -8864 -3821 -211
906 -211 -819 -205 -1309 -6767 -6824 604 2520 -224 2066 3442 -1937 -4888 -908 3242 6206 7995
922 7995 2775 -3934 -1360 4748 5566 5400 7629 5944 2125 1841 2238 3409 9720 13736 7380 1416
938 1416 3016 4580 4952 10609 15166 10291 4564 4017 4529 7375 13039 14037 10330 9670 8556 3259
954 3259 4127 12998 17513 13966 9399 4990 2109 6902 13388 12374 9781 9766 5952 303 1803 6587
970 6587 7615 8397 8004 827 -5883 -3407 1015 2140 3846 2589 -5411 -10369 -7120 -3920 -3661 -1982
986 -1982 -2580 -7245 -9599 -10508 -12416 -8735 -228 -334 -9307 -13385 -11643 -10181 -6136 -1044 -2937 -7958
1002 -7958 -8464 -8531 -10114 -6577 -639 -532 -2889 -4637 -9015 -11080 -4549 2258 1379 -1983 -4790 -9188
1018 -9188 -9160 -2209 1059 -1824 -2288 -2708 -7402 -9699 -5946 -2852 -1287 696 -3509 -11585 -11423 -4863
1034 -4863 -2377 -2592 -1826 -4501 -9203 -8391 -5474 -4944 -2304 920 -1895 -6451 -6309 -5076 -3538 2252
1050 2252 5624 508 -3742 -1610 213 1481 6089 8231 4841 4005 5525 3754 3815 10272 14277 11962
1066 11962 9150 6997 5387 9959 16532 15702 11290 11323 11000 8554 10419 14179 13470 12120 12927 9389
1082 9389 4371 6430 10738 11074 10185 7988 1766 -660 4650 7355 4094 2418 1969 -1015 -2030 -127
1098 -127 -1373 -2677 946 1428 -4163 -7147 -5085 -3342 -1043 859 -2730 -7605 -5450 -1770 -2765 -2502
1114 -2502 -551 -2391 -4193 -1843 -1356 -4208 -2471 1770 779 -1869 -2764 -4190 -3087 2083 2861 -2571
1130 -2571 -4855 -2534 -2420 -2594 -460 -1714 -4884 -3815 -2662 -6155 -6886 -3232 -3065 -5237 -5663 -7868
1146 -7868 -10774 -7811 -3581 -5254 -8520 -8835 -10185 -10931 -7126 -5446 -8746 -9516 -7318 -8875 -10739 -8385
1162 -8385 -6604 -6649 -4908 -5116 -9178 -9304 -4137 -2221 -2980 -1518 -1956 -4935 -2984 1429 1590 1371 3866
1179 3866 3917 1697 3353 5384 5163 7498 10639 8600 5637 7311 9069 8906 11595 13118 9640 7508
1195 7508 9985 9926 8633 11051 12044 8783 7193 7894 6111 5789 8866 8308 4718 4146 3870 1334 2114
1212 2114 5306 4058 934 1423 502 -1904 -342 3015 1680 58 801 -767 -2614 347 2874 1598
1228 1598 1699 2767 78 -1168 2472 3852 2891 4192 4962 1578 126 3145 3994 3404 5255 4217
1244 4217 54 -168 2119 1228 664 2757 990 -3010 -2999 -2314 -4526 -3883 -1417 -4040 -7750 -7435 -7621
1261 -7621 -9603 -8017 -6186 -8711 -10769 -10106 -11562 -12519 -9624 -8430 -11122 -10900 -9372 -11387 -12287 -8616
1277 -8616 -7057 -8641 -7750 -6986 -8713 -7740 -4206 -4058 -4682 -2556 -2488 -4646 -2804 567 139 25 1938
1294 1938 960 -748 1821 3745 2347 3168 5163 2985 965 3129 4425 3716 5109 5491 2134 1387
1310 1387 3770 3850 3231 5422 5125 1090 987 3329 2904 2703 4667 3977 1679 2237 2262 565 2744 6538
1328 6538 4787 1489 1953 2047 1553 4410 6785 4525 2992 4146 2913 1831 4998 7056 5327 5118
1344 5118 5869 3401 2021 4961 6915 6788 7455 5568 1282 2351 6787 6832 4834 5870 5087 2088
1360 2088 2009 3632 2949 3671 5600 3082 -1015 -801 235 -518 1412 3032 -819 -4616 -3805 -3173 -3482
1377 -3482 -1679 -1301 -4972 -6411 -5178 -6600 -7892 -4854 -3197 -5499 -7211 -7888 -9886 -8210 -3716
1392 -3716 -4095 -7051 -7176 -6934 -8910 -7513 -3747 -3733 -5400 -4717 -5731 -7452 -5570 -2991 -3286 -2556 -1221
1409 -1221 -4344 -7484 -4554 -1093 -1099 -793 -945 -4136 -5130 -2157 -1530 -2069 150 897 -2735 -4346 -2417
1426 -2417 -1917 -1227 1598 1414 -2069 -2842 -2069 -2357 -9 3884 2431 -1475 -1328 95 -324 1376 3927
1443 3927 3464 2398 2911 1125 -311 3454 7015 5573 4382 5011 3262 2215 5260 7982 7200 7199 6753
1460 6753 4041 3799 7122 8219 7098 8449 8298 4975 4238 6329 6836 7387 9218 7073 3099 3893
1476 3893 5853 4845 5075 7198 5597 2174 2018 2555 2048 3644 4742 1777 53 1179 10 -1775
1492 -1775 547 2329 -229 -1893 -1635 -3209 -3631 -1020 -634 -2825 -2833 -2949 -5561 -5655 -2448 -2343 -4367
1509 -4367 -3952 -4402 -6708 -6140 -3876 -4798 -5089 -3426 -4903 -8204 -7079 -4664 -4768 -4729 -3966 -5996 -7442
1526 -7442 -5522 -4704 -5648 -3902 -2560 -5154 -6331 -4022 -3861 -4704 -2478 -1117 -3068 -3767 -2816 -3213 -2607
1543 -2607 339 262 -2261 -1630 -419 -1621 -1116 1159 653 -471 635 458 -1623 -400 1804 879 374
1560 374 1812 412 -1496 480 2358 1115 1049 2170 677 -385 1835 2536 956 2278 3495 1729
1576 1729 985 2789 2807 2383 4233 4397 2130 2449 3978 3390 3387 5429 4652 2257 3502 4840 3394 3588
1594 3588 5131 4027 2548 3807 3835 2261 3288 4675 3024 2168 3245 2481 1289 3400 4268 2330
1610 2330 2223 3198 1972 1708 3931 3886 2070 3135 4148 2164 2057 3916 3666 3020 4358 3777 1475
1627 1475 1973 3615 2749 2370 3517 1763 -778 224 1168 -505 -920 -240 -1986 -3849 -3330 -4283 -5905
1644 -5905 -4739 -3955 -6771 -8467 -7700 -8568 -9492 -7769 -7571 -9998 -10437 -9274 -10363 -10565 -8328 -8209 -9581
1661 -9581 -8136 -7097 -8777 -8477 -5691 -4905 -4636 -3331 -3811 -5259 -3066 -191 -929 -931 1166 596 -563
1678 -563 1090 2206 1533 2487 4125 2624 1151 2276 2353 1655 3814 4563 1744 376 1810 1962 1735
1695 1735 3130 2651 741 1272 2371 809 699 3323 3528 2034 2397 2553 1474 2779 5299 4838 3800
1712 3800 4594 4050 2967 5066 6952 5551 5022 6269 5345 3825 4973 5578 4771 5588 5754 2717 1340
1729 1340 3269 3640 2305 2768 2460 -287 -874 591 -174 -697 786 125 -2502 -2129 -1165 -2397 -1730
1746 -1730 636 -27 -1951 -1695 -1203 -1587 411 2158 527 -658 773 653 -234 1522 3091 1652
1762 1652 1058 1562 231 -456 1579 2183 282 228 82 -2338 -2894 -778 -691 -2668 -2783 -3232 -5279 -5218
1780 -5218 -4136 -5004 -5497 -4421 -5517 -7810 -7003 -5618 -6404 -5904 -4683 -6087 -7392 -5775 -5063 -5794 -4290
1797 -4290 -2799 -4048 -4863 -3371 -3102 -3327 -1431 -459 -2056 -2133 -916 -1604 -1439 683 846 -1121 -313
1814 -313 574 -655 -794 1065 1048 60 980 651 -905 213 2290 1163 412 1574 1269 575 2022 2918
1832 2918 1549 1840 3661 3027 2194 3489 3982 3320 4679 5608 3985 3433 5386 5749 4785 5678 5659 4080
1850 4080 4900 6293 5021 3907 5322 5230 3899 4182 4508 3038 2973 4390 3342 1674 2296 2262 1516 2256
1868 2256 2632 408 -42 1721 1439 -459 328 799 -382 -36 927 -529 -1321 254 412 -884 -534
1885 -534 -145 -1606 -1319 315 -484 -2125 -1088 -756 -1937 -1697 -992 -2661 -3004 -1323 -1916 -3817 -3419
1902 -3419 -2845 -3647 -3474 -2899 -4293 -5151 -3689 -3493 -5068 -4621 -3853 -5103 -5156 -3729 -4241 -5489 -4535 -3861
1920 -3861 -4584 -4351 -3488 -4575 -4423 -2592 -2795 -4221 -3252 -2101 -2828 -2587 -1298 -1938 -2596 -787 -256 -1563
1938 -1563 -901 230 -515 -513 1024 666 -411 951 1663 924 1322 2251 1112 939 2796 2923 1526 2257
1956 2257 3295 2233 2336 3428 2757 2353 3903 4026 2397 2826 3935 2972 3061 4406 3850 2403 3191
1973 3191 3914 2980 3161 4089 3049 2565 3767 3399 1885 2729 3891 2836 2309 3076 2160 1390 2670 3024
1991 3024 1731 1701 2657 1456 734 1940 1919 672 1504 2007 359 164 1012 285 -325 1135 827 -761
2009 -761 -396 461 -735 -1068 180 -290 -1426 -610 -476 -1762 -1470 -395 -1329 -1814 -736 -1142 -2458 -1855
2027 -1855 -1216 -2243 -2209 -1031 -2013 -2928 -1873 -1759 -2955 -2517 -1398 -2376 -2951 -2084 -2590 -3541 -2436 -1906
2045 -1906 -2925 -2917 -2068 -3261 -3918 -2483 -2349 -3451 -2950 -2367 -3572 -3780 -2776 -3105 -3683 -2457 -2323 -3819
2063 -3819 -3486 -2646 -3292 -3229 -1838 -2262 -3456 -2661 -1922 -2667 -2164 -860 -1538 -2202 -850 -648 -1301 -344 920
2082 920 253 223 1368 965 830 2597 3496 2389 2638 3663 3322 3426 5158 5305 4374 5032 5537 4763 5268
2101 5268 6661 6327 5661 6281 6115 4572 5250 6550 5973 5281 5677 4333 3122 4097 4695 3662 3364 3572
2119 3572 1942 888 1728 1544 598 1519 1559 -518 -1377 -559 -961 -1250 111 -147 -1963 -2620 -1685 -1965
2137 -1965 -1620 -233 -890 -2147 -1767 -1519 -2415 -1719 -108 -446 -1320 -1119 -1606 -2485 -1183 237 -811 -1321
2155 -1321 -1105 -2147 -2904 -1582 -651 -2054 -2207 -1979 -3243 -3906 -2906 -2818 -3617 -2708 -2817 -4700 -5078 -3711
2173 -3711 -3516 -3841 -3075 -3180 -4603 -4123 -2891 -3301 -2983 -1729 -2053 -2958 -1870 -1092 -1770 -980 663 193
2191 193 -679 199 282 -54 1555 2361 944 352 1440 1102 665 1939 1899 745 906 1378 72 -232 1046
2210 1046 918 -116 195 -3 -1311 -975 373 150 -551 -111 -567 -1284 -109 904 147 49 1242 1087
2228 1087 199 1303 1889 1720 2588 3400 2464 2018 3273 3648 3363 4288 4731 3314 3296 4291 4049 3696 4467
2247 4467 4523 3430 3624 3907 2765 2781 4056 3589 2203 2413 2421 1592 1978 2696 1561 953 1641 1122 182
2266 182 1034 1597 402 151 916 241 -719 38 224 -598 -386 -136 -1511 -1886 -756 -1152 -2247 -2017 -1916
2285 -1916 -3163 -3311 -2852 -3708 -4327 -3472 -3993 -5416 -5173 -4474 -5462 -5603 -4754 -5254 -6237 -5599 -5131 -5778 -5099
2304 -5099 -4206 -4973 -5186 -3876 -3844 -4162 -3006 -1932 -2513 -2423 -1118 -1492 -1213 335 821 -3 856 1724 935
2323 935 1152 2613 2690 2172 2669 2583 1512 2152 3214 2315 1759 2536 2113 738 1095 1722 868 675 1253
2342 1253 316 -557 -14 20 -600 -17 843 -599 -1156 33 97 -254 608 1165 256 692 1713 976 991 2663
2362 2663 3030 2212 2595 3232 2696 2979 4305 4155 3638 4179 4155 3310 3881 4810 3822 3268 4117 3665 2543
2381 2543 3029 3185 2371 2495 2847 1421 402 1319 1350 299 341 652 -596 -969 -391 -773 -1423 -831 -880
2400 -880 -2111 -1841 -1301 -2180 -2366 -1212 -1358 -2602 -2440 -2020 -2625 -2218 -1255 -2078 -2910 -1897 -1834 -2862 -2381
2419 -2381 -1550 -2215 -2648 -2001 -2415 -3067 -2115 -1703 -2486 -2222 -1717 -2791 -3102 -1805 -1490 -2332 -2032 -1709 -2390
2438 -2390 -2278 -1377 -1702 -2153 -1113 -978 -2128 -1810 -1004 -1465 -1426 -325 -656 -1738 -1149 -710 -1161 -716 239
2457 239 -844 -1343 -342 -371 -931 -397 296 -258 -244 390 -277 -606 622 1280 473 547 1115 605 580 1817
2477 1817 2030 1234 2015 2344 1643 1877 2802 2382 2232 3370 3297 2227 2554 3346 2812 3028 3871 3311 2319
2496 2319 3181 3434 2516 2782 3421 2817 2308 3068 2585 1572 2401 2830 1930 1618 2091 1492 953 1773 1879
2515 1879 860 941 1499 520 370 1148 743 -77 542 612 -407 -408 368 -256 -605 14 -479 -1450 -1127 -345
2535 -345 -1275 -1576 -1029 -1482 -2150 -1525 -1529 -2441 -2231 -1554 -2503 -2868 -2008 -2380 -3115 -2425 -2253 -3205 -3249 -2468 -2860
2556 -2860 -3383 -2541 -2549 -3397 -2978 -2380 -3066 -3248 -2237 -2425 -2933 -2271 -2069 -2877 -2434 -1388 -2015 -2220 -1264 -1341
2576 -1341 -2032 -1190 -568 -1165 -946 -161 -651 -1029 76 392 -295 317 980 276 72 1102 1164 747 1597
2595 1597 1718 1032 1236 2140 1442 1207 2427 2233 1403 1824 2331 1680 1845 2662 2095 1529 2255 2309 1453 1863
2615 1863 2641 1874 1600 2227 1844 1248 1965 2339 1474 1608 2142 1381 905 2047 2006 1007 1380 1904 1206 1082
2635 1082 1597 1278 738 1691 1555 432 725 1499 1018 763 1327 1017 150 717 1170 367 479 915 328
2654 328 -327 634 618 -266 29 700 -136 -589 -18 -447 -766 32 -38 -1310 -1257 -527 -1171 -1488 -933 -979 -1944
2675 -1944 -1595 -1389 -2245 -2271 -1620 -1964 -2540 -2045 -2325 -3331 -2723 -1940 -2640 -3016 -2600 -2906 -3390 -2710 -2283 -3117
2695 -3117 -2812 -2042 -2649 -3239 -2305 -2067 -2494 -1769 -1253 -2291 -2179 -1304 -1336 -1445 -599 -503 -1277 -976 126 -491
2715 -491 -515 389 315 -181 384 639 -114 364 1353 1002 222 1025 1106 448 1230 1894 949 979 1691 1527 1113
2736 1113 1768 2122 1481 1864 2575 1778 1468 2594 2527 2037 2448 2797 1996 2214 3122 2856 2310 3057 3053 2238
2756 2238 2691 3192 2414 2170 2984 2545 1604 2248 2255 1437 1527 2117 1375 654 1145 1083 150 466 848 -176 -485
2777 -485 187 -417 -974 -255 -261 -1169 -940 -559 -1369 -1614 -758 -827 -1650 -1046 -857 -1740 -1540 -720 -1203 -1670 -940
2798 -940 -999 -1663 -1309 -792 -1490 -1455 -596 -1077 -1828 -1180 -1156 -1873 -1649 -927 -1662 -1983 -1462 -1618 -2234 -1750 -1495
2819 -1495 -2223 -2030 -1342 -2097 -2630 -1686 -1578 -2205 -1886 -1391 -2092 -2178 -1367 -1506 -1941 -1135 -795 -1590 -1365 -537
2839 -537 -1021 -1175 -101 -269 -830 -292 125 -391 -164 812 272 -106 681 702 55 548 1286 730 478 1247
2859 1247 1080 625 1234 1715 975 1183 1951 1310 919 1796 1966 1308 1754 2173 1451 1472 2350 2175 1707 2332
2879 2332 2392 1699 1940 2696 2153 1912 2567 2411 1674 2074 2359 1667 2025 2511 1885 1236 1816 1795 1125 1484
2899 1484 1773 890 718 1275 706 229 662 858 -10 -24 454 -443 -719 72 42 -765 -527 -399 -1130 -1002
2919 -1002 -386 -882 -1380 -852 -982 -1685 -1369 -968 -1617 -1763 -950 -1369 -2111 -1587 -1343 -1852 -1685 -1256 -2063 -2414
2939 -2414 -1521 -1665 -2309 -1810 -1627 -2302 -2182 -1485 -1939 -2519 -1745 -1456 -2088 -1966 -1441 -1972 -2007 -1089 -1265 -1964
2959 -1964 -1384 -988 -1577 -1212 -695 -1103 -1232 -461 -377 -1098 -710 -49 -581 -403 396 65 -595 303 646 43
2979 43 266 860 356 185 944 1043 389 834 1405 901 983 1562 1217 923 1825 1677 986 1362 1963 1521 1462
3000 1462 2088 1883 1066 1935 2194 1542 1796 2289 1828 1505 2250 2074 1368 1838 2207 1592 1683 1980 1560 1221
3020 1221 1956 1890 1101 1353 1753 1079 922 1560 1119 584 1126 1295 256 254 930 330 116 658 282 -466
3040 -466 -145 196 -338 -568 24 -572 -1070 -499 -521 -1257 -1092 -524 -1140 -1616 -999 -1157 -1718 -1132 -986 -1748
3060 -1748 -1796 -1200 -1711 -1950 -1245 -1423 -1978 -1787 -1385 -1898 -1976 -1317 -1537 -1944 -1535 -1451 -2086 -1788 -1060 -1630 -1888
3081 -1888 -1299 -1506 -2172 -1418 -994 -1478 -1422 -873 -1386 -1691 -1031 -772 -1219 -888 -341 -999 -1076 -351 -480 -683
3101 -683 -66 248 -521 -319 457 6 -21 745 837 90 557 1023 572 754 1485 1103 699 1291 1506 861 1277
3122 1277 1949 1410 1306 1795 1559 1056 1726 2179 1495 1556 2062 1475 1248 2028 2131 1403 1728 2189 1325 1213
3142 1213 1811 1630 1346 1868 1712 893 1123 1611 1087 1123 1585 1216 473 873 1228 531 561 1154 569 173
3162 173 662 500 -29 322 728 51 -322 253 -122 -512 5 37 -642 -715 -145 -793 -1011 -443 -493 -1134 -782
3183 -782 -660 -1426 -1404 -846 -1280 -1569 -1016 -1285 -1955 -1609 -1121 -1750 -1800 -1150 -1642 -2100 -1529 -1438 -2043 -1700 -1145
3204 -1145 -1766 -2081 -1343 -1478 -1916 -1429 -1105 -1618 -1906 -1199 -1467 -1598 -973 -933 -1538 -1219 -659 -1052 -1028 -547
3224 -547 -599 -935 -435 -208 -821 -468 141 -197 -317 184 182 -352 287 691 302 210 927 630 294 960 1095
3245 1095 568 824 1640 1024 851 1331 1432 1052 1437 1707 1054 1300 1867 1489 1178 1747 1875 1168 1444 1923
3265 1923 1428 1248 1950 1690 1242 1556 1711 1037 1480 1921 1326 1033 1546 1328 830 1366 1496 941 720 1287
3285 1287 895 449 803 991 442 690 934 293 -20 665 381 -195 150 201 -549 -520 87 -441 -946 -385
3305 -385 -575 -1281 -860 -755 -1319 -1449 -1013 -1328 -1933 -1291 -1252 -1873 -1728 -1281 -1732 -2038 -1349 -1484 -1929 -1450
3325 -1450 -1267 -1862 -1671 -1035 -1544 -1565 -1140 -951 -1433 -1215 -793 -1266 -1164 -431 -685 -1207 -677 -383 -1024 -851
3345 -851 -144 -661 -865 -338 -478 -870 -606 -236 -682 -612 -133 -591 -901 -398 -185 -630 -320 61 -445 -561
3365 -561 -11 73 -132 134 436 -148 143 680 455 315 958 958 440 1020 1277 836 988 1795 1438 1165 1605
3386 1605 1647 1225 1669 2202 1669 1523 1925 1850 1405 1725 1998 1449 1474 1911 1307 1007 1635 1606 1095 1266 1438
3407 1438 815 738 1215 1013 569 879 990 375 440 864 383 330 739 493 -183 184 340 -319 -123 298 -181
3428 -181 -642 -118 -190 -619 -465 -150 -681 -687 -554 -808 -1223 -819 -655 -1340 -1134 -747 -1266 -1520 -978 -1139 -1604
3449 -1604 -1293 -996 -1557 -1511 -1023 -1294 -1700 -1215 -1070 -1569 -1404 -1015 -1395 -1275 -822 -938 -1388 -1074 -811 -1203
3469 -1203 -1099 -680 -1055 -1307 -751 -808 -1155 -836 -628 -1065 -937 -559 -704 -1010 -420 -310 -850 -578 -119 -541
3489 -541 -612 148 -45 -472 -25 291 -112 69 736 425 290 753 902 477 873 1253 894 1099 1417 1235
3509 1235 1058 1403 1660 1312 1486 1781 1527 1362 1838 1783 1284 1517 1924 1381 1414 1880 1423 1153 1612 1601 1034
3530 1034 1111 1391 994 844 1347 931 549 838 944 476 494 758 499 230 691 615 -49 187 449 54 63
3551 63 419 41 -248 106 58 -515 -361 -93 -431 -562 -162 -329 -848 -288 -214 -965 -876 -492 -878 -1160 -709
3572 -709 -668 -1098 -857 -817 -1271 -1225 -883 -1073 -1439 -1071 -997 -1468 -1319 -978 -1276 -1336 -1052 -1128 -1486 -1105 -929 -1401
3594 -1401 -1428 -848 -1182 -1299 -881 -948 -1298 -1045 -684 -1034 -1179 -523 -672 -1012 -470 -365 -772 -514 -105 -395
3614 -395 -496 41 -17 -360 60 355 -33 54 777 436 187 594 657 360 553 1066 592 570 910 959 568 1013
3636 1013 1128 703 772 1129 832 723 1211 1034 756 965 1305 850 861 1303 1122 929 1212 1435 893 1006
3656 1006 1361 1013 970 1406 1257 853 1125 1322 918 980 1170 1075 861 1173 1094 710 927 1096 712 552 939
3677 939 621 229 585 574 34 207 398 -109 -265 48 -59 -670 -331 -127 -580 -786 -492 -790 -1250 -748
3697 -748 -809 -1253 -1087 -806 -1290 -1339 -1063 -1272 -1646 -1271 -1023 -1335 -1469 -1184 -1422 -1604 -1249 -1261 -1551 -1305 -952
3718 -952 -1452 -1449 -1062 -1055 -1339 -981 -924 -1190 -1177 -676 -916 -1079 -644 -640 -934 -578 -435 -773 -782 -135 -429 -553 -135
3741 -135 -193 -502 -164 85 -208 -185 178 77 -258 313 446 110 366 713 394 281 777 682 405 897 955
3762 955 653 698 1222 1011 734 1055 1110 789 1046 1290 930 775 1270 1131 894 1102 1158 826 958 1400 1023
3783 1023 851 1038 1053 589 826 1230 614 711 1104 764 387 788 702 498 556 859 423 240 569 456 294
3804 294 526 578 120 268 603 252 100 423 406 -52 -28 223 -218 -287 112 -127 -419 -202 -264 -696 -536 -212
3826 -212 -676 -927 -572 -805 -1106 -895 -791 -1094 -1145 -950 -1156 -1314 -1012 -1087 -1425 -1225 -1166 -1447 -1543 -1095 -1263
3847 -1263 -1400 -1207 -1074 -1391 -1276 -738 -1158 -1139 -784 -763 -1093 -874 -627 -862 -728 -387 -545 -844 -408 -398 -627
3868 -627 -389 -206 -334 -584 -12 -253 -356 -103 219 -270 -211 225 -76 -142 143 417 64 361 510 242 422
3889 422 924 747 532 960 1104 603 978 1437 966 1159 1542 1355 1158 1241 1612 1114 1266 1550 1290 1065
3909 1065 1230 1350 1140 1196 1361 985 861 1081 887 489 824 776 342 462 816 373 252 569 467 26
3929 26 352 404 -93 90 377 149 -177 275 277 -211 75 353 -30 -52 192 29 -170 138 61 -313 -255 33
3951 33 -346 -501 -166 -371 -663 -394 -481 -806 -849 -644 -888 -1259 -928 -946 -1324 -1212 -1068 -1401 -1329 -972 -1145 -1406
3973 -1406 -1161 -1020 -1349 -1319 -917 -1149 -1297 -808 -850 -1179 -956 -651 -982 -897 -539 -664 -865 -526 -319 -610 -560
3994 -560 -231 -374 -429 -107 -67 -528 -63 56 -200 -183 161 -64 -93 171 147 -6 102 417 159 101 562 291
4016 291 221 551 698 387 647 856 690 518 1021 985 657 939 1287 931 876 1333 1053 888 1187 1336 856
4037 856 1067 1275 1013 753 1234 1084 848 1063 1121 807 748 1167 734 602 933 808 357 550 747 524 341
4058 341 542 333 97 424 426 59 106 400 104 -136 177 44 -266 58 79 -412 -203 -69 -264 -443 -67
4079 -67 -155 -667 -364 -457 -795 -663 -445 -569 -943 -707 -712 -908 -901 -700 -987 -1164 -621 -876 -1242 -1022 -828 -1142
4101 -1142 -1041 -865 -1146 -1279 -959 -743 -1124 -1043 -813 -1090 -1116 -704 -703 -978 -729 -610 -1069 -792 -480 -698 -753
4122 -753 -482 -382 -811 -416 -167 -542 -392 -58 -166 -400 49 113 -186 -64 372 37 4 389 308 154 531
4143 531 633 411 500 789 521 442 849 861 537 680 1070 677 822 1051 803 713 1057 1144 822 840 1078 914
4165 914 839 1105 977 743 1014 1008 711 814 1062 706 734 927 886 607 710 893 571 336 752 606 341 654
4187 654 587 148 285 577 233 74 302 228 21 14 226 -224 -221 86 -342 -400 -257 -212 -610 -579 -270 -579 -818
4210 -818 -349 -482 -905 -615 -604 -936 -802 -570 -835 -972 -685 -738 -1058 -787 -704 -934 -895 -641 -872 -908 -730 -708
4232 -708 -948 -806 -540 -830 -937 -656 -627 -1002 -658 -577 -863 -742 -551 -571 -827 -595 -521 -782 -499 -251 -607
4253 -607 -659 -293 -344 -593 -125 -87 -306 -294 91 -301 -264 190 103 13 182 346 145 65 430 521 170 565 636
4276 636 370 609 772 575 560 836 695 597 796 961 711 711 1080 747 794 1030 904 601 865 1083 934 937
4298 937 1101 859 528 945 955 703 920 914 813 629 815 669 365 625 688 367 346 623 365 156 368 414
4320 414 59 215 317 13 -54 325 55 -176 90 14 -296 -329 -71 -431 -480 -185 -342 -520 -421 -424 -736 -658 -503
4343 -503 -659 -888 -590 -650 -1002 -929 -533 -962 -991 -810 -831 -1027 -901 -813 -920 -1038 -742 -1010 -1077 -728 -784 -1036
4365 -1036 -826 -652 -1019 -926 -517 -674 -812 -459 -482 -549 -484 -343 -439 -583 -201 -268 -403 -211 -78 -382 -326 -55
4387 -55 -110 -246 -6 -52 -36 7 178 -38 -154 274 165 -15 322 331 91 307 545 388 245 522 455 307 652
4410 652 827 410 642 852 675 609 925 942 830 847 1111 869 738 996 1069 601 943 1045 750 968 1022 830
4432 830 663 795 810 458 623 746 435 463 615 446 105 461 478 149 209 380 92 -27 319 136 -129
4453 -129 27 114 -94 -67 115 -130 -184 10 -113 -261 -248 -98 -418 -558 -261 -286 -627 -317 -351 -656 -622 -399
4475 -399 -594 -739 -573 -698 -913 -738 -616 -859 -904 -703 -827 -1005 -789 -792 -1000 -955 -740 -974 -936 -676 -829 -1080
4497 -1080 -694 -636 -834 -678 -566 -703 -691 -504 -515 -757 -421 -230 -661 -405 -147 -264 -256 31 -40 -208 -78 44
4519 44 -44 -157 296 123 -13 290 379 226 259 560 305 219 363 378 212 505 621 425 471 647 538 436
4541 436 689 671 531 652 890 651 557 954 815 727 964 1015 681 769 1025 845 662 902 914 714 753 890
4563 890 698 674 854 676 384 605 689 401 373 661 350 171 395 216 89 280 233 38 -27 130 8 -232
4585 -232 -103 40 -280 -158 96 -259 -314 26 -234 -451 -296 -249 -344 -454 -233 -429 -678 -404 -516 -702 -620
4606 -620 -605 -915 -795 -658 -858 -957 -722 -646 -939 -787 -676 -956 -815 -640 -691 -972 -801 -619 -915 -804 -555
4627 -555 -798 -750 -527 -473 -634 -429 -288 -512 -558 -386 -331 -483 -316 -127 -380 -251 20 -225 -222 35 -46 -61 -6
4650 -6 129 9 63 293 207 112 350 467 227 335 555 267 303 631 582 403 623 764 573 602 754 675 588
4673 588 718 692 574 763 861 677 571 862 620 706 747 693 524 716 672 568 576 632 661 547 685 725 412 429
4697 429 566 536 343 509 469 280 328 453 278 174 338 170 149 189 144 -174 58 103 -135 -175 -45 -217 -335
4720 -335 -114 -181 -413 -510 -277 -302 -641 -429 -440 -596 -507 -426 -699 -772 -424 -528 -886 -653 -715 -807 -855 -708 -816
4743 -816 -772 -621 -664 -973 -716 -626 -709 -657 -587 -582 -858 -491 -427 -649 -533 -519 -540 -643 -515 -461 -636 -444 -365 -392 -440
4768 -440 -239 -335 -462 -134 -200 -270 -102 44 -279 -86 195 23 -86 114 279 87 160 360 254 243 456 396
4790 396 404 537 595 470 555 584 768 492 690 692 602 756 749 629 602 743 663 621 777 847 626 711 890 738 583
4815 583 760 608 486 567 576 440 469 642 441 416 509 532 197 444 541 314 266 374 277 103 290 235 -68 144
4839 144 76 26 -158 33 65 -133 -20 -64 -230 -245 -111 -262 -402 -283 -292 -608 -406 -252 -495 -582 -489 -587 -690
4862 -690 -589 -452 -765 -817 -634 -531 -796 -597 -712 -734 -621 -608 -781 -744 -623 -792 -764 -592 -559 -780 -686 -444
4884 -444 -686 -606 -502 -428 -622 -493 -340 -495 -486 -154 -326 -461 -402 -219 -351 -194 -11 -203 -296 63 -72 -111
4906 -111 45 202 -37 74 244 42 62 321 336 189 473 455 193 262 558 471 354 589 594 527 461 676 610
4929 610 543 703 648 465 761 663 611 662 779 677 571 644 701 593 626 780 402 590 824 536 420 609 571
4952 571 405 523 584 368 285 544 484 242 308 312 261 188 270 127 18 228 83 -52 -90 82 -48 -204 0
4975 0 -241 -369 -8 -249 -360 -309 -314 -346 -495 -369 -487 -548 -440 -419 -470 -538 -301 -577 -663 -547 -516 -763 -608 -427
4999 -427 -608 -620 -624 -644 -630 -605 -447 -719 -739 -609 -652 -683 -503 -540 -698 -589 -501 -498 -514 -363 -431 -553 -445 -452 -411 -363
5025 -363 -230 -281 -250 -158 -143 -245 -65 13 -117 -110 25 -10 -50 268 241 56 175 357 216 245 456 352 389 414
5049 414 465 270 413 564 324 466 662 469 472 533 493 515 505 830 639 489 719 651 630 622 732 615 579 612
5073 612 614 473 544 675 567 546 606 515 500 637 550 366 396 578 309 331 428 308 249 206 287 34 161 195 -87
5098 -87 -132 -2 -112 -167 -57 -177 -243 -352 -40 -186 -349 -254 -324 -413 -353 -389 -535 -389 -413 -502 -562 -538 -433 -605
5122 -605 -538 -531 -653 -733 -593 -584 -701 -559 -487 -634 -740 -548 -554 -554 -562 -551 -618 -508 -458 -573 -504 -480 -541 -613 -438 -289 -420
5149 -420 -325 -346 -388 -371 -316 -308 -240 -229 -30 -183 -230 -67 -183 -204 62 -42 10 -27 194 24 127 344 172 205 257
5174 257 240 224 391 387 437 393 548 417 353 577 581 486 463 657 647 462 686 706 522 586 544 586 535 605 577 394
5200 394 571 582 556 412 548 377 461 536 444 372 539 511 384 410 395 324 291 393 301 173 231 377 73 159 237
5225 237 172 -51 19 -62 -225 -112 -126 -132 -277 -178 -289 -377 -315 -112 -426 -413 -361 -461 -441 -361 -393 -458 -574 -371 -406
5250 -406 -528 -495 -438 -569 -485 -574 -583 -485 -531 -628 -558 -537 -497 -573 -490 -428 -534 -559 -494 -587 -535 -506 -490 -475 -522 -354 -371 -481
5278 -481 -448 -412 -488 -342 -211 -239 -359 -191 -207 -114 -71 -28 -113 -69 99 117 5 210 187 57 136 188 83 229 320
5303 320 385 209 446 340 234 477 492 441 360 569 536 387 475 523 509 445 461 534 365 663 525 472 658 614
5327 614 453 556 669 597 467 561 611 558 440 575 451 373 431 325 298 445 349 251 322 301 169 116 264 220
5351 220 38 179 255 133 70 132 10 -14 -29 -45 -138 -255 -144 -229 -234 -220 -339 -384 -373 -264 -365 -343 -320 -362 -455 -379
5377 -379 -472 -579 -587 -388 -464 -624 -502 -483 -602 -578 -410 -664 -589 -474 -659 -546 -461 -481 -600 -527 -463 -455 -526 -431 -407
5402 -407 -584 -395 -412 -406 -371 -189 -420 -316 -284 -196 -307 -159 -174 -271 -54 -71 -65 -125 40 61 -44 37 137 63 149
5427 149 346 152 130 305 305 212 256 396 423 305 405 276 420 436 369 346 368 561 432 433 619 494 507 514 465
5452 465 599 464 628 477 480 544 566 477 416 591 428 517 494 470 400 372 621 401 444 426 321 172 326 336 230
5477 230 298 262 223 71 10 80 102 -20 91 -57 -63 -30 -147 -192 -145 -155 -343 -305 -239 -346 -304 -296 -403 -390 -268 -316
5503 -316 -505 -416 -407 -430 -415 -409 -417 -635 -494 -331 -522 -538 -488 -453 -633 -375 -436 -610 -494 -501 -521 -466 -435 -543 -474 -399 -426
5530 -426 -473 -363 -358 -380 -408 -401 -362 -420 -236 -211 -352 -303 -66 -268 -269 -116 -138 -256 -90 -40 -58 -171 72 85 10 142
5556 142 124 179 137 258 215 148 305 426 266 339 449 484 370 530 529 498 509 543 494 410 562 437 419 586 517
5581 517 499 544 565 486 479 545 486 414 524 442 362 421 401 397 414 490 317 354 249 281 230 295 367 254 202 216 263 134
5609 134 181 91 -22 61 119 -77 -121 -127 -19 -156 -76 -115 -187 -161 -31 -228 -317 -372 -182 -335 -485 -191 -357 -328 -256
5634 -256 -367 -477 -405 -417 -597 -494 -387 -487 -584 -532 -427 -559 -510 -529 -539 -472 -378 -511 -586 -566 -466 -546 -437 -494
5658 -494 -525 -440 -386 -483 -398 -354 -335 -402 -163 -340 -192 -317 -235 -165 -346 -182 -63 -170 -209 -13 -42 -10 38 96 -31
5683 -31 30 182 104 170 261 201 219 197 365 349 300 270 304 434 500 426 426 422 437 464 296 614 371 463 430 537 475 473
5711 473 519 470 319 454 457 377 353 462 401 380 401 340 235 336 293 432 333 408 366 252 266 202 120 271 322 130
5737 130 86 354 157 102 151 68 -14 -2 8 -125 -163 -83 -19 -192 -85 -213 -224 -188 -107 -201 -319 -238 -349 -402 -321 -337
5763 -337 -359 -285 -308 -345 -465 -402 -378 -542 -546 -452 -366 -610 -522 -406 -443 -452 -463 -529 -510 -566 -381 -499 -414 -398 -540 -442 -408
5790 -408 -412 -488 -296 -193 -255 -358 -284 -338 -291 -37 -202 -233 -18 -16 -25 -71 74 42 -114 109 30 9 91 135 144 89 129
5817 129 255 137 239 286 203 255 403 291 266 364 343 208 353 460 372 334 416 327 367 473 474 386 512 457 406
5842 406 359 473 502 369 565 377 469 495 505 386 512 452 394 220 416 431 351 295 309 227 228 250 157 79 218 133
5868 133 43 -12 71 -34 -108 17 -82 -60 -173 -9 -183 -151 -138 -297 -229 -60 -369 -226 -185 -236 -228 -318 -362 -371 -421 -435
5894 -435 -352 -391 -412 -423 -398 -439 -418 -453 -523 -384 -413 -534 -390 -420 -425 -425 -432 -359 -464 -451 -394 -506 -369 -353 -252 -320 -273 -241
5922 -241 -355 -405 -268 -319 -208 -225 -176 -251 -110 -75 -173 -77 -69 -136 -44 97 144 89 49 198 95 160 119 85 172 288
5948 288 271 183 279 267 335 197 410 309 234 348 315 265 333 462 266 360 394 435 268 361 502 280 329 471 378
5973 378 392 349 503 344 371 430 353 385 240 355 342 396 341 254 288 197 326 217 227 179 106 111 165 -80 -16 146
5999 146 241 -94 -72 -17 -65 -128 -155 -91 -125 -178 -92 -310 -167 -103 -240 -264 -240 -131 -333 -344 -165 -299 -469 -306 -379
6024 -379 -324 -321 -344 -502 -392 -390 -382 -463 -362 -333 -490 -454 -288 -309 -365 -392 -461 -393 -444 -325 -404 -357 -246 -282 -383 -361 -177
6051 -177 -274 -246 -248 -349 -200 -74 -260 -195 -164 -167 -253 -72 -105 19 -41 60 9 -5 117 129 11 83 174 151 258 269
6077 269 267 167 269 70 345 290 363 436 288 264 396 394 503 500 450 403 394 386 399 400 424 395 402 373 328 335 444 242 362
6106 362 372 408 277 163 291 282 238 193 162 268 250 408 187 193 262 91 138 124 57 113 100 95 72 56 49 7 -60 -14
6134 -14 -33 -104 -165 -68 -204 -175 -179 -235 -240 -191 -198 -322 -184 -239 -319 -366 -380 -406 -384 -513 -493 -452 -407 -260 -406 -345 -372 -346 -425
6163 -425 -414 -423 -375 -343 -391 -422 -313 -452 -407 -282 -271 -155 -236 -355 -258 -426 -243 -275 -245 -287 -249 -184 -150 -138 -117 -173 -141
6190 -141 -154 -63 -4 -90 33 -55 34 11 102 80 -57 80 59 99 95 197 216 232 310 293 167 308 305 164 290 284 319
6217 319 336 270 282 304 304 317 336 290 407 231 345 276 425 386 448 433 248 350 401 289 137 362 347 233 197
6242 197 304 300 229 221 141 265 151 155 59 195 187 86 149 112 123 33 53 -83 59 -27 -95 8 -76 -38 -195 0 -293
6269 -293 -139 -164 -375 -155 -322 -149 -188 -139 -377 -334 -282 -258 -297 -206 -303 -458 -301 -379 -454 -474 -352 -260 -404 -409 -370
6294 -370 -285 -318 -388 -385 -431 -368 -263 -357 -388 -241 -312 -328 -347 -228 -329 -261 -97 -346 -179 -189 -317 -112 -14 -104 -119 24
6320 24 -60 97 102 91 -71 37 47 60 95 184 202 169 156 263 211 164 124 214 264 226 349 271 329 333 273 305 255 356
6348 356 292 277 402 256 310 246 387 341 243 364 438 317 157 209 296 291 262 294 254 263 237 307 362 264 156 255 227
6375 227 132 132 135 257 122 85 109 114 26 99 153 -63 3 -12 -77 -23 -48 -92 -178 43 -31 -178 -161 -202 -170 -157 -121 -176 -235
6404 -235 -216 -216 -282 -326 -264 -233 -370 -276 -220 -340 -374 -358 -292 -293 -235 -361 -401 -431 -267 -353 -378 -294 -432 -271 -362 -376 -333 -387
6432 -387 -166 -248 -279 -250 -300 -196 -330 -257 -355 -132 -157 -150 -186 -169 -171 -185 -105 -137 -217 -33 23 -83 67 81 46 103 -4
6459 -4 124 136 116 191 259 245 186 304 251 308 323 266 339 257 244 157 244 404 435 320 407 343 332 442 294 396 280
6486 280 383 258 405 383 286 304 329 382 270 319 379 166 322 208 172 229 294 196 231 192 218 221 185 142 94 7 52
6513 52 60 149 -33 -62 -49 -45 -100 11 -104 -82 7 -120 -217 -165 -87 -214 -248 -207 -252 -235 -184 -174 -213 -169 -269 -269 -234 -210 -272
6542 -272 -356 -177 -222 -268 -330 -299 -306 -333 -286 -235 -458 -361 -243 -389 -349 -258 -286 -215 -196 -214 -416 -283 -228 -299 -266 -140 -167
6569 -167 -169 -157 -270 -80 -69 -46 -92 -19 -12 40 -133 56 12 12 -47 -8 132 81 31 74 -35 2 46 212 265 272 219 106
6597 106 348 247 71 265 326 328 235 381 285 344 258 309 355 297 238 256 197 328 410 245 306 409 271 323 275 225
6623 225 410 134 256 224 307 236 64 82 238 178 186 97 158 102 107 142 131 -90 8 27 64 153 94 -36 56 -26 -200
6650 -200 -173 -26 -76 -73 -77 -101 -126 -107 -83 -165 -140 -304 -138 -222 -368 -286 -227 -310 -227 -179 -196 -314 -345 -277 -363 -327 -320 -401 -358
6679 -358 -365 -328 -362 -264 -292 -195 -289 -313 -318 -195 -274 -260 -294 -271 -104 -252 -318 -247 -115 -222 -149 -19 -116 -84 -197 -55 19
6706 19 -96 -39 -3 9 -58 -81 28 15 41 65 148 10 60 30 200 183 165 197 246 214 149 251 238 305 163 174 278
6733 278 286 234 257 346 155 332 281 327 238 212 327 278 424 348 373 187 253 269 292 198 300 197 273 222 233 -24
6759 -24 312 230 112 216 83 148 88 147 162 -33 77 170 88 -69 90 -69 -70 -32 -47 77 -107 -18 -188 -93 -127
6784 -127 -103 -131 -141 -172 -168 -210 -210 -164 -193 -71 -165 -263 -270 -368 -243 -267 -292 -422 -281 -186 -309 -259 -237 -200 -248 -232 -270 -253 -226
6813 -226 -271 -288 -232 -235 -295 -198 -253 -282 -159 -229 -64 -157 -194 -203 -107 -232 -182 -154 -71 -23 13 28 -91 -197 32 6 1 -31
6841 -31 37 25 -30 63 75 97 5 214 49 101 58 164 193 282 274 164 -14 226 175 290 140 174 299 203 303 249
6867 249 252 252 317 187 408 307 175 342 272 287 299 132 261 325 303 326 218 373 292 249 240 243 237 222 187 208 209 72
6895 72 28 144 93 21 -32 -53 63 -67 8 26 -110 -74 -19 -81 -88 -81 -93 -153 -213 -67 -144 -127 -57 -154 -110 -202 -305 -223
6923 -223 -330 -116 -165 -159 -272 -357 -241 -177 -332 -215 -417 -226 -117 -215 -251 -313 -337 -355 -317 -325 -171 -264 -244 -207 -238 -242
6949 -242 -194 -142 -166 -159 -175 -207 -139 -104 -154 -246 -39 -100 -124 -85 -229 -153 -144 -59 -49 22 41 -43 27 28 118 164 -18 85 234
6978 234 77 140 128 163 206 153 45 162 225 332 307 217 284 286 183 336 288 156 257 269 233 304 298 270 155 261
7004 261 296 289 378 276 161 243 311 195 230 373 238 237 219 305 64 136 198 83 29 101 117 16 52 59 -29 47 238
7031 238 -50 24 11 24 -125 48 -33 -288 -223 -72 -195 -81 -104 -16 -187 -115 -125 -219 -216 -105 -120 -162 -198 -89 -216
7056 -216 -213 -290 -248 -254 -217 -292 -251 -215 -361 -353 -261 -209 -214 -377 -343 -244 -245 -324 -226 -308 -226 -100 -202 -273 -269 -266 -171 -213 -182 -143 -167
7087 -167 -174 -45 -67 -134 -70 -36 -6 62 15 -43 -30 -37 46 -39 41 84 177 204 286 90 180 174 207 165 190 263 116 196 174 303
7117 303 130 282 222 191 270 300 260 320 274 275 330 299 224 265 140 282 293 285 280 312 192 218 284 304 69 151 122 70
7145 70 201 192 167 94 156 127 118 196 81 57 14 34 190 -13 18 11 22 -28 -22 -116 -10 -25 -110 -60 -161 -72 -161 -9 -146
7174 -146 -134 -52 -203 -277 -121 -178 -191 -242 -207 -175 -279 -214 -275 -263 -434 -180 -222 -273 -163 -159 -293 -198 -283 -269 -264 -308 -268
7201 -268 -311 -292 -144 -220 -243 -217 -122 -205 -65 -281 -259 -189 -142 -40 -103 -118 -23 -34 -167 -13 18 -67 2 -100 -83 71
7227 71 83 87 11 66 90 66 130 27 158 172 54 226 127 141 174 161 161 262 206 139 263 300 225 120 227 202 313
7254 313 310 184 297 204 231 225 265 147 261 185 287 153 125 222 139 233 226 200 125 112 249 186 15 145 158 112 46
7281 46 109 51 27 44 112 84 15 -14 102 -60 29 -92 -119 -57 -50 -243 -71 4 -138 -148 -112 -214 -145 -51 -189 -195 -227
7308 -227 -212 -154 -187 -147 -215 -293 -102 -83 -370 -263 -294 -173 -254 -225 -112 -313 -220 -293 -248 -218 -171 -356 -249 -231 -214 -198
7334 -198 -195 -21 -188 -66 -179 -160 -112 -123 -50 -203 -125 -172 -99 -83 -27 -70 -63 -174 32 -26 1 -25 58 31 44 33 -15
7361 -15 31 59 177 114 128 110 196 124 220 35 173 104 263 106 225 143 198 184 276 190 127 288 240 186 296 316
7387 316 156 219 316 253 232 194 267 141 153 240 240 229 254 199 49 138 193 236 126 269 95 200 114 120 21 70 93
7414 93 2 162 93 72 -28 -41 -77 79 -55 -141 -62 -89 33 -143 -65 -51 -82 -145 -182 -192 -72 -109 -121 -47 -296 -160
7440 -160 -275 -157 -192 -137 -316 -271 -222 -274 -337 -219 -197 -382 -163 -155 -227 -274 -244 -153 -232 -162 -180 -211 -168 -186 -71 -188
7466 -188 -128 -60 -204 -186 -11 -74 -46 17 -69 -11 -53 19 -122 34 86 -27 6 55 58 -27 60 80 14 -21 148 103 242
7493 242 98 266 112 49 272 164 175 142 168 178 120 190 250 181 165 185 231 269 288 188 254 265 219 144 147 228 200
7520 200 253 255 249 198 229 214 97 258 135 154 232 225 185 107 124 152 37 144 78 3 128 145 109 131 12 -12 33 20
7548 20 -16 82 -86 -52 -39 -76 -44 -162 -115 -131 -59 -179 -235 -241 -56 -219 -135 -166 -120 -128 -181 -106 -170 -193 -219 -307 -111 -226
7576 -226 -212 -164 -237 -288 -193 -252 -253 -179 -147 -218 -183 -269 -135 -217 -169 -220 -111 -279 -317 -188 -39 -171 -117 -62 -282 -143
7602 -143 -90 -110 -112 9 -104 -16 19 -42 0 -62 -60 -55 94 73 68 12 12 35 72 172 159 151 109 224 165 200 188 152 241 124
7632 124 177 181 199 153 163 191 171 216 262 128 216 269 198 267 188 144 67 348 111 264 257 229 322 213 204 256 164 184 273
7661 273 128 142 -47 97 102 78 52 80 32 -7 -67 -123 -32 -17 -82 -72 18 -80 -14 -26 -60 -82 11 61 -110 -79 -189 -125
7689 -125 -14 -43 -148 -173 -122 -241 -179 -95 -150 -259 -196 -81 -224 -312 -156 -268 -319 -109 -112 -86 -242 -206 -268 -212 -171
7714 -171 -255 -150 -218 -219 -175 -178 -281 -151 -124 -105 -118 -231 -117 -160 -200 -77 -121 -206 -6 -68 16 75 -85 -93 -26 -57 6
7741 6 -43 102 31 70 -70 50 62 -20 55 57 -46 90 31 69 199 84 193 146 82 151 157 144 109 190 206 159 245 132
7769 132 119 156 209 110 206 330 308 118 216 234 185 98 214 172 192 233 212 134 158 140 56 229 164 174 160 224 64
7796 64 79 -31 163 -78 -121 148 21 66 -72 -28 -41 -30 56 126 -2 -112 -166 -140 -17 -141 -229 -72 -62 -117 -157
7821 -157 -107 -97 -342 -154 -46 -223 -126 -141 -278 -211 -176 -381 -222 -218 -82 -131 -172 -181 -157 -239 -157 -152 -174 -160 -1 -220
7847 -220 -261 37 -111 -178 -109 -102 -253 -139 27 -134 -218 -147 -87 -17 -148 -158 -56 -127 -188 -134 -149 -90 -5 -82 62 46
7873 46 -20 105 159 10 -15 76 188 60 90 190 161 185 179 209 135 274 171 293 224 74 138 145 239 195 213 213 181
7900 181 211 168 339 116 84 267 163 49 -9 286 163 12 169 217 39 165 114 147 196 45 139 126 34 140
7924 140 12 131 153 55 -8 104 78 81 -20 -35 -27 -105 -49 74 -136 -16 -25 -185 -144 -51 -98 -131 -72 57 -159 -180
7950 -180 -100 -222 -263 -48 -42 -208 -71 -82 -171 -300 -146 -187 -152 -225 -325 -145 -226 -226 -264 -220 -145 -153 -194 -209 -240 -111 -148
7977 -148 -96 -174 -63 -148 -136 -348 -255 -159 -143 -112 -12 -152 -143 -17 3 -132 23 -24 -76 -97 35 -4 -141 79 76 48
8003 48 20 82 49 149 -44 -12 29 109 84 174 107 199 208 122 270 114 63 83 224 111 196 309 285 267 156 180 66
8030 66 250 160 211 54 191 205 129 173 248 156 169 274 211 185 111 162 137 26 118 -18 16 228 67 114 25 -11
8056 -11 21 82 -56 44 46 -2 122 -46 42 -25 -59 -4 -37 -94 -133 -145 40 -87 -26 -29 -57 -146 -183 -41 -216 -39 -166
8083 -166 -140 -139 -144 -160 -216 -107 -185 -46 -154 -284 -152 -236 -224 -157 -256 -177 -215 -285 -234 -164 -108 -342 -231 -194 -149 -188 -128
8110 -128 -144 -251 -149 -148 -30 -243 -164 -144 -54 36 -112 -10 -59 -41 111 -5 85 105 -29 -35 56 30 147 142 62 69 15
8137 15 46 91 -11 61 169 0 106 -28 169 222 22 190 116 262 161 33 206 100 176 79 219 103 216
8160 216 290 221 254 151 191 148 203 243 188 142 206 88 127 272 41 173 212 96 82 149 104 108 9 94 105 17 52
8187 52 50 35 9 33
8191C3
$$ Imaginary data points
##PAGE= N=2
##DATA TABLE= (X++(I..I)), XYDATA
0 0 0 0 0 1 -8 0 -8 8 -8 16 -16 24 -29 32 -43 48 -62 72 -88 101 -120 136 -160 184 -209 241 -275 309 -351
29 -351 398 -446 502 -562 631 -700 781 -870 966 -1071 1187 -1315 1452 -1609 1784 -1975
45 -1975 2192 -2438 2718 -3039 3418 -3865 4402 -5067 5913 -7032 8586 -10898 14701 -22084
59 -22084 41754 -203131 -544752 -92127 209762 57816 -289464 -284319 -69535 3944 -180261
70 -180261 -282238 -148811 41725 16831 -126885 -193751 -147483 -105846 -53059 36258 91005
81 91005 -5427 -168006 -180265 34100 207046 91653 -134428 -91837 158437 202441 -49940
92 -49940 -197963 7525 288235 244015 -70367 -226492 -23723 225502 177939 -41165 -90274
103 -90274 40563 95560 4153 -57533 3486 72829 40895 -26193 -19888 12055 -29681 -65927
115 -65927 31120 140558 50597 -146647 -157375 48056 186418 78326 -115055 -126340 49294
126 49294 144152 14223 -126842 -42440 141195 137847 -49869 -154730 -43660 120319 127252
137 127252 522 -70760 -25393 15417 -3601 2595 48570 39295 -25213 -39209 8713 22700
149 22700 -21929 -39364 27886 101950 53102 -92003 -131946 16084 154940 96213 -55113
160 -55113 -84691 16873 83962 31965 -40957 -9834 86687 97136 -3028 -70241 -22824 56503
172 56503 79869 52495 11046 -19734 -21559 -249 25727 44574 33096 -13302 -35273 2017
184 2017 25399 -19797 -55758 -6895 59060 34707 -62818 -111035 -41521 59145 54251 -43218
196 -43218 -89641 -36240 14880 -1564 -36730 -38056 -11779 9222 -4166 -41541 -51521 -18013
208 -18013 13384 14265 -2261 -29744 -52170 -32206 18080 32723 -6032 -44806 -41261 -4878 19439
221 19439 -4489 -45608 -33698 18207 21707 -36497 -71433 -36854 20186 33219 -13322 -66247
233 -66247 -58200 -5375 14743 -10135 -25367 -17756 -15026 -16282 -12683 -15241 -15113 4720 23232 13258
247 13258 -13138 -28405 -13551 29952 60142 35944 -9942 -14178 19001 43065 42178 28685 20860
260 20860 34338 50148 31240 21 13239 57772 71168 42911 10599 -105 15953 43277
272 43277 49675 31766 18105 14998 10392 11268 18756 15427 9065 19857 26622 3476 -22643 -18484
286 -18484 7910 30565 26118 -8808 -35607 -18333 12827 12212 -4937 -6935 -629 -312 -4653 -14624
300 -14624 -18446 1851 23727 11981 -15865 -23026 -11995 1528 13800 13541 -3478 -15186 -11174
313 -11174 -4403 1114 5103 -2404 -10316 -725 4480 -16168 -29446 -8191 14658 7258 -15561 -30574
327 -30574 -27166 -7367 3991 -9335 -22876 -17484 -14006 -22036 -22926 -16386 -15407 -14110 -11390 -19896
341 -19896 -30205 -26154 -17493 -13011 -6532 -7758 -26164 -35494 -18138 -836 -3457 -13479 -18497 -15698
355 -15698 -4594 -1372 -14343 -16070 5008 14327 -3159 -15289 -6413 5687 11890 12740 5186 -569
369 -569 4724 9135 8901 15004 18664 8102 3462 15160 19672 9264 7082 15535 19053 16988 11096
384 11096 1723 4275 21866 25641 7528 -2084 5818 12643 12788 10427 4606 3156 10233 8447 -2686
399 -2686 144 12671 10273 539 2011 4070 -681 971 8902 10675 7564 2141 -5099 -1194 14832
414 14832 17350 3816 1458 10508 9310 3497 7385 13165 14608 15847 10591 540 3777 16637
428 16637 17887 11544 11350 9682 3278 3951 8906 8838 10270 11418 1562 -7479 -1733 3439 -2017 -2372
444 -2372 3448 -2546 -14672 -16507 -12047 -7313 -3399 -7818 -18744 -19712 -14096 -18591 -21768 -10468 -4378
459 -4378 -15018 -23606 -22337 -19797 -14153 -6346 -8402 -15485 -15376 -15157 -18726 -13536 -3317 -3854 -9537
474 -9537 -10489 -14213 -17630 -10097 -2175 -5287 -8158 -7291 -14695 -21439 -13127 -3511 -6014 -10751 -12921 -17418
490 -17418 -18053 -13355 -12835 -12178 -4798 -5485 -18299 -21078 -10494 -5076 -4366 459 650 -5965 -6199 -526
506 -526 3272 10318 18092 14418 7699 11391 16208 16500 22962 31260 28457 22877 23620 22815 22243 31335
522 31335 38022 30831 23655 23646 21961 20426 25495 27182 22274 19168 15239 7187 7637 15236 13406 6482
538 6482 7110 6072 -3725 -6738 243 2831 1168 362 -4955 -11799 -8372 -2585 -3323 -2136 684 -4693
554 -4693 -10411 -6190 -2571 -4000 13 4467 -1784 -7905 -5383 -3823 -3628 2231 4166 -3972 -9428
569 -9428 -7755 -7599 -5633 -625 -3511 -11314 -10839 -8769 -14066 -14438 -6588 -5785 -11616 -13101 -13938 -16867
585 -16867 -12670 -5581 -6655 -9884 -9233 -11399 -12768 -5797 -1073 -4307 -3520 603 -3527 -7819 -1435
600 -1435 4267 2708 3348 4435 -1005 -3954 651 2915 2565 4772 2206 -5827 -6566 -2719 -4318 -4910
616 -4910 -567 -3272 -12375 -13746 -10905 -11946 -10125 -5942 -9887 -16109 -14992 -14045 -15724 -10804 -4561
631 -4561 -6709 -10249 -9972 -11468 -10091 154 6003 274 -1840 2714 2897 2321 8306 13142 13612 15074
647 15074 14031 8978 10862 18856 20399 19592 23070 20445 11547 12651 21461 22785 19470 19206 17010
662 17010 13366 14382 14322 10733 13937 20462 15999 6069 3824 6124 8787 14067 13931 5153 1969 5900
678 5900 4249 1657 7562 11772 6125 2013 2379 25 -232 5494 8462 5798 3117 -2613 -8954 -3305
694 -3305 7414 5283 -4345 -6013 -5377 -8743 -9398 -7183 -7050 -5339 -5342 -14525 -23334 -18086 -10161 -10603 -12189
711 -12189 -13382 -19549 -23699 -19825 -16678 -15122 -10167 -9922 -18743 -22634 -16817 -13706 -12633 -5981 -2240
726 -2240 -7785 -14192 -15422 -11720 -1219 7612 2489 -6255 -4751 -2347 -6203 -3131 8228 11681 5095
741 5095 -1871 -7351 -7412 2356 10457 7506 2975 989 -5846 -10603 -3448 6006 7011 4265 -873 -8777
757 -8777 -10279 -3627 408 2545 7996 6200 -6930 -13267 -4598 5320 9346 9609 4521 -1177 -29
772 -29 2451 1543 7416 18254 16890 5236 434 3528 7379 13859 19393 16642 10751 6966 3399
787 3399 5365 16215 21961 14424 7769 8667 7288 5135 9372 14276 14739 13719 7547 -2834 -2063
802 -2063 11056 17172 10373 4141 1495 -864 884 5121 6002 6380 6802 53 -7260 -4025 2287 1739
818 1739 2165 5317 -278 -10788 -11671 -4556 2234 6001 984 -11111 -14281 -5894 -2732 -5747 -3374
833 -3374 612 -3423 -10214 -13488 -13174 -6282 3632 2932 -7952 -13720 -13192 -12166 -6695 1699 655 -7601
849 -7601 -12075 -13182 -12689 -7208 -2335 -4497 -5625 -4452 -11272 -20458 -14814 -1021 2888 -3510 -11197
864 -11197 -16260 -14317 -7048 -4317 -5754 -3468 -2498 -9561 -13999 -9378 -4733 -2101 1900 994 -6436
879 -6436 -9460 -6235 -3088 1958 8268 5028 -4756 -5465 746 3358 4581 7106 6510 4352 4176 1186
895 1186 -612 7128 15296 11369 3725 2942 4144 5446 10268 12898 9771 7482 6884 3523 4657 11864
911 11864 13551 8184 7790 9122 5069 2873 8523 12758 11804 10039 4865 328 4283 11638 11109 7716
927 7716 7900 6078 2344 3150 5935 6952 10108 10960 3431 -2453 1432 5824 5690 8044 9380 2826
943 2826 -3398 -1472 2056 4135 6943 5491 -560 -2745 -2377 -4568 -3021 4447 5751 -2039 -8001
958 -8001 -9649 -8979 -3864 1133 -2194 -8057 -9079 -10625 -14088 -10824 -4816 -5282 -8196 -10061 -15196 -18652
974 -18652 -13015 -6052 -6506 -8289 -10251 -15804 -17933 -10937 -5360 -6003 -6444 -7266 -10720 -11581 -8703 -7026
990 -7026 -3549 2485 499 -8930 -11003 -4662 -241 2137 4475 1295 -4443 -3831 -907 -631 2370 6773
1006 6773 4637 -282 -1998 -2905 -2477 4142 9287 5037 -1143 -2911 -3533 -1515 5217 7425 2007 -719
1022 -719 -92 -2398 -2932 2415 5843 5009 3890 189 -5014 -2274 6392 8519 5387 4331 2661 -229
1038 -229 2331 7248 8142 8486 9859 6869 2645 4584 8554 10366 13238 14023 7965 3695 7515 11414
1054 11414 11593 13357 13584 8544 6451 8759 8306 7813 12129 13527 8050 3537 2754 3084 6624 10521
1070 10521 6818 -5 -814 260 -1546 -689 2323 142 -3738 -4013 -6208 -9628 -6825 -2296 -3552
1085 -3552 -7218 -9448 -12795 -13002 -6744 -3752 -8114 -10961 -9808 -10753 -10750 -7663 -7197 -8393 -5732 -4865 -9561
1102 -9561 -11104 -6294 -3300 -2476 -2093 -5404 -8972 -5453 -369 -1259 -2891 -1264 -2490 -4543 -2142 -764
1118 -764 -3125 -2279 1174 -628 -4436 -4443 -3781 -2574 911 591 -5450 -7494 -3497 -2128 -3274 -2171 -2964
1135 -2964 -5991 -4913 -2719 -4847 -5455 -1640 -1000 -3832 -4449 -4099 -5018 -1914 2644 388 -3569 -2632
1151 -2632 -1173 -643 2875 4887 1431 374 3475 3621 2356 5150 7767 6888 7292 7473 4741 5493
1167 5493 11082 12848 9950 9798 9971 7915 9534 13576 13027 10630 11839 11442 8530 9360 11640 10548
1183 10548 10201 11421 8274 4413 5836 7731 6639 6471 6321 1988 -676 1897 2458 74 713 1137
1199 1137 -2730 -4808 -3265 -3650 -4366 -2214 -2643 -6727 -7208 -5699 -6245 -5570 -2422 -3653 -7044 -6335 -4871
1216 -4871 -6116 -4357 -795 -2092 -4658 -3452 -3343 -4357 -1537 1361 -771 -2220 -1329 -2910 -3935
1231 -3935 -518 1147 -1386 -2035 -1607 -4442 -5889 -2573 -1465 -3571 -3704 -4846 -8395 -8272 -5041 -5591
1247 -5591 -7184 -6056 -7295 -10739 -10089 -7584 -8569 -8230 -5835 -7702 -10930 -9231 -6929 -7434 -5887 -3468
1263 -3468 -5270 -6845 -4791 -3451 -3407 -372 1437 -838 -810 2062 1588 1179 4988 6820 4768 4663 6241
1280 6241 5458 6151 9560 9488 7379 8377 8760 6656 7672 10824 9624 7487 8459 7701 5676 7327 9237
1297 9237 6729 5888 7103 5037 2809 4832 6469 4616 4336 4384 1500 612 3725 4151 2363 3190 2997
1314 2997 -637 -650 2828 2845 1688 2628 2220 -538 174 1696 710 1973 4820 2452 -1496 -627 1324
1331 1324 1085 2715 4229 1161 -1408 166 478 -629 1789 3368 280 -1226 -449 -2084 -2989 -38
1347 -38 1730 -428 -1907 -3318 -6022 -4811 -195 -676 -4347 -4577 -4611 -7128 -7041 -4508 -4662 -5248 -4338 -6605
1365 -6605 -10371 -9149 -5985 -6192 -5957 -5000 -8262 -11288 -8839 -5886 -6023 -5349 -4845 -7765 -8659 -5802 -5400
1382 -5400 -5857 -3079 -1272 -3937 -5626 -4433 -3899 -1844 1979 1420 -2563 -2376 -254 -786 679 4199
1398 4199 3665 742 1004 1590 688 2668 5313 4310 3354 3915 1697 -425 3159 6891 5593 3726
1414 3726 3211 1146 736 4231 5597 3970 4505 4902 1688 520 3773 5282 4949 6159 5391 1884
1430 1884 1643 4110 4802 5983 8200 5984 1704 2526 5432 5374 5978 7519 6133 3973 4233 3835 3065
1447 3065 6254 8744 5863 2955 3566 2979 2184 4770 6660 4179 2281 1984 98 -73 3079 3540
1463 3540 1042 515 216 -2741 -3447 -522 84 -936 -933 -2888 -6452 -5425 -2288 -3128 -4360 -3142 -4627
1480 -4627 -7923 -7314 -5245 -5341 -4844 -4025 -6981 -8779 -6735 -6290 -7522 -5547 -3716 -6338 -8367 -6980
1496 -6980 -6612 -6684 -4276 -3498 -6122 -6443 -5225 -6477 -6016 -2499 -2130 -4839 -4556 -3832 -4900 -3982 -1279
1513 -1279 -1603 -2735 -1446 -1835 -4119 -2358 1201 1013 -159 529 -539 -1567 1130 2863 1657 2461
1529 2461 3555 1384 302 3139 4294 2789 4114 5338 2971 1917 3752 3946 4022 5930 5286 2389
1545 2389 2593 4537 3805 3304 5193 4697 2595 3272 3740 1987 2918 5065 4067 2490 3347 2797 1298
1562 1298 2975 5024 3447 2316 3378 2495 1488 3653 4480 2592 2703 3999 2407 1312 3162 3640
1578 3640 2426 3225 3448 994 800 2782 2276 1347 2365 1679 -800 -4 1899 465 -373 913 41
1595 41 -1750 -700 -98 -1455 -1260 443 -1197 -2605 -1283 -1250 -2296 -831 228 -2030 -2550 -1070 -1679
1612 -1679 -2338 -555 -473 -2652 -2434 -1104 -2733 -3608 -1668 -1788 -3395 -3017 -3405 -5562 -5409 -3350 -4341
1629 -4341 -5876 -5092 -6241 -8485 -7312 -5545 -7069 -7948 -6916 -7915 -9277 -8068 -7414 -8240 -6787 -5229
1645 -5229 -7347 -8352 -5965 -5079 -5198 -3024 -1892 -3713 -3427 -792 -453 -254 2265 3038 1944 3093
1661 3093 4792 3805 4197 7011 7593 6731 7321 6877 5478 7270 9742 8254 6540 7657 7174 5336 6163
1678 6163 7378 5972 5358 6274 4535 2621 3714 4159 3373 4184 4480 1587 249 2350 3148 2503 2971
1695 2971 2828 938 1364 3135 2085 1697 4161 4084 1928 1745 2657 2045 2661 4776 3602 1210 1674
1712 1674 1716 474 1866 3008 959 -919 -4 -646 -2214 -1512 -742 -2053 -2328 -2382 -4856 -5845 -3403
1729 -3403 -2567 -4214 -4412 -4239 -5972 -5937 -3597 -3438 -4174 -2872 -3062 -4874 -4244 -2098 -2302 -2186 -93 -740
1747 -740 -2857 -2170 -603 -690 279 1538 -773 -2526 -838 -321 -1528 -674 454 -1591 -3048 -2510 -3014
1764 -3014 -3847 -1971 -1705 -4104 -4647 -4233 -5502 -5688 -3327 -3119 -5207 -5171 -4541 -5498 -4676 -2739 -2843 -3533
1782 -3533 -2234 -2224 -3655 -2186 263 19 147 1445 781 -145 1673 3532 2589 3173 4735 3377 2299
1799 2299 3951 4731 3987 4982 5693 3730 3157 4514 4263 3856 5162 5147 2910 3059 4529 3391 2834 4409
1817 4409 4411 2819 3209 3476 2469 3155 4958 4131 2522 3575 3958 2936 4006 4843 3491 2935 4492
1834 4492 4015 2571 3455 4021 2907 3178 3798 1865 894 2577 2664 962 1029 892 -675 -577 811 -696
1852 -696 -2341 -1323 -960 -2775 -2652 -2095 -3298 -3597 -2300 -2910 -4689 -3950 -3168 -3961 -3505 -2957 -4530 -4915
1870 -4915 -3012 -2647 -4478 -4015 -2915 -3764 -3755 -2628 -3459 -4386 -2661 -2061 -3606 -3645 -2623 -3623 -3768 -2134
1888 -2134 -2632 -4275 -3388 -2456 -3601 -3412 -2604 -3541 -3935 -2421 -2368 -3867 -3559 -2055 -2600 -2647 -1689 -2299 -3025
1907 -3025 -1169 -468 -1862 -1562 58 -719 -954 884 875 -357 725 2154 1297 1481 2481 2092 1886 3715
1925 3715 3783 2169 2983 4463 3600 3276 4402 3971 3185 4504 5069 3533 3614 4959 4277 3576 4717 4500
1943 4500 3077 3984 4972 3650 3458 4116 3367 2574 4152 4178 2393 2439 3450 2668 1841 2813 2388 1654 2538
1962 2538 2546 696 772 2064 1303 453 1640 1079 -594 -44 959 -59 -561 378 -334 -1428 -464 -342
1980 -342 -1957 -1367 -91 -1177 -2105 -1431 -1875 -2622 -1522 -943 -2493 -2671 -1558 -2523 -3304 -2056 -1721 -2902
1998 -2902 -2623 -1877 -3041 -3516 -2279 -2412 -3094 -2201 -2166 -3712 -3431 -1992 -2755 -3403 -2127 -2117 -3431 -2722
2016 -2722 -2022 -3090 -3008 -1623 -2141 -3004 -1936 -1809 -2902 -2349 -1227 -2044 -2382 -1183 -1485 -2632 -1517
2033 -1517 -945 -2032 -1631 -315 -1167 -1970 -908 -793 -1627 -701 332 -714 -1067 91 -508 -1235 309
2050 309 988 -146 -67 880 212 -210 1311 1341 667 1761 2264 859 1141 2662 2296 2048 3308 3096 2032
2069 2032 2701 4070 3424 3465 4680 4137 3204 4517 5041 4159 4527 5789 4914 4276 5265 5184 4385 5571 6082
2088 6082 4327 3819 4815 4520 3798 4810 4410 2777 2677 3079 2063 1732 2571 1804 148 480 160 -1532
2106 -1532 -1129 23 -1124 -2469 -2441 -3299 -4222 -3241 -2386 -3772 -4519 -3916 -4957 -5642 -4455 -3829 -4648 -4146
2124 -4146 -3877 -5231 -5759 -4152 -3561 -3815 -2858 -2740 -4428 -4501 -2731 -2374 -2336 -1261 -1572 -3038 -2477 -1414
2142 -1414 -1872 -1480 -235 -721 -2137 -1912 -1741 -2341 -1048 138 -1189 -2405 -1906 -2283 -2750 -1254 -601
2159 -601 -1746 -2378 -1609 -2065 -2661 -1165 -594 -1208 -662 -371 -1688 -1529 656 1181 446 1234 1318 335 1127
2178 1127 2709 2646 2327 3362 3090 2158 2958 3916 3229 3410 4525 3645 2382 2939 3308 2732 3326 3672 2023
2197 2023 1095 2196 2034 1332 1861 1905 542 266 1140 291 -78 1054 1183 6 291 609 -36 329 1925
2216 1925 1850 711 1132 1441 1096 2232 3240 2352 1970 3015 2892 1906 2737 3454 2986 2876 3331 2165
2234 2165 1445 2453 2600 1656 1850 1967 350 -202 900 515 -541 -159 -201 -1692 -1880 -1318 -2203 -2525
2252 -2525 -1298 -1800 -3385 -3243 -2722 -3291 -2996 -2355 -3077 -4077 -3298 -3215 -3929 -3289 -2498 -3577 -4104 -3128 -3514
2271 -3514 -4382 -3614 -2908 -3786 -3951 -3427 -4164 -4486 -3298 -3266 -4368 -4003 -3421 -4160 -4187 -3050 -3348 -3825 -2670
2290 -2670 -2565 -3445 -2794 -1487 -1703 -1791 -534 -301 -902 121 1263 1117 1653 2706 2085 2041 3493 3903
2308 3903 3391 4316 5147 4355 3955 4965 4998 4417 5299 5440 4116 4168 4559 3803 3211 4230 3940 2583 2412
2327 2412 2395 1499 1454 2239 1322 302 808 636 -598 -193 737 51 -419 129 -216 -902 -21 609 96 604
2347 604 1434 460 -76 1299 2026 1447 2046 2420 1735 1816 2617 2106 1915 3012 3140 1825 1698 2135 1417
2366 1417 1347 2148 1623 290 362 203 -659 -596 173 -1005 -2218 -1484 -1770 -3031 -2889 -2185 -2910 -3299 -2879
2385 -2879 -3779 -4545 -3349 -2959 -4008 -3877 -3386 -3900 -4416 -3309 -3216 -3628 -3100 -2732 -3487 -3168 -2141 -2745 -2826
2404 -2826 -1621 -1459 -2641 -2331 -1463 -1699 -1460 -544 -1311 -1995 -1070 -637 -1306 -1029 36 -637 -1098 -334 -271
2423 -271 -785 -35 661 -177 -143 490 -53 -400 1050 1490 448 523 1068 686 657 1891 1589 1048 1730 1923
2443 1923 821 1014 2101 1897 1495 2255 2051 852 1400 2394 1872 1953 2582 2008 1222 1939 2435 1742 2078
2462 2078 2949 2321 1856 2529 2306 1774 2765 3414 2383 1934 2790 2196 2049 3031 3043 1965 2350 2700 1884
2481 1884 1656 2482 2055 1390 1905 1901 488 542 1373 934 483 816 227 -782 -285 191 -937 -1026 -311 -1112
2501 -1112 -1681 -1182 -1284 -2231 -1643 -1070 -2037 -2619 -1836 -2087 -2650 -1935 -1802 -2814 -2782 -1963 -2475 -2937 -2109 -2230
2521 -2230 -3103 -2539 -2153 -3048 -3090 -2060 -2391 -3175 -2426 -2308 -3201 -2885 -1826 -2530 -2980 -2040 -2174 -2790 -2139
2540 -2139 -1725 -2507 -2233 -1319 -1816 -2283 -1306 -1085 -1865 -1136 -549 -1295 -1349 -151 -305 -726 126 396 -462 -37
2560 -37 1023 619 246 1396 1458 724 1277 1845 1146 1508 2629 2095 1584 2427 2624 1884 2535 3188 2571 2418
2580 2418 3076 2620 2227 3015 3233 2330 2515 3263 2467 2136 2875 2914 2173 2491 2748 1799 1696 2460 1868 1402
2600 1402 2058 2169 896 1045 1698 1122 650 1346 1028 109 737 869 -27 -135 873 132 -422 161 -53
2619 -53 -760 -254 298 -520 -858 -264 -598 -1198 -384 -250 -1232 -1060 -538 -976 -1395 -731 -877 -1563 -831 -821 -1771
2640 -1771 -1628 -679 -1169 -1956 -1294 -1373 -2104 -1670 -1031 -1807 -1966 -1380 -1710 -2349 -1727 -1324 -2354 -2041 -1352 -2038
2660 -2038 -2580 -1981 -1898 -2256 -1547 -1532 -2655 -2548 -1529 -1864 -2337 -1554 -1589 -2401 -2134 -1373 -1985 -1966 -976 -1083
2680 -1083 -1831 -1318 -990 -1577 -1106 87 -430 -908 -304 -74 -384 359 1054 199 410 1267 1217 547 1437 1960
2700 1960 1541 2003 2424 1680 1455 2506 2701 2128 2594 2780 1957 2235 3078 2561 1962 2777 2746 1906 2216 2662
2720 2662 1946 2050 2959 2305 1451 2007 2248 1566 2013 2627 1528 1368 2165 1956 1176 1688 2024 1253 1326 1814
2740 1814 1304 634 1574 1469 706 844 1148 448 160 1064 542 -369 55 31 -766 -753 -279 -950 -1421 -968
2760 -968 -1288 -2161 -1886 -1363 -2249 -2287 -1726 -2389 -3094 -2468 -2082 -2817 -2530 -2200 -2820 -2998 -2219 -2316 -2815 -2127 -1784
2781 -1784 -2487 -2267 -1606 -2098 -2255 -1273 -1217 -1881 -1469 -956 -1493 -1547 -647 -891 -1318 -712 -584 -1255 -940 -481
2801 -481 -958 -1019 -186 -452 -1203 -668 -380 -939 -716 6 -411 -1000 -267 -118 -697 -420 348 -242 -321 544 244
2822 244 -313 530 1088 422 688 1358 795 591 1621 1735 1172 1660 2152 1311 1432 2270 1938 1576 2353 2383
2842 2383 1521 2041 2412 1911 1752 2608 2306 1480 2061 2376 1550 1741 2496 1854 1349 1870 1706 1028 1661 2117
2862 2117 1343 1076 1737 1359 704 1457 1726 850 834 1293 560 365 1160 958 197 475 688 -57 -156 611
2882 611 -26 -558 -4 -43 -1086 -721 -361 -1063 -1259 -665 -1156 -1972 -1477 -1212 -1912 -1854 -1329 -2180 -2494 -1697
2902 -1697 -1857 -2528 -1927 -1662 -2305 -2488 -1783 -2237 -2731 -1681 -1510 -2353 -2136 -1685 -2155 -2022 -1267 -1558 -2187
2921 -2187 -1503 -1204 -1927 -1738 -926 -1397 -1625 -802 -882 -1635 -1252 -540 -1008 -961 -425 -864 -1288 -348 -27 -819
2941 -819 -448 112 -381 -355 528 248 -260 443 950 330 478 1085 732 543 1617 1377 766 1315 1832 1357
2961 1357 1160 1921 1695 1118 1918 2063 1467 1713 2152 1840 1695 2187 2031 1328 1912 2266 1557 1622 2092 1798
2981 1798 1428 2151 2012 1137 1511 2164 1493 1175 1799 1491 969 1596 1695 824 923 1392 979 539 1171 768
3001 768 108 586 918 245 -38 614 77 -393 107 74 -694 -502 -51 -655 -925 -534 -851 -1332 -728 -621
3021 -621 -1402 -1419 -884 -1486 -1849 -1297 -1299 -1900 -1596 -1130 -2037 -2165 -1353 -1710 -2295 -1709 -1613 -2311 -1892 -1308 -1911
3042 -1911 -2153 -1502 -1793 -2195 -1698 -1348 -1944 -1844 -994 -1488 -1955 -1289 -1064 -1607 -1045 -696 -1245 -1337 -629 -662
3062 -662 -976 -435 -168 -871 -543 48 -334 -410 264 300 -391 99 368 -198 -9 882 533 128 781 796 264
3083 264 799 1443 880 754 1421 1204 837 1387 1944 1165 1346 1929 1336 1169 1929 2047 1448 1863 2034 1373
3103 1373 1424 2082 1869 1490 2012 1972 1345 1482 1956 1576 1233 2027 1662 953 1493 1576 972 1088 1669 1040 660
3124 660 1006 975 428 755 1330 370 96 669 330 -167 443 565 -205 -152 89 -441 -822 -56 -254 -789 -535
3145 -535 -466 -1254 -1160 -498 -872 -1230 -916 -1063 -1819 -1242 -806 -1480 -1556 -1037 -1382 -2032 -1511 -1234 -1865 -1688 -1149
3166 -1149 -1678 -2032 -1469 -1455 -1749 -1540 -1043 -1685 -1894 -1244 -1604 -1936 -1061 -1126 -1646 -1318 -976 -1518 -1536 -881 -853
3187 -853 -1359 -819 -805 -1451 -1065 -218 -597 -948 -394 -335 -711 -298 278 -259 -200 481 220 -305 520 639 207
3208 207 568 1148 561 288 1102 1166 692 1143 1350 819 1044 1699 1252 1085 1676 1692 1094 1595 1894 1351 1359
3229 1359 2103 1784 1249 1643 1860 1273 1512 2064 1540 1217 1814 1703 1171 1442 1739 1113 1168 1698 1187 696
3249 696 1300 1277 661 865 1207 605 406 984 723 171 493 480 -39 112 522 49 -319 146 48 -614 -314
3270 -314 -12 -639 -660 -132 -710 -1190 -721 -613 -1054 -920 -669 -1245 -1415 -893 -1098 -1737 -1343 -1078 -1642 -1577 -1118
3291 -1118 -1811 -1918 -1387 -1334 -2006 -1749 -1433 -2011 -2053 -1378 -1680 -2085 -1527 -1440 -1990 -1681 -1134 -1616 -1650 -1014 -1090
3312 -1090 -1672 -1134 -653 -1076 -823 -317 -699 -978 -231 21 -488 -31 201 -49 -35 435 410 -34 616 898
3332 898 221 495 1037 667 389 1119 892 396 732 1084 520 551 1229 925 638 877 943 534 862 1253 694
3353 694 654 1065 979 562 1030 1534 934 1018 1455 1084 931 1533 1609 1118 1548 1680 1280 1208 1894 1667 1351 1753
3375 1753 1700 1188 1160 1727 1218 1128 1620 1138 643 969 1053 444 440 1016 452 -38 424 236 -229 -89 122 -449
3397 -449 -638 -313 -628 -1103 -631 -344 -1069 -1028 -782 -1112 -1314 -892 -947 -1537 -1104 -926 -1497 -1472 -1113 -1277 -1645
3418 -1645 -1059 -1112 -1770 -1603 -1097 -1588 -1597 -1059 -1395 -1875 -1441 -1021 -1607 -1377 -962 -1293 -1602 -1170 -1148 -1536 -1068
3439 -1068 -648 -1313 -1136 -715 -904 -1115 -453 -329 -787 -578 -313 -535 -548 24 -5 -442 64 333 -187 -86
3459 -86 527 382 18 393 496 -36 526 869 501 373 804 599 288 728 1040 618 736 1080 695 804
3479 804 1174 1126 768 1158 1413 895 1070 1572 1317 985 1627 1692 1154 1409 1842 1416 1343 1813 1689 1255 1718
3500 1718 1694 1250 1255 1705 1359 1162 1458 1175 850 1167 1152 758 714 886 409 157 455 431 -333 -74 307 -275
3522 -275 -476 -155 -375 -795 -493 -322 -843 -914 -547 -775 -1178 -750 -896 -1312 -1012 -685 -1368 -1418 -871 -1109 -1518
3543 -1518 -1028 -1000 -1394 -1183 -913 -1246 -1386 -961 -1099 -1441 -1156 -965 -1470 -1293 -973 -1129 -1388 -921 -920 -1329 -1064
3564 -1064 -823 -1207 -1278 -770 -895 -1163 -651 -612 -983 -790 -383 -733 -866 -309 -351 -709 -226 -103 -544 -376 91
3585 91 -104 -266 158 276 -143 208 438 38 60 660 507 322 632 944 702 542 1114 813 694 1259 1137
3606 1137 869 1092 1498 920 1007 1441 1291 1030 1484 1469 964 1154 1431 1226 1019 1523 1256 964 1189 1401
3626 1401 843 919 1324 889 595 1003 987 571 780 969 604 436 784 505 234 420 688 271 298 656 218
3647 218 49 378 300 -208 166 363 -141 -157 127 -149 -443 -112 -141 -458 -445 -98 -690 -679 -309 -604 -859 -676
3669 -676 -570 -1143 -1069 -748 -1152 -1297 -1008 -1095 -1473 -1163 -1022 -1515 -1488 -1078 -1478 -1728 -1344 -1282 -1620 -1591 -1065 -1429
3691 -1429 -1629 -1159 -1181 -1406 -1198 -962 -1268 -1099 -723 -1053 -1067 -648 -619 -819 -487 -373 -522 -548 -57 -159 -454
3712 -454 36 155 -195 65 503 239 165 702 638 310 534 836 496 643 1084 800 464 1049 1098 758 874
3733 874 1277 761 810 1285 1286 892 1312 1403 871 1023 1479 1229 852 1353 1256 955 1181 1305 1054 1022 1381 1007
3755 1007 872 1167 1309 913 950 1178 815 714 1008 900 495 766 649 257 296 548 246 -4 374 264
3775 264 -180 83 67 -352 -260 153 -223 -485 -19 -237 -624 -503 -187 -488 -601 -326 -571 -827 -523 -450 -836
3796 -836 -743 -564 -785 -1070 -469 -528 -889 -810 -529 -976 -955 -706 -721 -1036 -919 -762 -1103 -1096 -779 -1032 -1184 -915
3818 -915 -962 -1315 -998 -990 -1111 -1095 -770 -1080 -1345 -960 -815 -1236 -913 -622 -866 -955 -560 -645 -808 -381 -269 -442
3840 -442 -414 52 -296 -210 338 282 10 253 503 165 269 887 466 497 784 886 399 684 922 818 747 1164
3862 1164 913 621 898 1049 826 905 1240 988 716 1183 1048 770 1007 1297 960 953 1334 1114 823 1214 1391
3883 1391 1037 1021 1354 1042 968 1466 1272 782 1140 1320 778 802 1288 743 519 787 904 272 436 692 225
3904 225 -12 262 -47 -452 -76 -130 -599 -522 -226 -574 -862 -432 -628 -1075 -754 -489 -934 -918 -593 -736 -1099
3925 -1099 -700 -686 -1048 -867 -609 -743 -966 -604 -738 -988 -610 -447 -915 -930 -613 -808 -880 -589 -838 -1104 -808
3946 -808 -765 -1170 -968 -737 -887 -1167 -1021 -888 -1244 -1027 -803 -978 -1299 -718 -829 -1092 -711 -495 -725 -590
3966 -590 -309 -429 -504 -17 -230 -331 -63 317 41 181 575 425 109 497 715 459 499 843 617 507 875
3987 875 836 624 908 1088 705 901 1047 820 613 1078 1031 585 785 1130 859 661 968 951 630 1010 1150
4008 1150 665 745 964 892 745 1012 1056 600 947 1290 776 784 870 803 557 792 840 370 640 851 419 288
4030 288 601 309 61 310 345 -44 -5 133 -173 -391 29 -97 -680 -461 -230 -436 -574 -279 -508 -864 -618
4051 -618 -458 -875 -817 -488 -837 -1021 -744 -698 -1178 -806 -714 -1072 -1057 -722 -874 -1183 -772 -701 -1114 -904 -683 -1070
4073 -1070 -1095 -697 -780 -1096 -883 -674 -1053 -1000 -593 -826 -886 -621 -718 -935 -679 -502 -915 -710 -313 -508 -723
4094 -723 -303 -214 -508 -204 25 -424 -324 197 93 -133 162 393 -35 78 416 289 243 573 595 358 510
4115 510 764 482 669 917 855 456 830 935 693 913 1132 954 806 1149 943 785 986 1282 900 957 1233
4136 1233 1121 780 1007 1206 723 999 1176 886 741 1022 930 699 808 858 490 561 849 514 282 608 409
4157 409 174 243 340 122 -4 367 115 -133 86 -25 -360 -177 -66 -325 -396 -211 -321 -568 -452 -391 -646
4178 -646 -649 -308 -643 -743 -542 -675 -972 -726 -617 -1000 -919 -652 -922 -1134 -813 -732 -1081 -941 -778 -1003 -1130
4199 -1130 -897 -935 -1165 -939 -798 -1047 -912 -684 -837 -958 -752 -539 -806 -571 -504 -587 -634 -314 -376 -565 -133
4220 -133 -85 -524 -261 -31 -380 -269 8 -38 -259 -35 210 -200 21 236 83 81 361 386 135 291 453 227
4242 227 316 573 510 372 458 729 469 455 819 618 464 874 740 527 725 957 671 812 1055 961 877 981
4264 981 1056 752 923 1048 786 787 1121 938 786 775 961 716 742 846 690 528 694 710 419 554 556 313 276
4287 276 508 351 30 245 315 -45 89 251 -33 -126 -33 -147 -334 -137 -203 -452 -387 -350 -400 -707 -357 -465
4309 -465 -669 -642 -469 -882 -789 -615 -754 -953 -800 -712 -916 -855 -758 -1008 -1146 -725 -924 -1135 -949 -645 -955 -962
4331 -962 -638 -894 -1053 -738 -637 -975 -798 -591 -904 -861 -506 -611 -905 -478 -362 -617 -558 -244 -331 -614 -103
4352 -103 -150 -381 -82 99 -190 -31 230 194 -5 259 419 163 251 555 374 310 592 553 306 624 804 424
4374 424 528 800 692 534 895 766 321 754 923 632 531 827 747 604 845 891 606 632 824 709 695
4395 695 862 788 571 724 868 596 630 860 584 604 830 856 396 618 734 503 491 739 605 256 413 526
4417 526 326 203 460 90 -58 233 62 -205 -72 18 -186 -363 -77 -434 -569 -339 -298 -694 -603 -364 -663
4438 -663 -708 -554 -647 -854 -736 -611 -874 -799 -583 -706 -783 -541 -523 -834 -707 -612 -718 -859 -568 -679 -904 -653
4460 -653 -527 -773 -711 -561 -718 -835 -558 -587 -799 -740 -326 -799 -620 -496 -699 -730 -467 -331 -579 -437 -242
4481 -242 -346 -342 -123 -189 -313 -2 61 -100 -90 269 159 15 500 414 210 517 606 343 333 607 672 368 740
4504 740 862 651 686 805 662 616 933 767 589 809 905 530 625 842 781 626 980 829 562 761 829 546
4526 546 662 882 709 491 814 937 541 707 849 467 475 625 677 313 549 561 300 300 460 242 89 223
4548 223 272 30 15 180 -33 -126 123 -28 -296 -118 -65 -376 -390 -181 -494 -630 -370 -436 -659 -652 -369 -812 -764
4571 -764 -550 -625 -821 -691 -660 -799 -787 -547 -871 -886 -708 -607 -825 -676 -495 -883 -743 -547 -818 -789 -534 -496
4593 -496 -700 -649 -619 -690 -777 -471 -517 -760 -438 -443 -646 -447 -285 -481 -462 -247 -280 -426 -195 -76 -249 -236 -8
4616 -8 -131 -164 143 277 -37 156 340 110 220 382 479 256 497 523 322 434 786 643 397 712 631 445
4638 445 679 823 690 710 860 793 631 896 843 625 748 926 660 574 775 680 560 792 869 517 689 786
4660 786 571 494 846 597 452 455 663 301 368 571 532 249 425 472 -11 272 310 151 -37 224 27 -104
4682 -104 -8 26 -172 -253 40 -188 -278 -92 -288 -523 -211 -131 -525 -639 -452 -438 -633 -505 -384 -799 -586 -408
4704 -408 -600 -791 -586 -644 -738 -666 -697 -785 -809 -681 -711 -834 -622 -606 -735 -856 -653 -783 -836 -571 -642 -851 -487
4727 -487 -498 -588 -482 -325 -566 -614 -297 -381 -453 -258 -85 -310 -190 -63 -21 -246 -71 83 -30 21 198 124 147
4750 147 233 217 123 389 334 274 401 520 296 289 428 648 418 626 603 603 475 706 697 528 778 872 778 748 845
4775 845 713 542 717 735 604 846 850 567 544 748 700 469 690 667 470 541 592 472 481 707 472 293 431
4798 431 415 330 278 487 231 152 255 129 1 120 214 -91 -84 22 -97 -135 -106 -189 -319 -229 -131 -359 -421 -255
4822 -255 -502 -473 -381 -351 -545 -467 -344 -494 -776 -537 -608 -766 -596 -502 -573 -633 -616 -670 -735 -589 -544 -799 -711 -445
4846 -445 -677 -770 -571 -611 -754 -492 -633 -671 -591 -423 -586 -628 -364 -449 -442 -392 -347 -401 -462 -131 -296 -274 -132 -143 -152
4871 -152 -156 68 -118 -93 119 167 -34 301 255 131 141 464 360 103 378 335 395 489 536 439 523 742 582 480
4895 480 646 676 535 543 836 573 531 761 722 556 738 763 635 572 775 571 663 660 800 612 528 693 467 482
4919 482 750 528 386 506 492 340 388 539 401 171 422 294 145 211 235 189 71 104 50 -121 78 62 -111
4942 -111 -8 -67 -229 -360 -185 -136 -545 -305 -245 -521 -447 -341 -566 -645 -340 -454 -627 -678 -494 -737 -652 -487
4964 -487 -751 -775 -620 -623 -777 -642 -545 -607 -729 -437 -526 -748 -536 -483 -605 -541 -538 -511 -647 -510 -398 -501 -486 -429
4988 -429 -501 -407 -267 -383 -527 -265 -28 -351 -246 -149 -232 -83 -82 -3 -127 -6 108 -7 63 209 53 182 248
5011 248 416 229 295 333 313 287 457 508 413 558 451 465 511 627 433 491 598 827 547 660 732 576 654 651
5035 651 602 602 617 699 620 571 743 653 497 590 640 430 585 601 384 451 605 480 308 332 402 280 206 429 313
5060 313 147 292 219 -18 17 172 98 -30 -10 -139 -219 42 -185 -267 -210 -181 -288 -224 -226 -382 -483 -313 -315 -637
5084 -637 -517 -451 -492 -596 -491 -626 -596 -634 -624 -746 -662 -513 -585 -750 -572 -648 -702 -611 -436 -636 -530 -527 -535 -642 -620
5109 -620 -491 -564 -601 -512 -567 -438 -402 -441 -462 -206 -284 -387 -405 -206 -181 -354 -183 -163 -152 -60 47 1 -17 115 19
5134 19 -72 140 212 102 130 261 230 142 219 366 234 484 498 304 393 437 502 424 493 562 458 604 651 578 546 588
5160 588 571 459 715 544 504 570 810 551 464 740 564 403 602 494 478 365 490 419 427 464 407 342 218 597
5184 597 299 256 408 249 169 225 267 10 95 268 112 -50 -1 -56 -94 -41 110 -254 -384 -143 -304 -428 -302
5207 -302 -341 -348 -359 -338 -353 -423 -443 -495 -592 -457 -559 -569 -695 -427 -664 -577 -616 -623 -684 -652 -497 -627 -438 -470 -664 -751
5233 -751 -532 -577 -477 -519 -386 -579 -498 -324 -447 -599 -498 -275 -513 -378 -258 -350 -356 -246 -208 -223 -126 -141 -136 -234
5257 -234 -5 -91 -237 10 129 101 -9 172 44 187 270 287 202 320 307 346 299 424 456 380 407 462 517 486 503
5282 503 503 564 695 521 469 618 701 588 544 507 443 548 701 595 481 549 565 419 462 520 514 433 517 471 287 422
5308 422 547 310 310 412 301 225 307 219 86 196 266 67 -25 102 110 -1 6 24 68 -59 -26 -75 -284 -155 -194
5333 -194 -248 -257 -154 -282 -377 -298 -325 -478 -398 -288 -563 -465 -345 -484 -636 -384 -502 -586 -588 -417 -519 -544 -460 -475 -671
5358 -671 -439 -485 -556 -587 -458 -545 -569 -441 -438 -506 -500 -370 -471 -513 -412 -397 -351 -387 -213 -313 -339 -197 -286 -282 -118 -305
5384 -305 -165 -110 79 -85 -41 -43 -28 -83 25 231 110 183 312 178 198 248 284 336 374 357 429 269 520 461 390
5409 390 473 576 377 443 584 474 632 575 596 532 552 589 590 477 593 508 521 635 590 444 561 744 429 405
5433 405 449 456 323 400 382 433 397 409 252 239 349 112 219 188 346 15 99 167 -26 -54 -76 34 -125 -31 103
5458 103 -189 -238 -141 -201 -298 -181 -157 -400 -150 -191 -342 -436 -356 -334 -547 -405 -260 -523 -534 -415 -479 -609 -417 -556
5482 -556 -576 -509 -478 -530 -661 -507 -620 -599 -512 -597 -742 -479 -387 -418 -419 -337 -338 -422 -451 -338 -391 -350 -222 -325 -351 -204
5508 -204 -137 -169 -71 -130 -138 -130 -74 9 -76 55 160 -30 50 235 132 94 146 78 132 174 366 254 318 375 355 327 382
5535 382 399 277 423 480 419 363 398 486 372 461 560 407 532 591 421 432 583 569 530 415 520 443 495 581 630
5560 630 393 447 492 428 452 517 322 340 327 477 318 387 327 231 113 222 140 42 -40 156 85 -111 67 -59 -61
5585 -61 -27 -101 -216 -105 -59 -186 -198 -193 -310 -280 -277 -334 -465 -387 -311 -258 -383 -243 -501 -443 -433 -429 -475 -412 -385 -486 -402
5612 -402 -525 -434 -571 -447 -431 -591 -410 -469 -557 -420 -486 -338 -574 -434 -454 -460 -370 -297 -386 -299 -366 -147 -294 -287 -188
5637 -188 -161 -282 -58 -184 -265 54 -79 -143 14 40 34 -15 34 93 82 67 96 112 172 278 318 210 318 286 311 412
5663 412 301 302 411 468 314 343 505 525 494 510 536 410 433 522 470 318 628 575 507 488 495 524 473 463 490 417 451
5690 451 453 434 408 362 448 290 321 340 211 242 268 229 79 142 276 18 36 29 56 22 66 44 -116 -54 -90 -113 -182 -114
5718 -114 -137 -364 -181 -142 -241 -206 -179 -384 -384 -266 -277 -326 -163 -356 -403 -425 -338 -475 -527 -464 -384 -569 -388 -353 -474
5743 -474 -489 -560 -411 -516 -362 -376 -521 -371 -361 -510 -352 -340 -400 -511 -453 -390 -437 -277 -316 -256 -343 -266 -269 -310 -167
5768 -167 -190 -278 -158 -157 -196 -161 -66 120 -117 -62 44 84 -6 106 134 155 213 189 155 257 253 233 413 326 340 255 264 292
5796 292 479 484 411 444 476 339 485 401 408 534 517 390 582 578 320 490 421 393 452 398 440 407 516 342 437 389
5822 389 321 335 471 306 331 208 209 257 156 58 136 77 22 140 145 77 77 164 -42 127 -18 -105 -73 -153 -83 -105 -296
5849 -296 -216 -202 -264 -192 -121 -315 -336 -253 -315 -485 -324 -451 -472 -456 -387 -467 -398 -430 -515 -457 -419 -592 -424 -369 -447 -445 -495
5876 -495 -338 -375 -426 -435 -369 -422 -371 -364 -383 -494 -271 -236 -431 -268 -195 -311 -240 -224 -187 -172 -69 -40 -136 -62 0 -18 -33
5903 -33 -23 62 52 7 84 5 196 231 160 55 316 134 42 219 225 113 256 331 293 281 361 330 327 376 198 341 420
5930 420 427 470 418 440 398 350 400 433 384 383 402 403 430 389 396 355 321 371 318 348 274 256 324 277 215 336 268 284 226 92 133
5961 133 240 136 249 125 69 238 73 119 -127 8 12 20 -74 64 -128 -113 -179 -173 -125 -197 -281 -229 -234 -384 -243 -393
5987 -393 -249 -373 -448 -290 -344 -441 -393 -338 -346 -481 -451 -419 -608 -561 -332 -385 -503 -475 -379 -519 -434 -381 -399 -265 -239 -487
6013 -487 -472 -221 -349 -298 -251 -244 -342 -262 -293 -177 -128 -223 -230 -138 -190 32 -6 -79 37 -21 -23 38 39 60 80 109 151 59 131
6042 131 207 171 118 160 227 196 361 348 265 299 292 292 249 346 415 385 229 362 328 401 537 368 468 494 407 365 516
6069 516 345 363 382 448 394 340 389 469 339 242 423 325 270 266 296 64 220 273 157 241 121 133 114 77 146 108 24
6096 24 31 -6 2 -63 -136 -70 -115 -93 -63 -163 -295 -103 -121 -154 -225 -225 -165 -227 -214 -333 -224 -204 -397 -327 -395 -248 -330 -231
6124 -231 -372 -348 -387 -415 -436 -333 -330 -413 -468 -383 -415 -311 -280 -404 -389 -437 -305 -420 -368 -411 -303 -412 -212 -221 -431 -316
6150 -316 -260 -274 -227 -146 -225 -176 -168 -149 -130 -27 -51 -25 -58 -70 89 -21 127 68 19 56 113 175 178 139 313 263 206 238
6178 238 263 216 215 284 311 200 325 234 278 334 287 414 323 431 414 434 387 314 406 421 478 340 384 287 443 364 368 326
6206 326 293 288 308 307 307 222 275 302 292 271 274 167 119 125 68 106 17 20 -22 75 14 27 17 -94 -4 -74 -85 -199 -105 -159 -238
6237 -238 17 -206 -296 -259 -166 -136 -253 -242 -270 -346 -344 -345 -424 -269 -320 -423 -459 -369 -386 -318 -422 -294 -394 -276 -232 -383
6263 -383 -373 -248 -394 -317 -475 -209 -338 -349 -266 -310 -214 -190 -244 -282 -299 -393 -283 -136 -197 -190 -105 -100 -85 -28 -106 -150 27
6290 27 -18 -28 -55 -47 -19 148 72 50 79 162 152 181 327 165 218 144 236 335 234 330 243 247 300 291 360 112 384 303 395
6319 395 413 305 366 469 384 232 349 348 472 407 343 288 390 259 307 270 244 382 363 232 199 288 220 385 200
6344 200 101 132 155 84 132 25 65 136 -14 -99 -65 33 55 -117 -144 -87 -57 -74 -129 -119 -155 -141 -130 -97 -197 -183 -221 -265
6372 -265 -176 -254 -270 -339 -215 -208 -374 -319 -349 -310 -336 -369 -365 -369 -385 -363 -386 -386 -291 -253 -343 -411 -338 -339 -338 -250 -302 -277 -281 -231 -456 -171
6404 -171 -143 -254 -276 -305 -296 -220 -236 -55 -1 -171 -129 -163 0 46 29 16 -103 -58 -14 -28 47 25 32 149 128 129 165 159 -9
6433 -9 177 350 224 208 211 253 279 238 219 201 378 362 284 307 297 386 393 431 340 389 329 351 246 407 414 430 302 267 337
6462 337 363 274 249 213 148 352 199 203 85 196 176 44 201 208 187 52 247 141 94 72 -1 90 -26 -125 14
6487 14 -12 38 -87 -174 3 -144 -114 -49 -196 -205 -257 -208 -198 -350 -247 -216 -231 -188 -210 -325 -317 -293 -290 -476 -381 -365 -398 -267
6515 -267 -263 -336 -306 -317 -417 -336 -337 -342 -371 -340 -329 -338 -304 -292 -297 -240 -253 -239 -217 -205 -202 -177 -66 -221 -207 -98 -176 -73 -121 -89
6545 -89 -95 8 -119 -15 16 -35 -17 -19 113 25 83 167 209 102 212 152 198 204 275 198 246 186 179 281 305 264 305 320 329
6574 329 297 293 319 399 222 279 337 250 316 359 285 283 346 273 223 307 260 350 241 281 225 123 353 141 191 181 267 172
6602 172 152 106 211 85 117 131 103 -7 72 -24 -63 112 -48 -27 53 -6 -165 -120 -106 -100 -113 53 -171 -129 -199 -81
6628 -81 -207 -312 -184 -315 -129 -216 -377 -211 -167 -127 -284 -296 -328 -145 -283 -263 -289 -193 -267 -277 -188 -381 -303 -326 -263
6653 -263 -301 -120 -264 -240 -252 -252 -246 -158 -218 -319 -304 -253 -238 -224 -154 -150 -81 -242 -223 -144 19 11 -204 -203 -69 23 -80 108
6681 108 39 144 10 98 -9 75 191 40 109 127 258 168 86 269 186 263 271 294 268 187 301 274 270 176 406 295
6707 295 302 351 273 262 362 260 294 344 247 387 274 320 212 236 259 243 185 89 225 285 154 194 230 56 50 132 133
6734 133 13 61 107 57 50 154 63 83 -17 -43 -61 -58 -31 -73 -34 -51 -168 -118 -78 -68 -79 -277 -105 -233 -148 -223 -275
6761 -275 -258 -167 -167 -285 -210 -233 -382 -315 -222 -315 -339 -252 -362 -325 -284 -260 -265 -319 -132 -235 -263 -278 -167 -347 -331 -221 -301
6788 -301 -319 -179 -240 -118 -217 -215 -87 -136 -96 -154 -147 38 -91 -41 65 -56 1 15 89 40 142 99 84 93 181 129 89
6815 89 130 30 243 118 119 217 268 145 216 181 187 158 225 314 294 317 272 230 281 319 262 151 245 201 259 223 193 254 281
6844 281 250 389 267 252 242 167 280 196 169 188 296 228 271 268 291 171 107 39 41 208 51 38 23 61 45 14 74
6871 74 54 30 71 -15 44 0 27 -68 -122 -53 -93 -268 -52 4 -66 -161 -243 -144 -243 -251 -281 -171 -198 -149 -214 -259 -254 -265 -324 -397
6901 -397 -269 -218 -380 -187 -285 -326 -226 -317 -334 -318 -281 -172 -384 -228 -318 -321 -163 -326 -269 -234 -142 -103 -175 -205 -43
6926 -43 -126 26 -56 -101 -26 -68 -39 77 3 5 16 -52 45 50 78 154 61 114 61 88 223 144 178 250 78 147 197 176 189
6955 189 233 336 190 223 363 301 385 306 144 214 366 338 231 279 172 331 215 278 160 224 307 129 234 256
6979 256 125 166 128 175 257 110 107 312 139 131 100 166 164 284 149 9 18 -32 33 -60 59 67 4 -14 -2 13 -180 -84
7007 -84 -160 -157 -124 -94 -163 -149 -199 -32 -67 -96 -211 -297 -259 -201 -165 -348 -263 -241 -208 -227 -213 -313 -176 -281 -207 -307 -306 -297
7035 -297 -97 -297 -293 -296 -309 -251 -271 -305 -272 -205 -204 -89 -140 -127 -186 -236 -134 -145 -84 -84 -92 -177 -83 -110 -156 -32 -40 -58 55 -102
7065 -102 -33 78 170 70 43 94 -23 214 84 123 181 173 53 105 108 194 157 230 291 287 321 191 234 99 185 235 155
7092 155 257 128 386 323 362 277 323 230 290 279 187 253 235 380 288 244 281 101 199 239 137 71 134 123 198 161 33
7119 33 146 147 71 35 170 80 83 -51 112 12 19 -16 -83 10 -44 -150 -47 -33 -46 -100 -91 -196 -76 -150 -198 -160 -173 -287
7147 -287 -240 -215 -72 -104 -208 -251 -201 -205 -130 -237 -154 -327 -337 -314 -246 -361 -198 -241 -268 -216 -286 -196 -262 -243 -249 -257 -223 -150
7175 -150 -207 -217 -194 -98 -165 -162 -168 -140 -119 -103 -3 -5 -92 -194 3 -81 -64 126 14 1 80 10 -59 8 104 15 -2 144
7203 144 125 100 155 192 153 213 96 111 129 173 207 224 209 194 407 115 299 283 270 305 253 273 247 243 158 270 322 225
7231 225 187 243 198 233 222 245 93 129 189 290 208 91 103 138 123 204 207 30 51 187 24 86 -60 -12 101 12
7257 12 -11 -20 -53 25 -88 37 -160 -100 -116 -9 -16 -188 -180 -93 -131 -238 -207 -102 -201 -225 -262 -228 -160 -179 -160 -320 -80
7284 -80 -197 -173 -326 -263 -314 -217 -180 -133 -207 -269 -246 -194 -238 -194 -216 -125 -187 -111 -205 -136 -266 -148 -219 -236 -219 -188 -167 -193
7312 -193 -46 -224 2 8 -15 -9 -93 29 -57 -19 -53 52 14 169 8 103 25 103 171 153 269 101 48 197 129 126
7338 126 328 164 180 217 156 129 247 203 223 171 188 196 109 250 238 233 207 371 323 135 315 344 269 194 142 269 191
7365 191 160 96 274 99 162 248 209 247 149 146 117 99 108 46 102 62 98 116 50 46 2 -62 26 -9 -115 -77 -6 -39 12 -65
7395 -65 -34 -227 -101 -99 -186 -130 -195 -178 -160 -127 -130 -139 -121 -224 -206 -345 -309 -230 -306 -192 -240 -305 -210 -215 -225 -294 -295 -219 -364 -95
7425 -95 -174 -270 -244 -177 -129 -248 -134 -179 -219 -138 -92 -198 -240 -58 29 -160 -146 -55 -214 -141 43 -23 -82 -7 -39 -24 16
7452 16 99 109 78 23 10 63 2 147 134 68 188 198 62 141 192 256 215 289 140 186 270 193 365 243 216 138 121
7479 121 186 247 222 229 343 164 159 303 164 186 143 178 138 305 98 260 204 108 210 84 112 24 216 150 50
7504 50 -50 -143 17 -58 65 84 85 76 -30 -24 73 17 13 97 -94 -13 -190 -66 -88 30 -65 -88 -90 -87 -196 -168 -204 -182 -119
7533 -119 -94 -191 -222 -149 -180 -150 -210 -203 -258 -288 -178 -116 -304 -224 -177 -212 -284 -181 -96 -188 -213 -15 -216 -191 -88 -124 -312
7560 -312 -80 -43 -167 -105 -100 -220 -177 -87 -133 -59 58 46 -123 -133 -21 -32 -92 -14 -2 10 -71 -35 101 3 98 10 -34
7587 -34 21 -16 71 62 198 14 47 70 188 123 202 192 110 199 216 233 257 237 208 151 154 127 234 266 278 341 212 289 245
7616 245 174 226 207 173 96 305 162 273 160 104 266 189 195 189 140 138 291 234 168 185 102 -44 159 -6 123 68
7642 68 -5 41 -13 8 36 -131 -16 10 -39 -71 -115 -42 -132 -74 -141 -148 -154 -106 -74 -83 -141 2 -202 -164 -93 -243 -196 -159 -302
7671 -302 -218 -223 -209 -252 -161 -190 -258 -359 -115 -290 -203 -183 -241 -176 -186 -180 -205 -261 -122 -139 -197 -172 -178 -151 -61 -56 -172 -132 11
7700 11 -173 -110 0 19 -62 20 0 19 -55 32 -44 6 51 24 54 55 200 217 134 120 75 101 216 141 41 53 170 187
7728 187 154 186 239 195 190 233 179 179 282 330 163 177 77 258 178 211 244 176 251 246 232 116 179 294 76 231 158
7755 158 26 101 253 182 254 165 161 82 67 97 67 -5 31 -12 68 113 21 30 45 -31 -11 33 41 -41 -166 -22 -54 -77 -51
7784 -51 -21 -126 -69 -87 -242 -153 -119 -182 -124 -284 -54 -153 -161 -149 -214 -236 -144 -242 -278 -196 -233 -226 -226 -181 -251 -195 -207 -158 -137 -186
7814 -186 -100 -186 -162 -138 -56 -149 -248 -83 -280 -206 -114 -198 -105 38 -87 -229 -195 -135 -62 -106 -39 -28 -121 61 36 33 142
7841 142 155 -13 41 236 97 -50 97 218 69 77 148 162 126 92 117 210 49 109 202 88 233 156 164 315 303
7866 303 215 81 219 233 226 322 191 88 228 223 176 162 288 263 177 214 52 143 296 132 29 158 198 150 168
7891 168 244 146 130 41 -46 120 133 80 49 68 72 -12 18 -83 13 -23 -31 -89 -81 -2 -126 -98 -128 -124 -104 -164 -241 -145 0 -236
7921 -236 -113 -150 -223 -225 -126 -175 -117 -143 -213 -149 -258 -89 -191 -302 -269 -171 -152 -122 -100 -179 -183 -174 -57 -198 -278 -93 -166
7948 -166 -280 -94 -61 -82 -65 8 -66 -141 -141 -20 -151 34 -41 -81 -59 -102 -38 -30 -139 -89 80 109 38 -3 -93 61 -8
7975 -8 -20 30 42 21 42 293 176 61 150 154 149 141 152 131 75 130 208 148 304 233 95 165 223 135 256 234 190 327 134
8004 134 198 70 159 224 153 261 153 162 206 77 108 104 116 210 54 62 125 -26 119 -22 60 33 -45 167 -74 1
8030 1 10 18 -13 -38 6 28 -105 -204 -51 -89 -71 -168 -124 -116 -35 -154 -123 -118 -262 -174 -190 -291 -243 -207 -231 -115 -230 -176 -223
8059 -223 -167 -225 -113 -199 -296 -109 -130 -204 -99 -308 -160 -269 -126 -219 -276 -148 -83 -233 -165 -122 -150 -222 -106 -167 -168
8084 -168 2 -154 -193 -33 -190 -24 -149 49 -42 59 78 34 -94 19 92 43 3 48 123 35 152 -13 74 65
8108 65 294 83 198 238 238 69 32 150 118 79 120 243 241 199 201 246 306 172 223 157 180 240 124 301 303 142 107
8135 107 123 105 120 241 138 58 134 121 157 78 182 41 43 104 -8 -6 71 103 142 -34 -46 65 60 78 38 -12 -78 38
8163 38 17 -100 -6 -47 -6 -28 -19 -67 -182 -147 -221 -125 -11 -127 -178 -219 -110 -91 -224 -115 -195 -168 -193 -141 -230 -71 -156
8190 -156 -127
8191a27
##END NTUPLES=NMR FID
##END=
