##TITLE=1H_TG-2295
 CDCl3, 8 sc, 
 5.7.2020
##JCAMPDX= 6.0         $$ Bruker NMR JCAMP-DX V2.0
##DATA TYPE= NMR FID
##DATA CLASS= NTUPLES
##ORIGIN= UXNMR, Bruker Analytische Messtechnik GmbH
##OWNER= root
$$ XWIN-NMR		Version 3.5
$$ Wed Aug  5 11:07:35 2020 Russian Standard Time (UT+4h)  she@DPX200
##.OBSERVE FREQUENCY= 200.1314999998
##.OBSERVE NUCLEUS= ^1H
##.DELAY= (6, 6)
##.ACQUISITION MODE= SIMULTANEOUS
##.ACQUISITION SCHEME= undefined
##.AVERAGES= 8
##.DIGITISER RES= 18
##SPECTROMETER/DATA SYSTEM= spect
##.PULSE SEQUENCE= zg30
##.SOLVENT NAME= CDCl3
##.SHIFT REFERENCE= (INTERNAL, CDCl3, 0, 15.7039)
##AUDIT TRAIL= $$ (NUMBER, WHEN, WHO, WHERE, WHAT)
$$ ##TITLE= Audit trail, XWIN-NMR		Version 3.5
$$ ##JCAMPDX= 5.01
$$ ##ORIGIN= Bruker BioSpin GmbH
$$ ##OWNER= she
$$ F:/spectra/data/she/nmr/H-F/1/audita.txt
$$ ##AUDIT TRAIL=  $$ (NUMBER, WHEN, WHO, WHERE, WHAT)
(   1,<2020-08-05 11:06:26.95 +0400>,<she>,<DPX200>,
      <created by zg, POWCHK disabled, PULCHK disabled
       configuration hash MD5:
       00 E9 B6 7A A2 85 ED C7 34 08 36 98 17 FE 4E 26
       data hash MD5: 16K
       3C 07 71 51 BB 76 7D 71 8D 17 BE 58 87 E2 2C 29>)
$$ ##END=
$$ 
$$ hash MD5
$$ DB 26 4F F6 D0 D6 11 B4 D5 96 95 5B EE EA 24 93
##$RELAX= 
##$RELAX= 
##$RELAX= 
##$RELAX= 
##$RELAX= 
##$RELAX= 
$$ Bruker specific parameters
$$ --------------------------
##$DU= <F:/spectra>
##$EXPNO= 1
##$NAME= <H-F>
##$PROCNO= 1
##$TYPE= <nmr>
##$USER= <she>
##$AMP= (0..31)
100 100 100 100 100 100 100 100 100 100 100 100 100 100 100 100 100 100 
100 100 100 100 100 100 100 100 100 100 100 100 100 100 
##$AQSEQ= 0
##$AQ_mod= 1
##$AUNM= <au_zg>
##$AUTOPOS= <>
##$BF1= 200.13
##$BF2= 200.13
##$BF3= 200.13
##$BF4= 200.13
##$BF5= 200.13
##$BF6= 200.13
##$BF7= 200.13
##$BF8= 200.13
##$BYTORDA= 1
##$CFDGTYP= 0
##$CFRGTYP= 5
##$CHEMSTR= <none>
##$CNST= (0..31)
1 1 145 1 1 1 1 1 1 1 1 1 1 1 1 1 1 1 1 1 1 1 1 1 1 1 1 1 1 1 1 1 
##$CPDPRG= <>
##$CPDPRG1= <>
##$CPDPRG2= <>
##$CPDPRG3= <>
##$CPDPRG4= <mlev>
##$CPDPRG5= <mlev>
##$CPDPRG6= <mlev>
##$CPDPRG7= <mlev>
##$CPDPRG8= <mlev>
##$CPDPRGB= <>
##$CPDPRGT= <>
##$D= (0..31)
0 1.2 0 0 0 0 0 0 0 0.06 0 0.03 0 0 0 0 0.0002 0 0 0 0 0 0 0 0 0 0 0 0 
0 0 0 
##$DATE= 1596611186
##$DBL= (0..7)
120 120 120 120 120 120 120 120 
##$DBP= (0..7)
150 150 150 150 150 150 150 150 
##$DBP07= 0
##$DBPNAM0= <>
##$DBPNAM1= <>
##$DBPNAM2= <>
##$DBPNAM3= <>
##$DBPNAM4= <>
##$DBPNAM5= <>
##$DBPNAM6= <>
##$DBPNAM7= <>
##$DBPOAL= (0..7)
0.5 0.5 0.5 0.5 0.5 0.5 0.5 0.5 
##$DBPOFFS= (0..7)
0 0 0 0 0 0 0 0 
##$DE= 6
##$DECBNUC= <off>
##$DECIM= 24
##$DECNUC= <off>
##$DECSTAT= 4
##$DIGMOD= 1
##$DIGTYP= 9
##$DL= (0..7)
0 120 120 120 120 120 120 120 
##$DP= (0..7)
150 150 150 150 150 150 150 150 
##$DP07= 0
##$DPNAME0= <>
##$DPNAME1= <>
##$DPNAME2= <>
##$DPNAME3= <>
##$DPNAME4= <>
##$DPNAME5= <>
##$DPNAME6= <>
##$DPNAME7= <>
##$DPOAL= (0..7)
0.5 0.5 0.5 0.5 0.5 0.5 0.5 0.5 
##$DPOFFS= (0..7)
0 0 0 0 0 0 0 0 
##$DQDMODE= 0
##$DR= 18
##$DS= 0
##$DSLIST= <SSSSSSSSSSSSSSS>
$$ [...]
##$SUBNAM2= <"">
##$SUBNAM3= <"">
##$SUBNAM4= <"">
##$SUBNAM5= <"">
##$SUBNAM6= <"">
##$SUBNAM7= <"">
##$SUBNAM8= <"">
##$SUBNAM9= <"">
##$SW= 24.9337058888022
##$SWIBOX= (0..15)
0 0 2 0 0 0 0 0 0 0 0 0 0 0 0 0 
##$SW_h= 4990.01996007984
##$TD= 16384
##$TD0= 1
##$TE= 0
##$TE2= 300
##$TE3= 300
##$TEG= 300
##$TL= (0..7)
0 120 120 120 120 120 120 120 
##$TP= (0..7)
150 150 150 150 150 150 150 150 
##$TP07= 0
##$TPNAME0= <>
##$TPNAME1= <>
##$TPNAME2= <>
##$TPNAME3= <>
##$TPNAME4= <>
##$TPNAME5= <>
##$TPNAME6= <>
##$TPNAME7= <>
##$TPOAL= (0..7)
0.5 0.5 0.5 0.5 0.5 0.5 0.5 0.5 
##$TPOFFS= (0..7)
0 0 0 0 0 0 0 0 
##$TUNHIN= 0
##$TUNHOUT= 0
##$TUNXOUT= 0
##$USERA1= <user>
##$USERA2= <user>
##$USERA3= <user>
##$USERA4= <user>
##$USERA5= <user>
##$V9= 5
##$VALIST= <valist>
##$VCLIST= <CCCCCCCCCCCCCCC>
##$VD= 0
##$VDLIST= <DDDDDDDDDDDDDDD>
##$VPLIST= <PPPPPPPPPPPPPPP>
##$VTLIST= <TTTTTTTTTTTTTTT>
##$WBST= 1024
##$WBSW= 4
##$XGAIN= (0..3)
0 0 0 0 
##$XL= 0
##$YL= 0
##$YMAX_a= 181345
##$YMIN_a= -120278
##$ZGOPTNS= <>
##$ZL1= 120
##$ZL2= 120
##$ZL3= 120
##$ZL4= 120
##$ABSF1= 10
##$ABSF2= 0
##$ABSG= 5
##$ABSL= 3
##$ALPHA= 0
##$AQORDER= 0
##$ASSFAC= 0
##$ASSFACI= 0
##$ASSFACX= 0
##$ASSWID= 0
##$AUNMP= <proc_1d>
##$AZFE= 0.1
##$AZFW= 0.1
##$BCFW= 1
##$BC_mod= 2
##$BYTORDP= 1
##$COROFFS= 0
##$CY= 11.3945322036743
##$DATMOD= 1
##$DC= 2
##$DFILT= <>
##$DTYPP= 0
##$F1P= 16.9975609425685
##$F2P= -3.02152046262296
##$FCOR= 0.5
##$FTSIZE= 0
##$FT_mod= 4
##$GAMMA= 1
##$GB= 0.15
##$INTBC= 1
##$INTSCL= 1
##$ISEN= 128
##$LB= 0.24
##$LEV0= 0
##$LPBIN= 0
##$MAXI= 10000
##$MC2= 0
##$MEAN= 0
##$ME_mod= 0
##$MI= 1.114404
##$NCOEF= 0
##$NC_proc= 0
##$NLEV= 6
##$NOISF1= 3.799351
##$NOISF2= 2.8
##$NSP= 1
##$NTH_PI= 0
##$NZP= 0
##$OFFSET= 15.70392
##$PC= 1
##$PHC0= -9801.49
##$PHC1= 24.20093
##$PH_mod= 1
##$PKNL= yes
##$PPARMOD= 0
##$PSCAL= 0
##$PSIGN= 0
##$REVERSE= no
##$SF= 200.130013532006
##$SI= 16384
##$SIGF1= 3
##$SIGF2= 2
##$SINO= 400
##$SIOLD= 16384
##$SREGLST= <1H.CDCl3>
##$SSB= 0
##$STSI= 0
##$STSR= 0
##$SW_p= 3612.71676300578
##$SYMM= 0
##$S_DEV= 0
##$TDeff= 0
##$TDoff= 0
##$TI= <>
##$TILT= no
##$TM1= 0
##$TM2= 0
##$TOPLEV= 0
##$USERP1= <user>
##$USERP2= <user>
##$USERP3= <user>
##$USERP4= <user>
##$USERP5= <user>
##$WDW= 1
##$XDIM= 8192
##$YMAX_p= 0
##$YMIN_p= 0
$$ End of Bruker specific parameters
$$ ---------------------------------
##NTUPLES= NMR FID
##VAR_NAME=  TIME,          FID/REAL,        FID/IMAG
##SYMBOL=    X,             R,               I
##VAR_TYPE=  INDEPENDENT,   DEPENDENT,       DEPENDENT
##VAR_FORM=  AFFN,          ASDF,            ASDF
##VAR_DIM=   8192,          8192,            8192
##UNITS=     SECONDS,       ARBITRARY UNITS, ARBITRARY UNITS
##FACTOR=    0.0002004,     1,               1
##FIRST=     0,             0,               0
##LAST=      1.6414764,     0,               0
##MIN=       0,             -120278,         0
##MAX=       1.6414764,     181345,          0
$$ Real data points
##PAGE= N=1
##DATA TABLE= (X++(R..R)), XYDATA
$$ [...]
2463a574K175R9k594K069J306l234r4K902n95k541K066l0j982J911J210k894m68
$$ -1574 601 700 -1894 175 1481 -1753 -1847 1055 460 -2081 -15 -45 -2027 -116 1094 -1800 -2268
2480b268L128o84k447J888P42j965J003J568k381m94L039j046k198K589L92k977
$$ -2268 860 176 -2271 -383 359 -1606 -603 965 -1416 -1910 1129 83 -2115 474 866 -2111
2496b111J189K509j960j308K458p56j474K589l15l084J191L151k376j656K517
$$ -2111 -922 1587 -373 -1681 777 21 -1453 1136 821 -2263 -1072 2079 -297 -1953 564
2511E64q7j765J999J55k211Q27K431k153j186K456j35k175J709J216k360P7K332
$$ 564 477 -1288 711 866 -1345 -518 1913 -240 -1426 1030 895 -1280 429 1645 -715 -638 1694
2528A694j581j004K475p34k410K150J922k941r98K946p20j455K206p55k391K257
$$ 1694 113 -891 1584 850 -1560 590 2512 -429 -1427 1519 799 -656 1550 795 -1596 661
2544F61J390k465q60K875p81j936J931K63k227J236J305k094k58K591j488j930
$$ 661 2051 -414 -1274 1601 820 -1116 815 1078 -1149 87 1392 -702 -960 1631 143 -1787
2560a787K653J020l199N06K089j298p38K038j475j403K925Ql080P52K839j648
$$ -1787 866 1886 -1313 -807 1282 -16 -754 1284 -191 -1594 1331 1339 -1741 -989 1850 202
2576B02j409J776J24j900J701N90k663R33K365k020j477K829O0k468J173J203
$$ 202 -1207 569 693 -1207 494 1084 -1579 -646 1719 -301 -1778 1051 1111 -1357 -184 1019
2592A019j513j7J573j678j041L080p27k812J875K285k728q45K276o81r18J827
$$ 1019 -494 -511 1062 -616 -1657 1423 696 -2116 -241 2044 -684 -1529 747 66 -852 975
2608I75m01k697K115K059k948o67L058o21k240J695M83j860J066J324k549n0L320
$$ 975 574 -2123 -8 2051 -897 -1564 1494 873 -1367 328 811 -1049 17 1341 -1208 -1258 2062
2625B062j431k939K302J318k724K32K146j646m33K277j259j851K613R56l229%
$$ 2062 631 -2308 -6 1312 -1412 -1180 966 -680 -1113 1164 -95 -1946 667 1623 -1606 -1606
2641a606K771j407j294K034n86j100J867L04k917J308K479k269j682K753P27k713
$$ -1606 1165 -242 -1536 498 -88 -1188 679 983 -1934 -626 1853 -416 -2098 655 1382 -1331
2657a331J367P91j511J38J795j632j173K793l36k396J283K340k358o66K049p55
$$ -1331 36 827 -684 -546 1249 -383 -1556 1237 901 -1495 -212 2128 -230 -896 1153 398
2673C98q94J877o13k278J903J966k803q15K654l29k019J775J64k142J315J581
$$ 398 -496 1381 768 -1510 393 2359 -444 -1259 1395 1066 -953 822 986 -1156 159 1740
2689A740j905q07K512p24k474K126J099k393K65J831j225o06J902j197k017K119
$$ 1740 -165 -972 1540 816 -1658 468 1567 -826 -561 1270 45 -561 1341 144 -1873 246
2705B46J503k983j18K904j491j379K095k79j696J690Q45k510K91K642j704j575
$$ 246 1749 -1234 -1352 1552 61 -1318 777 498 -1198 492 1337 -1173 -882 1760 56 -1519
2721a519K351l1k072J361J374k460pK253j553j344K444P1k863J366K168k091o98
$$ -1519 832 801 -1271 90 1464 -996 -1003 1250 -303 -1647 797 868 -1995 -629 1539 -552 -1250
2738a250J995j026q47K138k00k774J600J818j938r11K244o25j524J958L07k176
$$ -1250 745 -281 -1128 1010 810 -1964 -364 1454 -484 -1395 849 224 -1300 658 965 -1211
2754a211O24K159k054p02K754j353j496J863P42k558J43K258j717o31K045p13
$$ -1211 -587 1572 -482 -1184 1570 217 -1279 584 1326 -1232 -1089 1169 -548 -1179 866 153
2770A53j905J975J132k808K20K556j597r65J806M4k458J978J058k471J30K440
$$ 153 -1752 223 1355 -1453 -1233 1323 -274 -1239 567 611 -1847 131 1189 -1282 -1152 1288
2786A288j718r94K456j6k364J193J772k379N2J991j312j252K373R2k123J195J195
$$ 1288 -430 -1424 1032 1016 -1348 -155 1617 -762 -710 1281 -31 -1283 1090 1182 -941 254 1449
2803A449j959m9J755j272j361K602Ok378J274J500j721j051K645j255j326J867
$$ 1449 -510 -559 1196 -76 -1437 1165 1171 -1207 67 1567 -154 -1205 1440 185 -1141 726
2819G26P85k785Q79J848j800l06K371r62k098J679J003k273M90J971j706n61J861
$$ 726 1511 -1274 -395 1453 -347 -653 1718 756 -1342 337 1340 -933 -443 1528 -178 -739 1122
2836A122l62k080K081O90k332M75J588j358r61K218l97j834J437J039k371K78
$$ 1122 760 -1320 761 1451 -881 -406 1182 -176 -1137 1081 684 -1150 287 1326 -1045 -767
2852g67K148j754j324K429k04k394J608J374k157K67J982j494j251J969M56k503
$$ -767 1381 -373 -1697 732 528 -1866 -258 1116 -1041 -774 1208 -286 -1537 432 888 -1615
2868a615J307J293j679l83K116r66j768K206L14j894O43J589j729n82K086p32
$$ -1615 -308 985 -694 -1077 1039 73 -1695 511 825 -1069 -426 1163 -566 -1148 938 206
2884B06j645J797O13k163P09J649j644r87K527q62j638J702P26k222N07J863j882
$$ 206 -1439 358 971 -1192 -483 1166 -478 -1465 1062 200 -1438 264 990 -1232 -725 1138 -744
2901g44l06J935m66j946J583Q63k080N19K021j243j458K285j30k140J253J056
$$ -744 -1050 885 419 -1527 56 919 -1161 -642 1379 136 -1322 963 833 -1307 -54 1002
2917A002j820J05K226j583j248K037L71k145J160J207j874r9K357j814j417K449
$$ 1002 -818 -713 1513 -70 -1318 719 1090 -1055 105 1312 -562 -661 1696 -118 -1535 914
2933I14L22k293J136J605k441J90J895p44j759J766M94j987P13J837k382k11K545
$$ 914 1236 -1057 79 1684 -757 -567 1328 584 -1175 591 1085 -902 -189 1648 -734 -945 1600
2950A600r25j858J745O05k035P53J545j604q45K096m31j861J621J026k342O33
$$ 1600 675 -1183 562 1167 -868 -115 1430 -174 -1019 1077 646 -1215 406 1432 -910 -277
2966b77J720j450r99J905j65j845J575O74k182N49K026j418j258J709J29j771
$$ -277 1443 -7 -1006 899 734 -1111 464 1138 -1044 -495 1531 113 -1145 564 693 -1078
2982a078Q41J452k185N54J732j533j233K492m00k226J349J202j850J98J765j406
$$ -1078 -237 1215 -970 -416 1316 -217 -1450 1042 642 -1584 -235 967 -883 -685 1080 -326
2998c26j117K123J52k393J400J306j981o14K045l12j629J610N22k385J053J704
$$ -326 -1443 680 832 -1561 -161 1145 -836 -1450 595 283 -1346 264 786 -1599 -546 1158
3014A158j797l73J702m90j562J392O02j885Q91J820k134l04J970p99j891J751
$$ 1158 -639 -1012 690 200 -1362 30 632 -1253 -362 1458 -676 -980 990 191 -1700 51
3030E1R21j949K98J889j351j040J930k06j716J507R49k060J14J906r66j241K010
$$ 51 972 -977 -679 1210 -141 -1181 749 543 -1173 334 1283 -777 -663 1243 277 -964 1046
3047A046r8j567J101J099k144k74K074j298p96J647n6j677J113J146j561m12J754
$$ 1046 948 -619 482 1581 -563 -837 1237 -61 -857 790 734 -943 170 1316 -245 -657 1097
3064A097q45j278J677K96k189J106J450j423p31K034j049j232J958K4j787P47
$$ 1097 252 -1026 651 947 -1242 -136 1314 -109 -840 1194 145 -1087 871 895 -892 -145
3080a45J711j853m23J895j010j356J737N76k031P50J457j526q12J890j46k077
$$ -145 1566 -287 -710 1185 175 -1181 556 1132 -899 -149 1308 -218 -1030 860 714 -1363
3096a363J633P94j956K05J761j458l95J693m40j951J501J066k132K33J816j170
$$ -1363 270 1064 -892 -687 1074 -384 -779 914 474 -1477 24 1090 -1042 -809 1007 -163
3112a63q08J601l12j494J395J042j723k04J977j128j229J546J90k034J336J027
$$ -163 -971 630 318 -1176 219 1261 -462 -666 1311 183 -1046 500 690 -1344 -8 1019
3128A019j767J58J634q08j532J887K25j789M81J690j969l06J622n95j239J730
$$ 1019 -748 -590 1044 236 -1296 591 816 -973 -492 1198 -771 -1077 545 -50 -1289 441
3144D41K78k235J184J585j574p89J901l07j583R28P86j709P63J576j588r78K024
$$ 441 719 -1516 -332 1253 -321 -1110 791 484 -1099 -171 615 -1094 -331 1245 -343 -1321 703
3161G03k94j754J242J125k121M71J866j607m80J845l89j797J387N75j489K80J611
$$ 703 409 -1345 -103 1022 -1099 -628 1238 -369 -849 996 607 -1190 197 772 -717 -437 1174
3178A174j041j178J957k04j832J041J205j928L66J615r88j241J682J42j597J044
$$ 1174 133 -1045 912 708 -1124 -83 1122 -806 -440 1175 187 -1054 628 770 -827 217
3194B17R78j456l84J978r13j387J630R7j482Q91R05j399n33K146q24j400J514
$$ 217 1195 -261 -645 1333 420 -967 663 760 -722 169 1074 -325 -858 1288 464 -936 578
3211E78O11j800N26J311j362m79J448m42j123J108O43k140J039J474j696j083
$$ 578 1189 -611 -85 1226 -136 -615 833 391 -732 376 1019 -1121 -82 1392 -304 -1387
3227a387K018k34j185Q06O19j295K2J760j182q39J561l81j545J455P31k061L56
$$ -1387 631 397 -788 18 637 -658 -636 1124 -58 -897 664 283 -1262 193 924 -1137 -781
3244g81J586j076n56J221L2j725J118J013j500l82J759o95j304J818k03j381Q58
$$ -781 805 -271 -827 394 426 -1299 -181 832 -668 -1050 709 14 -1290 528 325 -1056 -198
3261a98J446j845j72J774o67j348J519K07j846P70J544j778m86J818p42j129J356
$$ -198 1248 -597 -769 1005 338 -1010 509 716 -1130 -360 1184 -594 -1080 738 -4 -1133 223
3278B23O39j749L65J396r96n73J475m33j908J975O14j838J11J476q18q80J410
$$ 223 862 -887 -522 874 -122 -695 780 347 -1561 414 1028 -810 -699 777 -41 -921 489
3295D89k77j461J355P89j840K78J735j284q76J925kj843J025J071j714J57J247
$$ 489 212 -1249 106 895 -945 -667 1068 -216 -1092 833 831 -1012 13 1084 -630 -473 774
3312G74r08p78J603J10k062J304J089j525j00J503r74r21J603K08j973R74J328
$$ 774 -134 -912 691 801 -1261 43 1132 -393 -493 1010 36 -885 718 926 -1047 -73 1255
3329A255j661k82J512o83o23Q48L59j431P20J101j370l34J937j010j227J478N47
$$ 1255 -406 -688 824 141 -482 366 725 -706 14 1115 -255 -589 1348 338 -889 589 1136
3346A136j452J11J162r72l03J867q72j708J450Q65j563J31J335j079p83J828q11
$$ 1136 -316 -205 957 -15 -318 1549 677 -1031 419 1284 -279 -148 1187 108 -675 1153 342
3363C42j014Q38R43j728J68J308q65q17J257N9j518Q78P66j504K65J489j246p48
$$ 342 -672 166 1109 -619 -451 857 -8 -825 432 491 -1027 -149 617 -887 -622 867 -379 -1127
3381a127J627J29j788J022N91j031Q0J516j244j018J689P5j469M84J056j296l14
$$ -1127 500 629 -1159 -137 454 -577 -497 1019 -225 -1243 446 521 -948 -464 592 -704 -1018
3398a018J554p11j229J495Q39j844M51J125j522j56J318j3j738J440K24j235N18
$$ -1018 536 -175 -1404 91 930 -914 -463 662 -860 -1016 302 289 -1449 -9 215 -1020 -502
3415e02J179j056p76J841l38j370J121O15j421M87J100j193m82J747m43j326R94
$$ -502 677 -379 -1155 686 348 -1022 99 714 -707 -220 880 -313 -795 952 509 -817 177
3432A77Q92j512K31J466r52o98J417m47j310J233O76j732L27J363o88j219J421
$$ 177 1069 -443 -212 1254 302 -396 1021 574 -736 497 1173 -559 -232 1131 443 -776 645
3449F45K95j493N44J054j373K2J502j222q56J358L30j506Q14J111j583l84J888
$$ 645 940 -553 -9 1045 -328 -306 1196 -26 -882 476 806 -700 114 1225 -358 -742 1146
3466A146p65j320J444m7j283P24J017j419n9J172m39j220J265L35j424N67J167
$$ 1146 381 -939 505 458 -825 -101 916 -503 -562 610 171 -1049 216 551 -873 -306 861
3483H61j331o57J825m07j484J133O39j543O49Q50j197k61J592j71j277R62N69
$$ 861 -470 -1127 698 291 -1193 -60 579 -964 -315 535 -662 -923 669 498 -779 183 752
3500G52j391K07J186r67r69K100o17j154R50Q93j382r6J204p76r14J470l22j027
$$ 752 -639 -432 754 -213 -1182 918 301 -853 97 990 -392 -488 716 -60 -974 496 174 -853
3518h53Q47R14j471J52J391q06j038J187J50j442J021N39j014J19J165r52r78
$$ -853 -6 908 -563 -411 980 174 -864 323 473 -969 52 591 -423 -304 861 -91 -1069
3535a069J454J93j324L21J294j094n10J629n35j343J280N14j385K29Q89r95k60
$$ -1069 385 578 -746 -425 869 -225 -735 894 359 -984 296 810 -575 -346 543 -452 -712
3552g12J422p05q15J119L51j084R3J093r43r38J691k69j267Q33P30j517J39J397
$$ -712 710 5 -810 309 660 -424 -331 762 -181 -1119 572 303 -964 -131 599 -918 -779 618
3570F18n81j005J441j05r58O03Q61j271l50J354m57r92J244J07r01N81O31j237
$$ 618 37 -968 473 368 -590 13 874 -397 -747 607 150 -842 402 509 -392 189 820 -417
3588d17m5J354q50r46J200K83j145P09O44p95l19J177m98j125J267M29j526M55
$$ -417 -462 892 42 -904 296 579 -566 143 787 -8 -327 850 352 -773 494 923 -603 -148
3606a48J102j174l98J012m9r77J180K29j351N45J074r04p36J508l25j027P36K59
$$ -148 954 -220 -618 394 345 -632 548 777 -574 -29 1045 141 -595 913 588 -439 297 556
3624E56r58L49P21q66m27J140j31j089N60O14j177K30J363r96r12J307O5j273
$$ 556 -402 -53 668 -198 -625 515 384 -705 -145 469 -708 -478 885 -111 -1023 284 349 -924
3642i24P96M76j201L28J110o49r90J072L48j576J532lq35j07J058l77j115J290
$$ -924 -128 348 -853 -525 585 -64 -1054 18 366 -1210 322 319 -516 -623 435 58 -1057 233
3660B33K68j450N04R95q78k52J483p72j137J210J04j338R90N75q67m55J254k32
$$ 233 501 -949 -445 550 -328 -580 903 131 -1006 204 308 -1030 -40 535 -332 -787 467 235
3678B35r69R67J77j308M32J217r65n85J230k8j002N12N36q68m6J112p84j01P78
$$ 235 -734 233 410 -898 -466 751 -214 -799 431 403 -599 -87 449 -419 -465 647 -137 -238 540
3697E40K1j304P40R52j061j82J212o93p08R10n1j009Q68P56j225m22J349k37j056
$$ 540 561 -743 -3 949 -112 -294 918 225 -483 427 376 -633 235 991 -234 -656 693 456 -600
3716f00J063P3j084P63N89j154J2J216q56n77R18K45j335N90R92j308j17J076
$$ -600 463 536 -548 215 804 -350 -338 878 22 -555 363 608 -727 -137 855 -453 -570 506
3734E06m22p92J199J12j244N98P81p76o63J101K1r64Q75J33r99M37Q45j006n39
$$ 506 84 -708 491 603 -641 -43 738 -38 -701 400 421 -543 332 465 -534 -97 748 -258 -797
3753g97J168R8j142R69N23j368M63M74l58n69J150j26j333P30P35j125J44J025
$$ -797 371 469 -673 296 819 -549 -86 388 30 -539 611 485 -848 -118 617 -508 -364 661
3771F61m23p79P33N5j271J081M99j198k78J235p1q84R71k56o10L31P36j232K9
$$ 661 238 -541 192 247 -1024 57 556 -642 -920 315 244 -640 331 75 -535 -204 532 -700 -671
3790f71J416r32r19J077M50r33J83O65q85M1P48k18p94Q73M25j188L65J022p23
$$ -671 745 -187 -1106 -29 421 -512 -329 336 -549 -508 240 22 -772 101 526 -662 -297 725 2
3809Bo87J021m60k70N60K35j417R82Q54j195m16J525k65j192N94P81j157NJ058
$$ 2 -685 336 -124 -394 166 401 -1016 -34 820 -375 -791 734 469 -723 -129 652 -505 -500 558
3828E58p66q8P81k17j013O71O26o59k64R07n84j24Q02r0j272O87J144j266k97
$$ 558 -208 -296 485 268 -745 -74 552 -107 -371 536 -48 -172 630 540 -732 -45 1099 -167 -464
3847d64J185l91p54Q09L07j258Q52N03j212k70J537l51j301R17O08j302L3R96
$$ -464 721 330 -424 385 692 -566 286 789 -423 -693 844 493 -808 109 717 -585 -552 444
3865D44q39Q1J178q88r73J242N14j059k58J311r04j90J024l73q58O77O43j395
$$ 444 -395 -314 864 -24 -997 245 759 -300 -558 753 -151 -341 683 310 -548 129 772 -623
3883f23M06J451j332m61R01K52j105J69J057j231J84P34o47n51J026K44j772J121
$$ -623 -217 1234 -98 -559 342 594 -511 -342 715 -516 -332 402 -245 -796 230 474 -1298 -177
3901a77R45j101k01N87j23p67J326%j289Q05P62j134m50J052q1q23O32J35r1K49
$$ -177 768 -333 -534 53 -70 -837 489 489 -800 5 767 -367 -817 235 154 -669 -37 98 7 256
3921B56K18q84j57J230l05j133Q58M95q93K11O24p03l53J121m89q99J159K37r59
$$ 256 474 -410 -567 663 358 -775 83 578 -315 -104 520 -183 -536 585 96 -803 356 593 -366
3940c66q5J088p75m33J004l28p29O16O49j569J010P47j006n77J053P7o70K60M51
$$ -366 -451 637 -138 -571 433 105 -624 -8 641 -928 82 829 -177 -754 299 376 -294 -34 417
3959D17p63M52Q90j187l98J205J30j586N37J189j006l47R94l70o03J176q4j284
$$ 417 -346 106 996 -191 -589 616 746 -840 -303 886 -120 -467 527 157 -446 730 646 -638
3977f38P37O82j299J7J334m64o03K93J46m42L29O26j146j88J267m09q61N18N96
$$ -638 99 781 -518 -501 833 369 -234 59 205 -237 92 718 -428 -616 651 242 -619 -101 495
3996D95p51L2K67k25m8P96l89q15P58O21j189j81J190m82l97R26o31m42R69K04
$$ 495 -256 -224 43 -182 -230 566 177 -638 120 741 -448 -629 561 79 -318 608 -23 -465 504 708
4016G08j387K83J165n91r55R18J62p08M78N60j280M31P57p10p37J228L82j435
$$ 708 -679 -396 769 178 -777 141 303 -405 73 633 -647 -216 541 -169 -906 322 704 -731
4034g31L41Q26n67n02Q66m07p09J595m37j356R22P32q49k71J044l50r38J053j38
$$ -731 -390 436 -131 -633 233 -174 -883 712 275 -1081 -159 573 -276 -547 497 147 -791 262 124
4053A24r22Q20M44q65PP23K86j202O36L24p62L01P91j201j47J268k94j027O38
$$ 124 -798 22 466 -399 -392 331 617 -585 51 375 -387 -86 705 -496 -643 625 331 -696 -58
4072e8O71r32j87J054l21o40Q20j33r21P37N06j384M55Q82n55p89J043M4n77L65
$$ -58 613 -319 -506 548 227 -413 407 274 -647 90 596 -788 -333 549 -6 -795 248 292 -285 80
4092H0P05j335L32J104j068p09J474J21j326Q15N70j184L65Q07p22o47J343P8
$$ 80 785 -550 -218 886 -182 -891 583 704 -622 193 763 -421 -56 751 29 -618 725 803
4110H03j237K06J021o75n93J253l59q56Q71j12q36N26N02j051J87J035l15n12
$$ 803 -434 -228 793 118 -475 778 419 -437 434 322 -514 12 514 -537 -350 685 370 -142
4128a42J56K42j006P58L93p85K50O85m53r55R06P03j247J03Q69n72l58J039m82
$$ -142 14 256 -750 8 401 -384 -134 551 98 -857 49 752 -495 -392 477 -95 -453 586 104
4147A04p09Q98N0j144N99Q50l91q24Q11J15o86M89M11q60J85R19r80n60P80J43
$$ 104 -605 293 343 -801 -202 648 257 -567 244 359 -327 162 573 -287 -102 817 -163 -723 57 200
4167B00q97L67P34q40Q6Q12n81n36J119l68p94P47L65j064j40O68J94o10P24Q
$$ 200 -697 -330 404 -436 -350 462 -119 -655 464 96 -698 49 414 -650 -790 -122 72 -538 186 194
4187A94o90M02N79m62o51J270m50o53Q30K48j132N00N77p43n84J402j88j117R16
$$ 194 -496 -94 485 23 -628 642 192 -461 369 617 -515 -15 562 -181 -765 637 449 -668 248
4206B48L93j120J76P58k93n44Q71m29p53J089K77j325L82R34o97o36J206k70q32
$$ 248 641 -479 -303 455 162 -382 489 60 -693 396 673 -652 -270 664 -33 -669 537 267 -565
4225e65P64N17j208K3J425r15n53R25J50n30J79L47j092L51P53k22p81O29L70
$$ -565 199 716 -492 -469 956 41 -512 413 563 33 212 559 -533 -182 571 349 -432 197 567
4244E67j049L93P86j088n0P49k21n76M24M71p64M83O31r38m63J069j05q06M81
$$ 567 -482 -89 697 -391 -441 308 87 -489 -65 406 -358 125 756 -182 -645 424 319 -487 -6
4263fM78r10K07R36r47j58R87l75r14P38N98q95oJ092r33k67Q57j33r23Q80Q3
$$ -6 472 -438 -231 705 -242 -400 587 212 -702 36 634 -261 -267 825 -108 -375 482 349 -574 306 389
4284C89q09L55N32n02o29P65L23q27L95L73j049K62O68o76k60J018n2j041M71
$$ 389 -420 -65 467 -35 -664 101 424 -403 -8 365 -684 -422 246 -430 -690 328 276 -765 -294
4303b94P81r50J33O25n09m21J066Q3j260K83J163r86q7Q62l83n79J046m19p13
$$ -294 487 -463 -330 295 -214 -635 431 514 -746 -463 700 -286 -373 489 106 -473 573 154 -559
4322e59K31J020m92r42J128q3q31Q27j62q81O93O44p90j17O34j19m59J49M99q25
$$ -559 -328 692 200 -742 386 303 -528 299 137 -744 -51 593 -197 -314 320 201 -258 -109 390 -435
4342d35L64N20m95o28J108j55j093Q93L05o80K95N88n38m62Q25q8p59O06M35j086
$$ -435 -71 449 -46 -674 434 279 -814 79 384 -296 -1 587 49 -413 412 324 -435 171 606 -480
4362d80K68J023p81j42O71k78q98L42P94p57j11R19o73l52P41L45j102J72Q83
$$ -480 -212 811 30 -112 559 281 -617 -275 519 -238 -349 570 -103 -455 286 631 -471 -299 584
4381E84o30k01O13j62p41Q57N1q98L58J191j033m68R09k48r15O60M07o11J00O93
$$ 584 -46 -247 366 204 -537 320 371 -527 -169 1022 -11 -479 430 182 -733 -73 334 -277 -177 516
4401E16p26j66R23j83q71P52K62p01q1Q65o54m78R51k62r70P62Q49j443L09J200
$$ 516 -210 -376 547 364 -507 245 507 -194 -275 590 -64 -542 409 147 -823 -61 788 -655 -346 854
4421H54j170m43J145k69o73O65K81j021L42O54j89q63J019q2p75L91O79r78M4
$$ 854 -316 -759 386 117 -556 109 390 -631 -289 365 176 -687 332 250 -525 -134 545 -433 -389
4440c89P72o58m53R54P3j203P06N93m83l27Q81m69n63P97J48n68kQ56p51n26Q79
$$ -389 383 -275 -728 226 299 -904 -198 395 -88 -415 466 -3 -566 231 379 -189 -191 665 -86 -612 267
4461B67j21p77N64N14q98K31N13q9l04M20j18o48O16R6p33L11L91l66k14R64k98
$$ 267 146 -631 -67 447 -451 -220 293 204 -100 320 202 -446 170 266 -467 -156 235 -131 -345 619 321
4482C21q25P43K41q48K9O67k21l25N86J03j208O86O04q66LR51n67m18Q95k48o34
$$ 321 -504 239 480 -368 -339 328 107 -218 368 471 -737 -51 553 -313 -310 641 74 -344 551 303 -331
4503c31K04P00p42N1Q32m36o50P88L17j070J99N69n44l56P59o3p90R40j44o57
$$ -331 -127 573 -169 -118 714 278 -372 416 733 -337 -138 431 -113 -469 290 227 -563 377 233 -424
4523d24jJ081j058l9J061n57n55O04M84j016L57P60q63n61R54r8n43L64O20q32
$$ -424 -425 656 -402 -441 620 63 -492 112 596 -420 -63 697 -166 -727 227 129 -414 -50 570 -262
4543b62O2M45m64k00R92m2j478J216J72o08k73R45n14m61M29J95q14O28L74p64
$$ -262 -200 245 -219 -419 573 531 -947 269 441 -167 -440 505 -9 -470 -41 154 -660 -32 342 -422
4563d22m8J104n00q30P51K79p42J98O28o81KL52r2n03O01N19r16kM04k31k48N30
$$ -422 -470 634 134 -696 55 334 -408 -210 418 -263 -261 91 -1 -504 97 616 -300 -302 102 -129 -377 153
4585A53o2n77O60J88q40L20O33o62j89N08l5o72N05L32n37M9P25o76l14Q42N6
$$ 153 91 -486 174 362 -478 -158 475 -187 -376 132 97 -575 -70 262 -275 -226 499 -177 -491 351 407
4606D07m21J34L31m13j77N14l37n42J373p38m63M66J90o07M1N73k45n38R11j80
$$ 407 -14 120 451 38 -139 375 38 -504 869 131 -332 134 324 -283 -242 331 86 -452 459 279
4626B79m98J06O32j029J39Q11l8q68N54L94j055M97N56q03O1P33l23o77O88N05
$$ 279 -219 -113 519 -510 -371 440 402 -466 88 482 -573 -76 480 -323 -262 471 148 -529 159 664
4646F64j044J21P41p05M6J78K04p79N78M49q57M56L94o24k74P26k51l48M51J35
$$ 664 -380 -259 482 -223 -177 1 205 -574 4 453 -404 52 446 -178 -452 274 23 -325 126 261
4666B61p78L02O71n17o21Q37j51n47K84N80o71j93J014n98o81R99L0o33N43M09
$$ 261 -517 -215 456 -61 -682 155 4 -543 -259 321 -350 -543 471 -127 -808 191 221 -412 131 540
4686E40j138K70O70m58n43R74l43l26K34Q20j378L67O36n52k53M99K48l93k7O63
$$ 540 -598 -328 342 -116 -659 315 -28 -354 -120 700 -678 -311 325 -227 -480 19 267 -126 -153 510
4706E10q76l6Q25k51q78R03Q0m44J69K88l82m02R76o85m38J134L4r28L93P10r61
$$ 510 -366 -402 423 172 -706 197 277 -167 2 290 -92 -494 482 -203 -641 493 527 -401 -8 702 -259
4727b59N8O70l48o18N76L24m36m0O72o31l01O63P8p44L02N98r00J42P39o45m15
$$ -259 -201 469 121 -497 79 403 -33 -73 599 -32 -333 330 408 -336 -34 564 -336 -194 545 -100 -515
4748e15Q16R3p94L97K10l78j38R24l44o87Q94l52k19K27L55o16QO63n79k97N28
$$ -515 301 394 -400 -3 207 -171 -309 615 271 -416 478 126 -93 134 489 -127 -119 544 -35 -332 196
4769A96M60q76K22N07o70m7N98j89q34P84K51l08j65O68q22k45Q76l74n54P48
$$ 196 656 -220 2 509 -161 -208 390 201 -633 151 402 94 -71 597 -225 -470 406 32 -522 226
4789B26J04o25o7P66o36r9O25N6p87L25N17n35j25P76p89k23P15k33n38M25N45
$$ 226 330 -295 -362 404 -232 -331 294 350 -437 -112 405 -130 -255 521 -268 -491 224 -9 -547 -122 423
4810D23p27M3K83l42m06P42J06p05M57L31n55k24J118n88m35O89j45n69K97N47
$$ 423 -304 -261 22 -320 -726 16 122 -583 -126 205 -350 -574 544 -44 -479 210 65 -504 -207 340
4830C40n95l21J108n57j64K88J49m39R6J68m88K26O03n71j97N50O1o87L75N24
$$ 340 -255 -576 532 -25 -189 99 248 -191 -95 73 -415 -189 414 -157 -354 196 257 -430 -55 469
4850D69l98k54P17m87l65Q90q7o02JN65o55J43M50k14n52M43M28r35K50O79r59
$$ 469 71 -183 534 47 -318 572 485 -117 -116 449 -206 -63 387 173 -379 64 492 -443 -193 486 -473
4871d73OO84k1q39O57K21l03l09J024o34l98P31q2p37N79K48m08n4M66m34l09
$$ -473 -467 217 196 -643 14 235 -68 -377 647 13 -385 346 264 -473 106 354 -54 -108 358 -76 -385
4892c85P96j28l69R2K97n98Q1Q81k99q60P31K05p94L51N57n37l02Q23l72l58O86
$$ -385 411 283 -86 6 303 -295 -214 667 368 -492 239 444 -350 1 558 21 -281 542 170 -188 498
4913D98K48q64R9L69l06k72L93j23k75O25q6p35q1O17m70J94N93l40m27M81J39
$$ 498 746 -118 -19 350 44 -228 165 42 -233 392 306 -429 -510 107 -363 -169 424 84 -343 138 277
4934B77o97K33N68p44RQ84j8q68K38M52n02j97N19m65j45M43K74m32LN37q41K86
$$ 277 -420 -187 381 -363 -354 530 512 -356 -118 334 -168 -365 154 -311 -456 -13 261 -171 -168 369 -472 -186
4956a86L54l5n82O35l0m69L00J96m36J98L16k73k75O27l45m53K31N34o03J36O01
$$ -186 168 133 -449 186 156 -313 -13 183 -253 -55 261 -12 -287 340 -5 -458 -227 307 -296 -160 441
4977D41n0j018P63K91p38L04M72l35m65Q04r4p52L39M59o89R8N10l99l76P35J33
$$ 441 391 -627 136 427 -311 -7 465 130 -335 469 375 -377 -38 421 -268 -170 340 -59 -435 300 433
4998D33p73L97L03n15k30P11n65j14P05Q1p36M27N23q90O1M96k16n79M88R8n00
$$ 433 -340 57 360 -155 -385 326 -239 -353 352 433 -303 124 647 -243 -182 314 98 -481 7 105 -395
5019c95M55L18m14o2M45j96l14L54J16m76K23L87p66J97O34k54n42K51M6k90K65
$$ -395 60 378 -36 -98 347 151 -163 191 307 -169 54 441 -325 -128 506 252 -290 -39 7 -283 -18
5040a8K92l29l03O48r8n66M03K81n62K82J33n59J10M75m74k75M02L19n62M05K94
$$ -18 274 -55 -358 290 192 -374 29 310 -252 30 163 -396 -286 189 -285 -560 -158 161 -401 4 298
5061B98l19m92N53P6m83N28J70o58J85L73j29l95O44J3p75J34L28l66j16N54o9
$$ 298 -21 -513 40 116 -367 161 331 -327 -142 231 102 -293 351 364 -411 -277 51 -315 -431 123 54
5082E4o69M75M48m95l1L86o06K12K09q3j04J47N26p93k3R16q71j72R83m99n76
$$ 54 -615 -140 308 -187 -218 168 -438 -226 -17 -100 -204 -57 469 -324 -347 569 -302 -474 509 10 -566
5103e66Q47j41n77K66N51n31j84N28k40k73O44j61o11O74J47l44k42N09p6o36
$$ -566 281 140 -437 -171 380 -151 -335 193 -47 -320 324 163 -448 226 373 29 -213 296 220 -416
5123d16L46J71m67L77M66m53k31L73J57m46K34N02p29KL22q2n65O34m2k75J89
$$ -416 -70 101 -366 11 477 24 -207 166 323 -123 111 613 -116 -114 208 126 -439 195 153 -122 67
5144F7L49o86j98P09j08m85M72K56j101Q73L06n81k92J167n30k00m9M36m70O2
$$ 67 416 -270 -468 241 133 -352 120 376 -725 148 454 -127 -419 748 218 18 -31 405 -65 -3
5164cJ42j02q9K99m06j78M41L05p93M39L06l97J58j01j10k09K85M66p39K01O79
$$ -3 139 37 -52 247 -159 -337 104 409 -384 55 361 -36 122 21 -89 -298 -13 453 -286 -85 594
5185E94r04PQ02m75m36L10L17m05L5M89l04l82N55r2q23N30M78m11j00M68k22
$$ 594 -310 -303 499 24 -412 -102 215 -190 -155 334 30 -352 203 111 -712 -182 296 -115 -215 253 31
5206C1m16P60m6r95O71M53p95J52K86n5l14K46J67j41j79L61k83j42L21j52l12
$$ 31 -385 375 329 -666 5 458 -337 -185 101 46 -268 -22 145 4 -175 186 -97 -239 82 -70 -382
5227c82N84j92m90N27K93m40l16O51o1o42N99K7n60K07M91k27j87K97O5n73M81
$$ -382 202 10 -480 47 340 -100 -416 235 174 -468 131 158 -402 -195 296 69 -118 179 244 -329 152
5248A52L16o15J69Q7j82k5M26k11o27O35J22n81J31K92k4m50P95l12l54M41J13
$$ 152 468 -147 22 109 -73 -98 328 117 -510 125 247 -334 -203 89 65 -385 410 98 -256 185 298
5269B98n76L77M49l57n10N77J99q35N36m4j54J91L58o19J98L00j57k93L08r4j94
$$ 298 -278 99 548 191 -319 258 457 -378 158 114 -40 151 509 -110 88 388 231 -62 246 152 -42
5290d2j09O94k95n45J51K61o13L19N08m54k26L95r8j34j5J58k36K93N09n25j54
$$ -42 -151 543 248 -297 -146 115 -498 -179 329 -125 -351 44 -54 -188 -203 -45 -281 12 521 -4 -158
5311a58L99k40n98Q11J37n97Q2N66n53k17L13R5l33N5K04j42j45P86n10l36O19
$$ -158 241 1 -597 214 351 -246 -164 402 -151 -368 -55 40 -293 -238 -34 -176 -321 465 -45 -381 238
5332B38j88j99l8N63p43L22L04o01J87L01k31l80K33N55p13J91K08o8k55K81j41
$$ 238 50 -149 -187 376 -367 -45 259 -342 -155 146 -85 -465 -232 323 -390 -199 9 -59 -314 -33 -174
5353a74j19L44J80j06l22O43m31jL88l13o00M05K74l12n8M10j41n22L53l2k06
$$ -174 -293 51 231 125 -197 446 15 14 402 89 -511 -106 168 -144 -202 208 67 -455 -102 -134 -340
5374c40J40M13m16K1L76p6k9k38L02m58M31K70l02N8j59j33J4M74Ro12N1M25l58
$$ -340 -200 213 -203 -182 194 118 89 -149 153 -305 126 396 94 152 -7 -140 -126 348 357 -255 -204 221 -137
5397a37O9J42P4j98M10m7p27J88M05m3m00K00K93n69M07K44j24m20M39k18r8J81
$$ -137 -68 74 148 -50 360 313 -414 -226 179 136 -264 -64 229 -340 67 311 187 -233 206 -12 -110 71
5419G1Q8l55k96P95n29K98K60k84m63L03J27l49r3R02n84KM86l35k57J34k4Q2
$$ 71 159 -196 -492 303 -226 72 332 48 -415 -112 15 -334 -427 475 -109 -107 379 44 -213 -79 -103 -21
5441b1p6K34%l29O27n67L1R8J3l87M09J05l1k72N72m41o09Q16l2k82j13K14O4
$$ -21 -97 137 137 -192 435 -132 -101 -3 10 -377 32 137 106 -166 406 -35 -644 172 140 -142 -255 -41 23
5464B3l93M70j19k81K66J48l80J56L99k97m53P04l61L7J74M88r81L49K17q8n17
$$ 23 -370 100 -19 -300 -34 114 -266 -110 289 -8 -461 243 -118 -81 93 581 -400 -51 166 78 -439
5485d39L74N26r19L28N38m09k18N18j83k52j3J76o0L88N5n14j09M92l62J4J77
$$ -439 -65 461 -458 -130 408 -1 -219 299 116 -136 -149 27 -33 355 410 -104 -213 279 -83 -69 108
5506A08K58n28J27N73o09j8K39k91m9K29J79m23K08K85l36m40Q17j84n22K15M39
$$ 108 366 -162 -35 538 -71 -89 150 -141 -190 39 218 -205 3 288 -48 -488 329 145 -377 -162 277
5527B77n08j7M69k42l34O50j60l85R3N49m43Q9N43l99m58N76p5m24J11N19n84
$$ 277 -231 -248 221 -21 -355 295 135 -250 -157 392 -51 38 581 182 -276 300 225 -199 -88 431 -153
5548a53j20O48m44l68N66R9m15K13J34k79J09M89n98j50J89J82k75J18K26m28
$$ -153 -273 375 -69 -437 129 228 -187 26 160 -119 -10 479 -119 -269 -80 102 -173 -55 171 -257
5568b57N3N72j30m94M33K40r64J78M78k32N9K87o58L83L13q7n22L45J38j56l66
$$ -257 -204 368 238 -256 177 417 -547 -369 109 -123 -64 223 -435 -52 261 174 -348 -3 135 -21 -387
5589c87P27k9p02M23L50l29j02L74o03j9L03J49m12J58K95o14P0L69j51m14P68
$$ -387 340 311 -391 32 382 53 -49 325 -278 -297 6 155 -257 -99 196 -418 -348 21 -130 -544 224
5610B24oo14J19P12p50l7M70q9m39M45J43p24N23K91m00K3K02j9k09K18K56n24
$$ 224 218 -396 -277 435 -315 -352 118 29 -410 35 178 -546 -23 268 -132 -109 93 74 -135 83 339 -185
5632a85r7Q04n18k30O65n76q3N11K56p69M10J20m17J0L32l8l15J61L37m46j21
$$ -185 -282 522 4 -226 439 -137 -220 291 547 -222 188 308 -109 -99 233 195 -120 41 378 -68 -189
5653a89M49k38m34N39K3m23J07N55m04nJ54k79K9K44K21n84J13L85p64L90K65
$$ -189 260 22 -412 127 150 -273 -166 389 -15 -20 134 -145 -116 128 349 -235 -122 263 -501 -111 154
5674A54k75R2J27O6m93O1M47l09q5P15m05k33L91j51n20M58M1j99J3L27k28k63
$$ 154 -121 -29 98 164 -329 -268 179 -130 -215 500 95 -138 253 102 -418 40 81 -118 -105 222 -6 -269
5696b69L99M0k98J47k27Jj53L08Kk43L20L5l58j9N71n20j02O85j3p38N24j50j89
$$ -269 130 170 -128 19 -208 -207 -360 -52 -50 -293 27 62 -296 -315 256 -264 -366 319 306 -432 92 -58 -247
5719b47Q4M34m31k81N52J33o27M56J03l63K01M56n95O1K52o7m95L90J00n17M42
$$ -247 -163 271 -160 -441 111 244 -383 73 176 -187 14 470 -125 -64 188 121 -374 16 116 -401 41
5740D1K99p16K60M90m29o3K38J51o03j05P34l93K4k6J10k89k2P14n52J99kR8l46
$$ 41 340 -376 -116 374 -55 -118 120 271 -332 -437 297 -96 -72 -98 12 -277 -299 415 -137 62 60 158 -188
5763a88L37K75o16q9Q10o90M9N60m07j29J2J12O2k64O23l27o9L2R9l24L54J94
$$ -188 149 424 -192 -281 529 -161 -112 448 41 -88 -76 36 98 -166 457 130 61 93 192 -132 222 416
5785D16m87K42j87P3r1J17n2J34k01J29P6o8Q5m01J40N7J9j05J41R0k66J92J54
$$ 416 -71 171 -16 57 -34 83 31 165 -36 93 169 101 186 -215 -75 -18 1 -104 37 127 -139 53 207
5808B07j89k19M06J19n82J86L23l81JM28o6o71M84J86l21j86M15l38J87K82m06
$$ 207 18 -201 205 324 -258 -72 251 -130 -129 299 233 -438 46 232 -89 -275 140 -198 -11 271 -135
5829a35Q0J96J88n30o0N97l16k59L50O2k59j65M03k70j59N40k61j85M65j89l29
$$ -135 -55 141 329 -201 -261 336 20 -239 111 173 -86 -251 152 -118 -277 263 2 -183 282 93 -236
5850b36L52J56m56j73O00j78k85L67l6k45L43j47l05L6N52l04m25P65r4m86J11
$$ -236 116 272 -184 -357 243 65 -220 147 111 -134 209 62 -243 -207 345 41 -384 381 287 -199 -88
5871h8M28m47k56K99M3m63O84O2q47O89M36n26j94M16j14m04M65K00n02J00K74
$$ -88 340 -107 -363 -64 -21 -484 200 262 -585 104 540 14 -180 236 122 -282 183 383 -119 -19 255
5892B55n92j38Q01L6l21K6K56n95J36L26m21K58M12m81J25K01j46k58P1M8O2j39
$$ 255 -337 -475 326 362 41 67 323 -272 -136 190 -231 27 439 -42 83 284 138 -120 -49 -1 61 -78
5914g8L25mm77J60M43l07q1K70m02k68O90L3l55QM63o09P3L60m63J59O57j91m05
$$ -78 247 243 -234 -74 369 62 -19 251 -151 -419 271 304 -51 -43 420 -189 -116 244 -219 -60 597 406 1
5937AM36m73K17m56O24m80l3K32L8m4l4L85m45k59M86Q8o52O64j99m5j49M91m55
$$ 1 437 -36 181 -275 349 -131 -164 68 106 62 28 413 -32 -291 195 283 -369 295 96 51 -98 393 -62
5960f2l15L29J96m83K81Q1J7j39K48q3l36L22K63m78J72P9Kn63N38l08l09M29
$$ -62 -377 -48 148 -335 -54 27 44 -95 153 70 -266 56 319 -159 13 92 94 -469 69 -239 -548 -119
5982a19K59m40L73pk02j03L73k10m42N39n0j13J09L03l28j9K23O1n93N02j96j07
$$ -119 140 -300 73 66 -136 -239 134 -76 -518 21 -29 -142 -33 270 -58 -77 146 207 -386 116 -80 -187
6004a87K12R0n61L47J68j23k35K79J25l58L83p4j75N5L64k71l31N54p9l22r3K22
$$ -187 25 115 -446 -99 69 -54 -289 -10 115 -243 140 66 -109 -54 310 39 -292 262 183 -139 -232 -10
6026a0M5jo6R1k73J57j7k48L72K24m72L19m7K05m99K10K91o13L12M5lk16L85q
$$ -10 35 34 -32 59 -214 -57 -74 -322 50 274 -198 121 74 279 -220 -10 281 -332 -20 25 22 -194 191 183
6050A83n66L08K0J1J08K10m17J35M2q8p0n6M21l92JL36k43j67K12J57k56L0kn1
$$ 183 -383 -75 -55 -44 64 274 -143 -8 34 -54 -124 -180 241 -151 -150 186 -57 -224 -12 145 -111 -81 -83 -134
6074a34j90K82k68k10M47K50m79J88q2P9p0O04o99J52L06K59p37L59K69l73j84
$$ -134 -324 -42 -310 -520 -73 177 -302 -114 -196 -117 -187 417 -282 -130 176 435 -302 57 326 -47 -231
6095b31L96k79k89L53K83k77j33M91n16j39Q25l80k55L82R7p41L80K9l14K81K09
$$ -231 165 -114 -403 -50 233 -44 -177 314 -202 -341 484 104 -151 231 328 -413 -33 -4 -318 -37 172
6116A72j43l74j2N61l22K77l4l74j56N11n1l48L47K2N0m70M74j10j58K18j29k1
$$ 172 29 -345 -357 204 -118 159 125 -249 -405 106 55 -293 54 76 126 -344 130 20 -138 80 -49 -70
6138g0o6L80m53j09O06l40k6L42n3m87j77P92n02l2L98p5k42J40K07n1j43Q9r6
$$ -70 -136 244 -209 -318 288 -52 -78 264 211 -276 -453 339 -163 -195 203 128 -114 26 233 182 39 128 32
6161C2l57M29Ok93K19K25l27L14L9j50m89L33J15k97J66L71l01j31K31k19l64
$$ 32 -325 104 110 -183 36 261 -66 248 287 137 -352 -19 96 -201 -35 336 35 -96 135 -84 -448
6182d48L56K87n97P80k96q7o4J16j23O2K88j40j69j11N29m12k65O81m62n34O96
$$ -448 -92 195 -402 378 82 -5 -69 47 -76 -14 274 134 -35 -146 383 -29 -294 387 -75 -609 87
6203H7k91J4R5n7j61J97L65n5o60N56K06k26m65M52k60j2L17l03m4lL51k19qK25
$$ 87 -204 -190 -95 -152 -313 -116 249 194 -466 90 296 70 -395 57 -203 -215 102 -201 -245 -248 103 -116 -124 101
6227A01k17P5j00K3l30M64L23m03L0K76k11k81K30L08p03O00K14m95M2J61L0l97
$$ 101 -116 -41 -141 -118 -448 16 339 -64 -34 242 31 -250 -20 288 -415 185 399 -96 -54 107 137 -260
6249b60O19k54M0j15k87J33O1M42m41j31L44j73j33J15J32l72K01K53r3l53L96
$$ -260 359 105 145 30 -257 -124 -63 379 -62 -193 151 -22 -155 -40 92 -280 -79 174 81 -272 124
6270A24O3l22k1N2p0j27N38j97m71K77K93k13j41M97m19j04N20m6l4k39K1l13
$$ 124 187 -135 -156 -104 -174 -301 237 40 -431 -154 139 -74 -215 282 -137 -241 279 233 199 -40 -19 -332
6292c32J08J85j75j37M55Q6m15L63k50k41J67N96l05j53L98j94m86J64L29k40
$$ -332 -224 -39 -214 -351 104 190 -225 138 -112 -353 -186 410 105 -48 350 156 -330 -166 163 -77
6312g7j67L72j57J90q6p1k69K28K17j73k09M76l68k08N05J1m39L42Jk45K23Q5
$$ -77 -244 128 -29 161 75 4 -265 -37 180 7 -202 274 -94 -302 203 214 -225 117 118 -127 96 181
6334A81q6j57L22k9p27K49K56l28K86K22n8m75K76J22n4j0J86m63J40K19j89k89
$$ 181 95 -62 260 231 -496 -247 9 -319 -33 189 131 -344 -68 54 0 -10 176 -287 -147 72 -117 -406
6356d06N89r1k99Q0K58k05K0K81j16j70J65k62q8J61O85n62j29k3m2j50P66m27
$$ -406 183 92 -207 -127 131 -74 -54 227 111 -59 106 -156 -244 -83 602 40 -89 -112 -154 -304 462 35
6378C5j56k38M02q8k60M84r7k75L33J6m02r1O52m31R8J91j70J21l00N18n21j18
$$ 35 -121 -359 43 -45 -305 179 82 -193 140 156 -246 -337 315 -116 -18 173 3 124 -176 342 -179 -297
6400b97K75K11l28mL34p75M49L91m76K4J20N8k56K09j87M66l30L26j85r1K89m7
$$ -297 -22 189 -139 -143 191 -584 -135 256 -220 -196 -76 -18 -274 -65 -252 214 -116 210 25 -66 223 176
6422A76k55j99P02m79J49J52l06j46K95M9K7n0J67k03N3K65j48n31N11J79o53
$$ 176 -79 -278 424 -55 94 246 -60 -206 89 138 165 115 282 79 132 397 249 -282 229 408 -245
6443b45K28N3p1j60M86m34j0K59K16l99P7N7j53J07l4J08n37N44J02j73K67j42
$$ -245 -17 36 -35 -195 291 -143 -153 106 322 -77 0 57 -96 11 -23 85 -452 92 194 21 288 146
6465A46l51J83J31l43Q0J95m2l69L50K85m88J84l3J73o8J18R5k17k27K74k21l13
$$ 146 -205 -22 109 -234 -154 41 -1 -370 -20 265 -223 -39 -72 101 33 151 246 29 -198 76 -145 -458
6487d58N76j19k92M5L72l91J47K22r3j61J82%k7q4J56j99k15L85j07k43L62j5
$$ -458 118 -1 -293 -248 124 -267 -120 102 9 -152 30 30 3 -81 75 -124 -339 46 -61 -304 58 43
6509D3l35K69o2k5R8J57j12j74L78j03j96L87j96m09L18K35m24J1K52J96k86J
$$ 43 -292 -23 -85 -110 -12 145 33 -141 237 134 -62 325 129 -280 38 273 -151 -140 112 308 22 23
6531B3o2L7j38J17J3j01K70K12m47J85K89o50M84q2l50r5K74N3O8k25K85J95o87
$$ 23 -39 -2 -140 -23 -10 -111 159 371 -76 109 398 -252 232 150 -200 -295 -21 32 100 -125 160 355 -332
6554c32M70on10K11p2L7K73J41l08k38K09Q3K4j8J80k34J77J63j64j54Q8j70J35
$$ -332 138 132 -378 -167 -239 -202 71 212 -96 -334 -125 -42 -18 -36 144 -90 87 250 86 -68 20 -150 -15
6577a5K16j94J41k90L15j31l03L20L07k44j52P4k33J13J18k31L0Q1R7k04K31p
$$ -15 201 7 148 -142 173 42 -261 59 366 122 -30 44 -189 -76 42 -189 -159 -78 19 -185 46 39
6599C9L5j51J36r9J11l07M66m86K70J83l38J54j78Q7j21L7L33m54L8K91j17O8
$$ 39 74 -77 59 -40 71 -236 230 -256 14 197 -141 13 -165 -78 -199 -162 171 -283 -245 46 -71 -3
6621cL13k99j83J59K56k74R3R1o9j18O8j43J37K72l63j43Q8M15k79K98m15o4k01
$$ -3 310 11 -172 -13 243 -31 62 153 84 -34 34 -109 28 300 -63 -206 -118 297 18 316 -99 -163 -364
6644c64N36l10J44j33M79m39j3mJ28l36L90J07k75j80L15k4k65J63J02k60K26
$$ -364 172 -138 6 -127 352 -87 -100 -104 24 -312 78 185 -90 -270 45 21 -244 -81 21 -239 -13
6665a3J80o7k09K86l84R7K41Q6l74J15K05p2j42K32j01k26L83o5l71j39M85r0
$$ -13 167 100 -109 177 -207 -110 131 217 -157 -42 163 91 -51 181 80 -146 237 172 -199 -338 147 57
6687E7k22N47l31j71n2K66l75J95J62j62J04K59k52l83P42o49J11k10O15j15m96
$$ 57 -165 382 51 -120 -172 94 -281 -86 76 -86 18 277 25 -358 384 -265 -154 -364 251 136 -360
6708c60O22O7l64j68L53l28l8M01j32l36J73L99o93L28J23l60K02N56n32k06J42
$$ -360 262 329 -35 -203 150 -178 -216 185 53 -283 -110 289 -404 -76 47 -313 -111 445 -87 -293 -151
6729a51K17p3K09J25m78l2K00L44p42M64rm20M87K29m05j21K18l5m50N46j28J4
$$ -151 66 -7 202 327 -151 -183 17 361 -381 83 74 -346 141 370 -35 -156 62 27 -423 123 -5 9
6751Im9P4l64o6M86k99n1J85K71l28M77j01j33m29N05j40l12L65j12k79R6N73
$$ 9 -40 34 -330 -396 90 -209 -260 -75 196 -132 345 244 111 -318 187 47 -265 100 -12 -291 -195 378
6773C78l19n28O28j66p1K0J75m6k28J62mj80K35q2O9M2K56m84j37J34l8J88J47
$$ 378 59 -469 159 -7 -78 -58 117 71 -157 5 1 -179 56 -26 43 85 341 -143 -280 -146 -184 4 151
6796A51n0l07j59M16k00J37N05n56lQ1J52j33j95K40k27j17N74k69p6l3K05m29
$$ 151 101 -206 -365 51 -149 -12 493 -63 -66 15 167 34 -161 79 -148 -265 309 40 -36 -69 136 -293
6818b93K03K99k23K90k36K2j3K3K88l61j51M30j62j00j11j07R5L11j0j53j32K70
$$ -293 -90 209 -14 276 40 62 49 72 360 -1 -152 278 116 16 -95 -202 -107 204 194 41 -91 179
6840A79l35L94l8K58n09K8L7J17j13J59l64J75p2P2k97O08p3j94j37L15m51K80
$$ 179 -156 238 200 458 -51 -23 14 131 18 177 -187 -12 -84 -12 -309 299 226 32 -105 210 -241 39
6862C9o3M2k93M47j16l58R3K84J41n52J39J86M3l08M62l92O9J70j51K7QJ06p5
$$ 39 -24 18 -275 172 56 -302 -209 75 216 -336 -197 -11 32 -276 186 -206 -137 33 -118 -91 -83 23 -52
6885e2P3l2k70M8L35l3j25J54K5o7k51J47Lj85K97L41m35k31L60m45J86K39k3
$$ -52 21 -11 -281 -233 102 69 -56 98 123 56 -195 -48 -45 -230 67 408 -27 -258 102 -343 -157 82 59
6908E9k58L11j49j95N17k44j4Q3L03l35l54M92m38K94KJ3k95L75J94l70R9K23
$$ 59 -199 112 -37 -232 285 41 27 110 413 78 -276 216 -222 72 74 87 -208 167 361 -9 90 313
6930C13j17j78o0K12k20o6L47k4k08J3K41k2n77M07k1r8M33m0l97n0K68k93J20
$$ 313 196 18 -42 170 -50 -116 231 207 -1 12 253 231 -346 61 40 -58 375 335 -62 -112 156 -137 -17
6953a7J53j01j38j54O6J35j68K86k85J61O6k48K02J91k88j71J01K96j08j3K17
$$ -17 136 35 -103 -257 -191 -56 -224 62 -223 -62 4 -244 -42 149 -139 -310 -209 87 -21 -34 183
6974A83m4m3o4o3j58K85o5O5J4j47R9j61J45P7k34M6J93J0j49J11o6K1J58m2k62
$$ 183 139 96 32 -31 -189 96 31 96 110 -37 62 -99 46 123 -111 -65 128 138 -11 100 34 55 213 171 -91
6999i1M7J44N3j23K05k05J38j67Q4o7k06L97j38k64M85l49J87j81K16p4l02M04
$$ -91 -44 100 153 30 235 30 168 1 85 18 -188 209 71 -193 292 -57 130 -51 165 91 -211 193
7021A93l22K2J92J93l10P6J88k41nj4P9l74P67m16m02L49J41k69q9N3Q8j42L06
$$ 193 -129 -107 85 278 -32 44 232 -9 -14 -28 51 -323 444 28 -374 -25 116 -153 -242 -189 -101 -243 63
7044F3j77O9J52r1J20l57L07k43qM5M45o90L59Q4l21K37J02j49n0P1%J8K74L0
$$ 63 -114 -45 107 16 136 -221 86 -157 -165 -120 325 -365 -6 78 -243 -6 96 -53 -103 -32 -32 -14 260 290
7068B90p7j47O7p6l20K65J99m08K42L85m73J19j7k10j64M15J34m76Q9N74k75m43
$$ 290 213 66 133 57 -263 2 201 -207 35 420 -53 66 49 -161 -325 90 224 -252 -163 411 136 -307
7090c07M14Q9j16j11K85m18K20Q4R9j70l25M60q1j40M38j88n19L11j08k49L22
$$ -307 107 196 80 -31 254 -164 56 140 239 69 -256 204 123 -17 421 233 -286 25 -83 -332 -10
7111a0J17l25M10j42n0K8N9J20j91K31k48n2O0K18j01j05J97ok90n0R8M9k44M00
$$ -10 107 -218 192 50 0 28 87 207 16 247 -1 -53 7 225 124 19 216 210 -80 -130 -32 17 -227 173
7135A73l94N25l86P5nl2J61k98J22K81l37QN46m10n57K61M35K01n44J5J70K3J35
$$ 173 -221 304 -82 -7 -12 -44 117 -181 -59 222 -115 -107 439 29 -528 -267 168 369 -175 -160 10 33 168
7158A68k67J9R9J28j32m0L02n35K75k65L49k34K9K70l1j55K33m1n57M46L61o02
$$ 168 -99 -80 19 147 15 -25 277 -258 17 -248 101 -133 -104 166 135 -20 213 172 -385 61 422 -180
7180a80M74k51l21K79j5O6m91O46j6k07j08L9Q1j61L47j59l32K95J42j08r4L07
$$ -180 294 43 -278 1 -14 52 -439 207 191 -16 -124 -85 -4 -165 182 23 -309 -14 128 20 -74 233
7202B33k43P6J06j9j84M47m58j46K11K88m38LJ99K44o15L46j10J78n1K7K48m84
$$ 233 -10 66 172 153 -31 416 -42 -188 23 311 -127 -124 75 319 -296 50 -60 118 67 94 342 -142
7224a42K97k09m51L63K40j77l8M81j28l46K45j24J20q8n6j5j8J54J4k89K54o0
$$ -142 155 -54 -505 -142 98 -79 -117 364 236 -110 135 11 131 43 -13 -28 -46 108 122 -167 87 27
7246B7L11l18Lj71L8L18l36k30M24L59n09K05L4k34j99K87J1J11j45j49J26p0
$$ 27 338 20 23 -148 -110 208 -128 -358 66 425 -84 121 155 -79 -278 9 20 131 -14 -163 -37 -107
7268a07K59j18k67J58Q9j02L23j7j07l79N20k25p4J78k35j5q7L93o3J29o9j91
$$ -107 152 34 -233 -75 14 -88 235 218 111 -268 252 27 -47 131 -104 -119 -206 187 124 253 184 -7
7290gj88M92n18J22J13L05n81j53K99J05k42M4K88n2r7J09l01k3J84Q1O9L51j06
$$ -7 -195 297 -221 -99 14 319 -262 -415 -116 -11 -253 -209 79 27 -70 39 -262 -285 -101 -20 49 400 294
7313B94l22q9L35k65J83j6L3l85L84N2l58L89p3n4nJ40p9k46%K31m28L28K8r4
$$ 294 -28 -117 218 -47 136 120 153 -232 152 204 -154 235 162 108 103 243 164 -82 -82 149 -279 49 77 -17
7337a7l0m8J46r8J18K21l54M3M4O7j02P4q5j54M43k85J92q9N5j32p1J97j89Jk05
$$ -17 -47 -95 51 -47 71 292 -62 -19 25 92 -10 64 -21 -175 268 -17 175 86 141 9 -62 135 -54 -53 -258
7362b58N58l64J4K90k70j29L16K8k96J43K54l24J52J94k19J03k69J97r3l04K72
$$ -258 300 -64 -50 240 -30 -159 157 185 -111 32 286 -38 114 308 89 192 -77 120 27 -277 -5
7383em71M82M70m93Q6Q3l5J22l66K81mm91M94j34j69J61J11k34K09q0R6j20k50
$$ -5 -476 6 476 -17 69 152 117 239 -127 154 150 -341 153 19 -150 11 122 -112 97 17 113 -7 -257
7406b57N88l09n8p1j31M20k20p9j84L48q9k10J08N46m63L16J18m72j29O4M8K12
$$ -257 331 22 -36 -107 -238 182 -38 -117 -301 47 -42 -252 -144 402 -61 255 373 -99 -228 -164 -116 96
7428I6k01L13l02j36M21j05j96K68O9ol09L33k48n46K96N28j29k08K57j30o7J00
$$ 96 -105 208 -94 -230 191 86 -110 158 227 221 -88 245 -3 -549 -253 275 146 -62 195 65 -2 98
7450I8k22j0J41J52m07L80k9n4k71K69j26j27J0R3J00J72N1n17J0K36K79j92J15
$$ 98 -124 -134 7 159 -248 132 103 49 -222 47 -79 -206 -196 -103 -3 169 220 -297 -287 -51 228 36 151
7473A51o2j15J73P2m92pN33k19l46L86Q9p8p2k06J22j39M28k10k68K69J45N8k63
$$ 151 89 -26 147 219 -273 -280 253 34 -312 74 163 85 13 -193 -71 -210 218 8 -260 9 154 212 -51
7496e1J12q0O2j18L3k14K57J40k53K26p1j92J09J2j15nJ4K10o9K6n2R5j48j2k04
$$ -51 61 -19 43 -75 -42 -256 1 141 -112 114 43 -149 -40 -28 -143 -148 -134 76 7 33 -19 76 -72 -84 -288
7521b88K43P9J81m59N19m1m33J26N0r9l5N5K42l96J27M27l54j67J64L27l79K22
$$ -288 -45 34 215 -244 275 234 -199 -73 -23 -122 -157 -102 140 -256 -129 298 -56 -223 -59 268 -111 111
7543A11J45j83o8K49m12J78J2m0J47j32K00l48LL38Km00L09j40L5m6L13l61j90
$$ 111 256 73 5 254 -158 20 32 -8 139 7 207 -141 -138 200 202 -198 111 -29 6 -40 273 -88 -278
7566b78M42j86k97K44J60j96o9R1K16k56J78j39q9k0K87j01j4J8m3l40P67p6l80
$$ -278 164 -22 -319 -75 85 -111 -180 -89 127 -129 49 -90 -179 -199 88 -13 -27 -9 -52 -392 375 299 -81
7589h1K49J3k09m7K31k72J87j50P9j72K10j72J09k84N50o86J34K34N9Nn8K07j33
$$ -81 168 181 -28 -75 156 -116 71 -79 0 -172 38 -134 -25 -309 241 -445 -311 -77 -18 -13 -71 136 3
7612Cr6J85k6j01N7R8j34k06K21J3j21L89k41L5K38l14J36j19J43j36j27R7L68
$$ 3 -93 92 66 -35 22 120 -14 -220 1 14 -107 282 41 76 314 0 136 17 160 24 -103 -6 362
7635C62k97k2J07No8k12n7J33L8J07k41J28l2p7N4J70j92p4K59N1k44K37J09l25
$$ 362 65 43 150 155 87 -125 -182 -49 -11 96 -145 -17 -49 -126 -72 98 -94 -168 91 142 -102 135 244 -81
7659h1J39K13l78k17L47r9J00K17k21j4j17J56P8l54J80J9k2J09J31k91K29K0
$$ -81 58 271 -107 -324 23 -76 24 241 20 6 -111 45 123 -231 -51 -32 -54 55 186 -105 124 144
7681A44j01k20L00m8j16Q7N0K7k79M96m43l58K93K07l0j7L42k49l50N55l63k14
$$ 144 43 -177 123 75 -41 46 96 123 -156 340 -103 -461 -168 39 9 -8 334 85 -265 290 -73 -287
7703b87M83l16l51P01k12QK90j40o9m43L90m9P4J91k05k88K91j72J58l0J35J20
$$ -287 196 -120 -471 230 18 26 316 176 107 -336 54 5 79 270 65 -223 68 -104 54 24 159 279
7725B79l64J02j51J71l1J17J74l58J01m9Rp4M83m75j46L41k08M8P6l54M81J12
$$ 279 -85 17 -134 37 6 123 297 -61 40 -9 0 -74 409 -66 -212 129 -79 -31 45 -309 172 284
7747B84o7Rk63N2r7O0j82L02kk33L34j61l2l4j3m2L40l58o9k04O04j72j95K61
$$ 284 217 226 -37 15 -82 -22 -204 98 96 -137 197 36 4 -30 -43 -85 255 -103 -172 -376 228 56 -139 122
7771A22n1j61J50j41p5K45r4Q5o3R9m78K84K3J28j93K10L17l03j79K55j23n75
$$ 122 71 -90 60 -81 -156 89 -5 80 17 116 -362 -78 -55 73 -120 90 407 104 -75 180 57 -518
7793e18M53J33j07j64R6J34q4l02K94J79o5Ml1l4%q5r7J90J57j50j80M29k38K6
$$ -518 -65 68 -39 -203 -107 27 -57 -359 -65 114 49 53 22 -12 -12 -97 -194 -4 153 3 -177 252 14 40
7817D0K08k29k27J87j82K15j0K09k90jL78l35q0J23J67o53N55p4j30J62L48l26
$$ 40 248 19 -208 -21 -203 12 2 211 -79 -80 298 -37 -117 6 173 -480 75 1 -129 33 381 55
7839E5j17J47j32L8J34pk16j50M01j78mk74M97j24R7r7j84O1J45j50J34n6J98
$$ 55 -62 85 -47 -9 125 118 -98 -248 153 -25 -29 -303 194 70 167 70 -114 -53 92 -58 76 20 218
7862B18j78j74P0R7p5K2%k73L57M0j09j56L53j81l70O64m41k3P0K83m46J73k9
$$ 218 40 -134 -64 33 -42 -20 -20 -293 64 104 -5 -161 192 11 -359 305 -136 -159 -89 194 -252 -79 -108
7885a08J38j93K59J04o0j18N9m7n57N39q7Q3j00K04k64L5J24j76Q2K50m27J52
$$ -108 30 -163 96 200 140 22 81 34 -523 16 -71 12 -88 116 -148 -113 11 -165 -83 167 -260 -108
7907a08J47K40k27r7K25J24o07N72k79k05J67k39m9L10N6Q9k26Q1L45l17K02m
$$ -108 39 279 52 -45 180 304 -303 269 -10 -215 -48 -287 -336 -26 30 119 -107 -26 319 2 204 200
7929B00K3k77k3L12n9j61J21j71J39K04l94O5J00k9l48N56m69o2J07K00M9N6k46
$$ 200 223 -54 -77 235 176 15 136 -35 104 308 -86 -21 79 50 -298 258 -211 -273 -166 34 83 139 -107
7952a07L15l39O9J32j65l23Q20l84j10L79P7l09n5L38n19j28M58m20Q4l8P22p44
$$ -107 208 -131 -62 70 -95 -418 402 18 -92 287 364 55 0 338 -181 -309 149 -271 -187 -225 497 -247
7974b47L43J25m12J00J44J25l26K05L9L0o8j5J25o1n2K68p25M71R9j34Mj1l3p1
$$ -247 96 221 -191 -91 53 178 -148 57 96 126 58 43 168 107 55 323 -402 69 168 34 38 27 -6 -77
7998g7K37Rj79L69k91p3J45j17j02J1J39N4o4K00J25l74J29J54p7l19K41l0j03
$$ -77 160 169 -10 359 68 -5 140 23 -79 -68 71 125 61 261 386 12 141 295 218 -101 140 110 7
8021Gn5J46l31J84j31J51j1n5L87l31jL22l14j52K9mL3R7P1l47K2K30m4J21J5
$$ 7 -48 98 -233 -49 -180 -29 -40 -95 292 -39 -40 282 -32 -184 -155 -159 -126 -29 42 -305 -283 -53 -97 24 39
8046C9O9l78L08pn27L75K18j28k51K57j29M96m59J31l32K48K05j52m79M30K70
$$ 39 108 -270 38 31 -496 -121 97 -31 -282 -25 -154 342 -117 14 -318 -70 135 -17 -496 -66 204
8067B04m17J00J73j88n0Q5J03R5M8j9m53O14L7l22r9J70o6k20L95J4j60N7J78
$$ 204 -213 -113 60 -128 -178 -93 10 105 153 134 -319 295 332 10 -89 81 15 -205 190 204 44 101 279
8090B79m25K19J7j29q6Q5J63l81M79J60J8n20M61l48j27J12J74m59O56k78l89
$$ 279 -146 73 90 -39 -125 -40 123 -258 221 381 399 -121 340 -8 -135 -23 151 -308 348 70 -319
8111c19L06K85m51L24j26O5K4k34J52n0M1K38k05m3k45N55l61jK95o17K26L7J93
$$ -319 -13 272 -179 145 19 84 108 -126 26 -24 17 255 50 7 -238 317 -44 -45 250 -367 -141 -104 89
8134H9k05R2j62O6K55k16P7k66K42O1j71L11L6k82K66l69J55R2K87k18j80j19
$$ 89 -116 -24 -186 -120 135 -81 -4 -270 -28 33 -138 173 209 -73 193 -176 -21 71 358 140 -40 -159
8156a59J90k27L13K4j45m4P1O1j74J18J48k81j47L00P7j23K5K82j73j28L98m65
$$ -159 31 -196 117 141 -4 -48 23 84 -90 28 176 -105 -252 48 125 2 27 309 136 8 406 -59
8178e9k94M76j43R3l04k4J49J13j46K64l52L68j21
$$ -59 -353 123 -20 73 -231 -255 -106 7 -139 125 -227 141 20
8191B0
$$ Imaginary data points
##PAGE= N=2
##DATA TABLE= (X++(I..I)), XYDATA
0@%%%%%%%qJ6j6J6k4L2l4M2n6O5p4R0j06J23j47J71j96K28k61K97l37L83m34M88
$$ 0 0 0 0 0 0 0 0 -8 8 -8 8 -16 16 -18 24 -32 33 -41 49 -57 66 -81 90 -106 122 -139 158 -179 204 -230 258
31B58n49O18o93P73q62R60j066J183j313J455j610J782j973K186k423K691k996
$$ 258 -291 327 -366 407 -455 505 -561 622 -691 764 -846 936 -1037 1149 -1274 1417 -1579
48a579L345l747M219m786N476o337P448q946J1093j4442K0440l4473J26009P7625
$$ -1579 1766 -1981 2238 -2548 2928 -3409 4039 -4907 6186 -8256 12184 -22289 103720 181345
62A81345k36365r234J35096P8172p7479p5621j4822P1516M1554m5467n6397K8780
$$ 181345 -55020 -64254 70842 149014 71535 -4086 -18908 52608 94162 48695 -7702 21078
74B1078J4776k7688Q625L4136l7294m5289J2833L5037J6066p380o6290m1843Q4761
$$ 21078 35854 8166 16791 50927 13633 -31656 -18823 16214 32280 24900 -41390 -83233 1528
87A528Q6146q1748j12642L8710J03663J5471o3581o7478O828R2309M4417q9809
$$ 1528 87674 5926 -106716 -68006 35657 51128 -12453 -79931 -73103 19206 63623 -26186
99b6186o7303O4420O1348l1369l1922O405J536M572J2938l802j138J188l2637
$$ -26186 -93489 -29069 32279 910 -31012 -24607 -23071 -18499 -5561 -9363 -10501 -9313 -41950
112d1950o057O9010K0601q7931m0374P6381N4212l3731n1933k3108L3792P5529
$$ -41950 -48007 21003 41604 -46327 -86701 -10320 43892 10161 -41772 -64880 -31088 44441
124D4441p03r9528k7039R4725M9205n7628m7041J6316L9478K5637k1705m0170
$$ 44441 43738 -55790 -82829 11896 61101 3473 -43568 -27252 12226 37863 16158 -24012
136b4012J8378M3068k2609k6882M2129J5870n5862r794N8044J6872l8326k9139
$$ -24012 -5634 37434 14825 -12057 30072 45942 -9920 -19714 38330 55202 16876 -12263
148a2263o25L8241M3505l9640p9908K4403Q8234p211p3951j6683L4679K8061L452
$$ -12263 -12888 25353 68858 29218 -50690 -26287 61947 54736 -19215 -35898 -1219 26842 30294
161C0294l5221l6073L1485M3784k7550l5154K2751J3123k1794O042J8553j2149
$$ 30294 -4927 -41000 -9515 34269 6719 -28435 -5684 7439 -14355 -8313 10240 -1909
173a909j0402N037m487J3763K6251l0811m4520M0679N6557l3678n2969J5021L7642
$$ -1909 -12311 -7274 -11761 2002 28253 -2558 -47078 -6399 50158 16480 -36489 -21468 16174
186A6174J0119j3082l2026r475M4356K3051m4274k3508L3615J2346j8890K157
$$ 16174 26293 13211 -18815 -28290 16066 39117 -5157 -28665 4950 17296 -1594 563
198E63J675j2042J0043J0523j9772J398K4777j8052k8153L0907K8171l2422k4109
$$ 563 2238 -9804 239 10762 -9010 -7612 17165 -887 -29040 1867 30038 -2384 -26493
211b6493K0273J7769K769q344k7167o78M7174P303n2759q486M5557P223k7772
$$ -26493 -6220 11549 14318 5974 -21193 -21871 25303 32606 -20153 -28639 16918 24141 -3631
224c631l504O548L312J2134p957k3475J6267K5292k6428k1242L2198J1760l1174
$$ -3631 -7135 -587 2725 14859 6902 -16573 -306 24986 -1442 -22684 9514 21274 -9900
237i900m489J9431j110k451J503j6936j003L1673l725l7118O861L2043q489j7960
$$ -9900 -14389 5042 3932 1481 2984 -13952 -14955 16718 12993 -24125 -17264 14779 6290 -11670
251a1670N365J655J646J2902j1500k0030K2320J9910k8803j3926L0556N217k4056
$$ -11670 -6305 -4650 -3004 9898 -1602 -21632 688 20598 -8205 -22131 8425 13642 -10414
264a0414K373J1709n409M304L357j8244K930K6122r573k5858J4933J7585j6053
$$ -10414 -8041 3668 -1741 2563 5920 -12324 -9394 16728 7155 -18703 -3770 13815 -2238
277b238n774J1499n985j983J3481r898j5274K1258J0849k7487l847K6324k154
$$ -2238 -8012 3487 -2498 -4481 9000 -898 -16172 5086 15935 -11552 -15399 10925 8771
290H771j7133M824K054k501J4692l166k6508J0048L1502j5047k6985J6654J6447
$$ 8771 -8362 -3538 -1484 -3985 10707 7541 -18967 -8919 22583 7536 -19449 -2795 13652
303A3652j3089k753N518p403M768J1949j5173q081K2896m37k5123R227K2441j4493
$$ 13652 563 -2190 3328 -4075 693 12642 -2531 -10612 12284 11847 -13276 -4049 18392 3899
317C899j3699J3027J380m665J0650p075j9420J7420K1900k2704j7887J9959Q796
$$ 3899 -9800 3227 4607 -58 10592 3517 -15903 1517 23417 713 -17174 2785 11581
330A1581j1000J669j368j0056J2742J1623k0443p039K2355l153j9542J2336J2118
$$ 11581 581 2250 882 -9174 3568 15191 -5252 -12291 10064 6911 -12631 -295 11823
343A1823j7736l476J5182l815n921P882p559r602K0017P897k6386l696K3129j281
$$ 11823 -5913 -9389 5793 1978 -3943 3939 -3620 -13222 6795 14692 -11694 -15390 7739 6458
357F458j2121N847k595p962J6486P278k4008l214K3781l175j4541Q754L109j0817
$$ 6458 -5663 184 -2411 -10373 6113 13391 -10617 -13831 9950 6775 -7766 988 4097 -6720
371f720P803Q020j4246R28J4573j0983r480K0843K406k4956L207K2260n908j1861
$$ -6720 1083 9103 -5143 -4215 10358 -625 -10105 10738 13144 -11812 -8605 13655 7747 -4114
385d114N469k741p30J5382n492k3188J0874K2164j4098j3822J2863P60r824J0271
$$ -4114 1355 -1386 -2116 13266 7774 -15414 -4540 17624 3526 -10296 2567 3327 -6497 3774
399C774K192j6304M911J4409j3072p321J6672l407j6599J1180J1124j4214l357
$$ 3774 5966 -10338 -5427 8982 -4090 -11411 5261 1854 -14745 -3565 7559 -6655 -10012
412a0012J0079o049j899J3613q929j6345J6913J4484j9736o947J6577j642p579
$$ -10012 67 -5982 -7881 5732 -3197 -19542 -2629 11855 -7881 -14828 1749 107 -7472
425g472R766k004j1757J1226R432j5068j279J5054p135r047J4691J959j5713O107
$$ -7472 2294 290 -11467 -241 9191 -5877 -7156 7898 763 -8284 6407 8366 -7347 -1240
439a240J1555j1210j622J2789q004j0154J5274N128j7146J932J2347p081k334
$$ -1240 10315 -895 -2517 10272 2268 -7886 7388 12516 -4630 -2698 9649 2568 234
452B34R691q559q268J7698L183k0328L598J7117r077r109J1769o84r643R159L277
$$ 234 9925 1366 -6902 10796 13979 -6349 -2751 14366 5289 -3820 7949 7265 -2378 6781 10058
467A0058j2806M673J1652j3128n959J6559k299j5737P544Q993j1993o34R799r966
$$ 10058 -2748 1925 13577 449 -5510 11049 8750 -6987 557 9550 -2443 -3077 6722 -3244
481c244n403J4483k901j6533Q476J1101j3462l173J1244o116o742J1872j959j2692
$$ -3244 -8647 5836 2935 -13598 -5122 5979 -7483 -10656 588 -5528 -12270 -398 -2357 -15049
495a5049R910Q763j4751j027J6409o469j0771J2255M307j1845M592R585j0367
$$ -15049 -5139 3624 -11127 -12154 4255 -2214 -12985 -730 3577 -8268 -3676 5909 -4458
508d458j06J2706o698q726J3244L223j4490N550J1722j1143m944J3527l580j1273
$$ -4458 -4564 8142 1444 -7282 5962 9185 -5305 245 11967 824 -4120 9407 5827 -5446
522e446J0140M523j3476K406J1137r598n158J1238l776r966J0253L269j4429L591
$$ -5446 4694 9217 -4259 -1853 9284 -314 -5472 5766 1990 -7976 2277 5546 -8883 -5292
536e292J3476j0347q706J3738N89j1794O828P134j0899J282J0862q472n695J3673
$$ -5292 8184 -2163 -10869 2869 3458 -8336 -1508 5626 -5273 -3991 6871 -1601 -7296 6377
550F377j636j3574Q917R279j2454j860J1558n578o825J0869j045j2759Q099R083
$$ 6377 4741 -8833 84 9363 -3091 -4951 6607 1029 -5796 5073 4028 -8731 -632 8451
564H451j3568l226J3021m641q909R425J360j1513O421Q524j1995j785J3978n431
$$ 8451 -5117 -8343 4678 37 -8872 553 1913 -9600 -3179 5345 -6650 -8435 5543 112
578A12r971J1368M782j2668L589J0892q109l306J0513k850p761J0735L092j2681
$$ 112 -9859 1509 6291 -6377 -2788 8104 -5 -3311 7202 4352 -3409 7326 10418 -2263
592b263M672J1604j0150n490J2718j854j1019Q449N591j2663M14J0693p577o707
$$ -2263 2409 14013 3863 -1627 11091 9237 -1782 6667 12258 -405 9 10702 3125 -3582
606c582J0054j641j0462O922M536j2208J405J0521q596p093J1864j79j2819O665
$$ -3582 6472 4831 -5631 1291 5827 -6381 -4976 5545 -3051 -10144 1720 1541 -11278 -4613
620d613P947j0661j320J0507n443o031J1003k92j1455P626R125j1259k776J2413
$$ -4613 3334 -7327 -8647 1860 -3583 -9614 1389 1097 -10358 -2732 6393 -4866 -7642 4771
634D771l487q264R763J553j0908N983Q403j0986k713J1894l368r602Q904L057
$$ 4771 1284 -6980 2783 4336 -6572 -589 7814 -3172 -5885 6009 2641 -6961 1943 5000
648E000j1146L674Q183r128l040J1999n083r797J0465N167j2890R87J1875p150
$$ 5000 -6146 -2472 5711 -3417 -6457 5542 459 -9338 1127 6294 -6596 -5609 6266 -884
662h84n538R843o78q419Q037M262j0743K236R986p684m531J1233j349j1176Q290
$$ -884 -6422 3421 2743 -5676 2361 6623 -4120 -1884 8102 418 -4113 7120 5771 -5405 2885
677B885P133j1585r48J0736n757o427R335k04j0745O085O638j0945p26R786n937
$$ 2885 10018 -1567 -2515 8221 2464 -3963 5372 5168 -5577 508 7146 -3799 -4525 5261 -676
692f76o952J0262O56j1857M624Q804r393k403R615l840o866R393J374j0748M944
$$ -676 -7628 2634 3290 -8567 -3943 4861 -4532 -6935 2680 -1160 -8026 1367 2741 -8007 -3063
707c063R050r510k641J1580l448q871Q927M220j0590K990Q706p908l420J0940
$$ -3063 5987 -3523 -6164 5416 1968 -6903 2024 6244 -4346 -1356 7350 -558 -3978 6962
721F962k337j0106P781N442r715J176P780p655l224J0887k899j0313Q170N081
$$ 6962 4625 -5481 2300 7742 -1973 -797 6983 -672 -3896 6991 4092 -6221 1949 7030
735G030j0528N91R767p173n883J0891P4j1119N579O752q658j45Q611n605n510
$$ 7030 -3498 -2907 6860 -313 -6196 4695 4769 -6350 -771 5981 -2677 -2822 5789 184 -5326
750e326R250M79r229N478O174j0321Q7J0909n215r152R115L029q458L272M914
$$ -5326 3924 4403 -4826 652 6826 -3495 -3408 7501 2286 -6866 2249 5278 -3180 92 5006
765E006q980J97J1364o038r614R130M237j0074K578P428q364k729J0088k363q470
$$ 5006 -3974 -3777 7587 1549 -8065 1065 5302 -4772 -2194 5234 -3130 -5859 4229 1866 -6604
780f604O421K826q874M431P505r315m489J1014l17q476N249K291q282M464R059
$$ -6604 -183 2643 -6231 -1800 5705 -3610 -8099 2915 2598 -5878 -629 1662 -6620 -2156 6903
795F903j0162o136J1951J399r432M072M461q353J953R230o745o246Q417O66p264
$$ 6903 -3259 -9395 2556 3955 -5477 -1405 3056 -5297 -3344 5886 -859 -7105 1312 1978 -5286
810e286O008L811j0750J057J1471m685p835O850J032o725P335M523j2340j587
$$ -5286 722 4533 -6217 -5160 6311 1626 -6209 641 1673 -5052 2283 6806 -5534 -7121
824g121J3648j737r097M676K032n726O553M707j1796k088J3186j905r247N846
$$ -7121 6527 4790 -4307 369 2401 -3325 3228 7935 -3861 -5949 7237 5332 -3915 1931
838A931K981q141L958P340p658m159Q245k020m156P884o49j2516N342J2808p715
$$ 1931 4912 -3229 729 8069 411 -3748 4497 2477 -1679 6205 5556 -6960 -1618 11190 3475
853C475r178P184K158m119N486o58j1108M518J1651o388q525O548J278n155N680
$$ 3475 -5703 1481 3639 -480 5006 4348 -6760 -2242 9409 3021 -5504 1044 2322 -2833 2847
868B847K356j0007R41R063m344m776P274k987q235R150P306j2449m685J0408M98
$$ 2847 5203 -4804 -3863 5200 856 -3920 3354 367 -7868 1282 8588 -3861 -8546 1862 2360
883B360m398M248l590p253R446P915j2257n326J0252J053m867M473j407q126O296
$$ 2360 -2038 2210 -1380 -8633 813 8728 -3529 -8855 1397 2450 -2417 2056 649 -7477 -1181
898a181Q343q992m188Q461k518m807Q616R77j1627K514J0084m322m093M760m242
$$ -1181 7162 -1830 -6018 2443 -75 -4882 3734 4711 -6916 -4402 5682 1360 -2733 2027 -2215
913b215m078J1752K634j5315o86J2824p25o114J905k637k462R715J591j2683M20
$$ -2215 -6293 5459 8093 -7222 -7908 4916 4191 -1923 -18 -2655 -5117 4598 6189 -6494 -6074
928f074J1156m012m993O510k081p921P231O321q500k198O128l675j706R554l294
$$ -6074 5082 1070 -3923 2587 506 -7415 -184 6137 -2363 -4561 1567 -2108 -3814 5740 2446
943B446j2574O212J1855o593o166L667j083N39Q161m523j1235O853J0496p610
$$ 2446 -10128 -3916 7939 1346 -4820 -1153 -2236 -1697 6464 1941 -9294 -2441 8055 445
957D45m787N888j699l547Q213Q95j0187K727P501n375r42P132o037p197J0784
$$ 445 -4342 1546 -153 -3700 4513 5408 -4779 -2052 5449 74 -868 6264 227 -6970 3814
972C814N980j1311k284O590j484J25N679o837o861J0442O470j0844l274P177j842
$$ 3814 9794 -1517 -3801 2789 1305 1430 7109 272 -6589 3853 10323 -521 -3795 3382 1540
987A540r80O169n207p708R080N174r516p82P444m935m396R311j2j0100L121O109
$$ 1540 560 6729 1522 -6186 2894 8068 -1448 -2230 5214 279 -4117 5194 5182 -4918 -1797 4312
1003D312m435R6M298p783l076J2301O18j2150M28Q094k417j469L327o449k539
$$ 4312 -123 -27 4271 -3512 -6588 5713 6331 -5819 -5391 2703 286 -1183 2144 -4305 -6844
1018f844J0693K82j1138K274P466n520k011P469m163o597P179L376p302J652M421
$$ -6844 3849 4131 -7007 -4733 2733 -2787 -4798 2671 -1492 -8089 -910 2466 -4836 -3184 1237
1033A237o678K30J0110m450j0007O733O417n497p95L062n045R75R098m112r487
$$ 1237 -5441 -5211 4899 449 -9558 -2825 3592 -1905 -2700 362 -4683 -3708 5390 1278 -8209
1048h209P175O077p157M3N653n218k620Q863j339p715M547M613o581J116P257
$$ -8209 -1034 5043 -2114 -2071 3582 -1636 -4256 4607 3268 -4447 100 4713 -1868 -752 6505
1063F505n906n344Q805J553p007K205L237n650K587P086p221o346R888K933q409
$$ 6505 599 -4745 4060 5613 -1394 811 4048 -1602 985 8071 850 -5496 4392 7325 -1084
1078a084J057M564n040N29O743n668n795Q464K056q459K254N555o270j783P486
$$ -1084 -27 4537 -503 26 6769 1101 -4694 3770 5826 -2633 -379 5176 -1094 -2877 4609
1093D609k331o280N242J841o358L157N276q127k429R372j178p984M079L178n988
$$ 4609 2278 -4002 1240 3081 -3277 -120 5156 -2971 -5400 3972 2794 -5190 -1111 2067 -3921
1108c921K529M550o891k505R263j576p926N001L857o984P15O557n005l752P055
$$ -3921 -1392 3158 -3733 -6238 3025 1449 -6477 -1476 2381 -4603 -3888 2669 -2336 -6088 967
1123I67k96n911M283L308p416J520P921n173n310P263J330o102L657L568o518
$$ 967 671 -5240 -957 2351 -5065 -3545 4376 -797 -6107 1156 2486 -3616 41 3609 -2909
1138b909M65Q253m244n704P122J855o850L262M710o303p07P574l477n475O627
$$ -2909 -2444 5809 1565 -4139 2983 4838 -2012 1250 5960 -343 -1050 6524 3047 -2428 4199
1153D199J580p316K947N708o712k098O933k236n068N301J542p531L133O068p093
$$ 4199 5779 -1537 1410 7118 406 -1692 5241 3005 -2063 3238 4780 -2751 382 6450 -643
1168f43k994P256q66o507M720J989o909K376O129o455l640P977r05o968M315L743
$$ -643 -3637 3619 2753 -3754 966 2955 -3954 -1578 4551 -1904 -5544 2433 1528 -5440 -1125 2618
1184B618o691N45N993m932k929O543j239o660N561L620p784l98P792l908m688
$$ 2618 -4073 -3528 2465 -2467 -5396 1147 -92 -6752 -1191 2429 -5355 -5753 2039 -1869 -6557
1199f557N754M91o208L916M001o589l11P456l755m857O703R20o748L648N215o324
$$ -6557 -803 -312 -6520 -2604 1397 -5192 -5503 1953 -1802 -6659 44 964 -5784 -2136 3079 -3245
1215c245r20P211k661m659O400J828p131L162N780n442j765O746k156m704O261
$$ -3245 -4165 3046 385 -4274 2126 3954 -3177 -15 5765 323 -1442 5304 3148 -1556 4705
1230D705J466p193K584O168n428k828O723r95n869N130K089p397K103O262n702
$$ 4705 6171 -1022 1562 7730 2302 -526 6197 5202 -667 4463 6552 -845 1258 7520 1818
1245A818l312O901j372o439M584L205o890O92O000m515l645O716j062o543M305
$$ 1818 -1494 5407 4035 -2404 2180 5385 -1505 -813 5187 672 -2973 3743 2681 -3862 443
1260D43M255o649l31O190l896l764O098m44p009M502M579o995j001O450l410m676
$$ 443 4698 -1951 -2282 3908 12 -3752 2346 1902 -5107 -605 3974 -3021 -4022 2428 -982 -5658
1276e658O277O38p122K962N313n776k131O543k385n065N739J333o936K555N380
$$ -5658 619 1257 -5865 -2903 2410 -3366 -5497 1046 -1339 -6404 -665 668 -6268 -3713 1667
1291A667n518j838O800j896n298N287K767o463J518N394m303k084O451j772n737
$$ 1667 -3851 -5689 1111 -785 -6083 -796 1971 -4492 -2974 2420 -1883 -3967 2484 712 -5025
1306e025N492L574p096Q53O350m081k743O211j180n757N166L204o881R20O112
$$ -5025 467 4041 -3055 -2202 4148 67 -2676 3535 2355 -3402 1764 4968 -1913 -993 5119
1321E119m145l939O644j7o327L716L888o102L77N703m380l757P114O00p885L177
$$ 5119 974 -2965 3679 3662 -2665 1051 4939 -1163 -786 4917 537 -3220 3894 4494 -3391 -214
1337b14N455n550j355N855l332l702O077M91p105L003N060n712j664O696k614
$$ -214 5241 -309 -1664 4191 859 -2843 3234 3725 -3380 -377 4683 -1029 -2693 4003 1389
1352A389m847N064J573o113K076M686n604k183P395k074o163M645L272n604P21
$$ 1389 -3458 1606 3179 -2934 -858 3828 -1776 -3959 3436 1362 -4801 -156 3116 -2488 -1767
1367a767M253m900q15O556k292o690N182L995o087m83N580l344k528N421j416
$$ -1767 2486 -2414 -3229 3327 1035 -5655 -473 3522 -2565 -3048 2532 -812 -3340 2081 665
1382F65n073N160K556o448N29O765l787m660O189P68n432K858K940n484J123N943
$$ 665 -4408 752 3308 -3140 -2611 4154 367 -4293 1896 2664 -2768 90 3030 -2454 -1331 4612
1398D612m530m606O970J895p202J885M735m400k67M730l880l351O749N1o944L253
$$ 4612 82 -4524 2446 4341 -2861 -976 3759 -641 -908 3822 -58 -3409 3340 3391 -3553 -300
1414c00N162n587k009N816j430m404M168Q19n155K706M350o346j948P205j616
$$ -300 4862 -725 -2734 3082 1652 -2752 1416 2235 -2920 -214 4136 -2210 -4158 3047 1431
1429A431n659L450K940n071J443L713n105j319P047k029o700N087L492n853k09
$$ 1431 -4228 -778 2162 -2909 -1466 2247 -2858 -4177 2870 841 -5859 -772 2720 -3133 -3342
1444c342N171l472j947N444j610n067M767L403o958K3P042l364m207M973R76m671
$$ -3342 1829 -1643 -3590 1854 244 -4823 -56 3347 -3611 -3588 3454 90 -4117 856 1832 -2839
1460b839L178K541n679J014O506m248m664O385J550o122K179L888m761Q2N498
$$ -2839 339 2880 -2799 -1785 4721 473 -4191 2194 3744 -2378 -199 3689 -1072 -990 4508
1475D508m054l793O535R25p069K441N802n297k036N459j424l545L578N24n190
$$ 4508 454 -3339 3196 4121 -2948 -507 5295 -2 -2038 3421 1997 -1548 2030 2554 -2636
1490b636K627M995n901k312O732j064n712L932K181n370K156L834n172j583O486
$$ -2636 -9 4986 -915 -3227 3505 2441 -3271 661 2842 -2528 -372 3462 -1710 -3293 3193
1505C193j627o272M324L865n745l19N171l134k368N021j464m808M364L189n988
$$ 3193 1566 -4706 -382 3483 -2262 -2581 2590 -544 -2912 2109 645 -4163 201 3390 -2598
1520b598k78O179l314l386M734K56m779L299K898n897M17O447l641m639O001J484
$$ -2598 -2876 3303 -11 -3397 1337 1593 -3186 113 3011 -2886 -2469 3978 337 -4302 1699 3183
1536C183n602J920L290l951j32N108l216m144O092J297o113J308M902m075j540
$$ 3183 -2419 -499 2791 -1160 -1292 3816 600 -3544 2548 3845 -2268 -960 3942 -133 -1673
1551a673M832j827m001N035R68n962K104N064n181k499O040j004n008L294K191
$$ -1673 3159 1332 -2669 2366 3334 -2628 -524 4540 -641 -3140 2900 1896 -3112 182 2373
1566B373m608Q06L806m301k043O238j306o009L543L245m733j10M442l812k112
$$ 2373 -2235 -1429 2377 -1924 -3967 2271 965 -5044 -1501 1744 -2989 -3099 1343 -2469 -4581
1581d581N663j113n297M209L296n874K75N756l095l289N137Q56n130L089L192
$$ -4581 1082 -31 -5328 -1119 2177 -3697 -3422 2334 -761 -4050 1087 1943 -3187 -98 3094
1596C094n329K92O167l355m399N339J639m615J412L114m057j42N265k988m460
$$ 3094 -2235 -1943 4224 869 -3530 1809 3448 -1167 245 3359 -698 -840 4425 1437 -3023
1611c023N405J537n486R83M503m355j426N316k280l501L897J563n077K016M275
$$ -3023 2382 3919 -1567 -584 3919 -436 -1862 3454 1174 -2327 1570 3133 -1944 72 4347
1626D347m691k032N650l93m691L302J342m055J688M161m839k224O115j46n502
$$ 4347 -344 -2376 3274 2881 -1810 1492 2834 -1221 467 4628 -211 -2435 3680 3534 -1968
1641a968K840K492m364M82M164l928k461M845m65n162L353K790n808k34N196k375
$$ -1968 872 3364 -1000 -518 3646 -282 -2743 2102 1637 -3525 -172 2618 -3190 -3424 1772 -603
1657f03l985M182K29l971L230K030n557M03O271k752m272M572J424m370K683K801
$$ -603 -4588 -406 -177 -4148 -918 1112 -4445 -4042 2229 -523 -4795 -223 1201 -3169 -486 2315
1673B315m643J85N561k403l866M748J299m879J500M282l944j515M729j717l440
$$ 2315 -2328 -2143 3418 1015 -2851 1897 3196 -1683 -183 4099 155 -1360 3369 1652 -1788
1688a788M006O19n672K074M934m572l102M671j04l848L246O62n148K160M399m194
$$ -1788 2218 2837 -2835 -761 4173 -399 -3501 1170 1066 -2782 464 1126 -4022 -1862 2537 -1657
1704a657k915N322j25m699K818K523l907O24L887k707k028M853p10m409L500L464
$$ -1657 -4572 750 625 -4074 -1256 1267 -2640 -2016 1871 -836 -2864 1989 1279 -3130 370 3834
1720C834m951q42M963j777k816L609m05m148L910K789n598q81N708j818m081L315
$$ 3834 -1117 -1959 3004 1227 -1589 2020 1615 -2533 1377 4166 -1432 -2313 3395 1577 -2504 811
1736H11Q68l803J711K693m735J33M893k531l819N015J384n418J229M249k688j395
$$ 811 1679 -2124 -413 2280 -2455 -2322 2571 40 -3779 1236 2620 -2798 -1569 2680 -8 -1403
1752a403L823j828k614M702J043n672J223N927l613k455L331j61k831L287P38
$$ -1403 2420 592 -2022 2680 3723 -1949 -726 5201 1588 -867 2464 2303 -528 2759 3497
1767C497m848J497M435m027k915N068m54m595K137K604m185K94L420l376j824
$$ 3497 -1351 146 4581 554 -2361 2707 2253 -2342 -205 2399 -1786 -1492 1928 -1448 -3272
1782c272M646p44n230L149L616m149j495L930j579j693L745p03m400L774L412
$$ -3272 1374 630 -4600 -1451 2165 -1984 -3479 451 -1128 -2821 924 221 -4179 -405 3007
1797C007m886j152N200j360l136K831J069l431K085K187m075m29N186k249m565
$$ 3007 -1879 -3031 2169 809 -2327 504 1573 -1858 227 2414 -1661 -2090 3096 847 -3718
1812c718M535K093m535K35K826k164p70L272k391l306M816J658n881N25N043l005
$$ -3718 817 2910 -1625 -1390 1436 -728 -1498 1774 -617 -3923 893 2551 -3330 -2805 2238 -767
1828g67k099L426k58l015L457N29m446K165L993l552k799N206K95l898J672K427
$$ -767 -2866 560 302 -2713 744 1273 -3173 -1008 2985 -567 -3366 1840 2135 -1763 -91 2336
1844B336l618J395L218l987j755N667n12n234K145L696l261j358L321j832j701
$$ 2336 -1282 113 3331 -656 -2411 3256 2744 -2490 -345 3351 90 -1268 2053 221 -1480
1859a480L610l82m331K776L488m978j044M585r42l196K969N78l510K313K141m293
$$ -1480 2130 1748 -2583 193 3681 -1297 -2341 2244 1302 -1894 1075 1653 -1857 456 2597 -1696
1875a696N2M825j715m584L696K190l789N75K452k890p29L907k019l392M069K388
$$ -1696 -1644 3181 1466 -3118 578 2768 -1021 -446 2006 -884 -1613 2294 275 -3117 952 3340
1891C340n363L51M374k428k181K840m20k489K750J073m793J408M537l224k935
$$ 3340 -2023 -1672 2702 274 -1907 933 513 -1976 774 1847 -2946 -1538 2999 -225 -3160
1906c160M428L84l925K311J544l363J052L557l644k071M670K83m730K100L147
$$ -3160 1268 1652 -2273 38 1582 -1781 -729 2828 -816 -2887 1783 2066 -2664 -564 2583
1921B583l411n09L247k116j345L514k91m293K852L377m779j184M381q66l001K749
$$ 2583 -828 -1337 1910 -206 -1551 1963 1672 -2621 231 3608 -1171 -2355 2026 1160 -1841 908
1937I08N03l437K237K640m288o31M960j918l489L045J546l579P13L080l252q36
$$ 908 1411 -2026 211 2851 -1437 -2068 2892 974 -2515 530 2076 -1503 -790 2290 -962 -1798
1953a798L817j759l450L755J645m437Q4L713k072j883K977p95k713L015J747m954
$$ -1798 2019 260 -3190 565 2210 -2227 -2143 1570 -502 -2385 592 -203 -2916 99 1846 -3108
1969c108Q01L815k211k476L667l4l319K472J860l486O97L048k552j863M276R6
$$ -3108 -2307 1508 -703 -3179 488 454 -2865 -393 1467 -2019 -1322 1726 -826 -2689 1587 1683
1985A683m110K024K770k952m47L172j758j902L732J1l876J876L157l603q10L805
$$ 1683 -2427 -403 2367 -585 -1032 2140 382 -1520 2212 2223 -1653 223 3380 -223 -1033 2772
2001B772j190l206L644K53l681J858K589l214r32M031j549l386K998J574m043
$$ 2772 1582 -1624 2020 2273 -1408 450 3039 -175 -1107 2924 1375 -2011 987 2561 -1482
2016a482J236K675k833r36L522j025l507L192J567l995N26L064k203j545L712
$$ -1482 -246 2429 -404 -1340 2182 1157 -2350 842 2409 -1586 -1060 2004 -199 -1744 1968
2031A968j090l354K465K145l715L31L035k564j601L489j99l544K425J800l029
$$ 1968 878 -2476 -11 2134 -1581 -1250 1785 -779 -2380 1109 910 -2634 -209 1591 -1438
2046a438k32L389k257k203L890J02l911K056K421l342m73L791j969k162K974N87
$$ -1438 -1670 1719 -538 -2741 1149 1251 -2660 -604 1817 -1525 -1998 1793 -176 -2338 636 1223
2062A223l358J699K724l412m39L628j457k630K525J433l278J189K562l245n37
$$ 1223 -2135 -436 2288 -1124 -1563 2065 608 -2022 503 1936 -1342 -153 2409 -836 -1373
2077a373L261r22l047L116J289l777P48L253k986j191L373q87k938K909N69l196
$$ -1373 1888 966 -2081 1035 2324 -1453 -705 2548 -438 -1629 1744 857 -2081 828 1397 -1799
2093a799O03L401k717j969L699l57l196J973J294l070N80L084k278k206L764l20
$$ -1799 -1196 2205 -512 -2481 1218 861 -2335 -362 932 -2138 -1558 1526 -752 -2958 806 486
2109D86l439J996K294l328j58L112j667j584K951l18k991K635K037l583j81L986
$$ 486 -2953 -957 1337 -1991 -2149 963 -704 -2288 663 345 -2646 -11 2026 -1557 -1738 2248
2125B248j653k356K773J044l521J692K383k887k19K938r67k944L009J271l381
$$ 2248 595 -1761 1012 2056 -1465 227 2610 -277 -496 2442 1475 -1469 1540 2811 -570
2140e70P70K390k622k67K879j588k466L043J156l911L86L499k550j371L151j145
$$ -570 200 2590 -32 -299 2580 992 -1474 1569 2725 -1186 -800 2699 149 -1222 1929 784
2156G84j947K305J187l642O12L402k413j722L063J60l156J837J558k705L69K602
$$ 784 -1163 1142 2329 -1313 -701 2701 288 -1434 1629 1789 -1367 470 2028 -677 -308 2294
2172B294k401j778L903m10l683J712K485l032l06K486k072j279K867l66l471J907
$$ 2294 -107 -1885 2018 1608 -2075 -363 2122 -910 -1216 1270 -802 -2081 786 420 -3051 -1144
2188a144K652l488r07L287j207k477K548N18k701J256K151k962k04L669j301k917
$$ -1144 1508 -1980 -2887 400 -807 -3284 -736 -218 -2919 -1663 488 -2474 -2678 991 -310 -3227
2204c227K966J215k657P24K095j964j57L141j706k744L181J868l703p9L251j858
$$ -3227 -261 954 -1703 -979 1116 -848 -1005 2136 430 -2314 867 2735 -968 -1047 2204 346
2220C46j153K344p74k202K603P29l384Q77L057k491j774K965j14k576J468J336
$$ 346 -807 1537 763 -1439 1164 1893 -1491 -614 2443 -48 -1822 1143 1029 -1547 -79 1257
2236A257k843Q68K522k390j819M173K76l759J538K439k543k6K382j461j223K948
$$ 1257 -1586 -718 1804 -586 -2405 1768 2044 -1715 -177 2262 -281 -307 2075 614 -609 2339
2252B339j62l128J543K690l195o94K974q32k085J941P32k965J427J879l386n81
$$ 2339 2177 -951 592 3282 87 -607 2367 1535 -550 1391 2123 -842 585 2464 -922 -1503
2268a503L726j149l554K275J293k557O01J778k673m16L223j412k860K752J635
$$ -1503 2223 1074 -2480 -205 1088 -1469 -868 910 -1763 -2179 1044 -368 -3228 -476 1159
2283A159l201L58K743j803j100K487m79k165K388J114l258M71L454j807k156K555
$$ 1159 -2042 -1684 1059 -744 -1844 643 164 -2001 387 1501 -1757 -1286 2168 361 -1795 760
2299G60O45k465J193J495k984P48K782k493j966L328M34l148Q81J859j891m48
$$ 760 1405 -1060 133 1628 -1356 -608 2174 -319 -2285 1043 1477 -1671 -790 1069 -822 -1270
2315a270K476j753j452K940Nl119J849K702l069p15K530q35j390K229L03k645
$$ -1270 1206 -547 -1999 941 946 -2173 -324 2378 -691 -1406 1124 289 -1101 1128 1431 -1214
2331a214J674K123k871l87L080o48k548J619J100k541J055J734k172j115L287
$$ -1214 460 2583 -288 -675 2405 1757 -791 828 1928 -613 442 2176 4 -1111 2176
2346B176j437k760K457J442l285J63K602j677j068K035q70k163K392R56l225M37
$$ 2176 739 -2021 436 1878 -1407 -1244 1358 -319 -1387 648 -222 -2385 7 963 -2262 -1825
2362a825K294j224j600K642P5k690J756J063k298K24K801j857j810L058L21l193
$$ -1825 469 -755 -2355 287 362 -2328 -572 491 -1807 -1583 1218 -639 -2449 609 930 -2263
2378b263J365K075j901j59K255j578j822L166K46l478J297K841k445p44K675q31
$$ -2263 -898 1177 -724 -883 1372 -206 -2028 1138 1384 -2094 -797 2044 -401 -1145 1530 699
2394F99k132K493N80k890J256K125k351o88K962q25k514K175J079k458P24K241
$$ 699 -1433 1060 1640 -1250 6 2131 -220 -908 2054 1229 -1285 890 1969 -489 235 2476
2410B476k463n37L223q42l270K347J436k285R2K111k038j190L266r36k814K108
$$ 2476 13 -524 2699 1857 -1413 934 2370 85 177 2288 250 -940 2326 1390 -1424 684
2426F84J294k646Q0K223j598j453K715M04l121J208J429k494N04K390k134j969
$$ 684 1978 -668 -588 1635 37 -1416 1299 1703 -1418 -210 1219 -1275 -771 1619 -515 -2484
2442b484K979P26l070J040J145j681K82J970j637j950K884O37l019P88K273k380
$$ -2484 495 1221 -1849 -809 336 -1345 -1063 907 -730 -2680 204 841 -2178 -1390 883 -1497
2458a497j55K451r84k115K202O65k739J452J962k790n32K985m82k441J583R99
$$ -1497 -1652 799 -185 -2300 -98 567 -2172 -720 1242 -1548 -2080 905 423 -2018 -435 564
2474E64j966P99K234k592j152L489k91k967J539J402j890L05K034j957j017K974
$$ 564 -1402 -603 1631 -961 -2113 1376 1085 -1882 -343 1059 -831 -526 1508 -449 -1466 1508
2490A508l01k489J660J175k391L75K609j544j968K413L8j891J126J527l137O66
$$ 1508 1207 -1282 378 1553 -838 -463 2146 602 -1366 1047 1085 -806 320 1847 -1290 -624
2506f24K741j404k419K386O58k173J285J101k127L75K312j400j953K507N38k794
$$ -624 2117 713 -1706 680 1338 -835 450 1551 -576 -201 2111 711 -1242 1265 1803 -991
2522i91R86J769j899o20K211n34j717K000k16k418J543K354k756j850K972K06
$$ -991 -5 1764 -135 -755 1456 922 -795 1205 989 -1429 114 2468 -288 -2138 834 1040
2538A040k008J162M35j674R44J920k718j091L226k33k738J599J055k178N79J778
$$ 1040 -968 194 629 -1045 -101 1819 -899 -1990 1236 1003 -1735 -136 919 -1259 -680 1098
2554A098j835r45K577n46k315K389J542l187l15K916j002j558J848k60k016K155
$$ 1098 -737 -1682 895 349 -1966 423 1965 -1222 -1537 1379 377 -1181 667 407 -1609 546
2570E46J015l300J36L384j226k536J804J191j832Q04J065k231J43K696j496k433
$$ 546 1561 -1739 -1603 1781 555 -1981 -177 1014 -818 -14 1051 -1180 -1037 1659 163 -2270
2586b270K920R69l008Q08K090j871r57K419j282j364K454N91l411J098K803k146
$$ -2270 650 1619 -1389 -581 1509 -362 -1319 1100 -182 -1546 908 1499 -1912 -814 1989 -157
2602a57j317K051J57j831J386O50k735J362K465k648j423K808N42l193J432J397
$$ -157 -1474 577 734 -1097 289 939 -1796 -434 2031 -617 -2040 768 1310 -1883 -451 946
2618I46j907L07J943k055m04K523n21k949J875J990k375q10K527q20j421J834
$$ 946 -961 -654 1289 -766 -1170 1353 832 -2117 -242 1748 -627 -1437 1090 270 -1151 683
2634F83j75j953J929J411k976n56L229r86j890J648O59j949J069J203k253J30
$$ 683 508 -1445 484 1895 -1081 -1637 1592 606 -1284 364 1023 -926 143 1346 -907 -777
2650g77K978j648k717L046J020k673P03J653j500m61K014j446j594K638N15k953
$$ -777 2201 553 -2164 882 1902 -771 -68 1585 85 -376 1638 192 -1402 1236 1751 -1202
2666a202P71K597k106j280K235k15j330J301P6k360J732J751k274j418L054k26
$$ -1202 -431 2166 60 -1220 1015 800 -530 771 847 -1513 219 1970 -304 -1722 1332 1106
2682A106k441J303R65j933K74J997j983j174K988l31k465J342J698k093m68K245
$$ 1106 -1335 -32 933 -1000 -726 1271 -712 -1886 1102 771 -1694 -352 1346 -747 -1215 1030
2698A030q52j466J637j68j765J546J651k993j29K890n27k403J532M61j965J508
$$ 1030 178 -1288 349 181 -1584 -38 1613 -1380 -1509 1381 854 -1549 -17 444 -1521 -13
2714a3J084k266j00K710r67k225J809Q93k153N45J873k080l09K274r14j687J802
$$ -13 1071 -1195 -1295 1415 448 -1777 32 925 -1228 -683 1190 -890 -1199 1075 161 -1526 276
2731B76Q25k812Q20K292j630r56K048l41j777J969K38k249P08K633k432r08K102
$$ 276 1101 -1711 -891 1401 -229 -1185 863 522 -1255 714 952 -1297 -589 2044 -388 -1296 806
2748H06J07k197J313J191k194M59J922j465j221K135k48k218J507J782k568l64
$$ 806 913 -1284 29 1220 -974 -515 1407 -58 -1279 856 608 -1610 -103 1679 -889 -1253
2764a253K314q21j600K055J16k473J675J862k727l77K639j018j723J984l7j988
$$ -1253 1061 240 -1360 695 811 -1662 13 1875 -852 -1229 1410 392 -1331 653 616 -1372
2780a372J223J799k148k76K360j250j464K132J20j970O72J833j539j014K229o63
$$ -1372 -149 1650 -498 -774 1586 336 -1128 1004 1124 -846 -174 1659 120 -894 1335 672
2796F72j389J768M56k519O99K237j859j471K318k03j746J450J043k389L25K106
$$ 672 -717 1051 1507 -1012 -313 1924 65 -1406 912 709 -1037 413 1456 -933 -608 1498
2812A498j418j426K363l49k083J895J030k448m8K402j416j497K662m63k101J530
$$ 1498 80 -1346 1017 668 -1415 480 1510 -938 -986 1416 0 -1497 1165 702 -1399 131
2828A31J400k516MK093q70j610J971J73k482J327J533k070l86K474j167j526J842
$$ 131 1531 -985 -981 1112 242 -1368 603 776 -1706 -379 1154 -916 -1302 1172 5 -1521 321
2845C21N99k688J070J718j860q27K482q15j829K166O46k475M75K127j639r83K685
$$ 321 920 -1768 -698 1020 -840 -1667 815 0 -1829 337 983 -1492 -1017 1110 -529 -1512 1173
2862A173j319j482J997R99k378J84K047j499q87K012n84j846J936P91k164J84
$$ 1173 -146 -1628 369 1368 -1010 -826 1221 -278 -1165 847 263 -1583 353 1144 -1020 -836
2878h36K287j662j005K229j02k304J423J550k253k10K077j079j131J923j98k147
$$ -836 1451 -211 -1216 1013 911 -1393 30 1580 -673 -883 1194 115 -1016 907 709 -1438
2894a438J316J502k022k24K013j125j445K047M26k341J294J602k229k08K182j058
$$ -1438 -122 1380 -642 -866 1147 22 -1423 624 1050 -1291 3 1605 -624 -832 1350 292
2910B92j372J907O48k545P70J925j767j095K561p59k079K379O37k650N46K184
$$ 292 -1080 827 1475 -1070 -300 1625 -142 -1237 1324 565 -1514 865 1502 -1148 -602 1582
2926A582j613r99K329o23j944J782P97k243L27K052j545q37J831j84j880J393
$$ 1582 -31 -1030 1299 676 -1268 514 1311 -932 -605 1447 -98 -935 896 712 -1168 225
2942B25Q21k113M04K120j543j158K204o4k233J592J444k312m1J860j090j535K182
$$ 225 1046 -1067 -663 1457 -86 -1244 960 896 -1337 255 1699 -613 -654 1206 116 -1419 763
2959G63m8j987Q80J803k147l07J981r38j575K000J23k036J206J174j722j86J735
$$ 763 715 -1272 -392 1411 -736 -1043 938 0 -1575 425 548 -1488 -282 892 -830 -1016 719
2976G19p55j879K073O36k168P40J709k011m79K119o87j831J812O42j804K95K112
$$ 719 -36 -1915 158 794 -1374 -634 1075 -936 -1415 704 17 -1814 -2 640 -1164 -869 1243
2993A243j863n98J988m84j725J491J173k335N51J722j329q31J865k51j561R30
$$ 1243 -620 -1218 770 286 -1439 52 1225 -1110 -559 1163 -166 -997 868 617 -944 -14
3009a4J329k200J21J926j028j197J996J76k212J232J340k215L08J802j459r37
$$ -14 1315 -885 -764 1162 134 -1063 933 1109 -1103 129 1469 -746 -438 1364 -95 -1032
3025a032J948J75j949J011J151j392n43K256j432j235J979J64j611L99J653k092
$$ -1032 916 1091 -858 153 1304 -88 -631 1625 193 -1042 937 1101 -510 -111 1542 -550
3041e50k95K090n94j768J758O71j857K68J848j874q64K282m83k172J898J004k422
$$ -550 -845 1245 651 -1117 641 1312 -545 -277 1571 -303 -1167 1115 632 -1540 358 1362 -1060
3058a060N89J685j202j036K320p96j536J841K19j993N04J826j296j137J649k36
$$ -1060 -471 1214 12 -1024 1296 500 -1036 805 1024 -969 -465 1361 65 -1072 577 341
3074C41j188P59R61k068N35J993j385j145J889K06k052J081J202k074j9J939r32
$$ 341 -847 -88 873 -1195 -660 1333 -52 -1197 692 898 -1154 -73 1129 -945 -964 975 43
3091D3j470J834L11j716Q57J166j991J45J734q08j204J310M90k011J069J486j814
$$ 43 -1427 407 718 -998 -141 1025 -966 -821 913 105 -1099 211 701 -1310 -241 1245 -569
3108e69q10K276k92j896J576M81j565L16J618j725n96K212o26j591J585O35k000
$$ -569 -1379 897 605 -1291 285 766 -799 -483 1135 -590 -1186 1026 400 -1191 394 1029 -971
3125i71N64J501j393r15J995m35j588J418R27k354M15J619q71r37J795m80j401
$$ -971 -407 1094 -299 -1214 781 346 -1242 176 1103 -1251 -836 783 -88 -1025 770 290 -1111
3142a111J389P51j988K28J667o96j227J648K01k058R63R78j346J07J714j206j105
$$ -1111 278 1029 -959 -731 936 240 -987 661 862 -1196 -233 745 -601 -494 1220 14 -1091
3159a091J625N07k363J284J352j573k06J564q51j311J746K97j956J067J326j366
$$ -1091 534 1041 -1322 -38 1314 -259 -465 1099 248 -1063 683 980 -976 91 1417 51
3175E1n78J509n89j449J526N60j778N93J608j546o50J674m07j769J529O04j597
$$ 51 -527 982 393 -1056 470 1030 -748 -155 1453 -93 -743 931 524 -1245 284 888 -709
3192g09M49J518j661m44K203m12k147J293Q55j448J29J443j310j001J963j65j455
$$ -709 -260 1258 -403 -847 1356 944 -1203 90 945 -503 -374 1069 -241 -1242 721 556 -899
3209h99Q89R43j601J1J830j383r21J990n01j350Q82R13j704K74J336r40j287K031
$$ -899 -10 933 -668 -657 1173 -210 -1131 859 358 -992 -110 803 -901 -627 709 -231 -1518 513
3227E13J91j411M70J182j678l41K269j121j435J577N58j773O16J333j644k11J509
$$ 513 704 -707 -237 945 -733 -1074 1195 74 -1361 216 774 -999 -383 950 -694 -905 604
3244F04k99j311J200M23j692O43J604j502q60K071k83j598J747j22j424O13J469
$$ 604 305 -1006 194 617 -1075 -432 1172 -330 -1190 881 598 -1000 747 625 -799 -186 1283
3261A283j240j401K044l6j612J119M15j200K47J446j168q87J492k74j262J104
$$ 1283 43 -1358 686 650 -962 157 572 -628 -381 1065 -103 -990 502 228 -1034 70
3277G0Q05j460j42J665j035q47J382k37j240R21J297j893m16K456q56j197J150
$$ 70 875 -585 -727 938 -97 -944 438 201 -1039 -118 1179 -714 -1130 1326 470 -727 423
3294D23J45j358P58J343j678m07J951q65j082J424J10j420P43J236j449n14J692
$$ 423 568 -790 -32 1311 -367 -774 1177 312 -770 654 764 -656 87 1323 -126 -640 1052
3311A052o39j663J895L58j972M50K101j687m35J244n68j143J363M37j477L18J437
$$ 1052 413 -1250 645 1003 -969 -519 1582 -105 -540 704 136 -1007 356 793 -684 -366 1071
3328A071r94q77J655k07j274R83P10j762M15J534j104q28J435r7j782J010J361
$$ 1071 77 -800 855 648 -626 357 1067 -695 -280 1254 150 -678 757 660 -1122 -112 1249
3345A249j724m1J361o76j064J712n01j699J243J028j682j52J448l46j454J600
$$ 1249 -475 -516 845 169 -895 817 316 -1383 -140 888 -794 -946 502 156 -1298 302
3361C02r2j488R93J039j409l00J526n24j373J722L86k073Q34R25r88n85J662o73
$$ 302 210 -1278 -285 754 -655 -955 571 47 -1326 396 782 -1291 -457 468 -520 -1105 557 -116
3379a16j016J117P84j741N10J221j183l52J370o18j194J749N11j633O6J611j159
$$ -116 -1132 -15 769 -972 -462 759 -424 -776 594 -24 -1218 531 1042 -591 -525 1086 -73
3396g3q86J621k25j374J004Q30j662J90J665j228n76J368k09j380J166R40j442
$$ -73 -959 662 437 -937 67 897 -765 -575 1090 -138 -714 654 445 -935 231 1171 -271
3413b71J72J269j094p29J692J51j421M68J078j276k51J665j008j016J527K14j573
$$ -271 -99 1170 76 -653 1039 1190 -231 237 1315 39 -212 1453 445 -571 956 1170 -403
3430d03O10J207j623k71J342m65j307J654K67j769M16J492j464p11J988p88j324
$$ -403 207 1414 -209 -480 862 397 -910 744 1011 -758 -342 1150 -314 -1025 963 175 -1149
3447a149J392N34j501J49J152r00n42J170M6j433J099Q16j745L77J329r42q15
$$ -1149 243 777 -724 -575 577 -323 -865 305 351 -1082 17 833 -912 -535 794 -148 -963
3464i63J422j47j146Q23P71j655M39J198n93j361J649j9j530Q70P37j143q7J596
$$ -963 459 312 -834 -11 760 -895 -456 742 149 -1212 437 418 -1112 -242 495 -648 -735 861
3482H61j105r23J365K89j383J092N20j243j25J529o37p82R47K10j387N33J222
$$ 861 -244 -1167 198 487 -896 196 716 -527 -652 877 240 -542 405 615 -772 -239 983
3499I83j192m67J601p53r60J114J79j292P05J093j407k70J324m42j085J378M20
$$ 983 -209 -676 925 172 -788 326 505 -787 -82 1011 -396 -666 658 216 -869 509 929
3516I29j503L22J163j224l71J775o82j266J192M20j470M33J058j081n21J401m39
$$ 929 -574 -252 911 -313 -684 1091 409 -857 335 755 -715 -282 776 -305 -826 575 136
3533A36q91P07Q87j288jJ201q14o10R78L87j507Q19N56j187K28J118q29r76J449
$$ 136 -755 -48 839 -449 -450 751 -63 -673 305 692 -815 4 560 -627 -399 719 -110 -1086 363
3552C63J99j348K83J451j297l39J391n11q47J113L39j463O29J077r60m35J110
$$ 363 562 -786 -503 948 -349 -688 703 192 -655 458 797 -666 -37 1040 80 -355 755
3569G55n71p45R19N38j365N88O08r16j85J216n38r37Q21O09j459P15P80q55m00
$$ 755 184 -561 358 896 -469 119 727 -189 -374 842 304 -633 188 797 -662 53 833 -22 -422
3588d22J385n24j301J244L74j516L61J253r43m88J075R4j338Q39Q65j515R0J475
$$ -422 963 439 -862 382 756 -760 -399 854 -89 -577 498 592 -746 93 958 -557 -467 1008
3606A008r23p71J162m6r91K84J301j471j85J392q46r05J514k38j128N32P15o46
$$ 1008 85 -686 476 430 -561 -277 1024 -447 -632 760 -86 -991 523 285 -843 -311 404 -242
3624b42n45J511j426m05J184O41j841J095M22r74j48J168l49j088J248J2q61N2
$$ -242 -787 724 -702 -1107 77 718 -1123 -28 394 -580 -728 440 91 -997 251 263 -598 -546
3642e46R40q56l84J388m4j384R69O50j275M56N11o68m62J381k99j114Q63P35j447
$$ -546 394 -462 -846 542 498 -886 83 733 -542 -86 425 -243 -705 676 377 -737 126 861 -586
3661e86m2J688j075o55J109J40j239Q25Q49j289o2J523j443n62J289L11j572J123
$$ -586 -628 1060 -15 -670 439 579 -660 165 1014 -275 -337 1186 -257 -819 470 781 -791 332
3679C32M31r59L9J236q87p40R84N00j431O08P41j057k58J173l50j062J323K4j387
$$ 332 763 -196 -157 1079 192 -548 436 936 -495 113 854 -203 -461 712 362 -700 623 647 -740
3698g40P49J206j654M7J013L03j563P77P12j308L5J352j396k56R52K63j084N24
$$ -740 9 1215 -439 -392 621 924 -639 138 850 -458 -423 929 -467 -723 229 492 -592 -68
3716f8Q60j362J28R13o96m55J103m80o75Q41M04q93n4J302q32p68J224k43p39
$$ -68 792 -570 -442 471 -225 -680 423 -57 -732 109 513 -380 -434 868 36 -732 492 249 -490
3735d90P24P23j312r5J409q75q62R23M81j280M23J031j494K56J111p20n99R07
$$ -490 234 957 -355 -450 959 84 -778 145 626 -654 -231 800 -694 -438 673 -47 -646 261
3753B61J36j053N64O31q97j24Q57l03j179J470R5j201O34Q82j283j10Q02J65j214
$$ 261 397 -656 -92 539 -358 -482 375 72 -1107 363 458 -743 -109 773 -510 -620 182 347 -867
3772h67J186M5j086L94P92r34q6J324l52j123P26P98j086K76N60n17r50J649j32
$$ -867 319 364 -722 -328 464 -470 -556 768 416 -707 19 817 -269 7 567 50 -900 749 617
3791F17j393Q77O82j374J65J036o12l77O26J48q07P37M05j164qJ386q71o83P43
$$ 617 -776 101 783 -591 -426 610 -2 -379 247 395 -412 325 730 -434 -442 944 73 -610 133
3810A33M93j206P48O75j078k1J062k53j137J035K35j188K44J015p85l70R40n07
$$ 133 626 -580 168 843 -235 -256 806 553 -584 451 686 -502 -258 757 -28 -398 542 35
3828C5m42J027%j208O43J123j135o26J174m53o67Q61J60j053O79P76q15p90J164
$$ 35 -407 620 620 -588 55 1178 43 -583 591 138 -529 332 492 -561 118 894 79 -711 453
3847D53J39j386Q24K99q91Q0J082j022n36J511l02r55N42O55j030j19J180n44
$$ 453 592 -794 30 329 -562 -482 600 -422 -958 553 251 -704 -162 493 -537 -656 524 -20
3865b0m47Q78k47r91J147L67j353j1J170m02m58Q32k50n07L58M13q46k49J378
$$ -20 -467 411 164 -827 320 687 -666 -677 493 91 -367 465 215 -292 66 479 -367 -616 762
3884G62p07j036J168N59j528N90N86n82m73J125n78n98J021K88j186J82J430j020
$$ 762 55 -981 187 746 -782 -192 394 -188 -661 464 -114 -712 309 597 -589 -407 1023 3
3902Cp40J174j95l41N86k7r83M53R19j081m73J354J02j402O59J53n0k57J200j211
$$ 3 -737 437 242 -99 487 460 -523 -70 849 -232 -705 649 751 -651 8 161 111 -146 1054 -157
3922a57l54J071k80r33O70Q33j376K53O51n00k97P67J81j218J054M35j235j23
$$ -157 -511 560 280 -653 17 850 -526 -273 378 -122 -419 348 529 -689 365 800 -435 -558
3940e58J113k54j060R10K84p46M54O51j007m9J318q79p40Q31N98j020J11O83o15
$$ -558 555 301 -759 151 435 -311 143 794 -213 -262 1056 177 -563 268 866 -154 -43 640 25
3959B5Q8O84r45j98R33J91j272Q8J097o93q23J015J17r24J048J12j273M56J231
$$ 25 113 797 -148 -346 587 778 -494 -406 691 -2 -825 190 307 -617 431 543 -730 -274 957
3978I57r79p65J258k93p20M43L93n85k9J206j252k72J142n6j366P58Q68o94j80
$$ 957 -22 -787 471 178 -542 -99 294 -291 -320 886 -366 -638 504 448 -918 -160 708 14 -166
3997a66L50k35k94R00k75j000P99P86j207k43R12O2j007O74J30q58P91N90j565
$$ -166 184 -51 -345 555 280 -720 79 865 -342 -585 327 389 -618 56 186 -672 119 709 -856
4016h56N8J541p19r82R15N08q85J06O81p34q9J047q34l71N96L36j198J67J235
$$ -856 -798 743 24 -958 -43 465 -420 -314 367 -367 -456 591 -243 -614 -18 318 -880 -713 522
4035E22o93l91P57j06l68N73K35j180N91R89r38n39Q69Po79M93J16n66N20O69
$$ 522 -171 -562 195 89 -279 294 529 -651 -60 929 -9 -548 321 328 -351 142 258 -308 212 881
4055H81j037l86J306n3j201N67Q49j040N1N95n26N7P84l52j230O90Q91j043o24
$$ 881 -156 -542 764 711 -490 77 926 -114 -63 532 6 63 847 495 -735 -45 846 -197 -821
4074h21J208j13o57M92L72j080L43Q34j170J63J220o19j151J113K14r26N06N66
$$ -821 387 274 -383 109 481 -599 -256 578 -592 -429 791 172 -979 134 348 -578 -72 494
4092D94m14k97Q83n05p69J008J62j016P7J006o49k14P02l07n84Q02J38j073J19
$$ 494 80 -217 666 161 -608 400 562 -454 -377 629 -20 -234 468 161 -423 379 517 -556 -437
4111d37J260o43q87Q37K9n53K71L97q50L06P94q10o34J403j63r64M03L49m71m8
$$ -437 823 180 -707 130 159 -394 -123 274 -576 -270 524 -286 -920 483 320 -644 -241 108 -363 -411
4131d11Q07o75j20J120n36q48N03N60p49J19Q95p65m52N80K18r18N76O60n63l25
$$ -411 396 -279 -399 721 185 -663 -160 400 -349 -230 665 -100 -552 28 246 -672 -96 564 1 -324
4151c24Q71n83p09P06L66p93L14L90p17j92J078o53m12M46O87r29j30R59o83j30
$$ -324 547 -36 -745 -39 327 -466 -152 238 -479 -671 407 -246 -658 -212 475 -454 -584 375 -308 -438
4171d38J037l37p08P93J09j025M93P81n66n60R17m0q80P11O7n24L04O26q04m17
$$ -438 599 262 -446 347 456 -569 -76 705 139 -421 496 456 -424 287 354 -170 134 760 -44 -461
4191d61R72N1j128Q23K53n67MN57n10n03J244k97j120P43O69j118n3J020n40n57
$$ -461 511 562 -566 257 510 -57 -53 504 -6 -509 735 438 -682 61 730 -388 -441 579 39 -518
4211e18M76L70j015R92L09j054Q0J119l61q86O46N29j003J17R58q00l22P03j98
$$ -518 -42 328 -687 305 614 -440 -360 759 398 -488 158 687 -316 -199 759 -41 -363 340 142
4230A42q04Q34N03j188L42Q95r82p6P02k39p10O07K34m95r7J215q36j177J418
$$ 142 -662 172 675 -513 -171 724 -258 -334 368 129 -581 26 260 -235 -332 883 47 -1130 288
4249B88k2r29J085j97o87k9J126q19k82Q13K55j122M68K91n24r2Q23o12m96R37
$$ 288 266 -663 422 225 -462 -491 635 -184 -466 347 602 -520 -52 239 -285 -377 446 -166 -662 275
4269B75k1j010P06P18r44m54J369n09r62J011k11m21M72O08r46k62R13j54p45
$$ 275 254 -756 -50 668 -276 -730 639 130 -832 179 -32 -453 19 627 -319 -581 332 178 -567
4288e67P32k1n92J90P25q70j03J053m60q78Q38O29j150L03Q42q22k68O13j66o41
$$ -567 165 144 -448 -258 467 -403 -506 547 87 -791 47 676 -474 -171 671 -151 -419 194 28 -613
4308f13P36M95j049K01Q51o75o5N24j16n37L79P52j388L23Q62n30j004J746o13
$$ -613 123 618 -431 -230 621 -54 -119 405 289 -248 131 883 -505 -182 680 150 -854 892 279
4327B79n88L22L41n07k02J230q16o80J004j06q59N73M43o23l22J144m25n69O44
$$ 279 -309 13 354 -153 -355 875 59 -621 383 277 -582 -9 434 -189 -511 633 208 -361 283
4346B83J8p99L95J029j032l14J174n61m83M92K11r78O11O44p96l44R51j63q64
$$ 283 301 -498 -103 926 -106 -420 754 193 -290 202 413 -565 46 690 -106 -450 501 338 -526
4365e26O80O17j200L60N70p16m70Q23N5q33O64K96o71L5O90l69k13L42r8m23M99
$$ -526 154 771 -429 -69 501 -215 -685 138 193 -640 24 320 -351 -316 374 5 -208 134 36 -387 112
4386A12o4n36MR20o51k08P07j3o94M26M73p55m1Q09o98n05J020m3n95J6J029j235
$$ 112 48 -488 -484 436 -215 -423 284 271 -423 3 476 -279 -320 489 -209 -714 306 263 -332 -316 713 -522
4408e22K68N24k1p02O18J65j220O98Q53q97m23R91l15o26O21L12q94L78Q69j313
$$ -522 -254 270 249 -453 165 330 -890 -192 661 -236 -659 332 17 -609 12 324 -570 -192 677 -636
4428f36P6J043l91o98Q05J73q66J06R66n05n03J023l41p76R92M3r48J44N14j98
$$ -636 -560 483 92 -606 199 372 -494 -388 578 73 -430 593 252 -524 468 511 -437 -293 221 23
4448B3k57O20O9r90P00K27o42M2Q65l28p23R38m07p05L63O65j021M06Q86l88r32
$$ 23 -234 386 455 -535 165 392 -250 -208 657 329 -394 544 137 -568 -205 460 -561 -155 731 343 -589
4469e89O49L31r76O84N61p69m24J043m47m31M76J22n72L19Q64j150l39P89l2n19
$$ -589 60 391 -585 99 660 -109 -533 510 63 -368 108 230 -342 -23 841 -309 -648 141 109 -410
4489d10Q34j1q53K69Q75o66n23J001k78o42Q78K10j138L11O36l68n81P85r1q04
$$ -410 424 413 -440 -171 704 38 -485 516 238 -404 474 684 -454 -143 493 125 -456 329 238 -566
4509e66O31K57p52l0Q18n98m21R02k17n40M65M50r01M15M19m89m02M59O58j210
$$ -566 65 322 -430 -460 358 -240 -661 241 24 -516 -51 399 -502 -87 332 -157 -559 -100 558 -652
4529f52N80P57j250K82N48l75l97M31O82j240L40Q24p28j87P38l04n61N93L19
$$ -652 -72 685 -565 -283 265 -110 -507 -76 606 -634 -294 530 -198 -385 353 49 -512 81 400
4548D00r89L41N86n19R2L24j25p22R15J46q04K18N36l42n43R03j21o42M60N25
$$ 400 -589 -248 338 -181 -89 235 110 -612 303 449 -355 -137 399 57 -486 417 296 -346 114 639
4568F39r32N2P66o74p3N30r1o44M72N91q15p3Q35o63k29O19j8r84J034L5o44j24
$$ 639 -293 -241 525 -149 -222 308 217 -427 45 636 -179 -252 583 -80 -309 310 292 -692 342 377 -267 -391
4590c91R43n37o08Q64N7q20M33j02J13j72R41o59m37Q44j92o71L74N40n58m73
$$ -391 552 15 -593 271 328 -492 -59 -161 -48 -220 721 62 -375 469 277 -394 -20 520 -38 -511
4610e11J042m30n44R18j21q01L21M07m40l39Q93k33n57O87p5o79M91P87j225O9
$$ -511 531 101 -443 475 354 -447 -126 281 -159 -498 395 162 -395 292 217 -462 29 816 -409 -340
4630c40Q66k18r10L34O16o59k8Q89q81m46J129k10q50R13K30q96r4R58k95m88
$$ -340 526 308 -602 -268 348 -311 -339 550 -331 -777 352 142 -708 205 435 -461 -555 403 108 -380
4650c80N25n2p47P01L39p12r9N98l71k84Q53j10o66K92M46o81o4P83n56l19N90
$$ -380 145 93 -654 47 386 -326 -425 173 -198 -482 371 261 -405 -113 333 -348 -412 371 -185 -504 86
4671H6L25r09L00N73n92K61M33l17p31Q07oo27K33P00p70Q0N08r6r50P72K50q21
$$ 86 411 -498 -198 375 -217 44 477 160 -571 236 230 -397 -164 536 -234 -154 354 258 -692 80 330 -491
4693d91K43O05m42o21J344n02m39M6M27m30k28Q78l62m52P88k27m12K99M23q52
$$ -491 -248 357 -85 -706 638 136 -303 -257 170 -260 -488 390 28 -424 364 137 -275 24 447 -405
4713d05m7J250q79j77M72M2p46O98K63p23P5Q91p70m87Q17K8m49Q3M98p41o1R43
$$ -405 -452 798 -81 -258 214 256 -490 208 471 -252 -177 714 -56 -543 274 302 -147 -64 434 -307 -368 575
4735E75n37l73N19L12j172O41O36o50p2N88n53m47P04J65p60J83M47l05m43J095
$$ 575 38 -335 184 496 -676 -35 601 -49 -121 467 -86 -533 171 336 -424 -241 206 -99 -542 553
4755E53k15r29Q64K61j047L99N81m05o65R39j02p82N54K23m59m3M49m69l23R26
$$ 553 338 -591 273 534 -513 -114 467 62 -603 336 234 -548 6 229 -230 -273 176 -293 -616 310
4775C10m12k54N90J18o33J16N10n80q5K89J00p31N81M08p11Q2Q31n70k05N72j94
$$ 310 -102 -356 234 352 -281 -165 345 -235 -320 -31 69 -662 -81 327 -384 -302 529 -41 -246 326 132
4796A32o33M94M94q20l4M74j69p52J050N6q07K23O28n60j0O98l88m50M74J76q36
$$ 132 -501 -7 487 -333 -367 107 -62 -814 236 292 -515 -292 336 -224 -234 464 76 -374 100 276 -560
4817e60K87L51k34K1P74m10p63P88l8n49J06P02n75k01M58L45p00K80K09m78M02
$$ -560 -273 78 -156 -135 639 229 -534 254 216 -333 -227 475 -100 -301 157 502 -198 82 291 -187 215
$$ [...]
8191B1
##END NTUPLES=NMR FID
##END=
