##TITLE=1H_TG-2295-2
 CDCl3, 8 sc, 
 5.7.2020
##JCAMPDX= 6.0         $$ Bruker NMR JCAMP-DX V2.0
##DATA TYPE= NMR FID
##DATA CLASS= NTUPLES
##ORIGIN= UXNMR, Bruker Analytische Messtechnik GmbH
##OWNER= root
$$ XWIN-NMR		Version 3.5
$$ Wed Aug  5 11:14:53 2020 Russian Standard Time (UT+4h)  she@DPX200
##.OBSERVE FREQUENCY= 200.1314999998
##.OBSERVE NUCLEUS= ^1H
##.DELAY= (6, 6)
##.ACQUISITION MODE= SIMULTANEOUS
##.ACQUISITION SCHEME= undefined
##.AVERAGES= 8
##.DIGITISER RES= 18
##SPECTROMETER/DATA SYSTEM= spect
##.PULSE SEQUENCE= zg30
##.SOLVENT NAME= CDCl3
##.SHIFT REFERENCE= (INTERNAL, CDCl3, 0, 15.7039)
##AUDIT TRAIL= $$ (NUMBER, WHEN, WHO, WHERE, WHAT)
$$ ##TITLE= Audit trail, XWIN-NMR		Version 3.5
$$ ##JCAMPDX= 5.01
$$ ##ORIGIN= Bruker BioSpin GmbH
$$ ##OWNER= she
$$ F:/spectra/data/she/nmr/H-F/1/audita.txt
$$ ##AUDIT TRAIL=  $$ (NUMBER, WHEN, WHO, WHERE, WHAT)
(   1,<2020-08-05 11:13:46.18 +0400>,<she>,<DPX200>,
      <created by zg, POWCHK disabled, PULCHK disabled
       configuration hash MD5:
       00 E9 B6 7A A2 85 ED C7 34 08 36 98 17 FE 4E 26
       data hash MD5: 16K
       BA 6B 0B 20 5A C5 AB F8 D1 49 CB 10 A0 56 ED E7>)
$$ ##END=
$$ 
$$ hash MD5
$$ B4 16 68 10 14 15 33 72 9A 0A 68 5C 02 06 10 78
##$RELAX= 
##$RELAX= 
##$RELAX= 
##$RELAX= 
##$RELAX= 
##$RELAX= 
$$ Bruker specific parameters
$$ --------------------------
##$DU= <F:/spectra>
##$EXPNO= 1
##$NAME= <H-F>
##$PROCNO= 1
##$TYPE= <nmr>
##$USER= <she>
##$AMP= (0..31)
100 100 100 100 100 100 100 100 100 100 100 100 100 100 100 100 100 100 
100 100 100 100 100 100 100 100 100 100 100 100 100 100 
##$AQSEQ= 0
##$AQ_mod= 1
##$AUNM= <au_zg>
##$AUTOPOS= <>
##$BF1= 200.13
##$BF2= 200.13
##$BF3= 200.13
##$BF4= 200.13
##$BF5= 200.13
##$BF6= 200.13
##$BF7= 200.13
##$BF8= 200.13
##$BYTORDA= 1
##$CFDGTYP= 0
##$CFRGTYP= 5
##$CHEMSTR= <none>
##$CNST= (0..31)
1 1 145 1 1 1 1 1 1 1 1 1 1 1 1 1 1 1 1 1 1 1 1 1 1 1 1 1 1 1 1 1 
##$CPDPRG= <>
##$CPDPRG1= <>
##$CPDPRG2= <>
##$CPDPRG3= <>
##$CPDPRG4= <mlev>
##$CPDPRG5= <mlev>
##$CPDPRG6= <mlev>
##$CPDPRG7= <mlev>
##$CPDPRG8= <mlev>
##$CPDPRGB= <>
##$CPDPRGT= <>
##$D= (0..31)
0 1.2 0 0 0 0 0 0 0 0.06 0 0.03 0 0 0 0 0.0002 0 0 0 0 0 0 0 0 0 0 0 0 
0 0 0 
##$DATE= 1596611625
##$DBL= (0..7)
120 120 120 120 120 120 120 120 
##$DBP= (0..7)
150 150 150 150 150 150 150 150 
##$DBP07= 0
##$DBPNAM0= <>
##$DBPNAM1= <>
##$DBPNAM2= <>
##$DBPNAM3= <>
##$DBPNAM4= <>
##$DBPNAM5= <>
##$DBPNAM6= <>
##$DBPNAM7= <>
##$DBPOAL= (0..7)
0.5 0.5 0.5 0.5 0.5 0.5 0.5 0.5 
##$DBPOFFS= (0..7)
0 0 0 0 0 0 0 0 
##$DE= 6
##$DECBNUC= <off>
##$DECIM= 24
##$DECNUC= <off>
##$DECSTAT= 4
##$DIGMOD= 1
##$DIGTYP= 9
##$DL= (0..7)
0 120 120 120 120 120 120 120 
##$DP= (0..7)
150 150 150 150 150 150 150 150 
##$DP07= 0
##$DPNAME0= <>
##$DPNAME1= <>
##$DPNAME2= <>
##$DPNAME3= <>
##$DPNAME4= <>
##$DPNAME5= <>
##$DPNAME6= <>
##$DPNAME7= <>
##$DPOAL= (0..7)
0.5 0.5 0.5 0.5 0.5 0.5 0.5 0.5 
##$DPOFFS= (0..7)
0 0 0 0 0 0 0 0 
##$DQDMODE= 0
##$DR= 18
##$DS= 0
##$DSLIST= <SSSSSSSSSSSSSSS>
$$ [...]
##$SUBNAM2= <"">
##$SUBNAM3= <"">
##$SUBNAM4= <"">
##$SUBNAM5= <"">
##$SUBNAM6= <"">
##$SUBNAM7= <"">
##$SUBNAM8= <"">
##$SUBNAM9= <"">
##$SW= 24.9337058888022
##$SWIBOX= (0..15)
0 0 2 0 0 0 0 0 0 0 0 0 0 0 0 0 
##$SW_h= 4990.01996007984
##$TD= 16384
##$TD0= 1
##$TE= 0
##$TE2= 300
##$TE3= 300
##$TEG= 300
##$TL= (0..7)
0 120 120 120 120 120 120 120 
##$TP= (0..7)
150 150 150 150 150 150 150 150 
##$TP07= 0
##$TPNAME0= <>
##$TPNAME1= <>
##$TPNAME2= <>
##$TPNAME3= <>
##$TPNAME4= <>
##$TPNAME5= <>
##$TPNAME6= <>
##$TPNAME7= <>
##$TPOAL= (0..7)
0.5 0.5 0.5 0.5 0.5 0.5 0.5 0.5 
##$TPOFFS= (0..7)
0 0 0 0 0 0 0 0 
##$TUNHIN= 0
##$TUNHOUT= 0
##$TUNXOUT= 0
##$USERA1= <user>
##$USERA2= <user>
##$USERA3= <user>
##$USERA4= <user>
##$USERA5= <user>
##$V9= 5
##$VALIST= <valist>
##$VCLIST= <CCCCCCCCCCCCCCC>
##$VD= 0
##$VDLIST= <DDDDDDDDDDDDDDD>
##$VPLIST= <PPPPPPPPPPPPPPP>
##$VTLIST= <TTTTTTTTTTTTTTT>
##$WBST= 1024
##$WBSW= 4
##$XGAIN= (0..3)
0 0 0 0 
##$XL= 0
##$YL= 0
##$YMAX_a= 816999
##$YMIN_a= -368652
##$ZGOPTNS= <>
##$ZL1= 120
##$ZL2= 120
##$ZL3= 120
##$ZL4= 120
##$ABSF1= 10
##$ABSF2= 0
##$ABSG= 5
##$ABSL= 3
##$ALPHA= 0
##$AQORDER= 0
##$ASSFAC= 0
##$ASSFACI= 0
##$ASSFACX= 0
##$ASSWID= 0
##$AUNMP= <proc_1d>
##$AZFE= 0.1
##$AZFW= 0.1
##$BCFW= 1
##$BC_mod= 2
##$BYTORDP= 1
##$COROFFS= 0
##$CY= 11.3945322036743
##$DATMOD= 1
##$DC= 2
##$DFILT= <>
##$DTYPP= 0
##$F1P= 16.9975609425685
##$F2P= -3.02152046262296
##$FCOR= 0.5
##$FTSIZE= 0
##$FT_mod= 4
##$GAMMA= 1
##$GB= 0.15
##$INTBC= 1
##$INTSCL= 1
##$ISEN= 128
##$LB= 0.24
##$LEV0= 0
##$LPBIN= 0
##$MAXI= 10000
##$MC2= 0
##$MEAN= 0
##$ME_mod= 0
##$MI= 1.114404
##$NCOEF= 0
##$NC_proc= 0
##$NLEV= 6
##$NOISF1= 3.799351
##$NOISF2= 2.8
##$NSP= 1
##$NTH_PI= 0
##$NZP= 0
##$OFFSET= 15.70392
##$PC= 1
##$PHC0= -9797.282
##$PHC1= 19.20093
##$PH_mod= 1
##$PKNL= yes
##$PPARMOD= 0
##$PSCAL= 0
##$PSIGN= 0
##$REVERSE= no
##$SF= 200.130013532006
##$SI= 16384
##$SIGF1= 3
##$SIGF2= 2
##$SINO= 400
##$SIOLD= 16384
##$SREGLST= <1H.CDCl3>
##$SSB= 0
##$STSI= 0
##$STSR= 0
##$SW_p= 3612.71676300578
##$SYMM= 0
##$S_DEV= 0
##$TDeff= 0
##$TDoff= 0
##$TI= <>
##$TILT= no
##$TM1= 0
##$TM2= 0
##$TOPLEV= 0
##$USERP1= <user>
##$USERP2= <user>
##$USERP3= <user>
##$USERP4= <user>
##$USERP5= <user>
##$WDW= 1
##$XDIM= 8192
##$YMAX_p= 0
##$YMIN_p= 0
$$ End of Bruker specific parameters
$$ ---------------------------------
##NTUPLES= NMR FID
##VAR_NAME=  TIME,          FID/REAL,        FID/IMAG
##SYMBOL=    X,             R,               I
##VAR_TYPE=  INDEPENDENT,   DEPENDENT,       DEPENDENT
##VAR_FORM=  AFFN,          ASDF,            ASDF
##VAR_DIM=   8192,          8192,            8192
##UNITS=     SECONDS,       ARBITRARY UNITS, ARBITRARY UNITS
##FACTOR=    0.0002004,     1,               1
##FIRST=     0,             0,               0
##LAST=      1.6414764,     0,               0
##MIN=       0,             -368652,         0
##MAX=       1.6414764,     816999,          0
$$ Real data points
##PAGE= N=1
##DATA TABLE= (X++(R..R)), XYDATA
0 0 0 0 0 0 -8 8 -1 8 -14 15 -16 24 -30 33 -42 52 -62 73 -88 103 -122 144 -166 191 -220 252 -289 328 -373
29 -373 420 -473 533 -598 669 -748 835 -928 1031 -1144 1269 -1408 1556 -1725 1909 -2112
45 -2112 2343 -2604 2897 -3232 3624 -4076 4620 -5283 6107 -7170 8601 -10638 13787 -19358
59 -19358 32149 -124935 147270 387601 -62211 -368652 -290293 -5957 34477 -131892 -276390
70 -276390 -163924 -2494 -19478 -193940 -256603 -150449 27270 87825 -8430 -119026 -73311
81 -73311 -18385 -114649 -218173 -120664 38088 53577 -45855 -94259 -29988 78940 76356 -38876
93 -38876 -71440 38687 73503 -57031 -150019 -57742 106426 154126 24189 -111808 -11892
104 -11892 252677 300420 22072 -222498 -135549 132557 243558 94065 -73913 -606 194841
115 194841 195128 24758 -11555 132061 218131 136368 -5637 -67674 12980 135082 130088 49809
127 49809 101986 252191 246929 47990 -104314 -20809 199405 274958 95048 -93797 -39339
138 -39339 126690 153698 82901 85945 156993 182103 102307 -34482 -75375 51267 164256
149 164256 91486 -30351 -75 125710 165789 78110 -20855 5735 127401 139289 -14091
160 -14091 -111304 -25052 72337 40871 -22114 6044 100101 136228 39543 -82108 -43963 97570
172 97570 93250 -80790 -178213 -62097 130707 178836 10114 -175542 -107881 138358 207211
183 207211 7908 -166416 -116140 25782 54365 -49493 -112195 -2987 150282 126517 -30647
194 -30647 -91409 -9811 65345 45202 -34112 -72318 -9584 60434 12456 -66912 -6820 122515
206 122515 135790 42903 -19911 -8560 20909 6964 -36730 -6298 107571 136318 12176
217 12176 -72459 27052 179579 190169 42275 -101112 -62572 114355 169111 7530 -120533
228 -120533 -14547 182394 227427 89160 -50741 -12967 142147 167864 11088 -84151 12788
239 12788 126943 102413 14886 1834 87289 167361 119819 -4632 -24591 73296 109574 22577
251 22577 -53655 -21287 75591 128099 75428 2197 37797 119159 82629 -29576 -41331 42003
263 42003 72141 2963 -74413 -51337 72477 145816 55264 -66032 -35489 79693 92272
274 92272 -18263 -116422 -89291 32467 87102 -6426 -90587 -17247 92572 65705 -40235
285 -40235 -71943 -11540 34906 -23134 -131956 -124653 20256 98375 1129 -104181 -60030 55362
297 55362 84664 -14181 -130758 -113955 14286 49913 -68836 -146727 -58652 66705 73923
308 73923 -19924 -87001 -39972 42993 9463 -108836 -124205 -12336 51924 -4438 -77418 -68227
320 -68227 18504 86992 44477 -53938 -62133 5852 4455 -71249 -90340 -18907 52378 43184 -27669
333 -27669 -49086 35683 97768 16792 -88897 -55160 52068 64611 -32748 -112229 -61693 85985
345 85985 150852 42121 -76501 -32724 81857 83702 -28107 -107173 -53590 69574 94963
356 94963 -16510 -81082 18767 129796 91448 -19361 -49471 16509 75543 32921 -70676
367 -70676 -85287 23188 97576 50176 -9346 11450 61816 60537 -2481 -59601 -24797 57755
379 57755 48949 -43720 -59678 30423 84627 39545 -18900 -2292 73664 95858 -9214 -125559
391 -125559 -89570 44130 86187 10774 -49603 -14794 65605 83869 -3317 -76419 -11790 91333
403 91333 56930 -72828 -115270 -29026 66281 65781 -10717 -35596 43710 95429 10793 -95556
415 -95556 -76790 16975 52336 389 -63717 -50069 36036 73498 3733 -50331 6796 74494
427 74494 37442 -58569 -98929 -45555 31949 26487 -46461 -48513 46976 89474 8105 -75820
439 -75820 -60112 11819 42349 -12249 -84724 -63846 24221 38130 -36304 -57987 18272 83707
451 83707 48488 -53714 -110634 -55367 25698 -258 -82843 -64611 36955 68634 -6164 -77969
463 -77969 -56895 32259 71069 -10321 -107309 -83634 5053 14628 -48302 -69194 -5623 74365
475 74365 68880 -34649 -106035 -46477 37467 8474 -72485 -72088 877 43757 8131 -54259
487 -54259 -43932 46255 87183 11124 -65796 -45753 7164 2864 -42067 -55903 2007 82971
499 82971 77025 -16738 -55847 14421 70619 27946 -40288 -39748 22622 60382 10315 -59323 -21073
512 -21073 95114 125990 38564 -32946 -11113 43476 46262 -15304 -56784 3160 97437 86930
524 86930 -7893 -34845 39475 103321 76723 -1740 -33972 20510 68416 16033 -57111 -22123
536 -22123 75736 101682 42862 -9479 2278 52291 57014 -13999 -63350 -7767 66438 46116
548 46116 -25236 -39338 19491 76685 59967 -12557 -34739 27584 54415 -23626 -96524 -58723
560 -58723 31248 63524 16241 -40965 -25200 41878 45224 -35525 -75811 -18051 38670 10485
572 10485 -62298 -89241 -29338 54437 51842 -24165 -44894 13419 33255 -31495 -89556 -66988
584 -66988 5833 40427 -8920 -70076 -38883 44796 53928 -12653 -43410 -5135 33423 12899
596 12899 -53451 -80453 -13239 64595 42377 -28382 -22230 48097 72912 20909 -40320 -33938
608 -33938 32784 63099 3892 -46729 3959 83733 84057 24845 -2074 38532 95286 83218
620 83218 -1560 -43351 19569 86176 62454 10414 22997 85256 118216 76806 6462 8814
632 8814 83858 110238 41847 -12604 19503 78583 89914 54424 31078 67375 122547 100351
644 100351 13853 -16296 40632 86431 60832 11276 6971 58810 101719 67295 7213 25418
656 25418 93757 92010 13906 -35239 -7896 48800 61659 12527 -23235 22609 85379 61645
668 61645 -13745 -31271 16139 48876 15491 -51198 -65514 2487 56358 14840 -46898 -26798
680 -26798 36138 43236 -14284 -67670 -57853 -2187 9293 -53036 -89810 -34748 29520 16242
692 16242 -38502 -56551 -21581 15790 -7879 -74366 -88420 -27340 8308 -32556 -72925 -47010
704 -47010 10231 28649 -14511 -65836 -50755 5369 1028 -64980 -85796 -29810 20273 7915
716 7915 -36080 -46842 2146 51849 20835 -52313 -58413 1128 26241 -15176 -56843 -37363
728 -37363 28699 63710 18049 -38578 -11872 52849 48213 -15621 -46206 -13291 34629 37018
740 37018 -8179 -27620 27934 83666 55100 -8546 -15718 24483 44343 15827 -27718 -24005
752 -24005 32333 59617 14334 -22038 17289 70873 61525 5070 -31164 -10047 33901 27264
764 27264 -26839 -37093 23514 62480 26889 -22569 -21832 21931 48596 13047 -51075 -55430 1636
777 1636 22368 -20645 -46609 -9555 37750 33629 -20575 -59506 -29410 20682 1665 -63956
789 -63956 -77262 -28494 5005 -13021 -47934 -48569 -3110 26468 -18305 -83312 -74171 -15441 -3246
802 -3246 -49317 -84541 -62196 -7055 12204 -31751 -67512 -34381 7397 -19490 -76803 -86871
814 -86871 -46109 -8875 -18431 -61659 -71589 -21342 17217 -11116 -50172 -38970 -9365 -14199 -54416
827 -54416 -81156 -50942 10688 20079 -35859 -61471 -14907 26672 4950 -39290 -46122 -10425
839 -10425 16121 -16548 -71960 -58114 20702 60218 19476 -32623 -30267 13916 38276 1725
851 1725 -48101 -31230 26901 29779 -25276 -43494 5068 56762 55427 7436 -27663 -4964 32659
864 32659 18329 -21761 -18766 20349 35072 11561 -11097 2412 47276 63448 13576 -35178
876 -35178 -14568 30590 24692 -15203 -23994 11841 49065 36758 -12837 -22065 34582 70719 24843
889 24843 -40012 -44624 266 34096 20721 -17414 -16581 30500 48139 2459 -33351 -7346 34693
902 34693 30891 -16682 -54042 -33710 20472 31768 -4509 -13373 21048 32716 -2191 -36410
914 -36410 -29438 7748 27147 -7953 -56272 -43190 15342 33827 -1056 -23467 -2601 25716
926 25716 14871 -35407 -62781 -20111 34296 18754 -38952 -50050 -5912 33662 26808 -11989
938 -11989 -31794 -6196 15493 -15887 -54209 -34778 13727 25773 -4775 -31065 -17913 22125
950 22125 32675 -5076 -32220 -9647 11263 -13734 -44160 -30642 14540 41086 16359 -30680
962 -30680 -32047 19324 41771 893 -39552 -27440 8036 16899 -12084 -37474 -8014 50371
974 50371 54025 -5852 -42459 -12358 27493 23626 -12648 -34816 -13829 21724 16014 -14800 -7455
987 -7455 33416 43691 10110 -22507 -20975 7066 23042 462 -25074 -4303 31775 22951 -11056
1000 -11056 -9727 26575 46751 19987 -30911 -44940 938 40882 17015 -25040 -15482 28189
1012 28189 44456 17033 -17915 -12456 29616 42667 -6443 -49145 -26476 23240 35369 10446
1024 10446 -10810 -534 27883 28349 -6571 -21973 6546 24350 -984 -28103 -19167 12536
1036 12536 31819 16989 -9365 -2709 27897 23088 -19556 -36197 -5727 23660 13771 -23715
1048 -23715 -38646 -624 47412 35665 -17852 -31692 4264 26376 2930 -33612 -37652 -930
1060 -930 30623 9250 -31626 -23874 19907 33308 4303 -26408 -27140 -5784 4304 -16380 -32713
1073 -32713 -7602 22272 9650 -19345 -16503 8713 19346 410 -30457 -33694 -2423 10232
1085 10232 -20252 -40043 -9433 30191 26205 -11448 -36582 -17972 22438 21973 -26625 -52147
1097 -52147 -16969 21789 14061 -17987 -26242 2776 34479 21853 -24430 -37098 -3501 17022
1109 17022 -3665 -26423 -19872 5799 20939 8757 -11233 -2104 25567 19285 -16015 -26469
1121 -26469 -2208 16460 6235 -16256 -17576 15187 40947 17808 -19210 -10790 25453 29334
1133 29334 -3762 -30593 -19474 20078 38206 8218 -21093 1094 41057 38888 1782 -18922
1145 -18922 -4409 21586 21428 -10229 -25000 5597 36328 23021 -2561 463 21008 26496 8042
1158 8042 -15622 -12036 16553 21623 -8258 -20602 8569 35666 26450 -2758 -15889 3994 30107
1171 30107 14952 -29387 -36275 4935 31413 10333 -20407 -18711 14255 36821 14888 -26396
1183 -26396 -27940 5575 15454 -12307 -32018 -20147 7397 18982 1214 -21821 -12316 11797
1195 11797 5476 -22609 -27996 -10760 -3326 -13810 -26868 -20448 5848 18055 -7163 -31209 -15487
1208 -15487 9149 -1163 -32217 -43768 -21849 8184 7154 -28524 -43521 -7142 27617 10789
1220 10789 -28949 -39870 -16156 7939 -2485 -36857 -42534 -3716 22543 2256 -25830 -20954
1232 -20954 1976 11267 -5122 -29416 -28221 -2260 4844 -16961 -24117 -2117 16345 9474 -7163
1245 -7163 -11648 2562 14421 -3450 -30448 -21466 12415 19186 -5097 -17810 -836 23872 26778
1258 26778 -1046 -23907 -5537 25722 18090 -17400 -27442 -1078 27948 29034 3739 -11398
1270 -11398 9544 31889 14006 -17998 -16764 9262 20323 6961 -11686 -8989 16453 29351
1282 29351 8861 -8163 6089 22700 10410 -14833 -21330 -3386 19595 17186 -8623 -14425
1294 -14425 13078 28794 6379 -19967 -15796 7159 16974 -3219 -31154 -24322 10510 22660
1306 22660 -1969 -17828 -3364 14543 10375 -13530 -31288 -19972 4946 3827 -19606 -23007
1318 -23007 -892 9512 -2820 -17202 -15743 1227 8819 -12981 -36959 -25373 2532 2401 -17842
1331 -17842 -21242 -2566 14971 8401 -21373 -36270 -12184 14021 -574 -30600 -31686 -5475
1343 -5475 12573 3687 -19029 -20488 8103 24675 -213 -30928 -25848 -1596 7631 -3386 -15706
1356 -15706 -9295 12941 18947 -3115 -16552 -934 14377 5882 -10024 -12695 -1270 10685 5294
1369 5294 -8923 -1120 26219 30441 4905 -12913 -2543 14221 14298 -2896 -13705 4940 30451
1382 30451 23591 -5694 -9948 16340 35279 24332 -1999 -13735 4122 24824 13560 -9930
1394 -9930 -3315 26994 36440 17422 -4025 -3985 15001 25369 7913 -10744 -688 18999 15193
1407 15193 -1088 -2445 12896 27873 23419 1063 -9665 6731 18478 2391 -15228 -5692
1419 -5692 15927 22495 8553 -8314 -4482 17269 20794 -3345 -18067 -2558 12834 5504 -12164
1432 -12164 -16783 -250 21665 18687 -5564 -13590 3917 12122 -4495 -20708 -16363 2695 14150
1445 14150 1087 -19474 -13708 11154 15640 -4350 -13295 -3259 5542 -692 -18740 -25224 -4825
1458 -4825 19563 12473 -12301 -14798 3521 12489 561 -16627 -17960 996 12718 -4376 -24570
1471 -24570 -13373 12386 17181 2737 -8226 -4048 7808 7126 -12179 -21266 -2694 14705 6120
1484 6120 -9690 -8070 7146 16640 8771 -8810 -10659 8124 14841 -3793 -17740 -5739 11687
1497 11687 14713 3300 -5023 4347 21484 15493 -10254 -17270 2604 17082 8130 -7559 -9987
1510 -9987 5870 21929 13968 -6971 -6104 15410 20744 1499 -14427 -10567 6392 16342 6467
1523 6467 -5879 2909 20018 14300 -5185 -8569 4035 13546 7798 -8286 -14400 1597 18441
1536 18441 9993 -5513 -339 15032 16048 1319 -12129 -9473 6783 11901 -3656 -13927 512
1549 512 16911 10626 -4796 -7792 3571 15048 7597 -14006 -19829 987 15128 3299 -10932
1562 -10932 -6368 8497 15835 5249 -11964 -11630 5484 8321 -8951 -17353 -4212 8786 6929
1575 6929 -4264 -9706 1220 14983 7726 -13172 -16435 -204 7153 -1861 -12203 -10116 3938
1588 3938 13941 4374 -12217 -6891 8992 6807 -9591 -15842 -6472 4991 5514 -7380 -13149 2702
1602 2702 18355 8332 -11450 -12521 1305 8192 413 -13473 -14717 2405 13537 1887 -10802
1615 -10802 -2487 11632 9995 -3317 -12128 -7132 6323 6951 -7844 -12856 3969 16927 7760
1628 7760 -6119 -6703 3882 13040 5362 -11620 -13379 3305 10508 -174 -7396 1846 13273 13369
1642 13369 1510 -9717 -3061 12066 9110 -8379 -11476 3261 12887 6834 -3679 -5506 8017
1655 8017 19234 8686 -10456 -10878 4258 9637 971 -5680 -1180 10794 15013 2983 -8212
1668 -8212 1780 15761 10085 -6340 -10425 -918 8597 7676 -3736 -6972 7666 18784 7996 -7068
1682 -7068 -5440 5512 7980 287 -8523 -5433 8642 12755 -946 -8460 2682 13576 8205 -4724
1696 -4724 -9716 -2317 7349 3001 -11869 -11558 5975 15507 5852 -6343 -6416 1582 6231 -1205 -12563
1711 -12563 -8249 6103 5500 -9798 -14419 -2340 9943 9220 -3458 -12826 -6056 4527 -1992 -16301
1725 -16301 -13770 1798 8766 1144 -10224 -12380 -900 8058 -134 -12767 -9557 531 -1691
1738 -1691 -11742 -14707 -5976 6242 7994 -4290 -12694 -3776 5565 -1918 -12694 -11145 -1813 4040
1752 4040 -523 -10118 -9516 3512 9683 -1366 -9973 -3163 4699 2055 -8036 -14108 -6333 8773
1766 8773 10167 -3667 -7484 4248 11681 3238 -7801 -8429 2213 11876 4872 -9438 -9028 6160
1780 6160 12367 4873 -1365 2550 9300 9024 -1885 -11569 -3633 12417 12303 483 -2731 4635 10691
1795 10691 8045 532 -1821 6982 13333 3514 -8729 -5615 6811 10656 5943 1833 3561 10451
1809 10451 10703 -1149 -8244 1814 12174 6935 -3434 -5336 2305 10419 8331 -1739 -3867 7646
1823 7646 12600 906 -10244 -7063 2748 6965 2179 -5679 -2140 9370 10660 -2730 -10138 -1924
1837 -1924 6500 4627 -4391 -10178 -4738 5321 3406 -7088 -6653 5099 9298 596 -9312 -10567
1851 -10567 -3526 3019 -953 -8735 -4781 4944 3930 -5440 -8587 -1831 4755 3995 -5299 -12123 -6074
1866 -6074 2685 -1156 -8462 -4163 5831 7849 630 -8223 -8539 1547 6509 -2028 -9903 -3674 5833
1881 5833 4100 -3331 -5810 428 10002 9545 -2670 -9507 -559 7101 2564 -4983 -3097 5280 11957
1896 11957 7796 -2588 -3587 7489 11832 3185 -3633 16 6126 7674 2870 -2035 3004 13094
1910 13094 13224 2723 -678 4986 8778 5092 -295 -251 6923 13202 7351 -1598 1302 11216 12232
1925 12232 4766 -384 2066 6672 7437 -364 -4768 2938 13295 10230 573 -1216 4226 8342 5054
1940 5054 -3137 -5249 3712 9662 1760 -6931 -3002 6305 8860 2745 -4381 -4297 3344 4510 -4701
1955 -4701 -10213 -3103 5312 3427 -3304 -6520 -2328 4132 2600 -6742 -9392 -1320 2549 -4435 -9986
1970 -9986 -7668 -1349 2810 -750 -7402 -6259 848 544 -8111 -10750 -4793 -478 -1533 -6530 -8827
1985 -8827 -3241 4020 -425 -8852 -7784 -11 1247 -5251 -10517 -8337 -589 4277 -1865 -8898 -3960
2000 -3960 4436 3346 -4811 -7943 -3983 1981 2495 -5120 -8955 -1127 6929 3132 -4031 -3577 2251
2015 2251 5215 1935 -5074 -6175 1453 6375 465 -4185 399 6370 5797 1446 -1697 -102 5287
2030 5287 4927 -2900 -4914 2369 7011 3606 -768 -206 4484 8384 4105 -3681 -2647 5445 6595
2045 6595 -488 -4120 -66 5514 7137 2116 -2836 557 7448 4960 -3716 -5083 684 4959 2894
2060 2894 -2404 -4095 2124 7638 3017 -4799 -3259 3344 3623 -2026 -6217 -4826 1086 4288 -1002
2075 -1002 -5829 -1488 4239 1757 -4631 -6202 -2275 1057 46 -6315 -8089 -1128 3694 -964 -5828
2090 -5828 -3722 738 932 -3108 -7787 -6721 -137 1525 -5106 -7590 -2239 1978 190 -4555 -6230
2105 -6230 -2433 2345 -64 -8110 -8617 -874 2664 -1510 -5354 -3613 1344 3371 -1179 -7615 -5097
2120 -5097 1843 1972 -3733 -6007 -2198 2194 2943 -1566 -4772 -458 5256 2017 -4686 -4903 66 2439
2136 2439 534 -2475 -2032 2609 5396 200 -4696 -989 3671 3100 -1264 -3509 -1104 3236 3946 -1454
2152 -1454 -3093 2623 7355 3197 -2828 -3028 948 3778 1881 -3308 -3022 3491 5905 370 -3363
2167 -3363 107 4047 4083 300 -3888 -2233 3028 3153 -2430 -3300 1875 5017 2371 -1400 -3021 -85
2183 -85 3732 1051 -4749 -3351 2433 2825 -1310 -3685 -1107 2606 4084 -354 -4955 -2855 2419 807
2199 807 -4252 -4580 -136 2930 1663 -2515 -4824 -157 3498 -103 -4741 -3648 253 629 -1724 -4420
2215 -4420 -3256 1675 3551 -1414 -4949 -2090 1815 -287 -3913 -4851 -1834 1480 1332 -3884 -5236
2230 -5236 482 3285 -293 -4449 -3410 -361 1255 -1201 -5358 -4785 1165 2899 -1424 -3951 -1085
2245 -1085 1358 366 -2437 -4717 -2482 2177 900 -4025 -3801 402 1825 73 -1869 -1875 563 1706
2261 1706 -1750 -5708 -2769 2396 2079 -1976 -2836 -763 1945 2351 -2089 -4630 -20 3767 892 -4491
2277 -4491 -3759 538 3282 2053 -1335 -2849 898 3870 362 -3491 -1918 1401 2156 -183 -2299
2292 -2299 -1119 2608 3810 195 -2372 854 2849 810 -1583 -1251 616 2493 1379 -1405 -841
2307 -841 3831 4361 -269 -2403 -97 2526 2859 239 -2516 144 4482 3263 -1455 -1716 2718 4908
2323 4908 3229 -1004 -2738 56 4277 2966 -1575 -724 2984 3570 1516 -960 -472 2373 4088 1118
2339 1118 -2592 -579 2673 1995 -189 26 1920 2610 1776 -1044 -2093 1392 3740 422 -3179 -1683
2355 -1683 1465 2351 1107 -1139 -1146 1882 2858 -1523 -3851 -441 2093 952 -1674 -3319 -1131 2045
2371 2045 2082 -1553 -2872 94 1177 -842 -2875 -2272 -203 1554 106 -3240 -2507 1250 2001 -1541
2387 -1541 -2134 -642 489 -268 -2671 -3532 -522 3057 1377 -3144 -3247 414 2202 1084 -1588 -2547
2403 -2547 -520 2275 250 -2988 -1386 2274 2294 273 -1403 -968 1279 2672 344 -1753 130 2131
2419 2131 905 -532 334 1586 2349 2186 -10 -569 2065 3195 486 -917 1096 2660 2206 522
2435 522 -417 1182 4695 3912 -683 -2159 1441 4017 2858 408 -663 1459 4079 3201 -188 -788
2451 -788 2509 3759 1692 -545 -854 770 2763 1997 -678 -267 2196 2213 -412 -520 707 1196 1198 -540
2469 -540 -1905 -202 1726 406 -1967 -683 1020 471 -1037 -2141 -1720 561 1069 -1817 -3690 -1409
2485 -1409 1032 -350 -2456 -2833 -1594 838 572 -3019 -4372 -1791 623 -882 -2435 -2908 -1880 -555
2501 -555 -790 -2534 -3168 -787 -345 -2504 -3645 -1871 -508 -874 -1361 -2786 -1993 104 -164 -2993 -2903
2518 -2903 -168 459 -1121 -2575 -2657 -990 1036 531 -2169 -1566 696 615 -1267 -1847 -549 1082 1344
2535 1344 -732 -2631 -765 2211 2381 -72 -590 438 727 935 21 -229 1416 2378 777 -1116 108
2552 108 2469 2372 1383 229 221 1325 2346 205 -486 1660 3421 1513 -413 -431 819 3106 3444 359
2570 359 -481 918 1827 463 -30 1153 2069 2255 728 -1262 -1343 2131 2885 528 -779 -214 44 342
2588 342 457 -321 419 1651 613 -1837 -1955 223 1050 66 -688 -1044 -1235 27 -717 -1389 -93 1438
2606 1438 98 -2351 -2963 -1704 574 1072 -855 -2920 -2307 -376 -286 -1231 -656 75 -150 -1294 -2876
2623 -2876 -2553 -229 1572 -421 -2240 -2229 -1130 -555 -173 -352 -524 188 -229 -2362 -2966 -194 1396
2640 1396 1095 -222 -1377 -1600 -677 426 15 275 1382 648 -1725 -2289 -306 1717 2182 1273 -1303
2657 -1303 -1177 487 1313 75 533 1549 1446 120 -799 -1097 1043 3354 2541 180 -1016 278 978
2674 978 1381 1197 1007 1165 1554 116 -607 716 2941 2679 926 -515 -526 430 1629 1461 794 1458
2692 1458 1186 -416 -946 771 2397 2661 1157 -642 -1465 113 1390 792 96 1071 1262 -12 -1212
2709 -1212 -917 508 2461 2347 -642 -2414 -1204 479 1091 652 340 -143 536 -349 -1584 -834 1104
2726 1104 1470 -428 -1573 -2043 -1489 628 1106 140 30 -16 -1009 -1963 -965 790 901 -146 -1233 -2123
2744 -2123 -956 876 518 -483 -212 601 -524 -1588 -1499 -582 1108 1529 -566 -2591 -1878 965 913
2761 913 648 -164 -886 -464 -417 -1022 -1035 775 1500 247 -1118 -958 -447 685 1291 826 -907 -481 -586
2780 -586 -939 -723 1282 1891 571 -662 -1194 -485 1280 1284 -263 -765 204 268 -537 -599 85 1067 1926 1068
2800 1068 -1374 -1296 314 1491 519 7 -313 -296 428 590 -11 513 1335 738 -488 -546 138 386 541
2819 541 740 104 -56 432 296 40 1014 1604 1086 -263 -828 -552 1168 1603 90 -513 21 1489 708
2838 708 143 49 448 944 1150 -485 -1406 -209 1557 1382 376 29 138 444 1064 453 -32 578 665
2857 665 -373 -387 211 702 734 478 442 137 61 -53 -334 -236 689 345 -610 -945 -242 641 1433 234 -1236
2878 -1236 -605 590 539 -950 -926 -222 208 554 200 -1279 -716 874 757 -252 -760 -540 -620 411 -444
2897 -444 -931 -366 534 270 -506 -334 -136 -257 -647 -382 -370 -179 -384 -865 -1247 118 743 26 -737 -488
2917 -488 -128 439 448 -1049 -1392 142 894 58 -986 -554 406 584 375 -432 -1104 -216 588 64 -362 -105
2937 -105 63 695 810 162 -177 850 653 -65 -14 497 208 373 107 518 807 1302 485 -44 537 1496
2957 1496 929 337 202 -26 1098 1275 682 -232 771 1831 1292 -82 -138 464 986 1061 106 -624 616
2976 616 1413 1185 283 244 682 790 260 110 -331 176 939 142 -427 155 860 509 -108 -54 -18 146 230
2997 230 -758 -926 232 856 -210 -539 -386 28 -18 366 -694 -1106 -352 -43 -1209 -1533 -1039 -254 -56
3016 -56 -281 -963 -1049 18 -193 -1334 -1136 -361 -491 -1152 -1127 -1244 -402 169 -342 -1232 -807 -35 -603 -1226
3036 -1226 -1491 -1115 -312 622 -283 -1327 -735 534 -17 -564 -850 -320 164 84 -625 -1247 -363 573 391
3055 391 298 -146 115 102 56 -301 -373 536 730 -113 -311 301 924 465 718 763 480 440 359 -549 -134 1107
3077 1107 1054 210 430 602 1201 1372 817 -199 33 1266 976 -59 -610 553 1012 912 252 54 389
3096 389 1690 1172 -592 -876 -20 414 349 363 -58 761 969 25 -913 -46 1115 1157 48 -723 -1284 -783
3116 -783 439 374 -212 -142 580 -213 -973 -1001 -606 -95 523 -424 -1139 -1369 -565 -532 -75 437 220 -756 -1130
3137 -1130 -1268 -1094 -95 57 -978 -660 -165 -116 -756 -1285 -367 281 518 -520 -2040 -1554 353 740 -253
3156 -253 -1511 -1118 158 808 642 -1068 -1275 -236 5 -487 -976 -232 757 1106 502 -858 -1192 395
3174 395 1310 801 244 -444 -1037 -425 -12 809 1226 1111 575 -225 78 -1 38 11 866 1305 464 -577 -982
3195 -982 -15 1905 2832 1109 -637 -645 248 810 554 341 -5 1390 1583 46 -587 7 1265 1795 1044
3214 1044 -535 -760 268 982 586 33 595 746 528 153 269 576 797 316 -594 -850 505 1008 622
3233 622 -51 175 327 199 -36 -463 469 1061 485 -927 -1207 -434 850 898 601 -80 -373 97 -213 -902
3253 -902 -11 766 393 -474 -876 -600 -104 390 675 622 709 -237 -1357 -1502 -711 745 1121 -158 -1802
3272 -1802 -1221 569 1481 116 -1002 -613 127 732 -308 -1764 -1338 547 1523 403 -1080 -1280 26
3289 26 857 562 -838 -1440 -643 633 -124 -232 -341 353 640 288 -262 -869 -294 91 -33 80 -278 -1011
3309 -1011 -926 791 1897 467 -562 -1487 -760 1065 1698 -467 -1572 -983 924 1307 352 -1119 -971
3326 -971 1032 2205 519 -1829 -1426 119 1455 873 -373 -903 220 1204 758 -201 -119 576 526 209
3344 209 -560 -324 20 981 945 434 65 583 90 531 684 340 -203 -202 -269 362 858 469 -503 64 1474
3365 1474 1271 48 -949 -1126 382 1490 414 -912 -1037 114 804 784 83 -390 257 186 16 -679
3383 -679 -472 131 -71 -118 -119 400 -92 -174 -923 -810 412 657 -401 -1708 -1513 -381 649 626 -448 -702
3403 -702 -343 190 -776 -1322 -691 -121 -181 -1038 -1565 -890 80 599 -489 -1143 -1031 -686 -136 -115 -960 -1232
3423 -1232 -1030 9 -511 -311 -331 -365 -584 -45 208 -847 -1654 -1588 -42 1263 914 -818 -2361 -1462 1205
3442 1205 2149 755 -1411 -1990 -877 619 426 -648 -153 1072 1251 -210 -1306 -406 835 1940
3458 1940 794 -967 -1197 -153 840 454 800 740 1003 903 -136 -1021 -784 716 1193 1043 609 -360
3476 -360 -944 -361 1333 2010 1506 -188 -1297 -974 1232 2051 695 -1035 -799 489 1770 1378 -173
3493 -173 -724 599 947 107 -670 -307 481 1129 788 -395 -804 99 1097 143 48 198 218 -673 -1349 -1605
3513 -1605 120 1674 1496 -210 -1664 -1875 -902 543 1166 819 -265 -1616 -2291 -1804 304 1464 980
3530 980 -631 -1396 -1012 -384 -275 -725 -868 84 145 -468 -1477 -1577 -786 656 1129 283 -1380 -1749 -1092
3549 -1092 -664 -229 711 205 -576 -1530 -1162 444 1188 762 -1394 -1537 -336 780 585 61 -494 -609
3567 -609 166 303 387 594 1150 667 -642 -1568 -727 948 1275 555 -49 299 668 152 -526 -39 1256
3586 1256 1908 1461 -73 -1760 -1237 354 2109 2251 1787 208 -1239 -1382 32 1344 2255 1052 -367
3603 -367 -1017 -161 1200 975 662 800 1182 834 156 -867 -922 421 1233 1251 444 -80 459 385 126 -241
3623 -241 326 1138 529 -549 -1008 137 1390 883 -15 -955 -440 814 1414 220 -1120 -1347 -784 -201
3641 -201 579 780 292 -312 -1101 -912 -40 807 608 -396 -737 -539 -134 -430 -594 -328 232 969 347 -1251
3661 -1251 -1793 -940 199 548 35 -181 -439 -765 -828 -999 784 1518 841 -711 -1888 -1298 133 822
3679 822 188 -666 -501 324 69 144 -344 -100 -122 402 346 -98 -6 169 -454 -227 693 991 214 -374 -663
3700 -663 95 742 254 -643 -710 127 1179 815 132 134 17 596 243 253 766 864 405 -367 -307 245 1671
3721 1671 1722 180 -578 -484 1054 1121 531 116 376 802 833 464 -173 197 651 935 930 776 56 -413 -395
3742 -395 135 644 1303 644 -204 -730 625 1325 596 -159 1 1 877 301 -555 -69 858 702 246 -547
3762 -547 -155 284 -12 -114 -970 -429 757 632 -146 -928 -262 488 643 38 -768 -686 160 119 -653 -328
3782 -328 -238 -438 3 -487 -255 -78 -433 -725 -1085 -270 215 -135 -1046 -972 -319 585 404 -456 -886 -538 571
3803 571 84 -805 -651 -512 -303 21 -490 -223 215 422 -284 -737 21 28 2 -399 -673 -92 649 345 -238
3824 -238 -244 392 460 -126 -491 -262 584 570 29 -971 -339 977 1427 -47 -514 142 570 928 123 -698
3844 -698 -651 879 1416 508 -596 -712 463 894 876 -97 -314 30 73 -45 10 69 222 314 1079 468 180
3865 180 33 -565 -3 1050 660 -253 -945 -107 705 1104 526 -736 -55 1025 1331 -794 -1908 -478
3883 -478 1161 1387 142 -835 -903 452 1362 -105 -1031 -495 726 851 -18 -1222 -1340 -126 668 761
3901 761 -393 -689 -310 -377 -250 -359 -463 -83 32 -171 -356 -522 -687 -822 -110 589 158 -733 -1241 -942
3921 -942 -23 679 -389 -976 -616 395 168 -731 -1085 -643 223 613 -30 -1238 -807 -171 123 -417 -448
3940 -448 13 225 298 -697 -1079 -424 425 72 -478 -105 343 495 -307 -716 -496 595 1094 189 -734 -603
3960 -603 -95 118 135 -189 669 1155 879 -653 -995 -182 884 822 485 -249 -232 190 150 216 305 921 723
3981 723 358 94 147 280 -222 52 594 1269 1074 71 -503 154 1421 1565 267 -551 76 1120 1352
4000 1352 -200 -793 119 1369 1687 615 -426 -416 625 756 31 -574 -95 974 1632 -50 -1057
4017 -1057 -831 339 1056 331 -565 -855 30 -3 -303 -320 -282 184 828 261 -270 -727 -909 -686 349 1357
4037 1357 282 -1143 -1544 -632 569 936 131 -459 -724 290 92 -768 -1459 -244 877 980 -218
4054 -218 -1432 -975 661 862 -339 -921 -346 163 178 -639 -941 -260 557 770 -129 -428 -329 189 175 -87
4074 -87 -596 -583 432 270 47 275 121 -68 -108 243 485 937 482 -514 -628 280 451 716 396 760 508
4095 508 398 27 -419 134 927 1326 111 -153 -268 254 314 448 842 1130 1331 395 -790 -776 922 1180
4115 1180 892 259 -305 183 662 423 -120 -128 1126 947 -106 -779 -739 802 1108 394 -289 57 659 652
4135 652 -185 -306 -25 206 492 165 -589 -103 366 72 -13 -385 -345 -193 -12 52 148 -506 -526 -592 -370 364
4157 364 616 -478 -1141 -343 113 128 -370 -644 -544 399 80 -641 -1237 -350 683 611 -461 -1589 -952
4176 -952 59 440 -519 -800 -396 145 130 -427 -1304 -508 990 565 -171 -1162 -1068 -237 117 69 -307 -1
4196 -1 388 109 -238 -244 8 -59 82 -379 122 106 -94 -143 99 549 535 -275 -527 -27 468 366 -271 -524 119
4219 119 601 312 -295 -524 478 731 363 -386 -552 -80 722 254 -298 -848 348 677 480 -277 -381
4238 -381 495 749 131 -405 -646 180 648 260 -234 -303 253 472 187 -205 -399 204 421 -125 -309 -109
4258 -109 32 113 -32 -96 79 329 -438 -710 -211 161 -171 -526 -435 67 392 97 -319 -432 243 581 -92
4279 -92 -803 -496 164 592 119 -620 -724 357 674 -158 -914 -458 206 115 -238 -582 -310 551 703 -74
4299 -74 -714 -419 257 397 42 -275 -237 -120 -245 -547 -256 365 350 72 -277 -461 -230 112 78 -104 -5 -52
4321 -52 -241 -498 -410 290 540 200 -337 -543 -147 566 -314 -709 -199 323 425 -165 -549 -15 575 456 -661
4342 -661 -665 -185 702 414 -259 -192 -180 232 74 -498 -186 742 725 -165 -525 -353 295 800 798 -96 -603 223
4364 223 691 69 41 76 752 446 387 -435 -58 474 590 779 182 111 -172 -273 -71 364 748 668 -262 -262
4386 -262 -61 607 562 188 118 601 389 -284 -489 -351 276 1156 595 -475 -529 475 1284 711 -310 -235
4406 -235 189 545 -63 -866 -366 457 567 -33 -401 -113 98 458 54 -584 -463 -239 -216 6 357 314 -108
4427 -108 -130 -547 -644 153 255 -67 -344 -464 -274 -213 -656 112 245 600 -69 -923 -1053 -414 530 -2 -306
4448 -306 -688 -477 -120 -272 -565 48 707 327 -266 -936 -626 117 596 132 -248 -270 201 148 -413 -22 96
4469 96 -39 -2 -303 -655 0 458 114 -418 -280 366 381 95 -148 -105 546 577 -388 -472 40 500 586 278
4491 278 196 126 -198 404 6 -207 -222 296 -288 -291 138 438 549 695 -80 -261 160 140 -130 141 689 586
4513 586 13 -182 -406 114 941 338 -609 -701 279 326 -206 -490 -248 142 558 69 -780 -342 232 295 -54
4534 -54 -587 -508 -189 107 -370 -392 13 -131 -240 -142 -470 -85 118 -204 -655 -552 -181 -235 -387 -292 -142 133
4556 133 -283 -440 -433 -369 213 -232 -714 -751 -187 139 -203 -368 -314 -215 180 -222 -817 -429 139 498 -249 -864
4578 -864 -293 -238 232 -58 -458 -371 315 231 -574 -291 -98 137 90 -170 -49 -115 340 -230 -296 -34 458 80
4600 80 -122 -422 -284 158 250 -178 -559 -35 174 350 -372 -261 -102 295 229 -134 -364 221 422 57 -441
4621 -441 -74 -70 515 51 -21 -363 129 220 34 178 18 63 -112 -186 -310 64 100 -147 -370 -97 420 521
4643 521 224 -386 123 15 278 145 -444 -356 341 121 -102 -484 -2 60 99 -261 -312 -53 177 68 -226
4664 -226 -407 -24 -10 -111 -223 -154 144 325 -80 -418 -76 85 93 -455 -349 -176 63 135 -302 -652 -33 165
4686 165 157 -515 -292 -298 -157 -70 -209 -482 136 628 -365 -449 -322 17 211 27 -483 -168 3 96 -399 -562
4708 -562 189 184 221 57 -315 -148 156 244 -437 -324 292 204 -305 -106 -194 235 51 -44 -540 -109 285 303 -307
4731 -307 -126 40 188 325 -250 -443 20 516 23 -158 -65 392 315 -81 -386 -210 420 201 98 -359 -78
4752 -78 269 -25 -42 -485 61 -45 368 -152 -432 254 318 115 -131 -113 298 174 49 -262 24 418 288
4773 288 -210 176 307 -95 8 -406 -75 -164 451 -19 -331 -291 369 210 206 -184 -239 283 819 -52 -356 -443
4795 -443 360 350 -10 -170 -113 99 80 6 -396 -134 659 -202 -327 -210 187 52 88 -56 -325 148 180 -251
4817 -251 -289 156 52 -19 -406 -103 -167 274 305 -217 -506 13 386 5 -200 -60 43 357 -9 -336 -285 224
4839 224 678 40 -528 -297 91 246 164 -10 -26 115 295 -114 -32 249 -151 -51 -14 169 -211 -300 -80 -185
4861 -185 115 685 302 -155 -695 -48 332 256 -88 -771 -4 532 397 -200 -426 92 715 462 -81 -461
4881 -461 -84 512 226 68 -150 -153 70 402 148 -247 98 359 -33 -212 181 -6 -12 -61 -245 220 24 70
4903 70 70 -19 283 212 -227 -348 -171 454 406 98 -380 -227 355 322 -427 -255 65 353 322 -106 -356 -150 501
4926 501 649 1 -269 -62 92 109 5 -41 110 183 -115 25 10 335 132 160 112 -192 -30 -108 -135 -255 435
4949 435 7 91 -175 109 226 339 290 -160 -280 30 226 -72 -338 -90 -117 -35 -90 -517 -230 -14 166 -429
4971 -429 -140 -227 227 31 168 229 -310 -103 -306 -292 -147 112 212 -378 -285 -222 229 274 -288 -316 -112 280
4993 280 26 -543 -446 180 417 -98 -382 -903 -167 331 149 -404 -406 53 167 -31 -120 -402 47 44 61 88 -204
5016 -204 69 -176 194 -4 160 241 -31 -155 219 382 308 -93 -174 93 321 252 20 -487 -40 443 244
5037 244 -125 -237 -112 536 439 -79 -284 306 456 427 28 -350 -72 236 406 -7 -143 -75 458 306 -352
5058 -352 -195 409 302 323 179 107 -37 -64 224 27 401 631 -35 -220 26 218 74 -111 -237 174 65
5079 65 264 -70 -336 -338 53 206 53 -81 -355 34 229 -150 -313 321 235 -21 -8 157 294 90 60 95
5101 95 -156 18 62 -201 -143 -88 264 104 193 -322 -180 -248 -38 -346 -126 5 165 -34 -157 -26 -164 676
5123 676 141 -306 -67 289 136 275 -32 -241 28 333 233 -61 121 159 176 382 -23 -3 19 172 58
5144 58 21 267 29 -110 -421 336 32 211 35 100 -48 353 53 -37 -270 129 543 257 -114 -107 68 117
5166 117 509 -201 25 -54 644 227 162 -15 232 241 526 148 124 88 109 111 281 85 76 129 487 203 -7 269
5190 269 64 87 270 525 -6 241 81 -99 196 441 -161 -403 181 409 233 -32 -45 54 328 516 -32
5211 -32 -222 69 329 123 -16 8 23 182 129 -225 -381 174 251 -119 -435 -82 -37 146 130 -157 -312 246
5233 246 429 171 -186 65 -6 -136 -349 -182 -134 -12 65 -458 -240 -183 218 -102 -96 171 84 -60 116 -362
5255 -362 -348 154 310 -113 -136 -222 -321 -254 281 53 -107 384 218 -52 -76 215 272 360 -60 -72 154 209 -188
5278 -188 -518 78 518 98 244 -185 41 134 299 210 -47 204 575 136 -74 -172 71 -41 328 98 -2
5299 -2 21 252 138 -35 394 26 -21 102 -100 -136 138 41 14 190 407 31 119 267 -75 209 351 33 122
5322 122 254 305 95 -364 -257 285 382 290 197 -387 -378 200 97 28 165 158 399 -18 -139 -772 -147 179 171 185
5346 185 186 -340 -249 96 -195 -253 -55 153 130 -325 -141 -301 -72 -358 -30 -1 -153 76 -366 -313 7 182
5368 182 64 -460 -38 -97 -36 -71 -27 -153 268 -80 80 -43 -340 65 -83 -250 -279 -40 115 17 -312 28
5390 28 72 101 -120 -91 -177 74 -159 -186 -127 313 114 -123 91 -219 -168 136 69 127 -239 116 252 -35 -70 120
5414 120 198 178 591 174 -17 350 264 -38 -24 45 238 107 155 -233 -86 163 86 -5 153 103 426 55 72
5437 72 240 -120 418 312 312 -88 184 259 41 -169 38 62 253 102 45 -436 202 126 -130 -170 15 337 -214
5460 -214 -294 -140 -27 122 103 179 23 211 -1 -176 -10 -182 -53 249 258 -293 -117 68 24 -50 -21 -39 -90
5483 -90 -98 -388 -221 -308 17 -291 -186 -385 -42 -97 215 53 -227 239 -208 -297 -307 -33 -77 -12 -161 -215 -39
5506 -39 126 -11 -372 -273 -168 329 -186 -188 -228 64 -228 -99 -407 -272 100 -27 -284 -325 154 161 -151 278 -71
5529 -71 63 107 72 -155 -207 33 72 -139 210 154 258 25 112 -82 156 167 32 -200 -187 191 228 131 -200 -117
5553 -117 207 312 183 -220 -56 312 147 254 -92 34 77 247 -237 193 83 313 79 343 -162 135
5573 135 108 222 -94 -153 -40 374 175 5 155 -10 108 34 -123 3 89 -100 -41 -174 -165 218 -58 -167
5595 -167 -145 -144 87 124 -387 -88 65 -129 -266 -169 26 -89 -143 163 -152 -228 -143 -178 59 -110 -211 -339 -291
5618 -291 -5 -262 -165 -105 -16 24 -58 -345 -4 113 -333 -489 66 -196 -385 -350 10 -41 -40 76 -458 -141 96
5641 96 427 -204 -124 -27 126 -7 -129 -174 -349 -67 378 74 -20 -99 43 -472 -251 -13 -116 -97 129 -270
5663 -270 -139 234 -154 33 82 8 142 101 -23 -141 -239 425 63 -285 35 16 308 -243 253 61 90 338
5685 338 152 87 28 -38 47 -71 4 46 32 95 71 -220 -120 160 -91 -27 275 -63 62 -11 -156 302 29 155
5709 155 152 -6 136 -79 -176 143 294 291 105 111 -18 -100 -154 -200 53 -145 -313 -224 42 -222 -71 -10 -150 115
5733 115 -129 35 -352 -113 -34 -142 -121 140 -129 163 -530 -324 -211 207 360 -252 135 -215 -113 -81 -152
5754 -152 -290 82 -69 -321 -603 -147 -230 -399 204 -402 -124 -10 12 -244 -405 -92 -133 34 -114 -52 -62 -213
5776 -213 -149 -407 -372 0 107 -116 -129 -237 -218 59 99 124 146 -23 183 -30 -351 -96 186 274 72 1 300
5799 300 12 -150 157 183 227 366 72 -168 90 156 14 32 -29 -116 156 105 8 -193 19 313 148 81 44
5822 44 126 127 181 89 -69 24 207 149 -452 76 20 95 253 -61 -18 -56 7 161 -226 -448 46 105 269 60 159
5847 159 -282 -269 -240 11 391 240 -158 -18 -133 -119 29 21 -286 -240 21 175 -165 -121 48 -73 -26 212 -126
5870 -126 -110 70 -153 -371 58 56 136 -296 -248 -150 -91 164 -58 -346 -361 150 -49 -57 -164 -317 -165 193 -165
5893 -165 71 -32 178 70 -37 20 211 327 193 65 -111 -144 -89 -66 0 7 -161 144 167 -294 -20 191 159
5916 159 -4 -32 -165 37 78 -322 -126 122 218 -154 -276 -228 -96 -33 -367 268 100 138 -33 -100 -324 180
5938 180 137 -100 49 -68 91 -129 -5 189 -78 -32 409 214 -201 92 164 67 14 101 -194 66 -120 48
5960 48 -107 -4 -15 7 146 203 -69 -127 96 -180 36 92 150 39 -40 -117 -49 -19 -39 -158 -121 439 131 -206
5984 -206 -402 63 239 -139 -23 -234 -71 -90 82 -658 -44 127 -180 -150 -371 -203 -147 173 -51 75 -205
6005 -205 152 90 91 132 -213 -333 88 169 81 200 163 -84 -177 -419 -58 169 -296 108 -227 -136 139 55 -116
6028 -116 -3 -2 -146 135 104 58 128 -130 -102 -185 182 275 36 33 -220 393 28 -88 -214 -244 313 296 56 -285
6052 -285 90 10 -7 1 -47 393 124 250 193 -137 266 -69 98 -401 -100 87 50 -11 -91 51 412 104 -76
6075 -76 -120 -255 -80 113 430 163 196 -5 166 208 79 88 294 116 -79 12 103 -1 -223 -124 -139 294 62
6098 62 41 108 -182 206 300 -239 69 -215 5 57 -348 48 134 12 282 -87 105 -61 65 140 144 -307 -88
6121 -88 -36 106 11 -552 -160 202 308 9 -88 -371 24 24 -7 7 105 178 -354 -25 -451 123 -23 15 -173 -170
6145 -170 -101 -248 -253 38 325 181 -122 -65 -291 32 80 -167 -282 -331 106 -111 213 181 -99 -32 164 113 -83
6168 -83 -346 10 -166 66 -221 -112 -178 173 267 -75 24 103 325 103 136 481 156 -90 -245 -30 40 244
6190 244 -354 111 245 24 108 193 -253 86 49 419 -13 39 -56 130 171 177 229 -76 55 177 44 69 -62
6213 -62 -107 111 390 77 -49 89 142 -311 320 13 37 -56 95 404 404 -218 -49 -48 -1 331 34 -198 -250 114
6237 114 195 77 51 -64 118 124 196 -242 192 -245 110 105 347 -114 -306 49 -79 -21 -85 115 -153 -63 -75 42
6261 42 60 35 -37 246 53 162 -117 -172 -14 61 -32 41 -130 20 124 -10 -400 73 -108 -188 -68 -70 34 438
6285 438 -100 -113 -127 -94 -7 -82 -50 -246 -32 -135 76 -119 40 312 30 -100 -98 -133 39 -131 -87 110 243
6308 243 205 251 230 370 138 507 194 -245 -7 102 112 276 99 86 172 123 -96 36 198 -37 298 150
6330 150 189 -88 -44 103 22 -263 277 -5 -105 -16 -111 159 53 71 -122 230 243 -28 23 368 -98 93 67
6353 67 -3 93 17 191 -264 -55 -210 54 -127 160 222 -105 -238 -74 -140 -157 -140 130 24 349 -51 -7 42
6376 42 -21 65 -42 -8 20 -140 -13 50 -2 -101 -192 221 130 -125 -49 -308 1 4 275 91 44 -195 -365 105 -39
6401 -39 -225 -26 -196 68 -579 -350 -184 -72 47 -130 -47 -411 -129 133 144 81 -162 -29 -141 -442 53
6422 53 80 21 -127 17 -229 59 99 -3 74 -388 165 171 -38 11 14 -21 -119 12 1 -5 170 -27 199 36 131
6447 131 -29 105 38 11 -105 -210 1 69 119 62 -9 153 224 -28 185 -57 -87 18 31 -206 -168 -118 -380 -98
6471 -98 63 253 -181 121 -59 67 106 27 -224 -144 -68 -69 -113 179 -85 414 135 -137 -235 269 -99 -428 -30
6494 -30 -208 29 -222 -153 98 -95 -204 -51 -251 -102 -66 -120 -253 -176 -363 169 23 327 -324 -75 0 -88
6516 -88 -202 94 289 -58 -12 87 11 -78 -22 -119 259 47 -143 9 71 112 -159 115 114 60 210 122 -187 176
6540 176 -98 -107 -267 509 8 -296 25 180 -199 221 166 -98 106 69 58 89 -240 -87 152 -38 132 357
6562 357 -19 120 6 -66 -207 145 -35 63 -128 -106 69 -195 -110 -237 -46 71 255 -248 -200 -14 -79 -95
6584 -95 -8 -78 -40 -104 63 71 85 48 49 144 256 1 131 275 4 291 166 20 -231 -81 -238 184 142 294
6608 294 63 -139 -182 -360 159 339 -3 27 -138 -220 -341 -271 107 -72 -195 -161 23 -35 -148 136 24 -66
6630 -66 -80 1 123 -258 232 -89 -185 -13 -56 219 60 250 64 -22 23 215 -4 -49 323 -86 -121 26 132
6653 132 201 32 109 146 65 -49 21 -142 65 -171 158 -50 -87 -126 80 116 28 185 143 192 -27 63 -32 227
6677 227 -59 77 11 -36 -2 -243 52 -173 -100 -120 6 -71 -24 169 -65 30 204 -156 -25 84 -228 -66 129
6700 129 400 34 172 152 -65 120 -333 -29 -62 -383 -73 93 232 253 252 89 -2 -233 -243 -48 -67 -186 186
6723 186 25 -321 -85 -17 59 310 -353 39 -69 304 23 115 118 -57 -15 -230 91 0 247 -332 69 -68
6745 -68 -239 -181 -22 92 113 -117 -78 -357 -166 256 -5 63 -106 -72 -13 -34 202 51 -69 47 72 106 -3
6768 -3 80 -279 426 20 -50 64 126 213 69 -184 -97 -5 3 -84 -264 -59 6 276 191 50 23 88 189 155 74 129
6794 129 -252 -63 14 -72 227 279 -238 78 -76 22 183 146 294 236 -49 155 -173 57 -25 205 96 4 188
6817 188 43 -40 -23 43 41 -32 -216 -248 -67 -190 79 96 62 -194 -312 177 49 142 164 64 -410 36 -160 105
6841 105 -198 14 105 -26 -219 56 -85 120 -24 29 11 -115 -88 -110 -107 -179 -242 -137 -195 -106 84 -256 96 -209
6865 -209 239 -127 -33 -175 -330 108 155 8 -77 175 -55 82 -108 -150 115 -142 232 3 271 -328 85
6886 85 -184 107 97 181 16 178 8 -28 107 -82 262 -80 -99 -111 -103 238 262 -50 47 142 -100 187 357 125
6910 125 157 -264 28 68 156 111 -2 -160 122 166 -176 28 238 65 -140 -65 5 -154 246 123 191 92 92 209
6934 209 47 -257 -160 3 5 12 105 -34 -31 -107 -179 -296 34 10 27 -133 -378 -390 -410 122 -197 -102 -90 -134 35 -268
6960 -268 34 -230 -186 -347 -189 124 28 -499 -147 -153 -27 -52 -139 -184 20 133 70 -28 -96 77 51 -15 -35 -176
6984 -176 -73 178 99 -63 -77 25 -307 -55 60 -128 -330 -195 60 193 -148 8 126 48 174 108 10 -159
7006 -159 -306 100 5 189 -238 -51 -94 135 36 -48 131 -3 -29 -212 158 -131 198 -3 85 -42 -111 -141 -301
7029 -301 233 260 -128 2 -86 -143 477 105 153 8 60 345 2 16 -182 213 191 -40 -47 130 -79 78 269
7052 269 -62 -5 45 -98 -242 101 116 25 -152 -186 -68 338 -30 -18 366 67 188 -21 26 -467 303 -47
7074 -47 77 -83 282 -199 -1 -82 -44 134 -21 135 -23 -231 -261 370 -175 85 266 32 -262 14 228
7095 228 211 -128 163 338 -168 247 -108 155 -145 -148 17 71 -119 -263 -147 76 284 -343 -206 -296 115 50
7117 50 227 74 -195 -50 -96 84 264 -204 -129 13 -84 -99 16 195 175 16 -59 -12 -320 -18 8 159 23
7140 23 -193 -105 -250 182 75 105 37 -67 27 289 43 18 -121 -270 282 123 -222 248 -202 66 197 20
7162 20 -217 -31 15 302 169 2 -121 -139 138 -236 26 -52 -289 334 279 17 86 -179 -3 203 189 315
7184 315 47 298 -40 205 -259 -54 77 72 119 -77 -28 -36 -139 -263 7 90 -216 -221 -53 182 268 -185 62
7207 62 -8 -157 -123 -23 -128 -51 26 198 -184 -193 -17 -223 42 81 21 -61 -136 26 224 234 16 -281 -80 -35
7231 -35 -242 -82 0 -25 -203 105 105 -180 -121 -24 -19 336 180 -559 -513 -31 232 -47 -48 -245 72 15 -127 -35 -392
7256 -392 -38 94 -11 -234 -222 -61 51 287 69 -292 -37 -114 -55 -162 145 -14 -303 -55 -25 -323 -182
7277 -182 -198 -27 130 154 -193 -143 -250 325 135 -88 -132 -12 115 304 -93 -284 -185 -38 -7 332 212 -97
7299 -97 51 -6 210 -261 -31 286 -264 201 -161 -61 -3 51 176 38 146 -154 -109 90 84 335 145 113 -323
7322 -323 212 129 263 -150 -147 69 30 132 -292 -38 -550 166 13 -23 -42 106 -169 -82 160 -60 -138 -121 -10
7345 -10 -126 -227 -178 -76 -190 327 48 0 -112 -120 212 -38 224 -619 -487 -43 -9 -285 -203 10 -154 18
7367 18 44 -346 -362 125 -4 -352 -77 -406 -177 -22 2 1 -414 -11 -415 144 -58 -147 183 49 359 80
7389 80 -194 -126 -8 -48 167 128 -101 -166 -193 15 263 90 -95 -163 24 148 63 -83 260 321 76 355 45
7412 45 -360 -153 104 320 134 -143 120 83 103 -35 -93 -119 134 -171 52 64 287 129 -240 -33 -78 -6 356
7435 356 -143 -53 -101 -78 -133 -180 207 143 58 33 -54 -141 355 -15 -131 -81 -181 271 50 -160 -56 -293 74 24
7459 24 -229 94 222 -118 9 117 70 233 -203 -124 -71 236 46 -217 321 176 -69 45 -405 -6 -22 5
7481 5 -73 -416 -64 151 67 -159 57 -83 243 57 3 -89 -28 216 98 -89 73 276 -27 -254 263 -94
7503 -94 -51 -6 -361 7 -120 -16 -214 -259 34 96 -75 -213 24 -125 201 114 -266 57 -21 -196 -57 117
7525 117 189 -55 31 -253 -19 218 289 120 -15 -193 200 25 265 303 -212 407 65 -3 -353 -62 -132 148
7547 148 36 27 186 -41 -38 89 -35 25 -127 -179 -128 -57 142 77 261 40 33 -23 -57 -40 -121 59 -171 -303 71
7572 71 140 27 -65 47 -253 5 132 111 -10 -110 -146 0 127 -41 -30 -252 84 406 -21 108 258 74
7594 74 -4 34 99 24 -208 -104 -169 -78 82 72 131 -45 -108 48 117 115 75 -12 -101 -130 -87 160 226 2 -20 -1 8 204
7622 204 347 39 76 80 149 -25 74 -72 -207 -124 218 -157 -89 -155 -237 67 38 315 172 -139 173 -490 84
7645 84 13 -29 142 79 -181 12 316 -1 -107 136 -116 -247 124 -1 273 261 66 -138 3 209 85 -224
7667 -224 -198 11 -169 -172 -269 -234 3 19 141 167 -199 280 -134 -91 377 -157 -62 36 -313 144 3 163 98 -154
7691 -154 234 -82 -101 -80 -31 -128 134 84 161 13 -168 -67 98 267 -101 -116 1 -21 -80 53 21 -150 17
7714 17 -43 161 171 92 65 41 82 -43 159 147 164 115 -320 -90 -106 41 -51 216 101 -180 40 49 -51 -21 115
7739 115 -24 190 -111 198 29 110 14 160 157 51 -108 41 -67 -176 -240 41 232 72 -34 3 53 47 -153
7762 -153 -127 15 -18 73 -73 -66 -186 -9 -91 -18 -94 -159 -221 -116 -57 -134 -278 -111 -281 -134 126 -107 -152 -202 -151
7787 -151 -41 103 -108 25 -127 -16 -68 -255 98 -279 -29 123 221 -312 9 -124 -124 148 -186 70 -161
7808 -161 -95 18 64 63 -97 162 295 -127 -58 66 15 379 33 21 -136 7 -23 -4 47 61 59 73 -91 89 146
7833 146 -326 43 -209 -183 1 127 -206 -214 -100 -61 -85 -103 -145 -50 -209 -167 -91 153 69 -63 -11 -342 190 93
7857 93 -74 100 85 -43 294 145 240 100 -165 82 41 257 118 -71 159 363 33 117 223 -35 -6 -29
7879 -29 94 -34 -143 -25 -53 191 -47 -80 -38 50 -126 -298 -174 -47 92 142 -17 -39 9 59 53 53 163 313
7903 313 212 144 -210 111 -107 65 -70 -7 25 -238 -319 37 -26 -91 -130 -101 168 -111 246 20 -18 -160 -161 -169
7927 -169 80 105 42 16 -375 -32 8 91 -178 -131 -78 117 -88 -183 -255 -137 19 -35 -158 -77 -139 146 164 -179
7951 -179 -219 201 103 297 -235 73 0 -68 -121 106 -182 81 21 28 74 -74 249 87 270 51 -230 -116 207
7974 207 247 178 -18 -348 59 -59 -27 86 -9 42 64 139 -215 85 96 43 -145 132 -79 -104 -227 21 -107
7997 -107 73 46 -55 -68 50 72 94 138 65 214 167 101 313 115 93 -191 -104 -5 73 154 -27 81 -290 80
8021 80 -114 -125 -290 156 -137 -212 -97 -258 191 -53 -15 -120 52 -33 -108 -97 177 -373 39 -66 -72 -175 -297
8044 -297 -3 98 67 -77 215 -120 -175 -61 -15 -105 -34 -100 78 30 -155 239 -82 -231 20 93 23 1 -113
8067 -113 -53 -61 -198 -67 -268 -98 -271 -145 -40 133 224 -56 -94 -76 73 -103 149 25 -36 0 -84 243 -16
8090 -16 -88 -62 224 -86 -77 0 -42 -12 -317 117 -181 314 0 65 168 -85 -135 -147 89 104 36 15 -100 233 76
8115 76 96 59 52 104 -5 -56 -21 204 -41 43 224 125 -31 61 232 18 114 114 20 -154 181 42 61 60 42 -21 49
8142 49 4 187 -46 21 -4 86 -14 107 -108 5 -136 149 116 91 -75 -192 -100 111 -249 -88 -242 -44 42
8165 42 101 -36 -6 -101 -16 227 -69 193 -167 -138 -198 65 177 -115 -345 -23 -149 -258 -319 32 17 6 -92 -237
8189 -237 -75 -186
8191a86
$$ Imaginary data points
##PAGE= N=2
##DATA TABLE= (X++(I..I)), XYDATA
0 0 0 0 0 -8 8 -8 16 -16 24 -25 40 -48 56 -72 88 -103 123 -147 176 -203 242 -278 324 -373 429 -491 559
27 559 -637 721 -812 916 -1029 1154 -1290 1441 -1604 1785 -1982 2200 -2437 2700 -2990 3309
43 3309 -3663 4060 -4506 5007 -5578 6238 -7004 7906 -8998 10340 -12035 14264 -17336
56 -17336 21856 -29198 43192 -79553 373253 816999 138108 -98366 85954 429303 385718
67 385718 185148 57051 210951 346266 291783 101289 90690 229135 364530 322912 166848
78 166848 39960 91314 155628 88075 10694 124876 258683 214925 69644 26882 95264
89 95264 165404 117359 -9615 -42858 60611 84854 -39390 -99464 24438 159153 131968
100 131968 -25962 -124477 -11790 181699 130666 -172212 -332022 -133956 148295 175011
110 175011 -37461 -188996 -84163 99591 63206 -125726 -149125 6159 61304 -61300
120 -61300 -182022 -166460 -35785 80817 56056 -38844 -12485 90090 41233 -148916 -219664
131 -219664 -58734 147065 149537 -58045 -196882 -68696 132563 139349 29654 15193 76179
142 76179 72579 -13451 -95270 -62925 89792 184951 92760 -21990 35055 164061 168542 56898
154 56898 -17067 38462 149363 140505 -1358 -53717 79061 192900 146962 74202 106181
165 106181 179765 173052 65805 -21697 44546 177944 154663 -4958 -42523 119742 274415
176 274415 233927 36508 -92438 27531 250481 243723 -403 -139575 -15810 153007
186 153007 153311 36932 -5979 100324 203566 120831 -56402 -89355 26530 94563 40903
197 40903 -40736 -53191 17202 74722 21153 -53002 2079 102892 66441 -64667 -119842 -76833
209 -76833 -30169 -34661 -61514 -32964 45769 38038 -90864 -150603 -35379 80914 22177 -146464
221 -146464 -232869 -135316 37068 51668 -119031 -207430 -61860 110097 74053 -109883 -217564
232 -217564 -134472 17328 12791 -146368 -206621 -69893 46611 -7446 -105452 -98638 -11831
243 -11831 31918 -41764 -152514 -141062 -24731 8956 -79344 -127915 -55953 42874 59268 -16580
255 -16580 -86164 -47417 26273 -13531 -112579 -96557 7742 34129 -36593 -81389 -24118 86044
267 86044 112044 -3183 -109610 -52051 67366 56243 -60616 -113662 -34517 88994 111533
278 111533 4323 -67587 16091 112768 56367 -59740 -67603 13762 52861 -3284 -73850 -29513
290 -29513 109077 148407 21399 -77223 -8721 100217 86299 -30492 -110638 -50372 80583
301 80583 96197 -26053 -80144 31263 137952 93146 -27464 -75890 -11354 61494 20876
312 20876 -79697 -65195 59593 104743 19544 -50742 -16526 64619 91607 17586 -79218 -69751
324 -69751 12983 19985 -45920 -45542 37379 86612 44850 -29718 -40462 33406 70091 -19465 -107891
337 -107891 -48413 61990 51788 -49839 -90280 -5418 116569 122221 -18923 -124404 -52641
348 -52641 64088 41215 -75310 -112547 -20887 89826 79929 -39399 -85786 21601 108832
359 108832 32245 -89516 -91282 -3897 41505 -11951 -91791 -70872 46374 98482 18426 -56000
371 -56000 -28688 19735 2379 -57962 -85400 -32393 42816 24242 -62660 -63461 33287 70017
383 70017 -587 -61540 -35558 24973 18886 -78773 -148067 -65919 75062 86690 -19126 -73747
395 -73747 -20681 47434 35731 -53054 -101891 -25147 64144 11508 -107873 -106591 14020 94071
407 94071 54792 -34542 -53068 18653 50928 -37816 -119289 -61260 49595 64576 -5510 -53865
419 -53865 -18357 61749 75584 -5642 -55568 5292 62586 9172 -75634 -73256 11541 81647
431 81647 59728 -12685 -10802 72766 89832 -7792 -76374 -26766 56410 67570 5149 -46025
443 -46025 -4289 82921 83705 3120 -14713 59677 97362 30059 -63025 -76177 8961 88132
455 88132 54585 -22611 2582 96178 99237 3310 -52766 -5578 75204 81174 -11128 -84441
467 -84441 -29860 71152 70180 -1627 -13744 50079 95260 49898 -54382 -94260 -10971 72519
479 72519 30891 -50702 -33703 46494 68371 12469 -42797 -21508 53506 62903 -29993 -98025
491 -98025 -51819 16583 9276 -32352 -30717 25131 71697 32633 -64636 -87999 -5499 42579
503 42579 -15505 -78824 -55584 12724 33856 -20101 -70411 -21276 74947 66279 -47392 -108720
515 -108720 -56876 8448 3247 -49029 -64637 3591 77096 40289 -58777 -68243 18247 64128
527 64128 9634 -66836 -72086 -3260 42092 -6287 -60959 -8531 84431 80034 -4101 -49472
539 -49472 -17841 32930 30372 -29139 -51339 20300 88630 53116 -19312 -13687 55352 92169
551 92169 51922 -19077 -26557 39194 63945 -5598 -50376 18685 110281 111280 40024 -10137 17367
564 17367 77538 69465 -8006 -30074 42472 93086 49378 -15139 -10733 62652 123293 89850
576 89850 1833 -16286 45465 61292 -3124 -40195 9706 81973 90752 27645 -23538 16474
588 16474 89610 74816 -7771 -33904 13782 45323 13062 -39721 -38929 33891 91196 44447
600 44447 -35774 -26277 40221 43585 -24636 -71773 -43184 23677 38276 -24856 -65091 -6851
612 -6851 60347 32020 -44264 -62852 -16500 21019 -10497 -86066 -100591 -20498 40535 536
624 536 -57784 -39603 15692 21790 -37104 -94073 -73036 1540 14497 -59252 -99587 -44929 18434
637 18434 11546 -34845 -53905 -20731 14360 -21286 -97857 -101697 -23402 20811 -16883 -62463
649 -62463 -48759 4945 30356 -14255 -68518 -43830 18825 4418 -72523 -95463 -36557 24171
661 24171 22326 -27898 -51153 -2402 47037 8338 -66017 -64462 -1735 24682 -15098 -62872
673 -62872 -48875 25744 64925 10220 -50163 -20675 40365 29638 -35798 -68999 -33551 25208
685 25208 29664 -27002 -47887 15985 69394 33579 -31342 -38367 4375 29660 -2002 -55916
697 -55916 -50071 18632 47340 -2324 -39872 -5396 42999 35364 -21094 -61808 -35791 18014
709 18014 8333 -53120 -58971 7778 46575 11423 -37917 -39634 4719 30929 -15260 -83136 -72477
722 -72477 -3970 13614 -36126 -67286 -33183 23694 30518 -30229 -82056 -48524 10865 -7923
734 -7923 -75511 -88509 -36397 6851 -5297 -50916 -61086 -9277 26804 -21181 -87668 -79967
746 -79967 -27761 -13068 -45957 -75164 -55029 -126 14578 -36249 -68480 -25539 18460 -10286
758 -10286 -70962 -86127 -45129 -1108 -10304 -56483 -54226 7421 33287 -17268 -64263 -46450
770 -46450 306 13065 -28124 -75457 -57119 10441 29204 -17449 -38102 4806 40654 16529
782 16529 -38636 -58555 -15763 31383 7701 -49998 -43978 19463 47962 17053 -16721 -8411
794 -8411 30357 42780 -6616 -56920 -28568 37818 42554 -8752 -30134 7769 56073 55311 2918
807 2918 -28670 6682 43687 11096 -40232 -29132 25268 53106 29335 -10916 -10883 37560 61946
820 61946 19700 -24459 -8351 23171 13456 -20270 -27398 12966 61594 51429 -11200 -31530
832 -31530 19566 51894 14837 -31157 -25533 14263 31298 -2333 -40604 -11699 61126 74188
844 74188 7896 -44575 -26432 21039 31366 -9782 -47923 -19851 37313 32113 -23475 -31180
856 -31180 23475 59275 30749 -26151 -48178 -13820 24683 7915 -29471 -18515 24126 30822
868 30822 362 -17851 459 33263 30475 -22336 -58142 -21523 29569 18877 -20954 -19300
880 -19300 20894 44304 18918 -26064 -25542 27347 47610 -9086 -62498 -40124 20863 45794
892 45794 19053 -16789 -10455 31672 38115 -11344 -39431 -3223 36138 19452 -27323 -43049
904 -43049 -3947 48036 46958 982 -12259 19343 26012 -12672 -36287 -13471 24560 31457 -5146
917 -5146 -39161 -11123 47542 52063 3360 -20416 3891 25840 7114 -33325 -39767 11867 56335
930 56335 26779 -31147 -28555 25265 51913 24188 -19756 -30518 -514 20966 -6318 -34515
942 -34515 -4100 43420 40094 -836 -21397 -419 32171 29815 -12380 -34864 -5722 18953
954 18953 -2772 -25212 -799 40172 46274 7613 -33153 -22562 27584 39264 -9774 -43292
966 -43292 -15549 24789 26131 -4263 -18968 11893 53839 37742 -28669 -52365 -6631 33586
978 33586 17866 -20967 -30207 1189 33363 21945 -10727 -4494 30475 28128 -14277 -38653 -20873
991 -20873 11724 21794 -1743 -22671 253 32345 17021 -19189 -14480 19537 25300 -10289
1003 -10289 -48463 -40240 12893 44452 10355 -31662 -14554 28960 30815 -7607 -35558 -21077
1015 -21077 16730 20045 -27677 -55446 -15367 36539 33864 -4220 -23670 -8540 14955 9181
1027 9181 -24645 -33222 -745 16499 -9876 -31213 -10388 21798 27814 3625 -21951 -14044 12773
1040 12773 5012 -32944 -37322 2488 27971 8280 -24243 -24597 15896 48917 21258 -34019 -37915
1053 -37915 6770 25051 -4532 -32752 -20792 19631 39665 10750 -27178 -12215 31065 32929
1065 32929 -7159 -31867 -18779 9244 18026 -150 -11189 13496 37537 17500 -13898 -6903
1077 -6903 19175 21579 -2945 -25032 -15764 17507 27410 -1798 -15598 17197 47100 26764 -15350
1090 -15350 -28593 -539 32839 23247 -23301 -34887 10315 45437 24670 -11598 -12809 17345
1102 17345 35448 11396 -31122 -32518 8659 27628 1544 -19467 -4002 21612 26563 6506
1114 6506 -13799 -5508 16871 6578 -26724 -28793 2779 19006 2463 -16728 -11257 16913 29960
1127 29960 -1063 -35719 -21332 15181 12188 -24109 -39016 -13676 22706 27396 -7688 -33120
1139 -33120 -7584 27260 12519 -29605 -40892 -14880 9793 4370 -23671 -29794 4213 28860
1151 28860 6219 -23853 -17395 4192 3973 -16724 -31471 -19190 8732 11015 -16673 -24135 7113
1164 7113 27265 6269 -24777 -28757 -4587 15300 -2669 -37737 -31750 15390 34199 3240
1176 3240 -26142 -14280 17354 26831 -3240 -38139 -28423 10817 17771 -12237 -25350 -3374 22497
1189 22497 22993 -761 -20794 -8455 14880 5710 -21280 -20266 3452 11846 -832 -9262 1077
1202 1077 21038 22538 -5840 -26207 -7023 16995 3212 -25167 -23574 5747 28458 17510
1214 17510 -16367 -22935 14231 39160 9003 -31911 -30217 2922 21710 5505 -23070 -19411
1226 -19411 19766 37091 6023 -24044 -12735 12149 14130 -6897 -24737 -15087 12091 16825
1238 16825 -5540 -11933 10994 23836 7619 -11608 -12468 1423 9021 -7599 -26199 -10646 22923
1251 22923 22650 -6618 -16453 4099 22715 13675 -14809 -28800 -5145 23300 9891 -23871 -22881
1264 -22881 10885 32669 19788 -9512 -19967 1973 19737 -1031 -28790 -17958 13242 19656
1276 19656 769 -13592 -5040 18071 23402 -449 -17725 -1843 14237 -372 -21260 -16049
1288 -16049 7849 24976 15551 -9073 -11678 14668 24434 -2553 -24711 -10688 14728 17791 -3577
1301 -3577 -21614 -6019 27888 31981 950 -15074 3769 19585 8181 -13836 -20230 -1142
1313 -1142 23225 18486 -5554 -6398 16946 23965 5824 -7741 -1310 13460 16067 -4083 -19763
1326 -19763 -1465 27632 23322 -293 -2065 17270 26255 11026 -15216 -19235 9208 31319 11854
1339 11854 -16512 -8811 21753 32487 14529 -6421 -4151 21322 29171 110 -25995 -9655
1351 -9655 20484 24769 8233 -2689 6080 23331 22094 -1857 -13028 5836 19983 7378 -8317
1364 -8317 -5443 9650 18502 11176 -1042 5779 25835 21399 -8206 -20888 -2576 15269 10885
1377 10885 -5151 -9686 9450 28534 14634 -14359 -12936 15906 26498 5720 -19349 -20746
1389 -20746 2703 20766 7419 -14218 -3814 24029 24154 -3481 -21316 -12772 7950 14108 -4429
1402 -4429 -19642 -4868 15651 9699 -8120 -6216 10020 16720 5057 -15834 -20253 -1209 11250
1415 11250 -4141 -18114 -3248 17919 15840 -2964 -16018 -7735 11687 11004 -13133 -22804 -2372
1428 -2372 13675 3136 -12744 -10159 8530 22355 11143 -14507 -18802 1781 9613 -7590 -18733
1441 -18733 -6533 12529 17079 603 -16131 -6341 17282 16011 -7880 -15364 -1372 7156 -1091
1454 -1091 -13503 -11501 10320 27017 12244 -14094 -13458 8072 12964 -2661 -15887 -10133 9361
1467 9361 16509 -1617 -17073 -1382 23104 19646 -2144 -11883 -3969 6303 3886 -11092 -14675
1480 -14675 5727 20770 7424 -10040 -4546 10648 13954 1659 -13998 -11249 7347 11845 -7057
1493 -7057 -16542 496 17537 13198 -1751 -8217 990 12266 2673 -19222 -19527 4881 16925
1506 16925 2810 -12428 -8469 8022 17488 4731 -15406 -11708 9716 10814 -10647 -21596 -8805
1519 -8805 9717 14316 915 -10834 -2506 11719 3349 -16290 -15680 1525 8146 -1695 -14033
1532 -14033 -13448 4357 17219 4607 -11970 -6369 8746 4934 -11494 -18918 -9594 6634 9100
1545 9100 -6325 -14071 2398 16186 4649 -12647 -11371 2208 8710 -1500 -18350 -16789 6540
1558 6540 18087 1897 -12238 -4212 10009 11139 -3076 -16308 -11960 6334 8026 -8738 -13659
1571 -13659 2866 15170 7571 -5119 -7182 3440 12605 2777 -16311 -14118 5502 12290 54
1584 54 -8461 -2157 10586 14733 1671 -12616 -5899 10097 6469 -10004 -12094 2374 12489 8736
1598 8736 -3384 -6390 8115 18311 4070 -15165 -11171 5882 10428 2 -10507 -6514 10406
1611 10406 17133 2643 -10125 -340 12273 6363 -8351 -12203 -2582 9013 8018 -5842 -8158
1624 -8158 8228 17093 3142 -11607 -8164 4312 8604 -1059 -14663 -11256 6919 12384 -1208
1637 -1208 -7837 2682 11054 5466 -8120 -14542 -5145 8491 4060 -12375 -12152 5049 11642 1261
1651 1261 -9146 -7324 4574 10060 -2608 -19573 -14414 3945 8317 -3206 -8398 -1608 7540
1664 7540 6911 -6125 -14486 -3736 8960 445 -15510 -14249 -399 7593 3268 -7049 -7866 5140
1678 5140 11946 -1822 -16425 -10202 2688 3916 -4514 -9989 -4228 8090 8995 -5664 -11852 486
1692 486 9785 261 -11950 -12004 -1758 6342 1093 -10118 -7228 10640 15137 -126 -12007 -7968
1706 -7968 1998 4065 -2784 -10987 -4416 9182 6761 -7933 -9895 4887 13742 6518 -7115 -12742
1720 -12742 -3116 7252 1158 -10582 -4637 11389 13813 952 -8698 -6165 5351 11028 548
1733 548 -10967 -5745 6137 4009 -5510 -4961 5499 13724 9669 -4014 -10126 143 8800 705
1747 705 -9151 -4312 6946 9216 2306 -5310 -2892 8975 11499 -1837 -9711 -1328 6950 1926
1761 1926 -7095 -8013 2551 14105 10661 -4491 -8061 4720 9547 -1218 -11216 -6810 4692 10080
1775 10080 1206 -11135 -7370 8625 12390 347 -6722 -1614 3897 1086 -8002 -12255 -1298 13031
1789 13031 8960 -5271 -8022 1725 6454 1124 -6000 -5563 2190 6046 -3497 -13318 -5655 8401
1803 8401 9764 1247 -3595 -1253 3708 2139 -7476 -10677 1111 10166 2541 -7930 -6070 3529
1817 3529 8824 4152 -5565 -5799 4886 7907 -4639 -12680 -4198 7448 8913 1672 -4677 -408
1831 -408 8970 7592 -5933 -10404 440 9054 3839 -5289 -7434 1000 9373 6392 -4128 -3012
1845 -3012 8078 8934 -2293 -9959 -6079 3227 7887 3156 -3580 -196 8790 5912 -4501 -5265 2805
1860 2805 7473 3169 -5794 -8654 -77 8214 3439 -3922 816 9421 7242 -2527 -8736 -4855 4807
1875 4807 7639 -1819 -8158 -648 8509 4447 -3843 -4244 2895 8434 4003 -7819 -11652 -203 7456
1890 7456 1342 -6127 -2416 6108 8084 971 -8385 -6962 4118 6553 -4079 -9800 -3276 3409
1904 3409 2476 -2537 -5372 -468 7654 4393 -6963 -9625 -1542 2269 -2516 -6303 -3866 2624 5834
1919 5834 -1015 -8985 -4966 4782 3637 -5939 -9085 -4395 878 246 -5520 -7796 652 8662 2522
1934 2522 -8201 -8128 -805 2195 -2499 -8338 -7649 1447 5738 -2988 -10204 -3616 5922 4933 -3180 -8875
1950 -8875 -6417 1192 2160 -6588 -9593 -411 7215 2906 -5060 -6026 -543 3711 557 -7524 -8262 557
1966 557 3812 -3029 -7513 -2608 4059 5532 -187 -6172 -4374 2327 1681 -6099 -7049 566 4144 1134
1982 1134 -3439 -4039 1169 5998 687 -7431 -5276 3032 3193 -3937 -7218 -2347 4380 6756 -483
1997 -483 -6385 -1519 6026 2571 -5924 -7124 -1057 4332 2604 -4507 -6649 1853 8221 2251 -5942
2012 -5942 -4281 2176 3011 -1746 -6715 -5162 3200 6247 -919 -5394 -431 5096 2374 -2843 -4840
2027 -4840 -2207 2593 1154 -5374 -5937 2091 5770 765 -3990 -2306 2328 3479 -1469 -7268 -4978
2042 -4978 3336 4050 -3788 -5757 -128 5266 3568 -2006 -5528 -1531 4332 776 -6965 -6384 1320
2057 1320 4626 571 -3895 -3860 2280 5777 0 -7400 -4439 2894 1998 -3516 -5916 -2043 3493 4695
2073 4695 -1379 -5359 -439 4445 552 -5690 -4804 413 2919 638 -4326 -4334 2664 6230 87 -5016
2089 -5016 -1836 2569 1545 -2974 -5613 -2757 3588 4074 -2528 -4165 1523 4871 943 -3737 -3842
2104 -3842 460 3832 570 -5710 -4636 3595 6200 -294 -3333 -739 2955 3395 -1692 -5746 -2754
2119 -2754 4553 3832 -2733 -3984 1449 4953 3367 -1208 -3710 602 5173 1008 -5373 -3824 2544
2134 2544 4043 839 -1718 -448 3801 4702 -718 -4848 -713 4529 2313 -2259 -2500 434 4138
2149 4138 3471 -1357 -2940 2943 6054 -36 -5359 -2866 2055 3532 875 -3058 -1745 4250 5181
2164 5181 -1588 -4441 7 3954 2193 -2336 -4501 -1607 3368 3109 -2395 -2899 2636 4462 265
2179 265 -3729 -3378 167 2761 21 -4713 -2368 3494 3051 -1875 -3745 -26 2992 2349 -2284 -5654
2195 -5654 -2335 2485 628 -4305 -3003 1892 3788 705 -3192 -3936 448 3763 -494 -5373 -2641
2210 -2641 2012 1563 -1465 -2959 -613 2687 3545 -1823 -5134 -964 2597 34 -3645 -2648 956 3556
2226 3556 1643 -2922 -3090 2578 4324 -444 -3922 -1588 2064 2252 -512 -3253 -798 4761 4752 -663
2242 -663 -2529 1053 3169 1338 -1391 -1968 974 4773 2971 -1840 -1025 3669 4418 1538 -602 248
2258 248 2513 2809 -80 -3046 922 5914 4555 -631 -832 2363 4313 3259 -629 -1699 2502 5253
2274 5253 2045 -2667 -512 4426 5744 2631 -959 -1230 2675 4476 560 -2761 57 3930 3340
2289 3340 390 -739 674 3538 3564 -474 -2230 1050 2945 397 -1642 -322 1600 2657 1299
2304 1299 -1299 -479 3362 3056 -1952 -3695 9 2524 1643 -914 -2448 -93 3738 2000 -2946 -2222
2320 -2222 2231 3668 186 -3868 -3442 502 3684 1546 -2797 -1737 2354 2389 -801 -2040 -758 1534
2336 1534 2320 -626 -3698 -906 2804 1636 -976 -617 1070 1607 237 -2257 -1860 1768 3022 -326
2352 -326 -3014 -651 2675 2608 508 -1213 -427 2272 2506 -1594 -2891 1003 3414 1403 -1228 -1271 987
2369 987 3510 2701 -1169 -2079 1307 2616 7 -1590 9 2186 2680 1167 -1423 -184 3406 2970
2385 2970 -612 -1518 900 1610 740 -980 -990 1853 4231 1557 -2365 -1812 2397 3044 771 -1269 -1635
2402 -1635 732 2498 561 -2400 -190 3036 2533 -1072 -2161 -442 989 1889 -849 -2133 -182
2417 -182 2102 547 -1449 -371 1079 1243 -370 -2022 -2204 295 1547 -1350 -2705 -243 1527 -64
2433 -64 -1555 -1992 -280 1789 646 -3536 -4032 579 2429 75 -2551 -2564 -31 1970 1053 -2931 -3085
2450 -3085 633 1591 -1062 -2932 -2021 199 1114 100 -2162 -1326 922 277 -2149 -1812 106 366 -400
2467 -400 -1485 -1750 -355 1582 138 -1806 -520 1136 292 -1724 -2019 -693 1077 1059 -1148 -2656
2483 -2656 66 2515 622 -2062 -1812 143 1806 284 -2304 -2805 510 2935 779 -1464 -1095 728
2499 728 1438 709 -1158 -1215 929 1676 -1064 -2301 541 1777 1074 -241 -1060 59 1157 622 -1291
2516 -1291 -1313 1485 1732 -338 -1051 -534 1030 2378 1248 -1463 -883 1370 1265 -791 -972 721 1460
2533 1460 1208 -346 -1733 -2 2808 2069 -1062 -1285 439 929 784 -65 -347 956 1746 272 -1597
2550 -1597 214 2200 1833 -12 -762 -537 710 1170 10 -449 1581 2298 531 -1667 -711 1406 2812
2567 2812 2045 -1010 -1559 149 1600 582 -182 1043 1729 738 -501 -1523 -695 2287 2530 -263 -1754
2584 -1754 -762 362 298 123 357 324 1102 -66 -1986 -1215 1233 1615 -10 -876 -897 -412 611 450 -460
2603 -460 229 1367 -260 -2707 -2039 460 1371 1364 -624 -2489 -1326 1286 730 -464 -337 358 -237 -1276
2621 -1276 -1677 -1168 1106 2320 145 -2435 -1321 494 742 378 285 -324 85 -508 -1700 -1457 1631
2638 1631 2849 973 -995 -1508 -902 592 1246 759 323 1085 -71 -1532 -811 1799 3212 2060 279
2655 279 -1399 -815 991 2020 470 414 1263 896 -289 -370 89 1891 3609 1856 -1455 -1150 699
2672 699 1794 1177 1208 558 439 1000 222 -217 1187 3031 1670 -231 -1152 -398 910 1921 1448 455
2690 455 437 911 -631 -817 1241 2468 1431 -413 -1879 -1700 590 1742 921 -287 570 258 -922
2707 -922 -1473 -625 644 1529 511 -2560 -3117 -643 1042 593 -48 -790 -1153 -1390 -1085 -1597 -1045 692
2725 692 349 -1843 -2871 -1852 -607 500 533 -612 -1560 -1295 -1433 -2132 -878 746 616 -1564 -1946
2742 -1946 -2015 -511 988 131 -1142 -1050 -283 -1084 -1650 -939 136 738 713 -1009 -2669 -589 1593 1757
2760 1757 -74 -841 -571 -317 278 352 112 1544 1771 238 -891 -281 847 1758 1281 600 -571 5
2778 5 717 352 982 2056 2454 803 -565 -257 831 2350 2077 174 -195 956 1438 613 655 1753
2796 1753 1841 1895 764 -855 -478 1527 2678 941 -105 -88 522 821 1371 602 494 1425 417 -951
2814 -951 -442 667 631 636 474 -317 -344 15 -23 -228 429 707 -504 -1705 -1545 -476 874 1033 -802 -1716
2834 -1716 -483 652 -769 -1880 -1036 -164 -349 -349 -1753 -2107 -730 658 -68 -1057 -1573 -1349 -824 -451
2852 -451 -1112 -1643 -769 -536 -1439 -1493 -40 -12 -399 -692 -438 -1050 -997 -794 -1052 -377 320 -90 -961 -1027 -78
2873 -78 576 627 -6 -1467 -855 449 810 -1017 -736 313 1045 849 13 -626 362 1520 1205 -417 -732
2892 -732 156 515 808 535 106 699 1337 894 31 427 832 444 386 473 380 638 704 327 222 1385 1706
2913 1706 699 11 223 1042 824 782 -232 -222 851 1537 343 -619 289 873 823 198 -671 -735 429
2932 429 1124 60 -812 78 549 184 228 -77 -653 -37 -72 -851 -858 -73 138 -345 -192 -52 35 -234 -800
2953 -800 -1162 -631 38 -430 -1657 -734 -388 -32 -22 -625 -1057 -497 112 -255 -1768 -1753 -310 -214 -340 -1116
2973 -1116 -1687 -332 531 -89 -1114 -675 -75 -555 -487 -609 -932 -346 -42 -120 -1124 -304 317 48 -709
2992 -709 -398 -597 -348 -221 -560 -634 596 682 -309 -762 33 614 356 127 -831 -457 292 384 -197 -364 486
3013 486 850 556 -240 -472 -493 498 296 -813 -521 384 545 -115 -256 372 939 956 138 -645 -393 893
3033 893 7 -676 -370 242 718 890 -90 -894 -128 1128 621 -651 -314 215 435 257 -394 -792 511
3052 511 1453 1054 -393 -213 118 -318 -177 -7 -403 79 464 -265 -667 26 872 339 -539 -190 38 -268
3072 -268 -246 -555 -422 819 986 -381 -221 234 499 433 -435 -736 -493 616 415 -483 -522 332 924 292
3092 292 -367 -343 49 529 47 -1246 -1158 85 357 294 239 -297 144 276 -390 -869 -235 1189 576 -985
3112 -985 -1337 -770 94 1278 848 13 -38 254 -556 -1304 -738 512 694 541 -234 -1169 -669 165 612 364
3132 364 493 98 -1106 -1399 -582 126 569 420 -327 -209 78 468 -618 -867 329 657 315 -764 -1533
3151 -1533 -578 1309 1586 -527 -1348 -241 1138 1393 433 -1111 -1199 471 637 -45 -575 584 1088 1253
3169 1253 -44 -1000 -740 948 1714 400 -388 -669 -159 117 940 1271 1343 619 -130 -407 -105 673 671 355
3189 355 1037 854 107 -466 -631 755 2039 1973 249 -1683 -992 583 1322 642 72 231 1212 1275 -273
3208 -273 -1246 117 1240 1282 126 -1309 -1068 478 1348 493 -189 198 267 -534 -166 -186 254 228 -513 -1155
3228 -1155 -721 351 935 118 -727 -514 -280 -184 -238 -695 -290 398 -560 -1608 -1368 192 914 781 -25
3247 -25 -1201 -1415 -560 -494 -779 -7 281 -226 -1204 -924 -877 -239 408 147 -201 -788 -886 -1772 -1451 226 1425
3268 1425 603 -612 -1869 -956 896 1243 160 -1396 -806 164 297 -446 -1196 -184 1475 2064 -102
3285 -102 -1481 -955 756 885 466 -645 -1141 163 914 680 47 240 398 551 261 -216 -439 144 632
3304 632 739 208 -227 -370 567 1086 1678 359 -903 -1304 270 1473 1557 -220 -1594 -295 1842 1527
3322 1527 73 -1059 -162 1571 1526 -258 -2297 -1299 1181 1626 542 -513 -752 402 882 243 -677
3339 -677 -851 -24 11 -413 -491 -439 379 420 -55 -313 -241 -313 -338 -632 -107 -561 -766 -725 -530 99 105 -384 -1019
3362 -1019 -187 759 -62 -1368 -1919 -1166 95 985 -395 -1791 -1758 28 679 -247 -657 -1008 -851 -388
3380 -388 -824 -974 -556 252 -243 -379 -168 136 -65 -607 -1262 -473 491 563 -645 -1703 -502 860 1305
3399 1305 180 -556 -789 252 336 -347 -748 -26 873 134 -314 -230 638 1208 965 -146 -956 -265 781
3418 781 495 217 -330 -456 296 963 912 310 149 86 230 391 633 -204 -606 -4 1407 1509 1255 -763
3438 -763 -1549 216 2270 2367 -253 -1898 -1633 478 1722 1215 -14 159 1063 789 -607 -1064 -175 1051
3456 1051 1673 485 -1365 -1075 445 1038 796 510 74 414 105 -867 -1133 -665 649 1304 600 -408
3474 -408 -1096 -802 473 1265 1045 -122 -1474 -2050 -901 1085 1005 -469 -1960 -820 469 1447 148
3491 148 -1016 -1117 147 498 -747 -797 -417 964 752 -42 -1097 -854 445 966 -87 -111 -47 -275 -943
3510 -943 -840 -164 1158 1723 845 -1038 -1669 -1000 649 1628 1241 209 -1061 -1297 -1093 419 1613 2302
3528 2302 945 -980 -1187 -416 515 402 364 -120 766 1111 -384 -794 -551 743 1621 1278 -313 -1364
3546 -1364 -1062 -72 398 1096 1235 436 -722 -729 195 1371 1597 -50 -1225 -900 643 1742 909 -222
3564 -222 -466 -68 342 520 250 583 778 109 -1016 -1077 424 1525 1469 150 -673 -384 -122 35 -701
3583 -701 -75 1167 1187 410 -1300 -1511 -371 1683 2276 1419 2 -1280 -1319 -908 549 1411 1516 148
3601 148 -1431 -1297 55 1686 948 -27 89 254 10 -573 -1073 -651 1021 1600 723 -431 -401 6 -77
3620 -77 -40 -10 352 207 191 -1270 -834 318 1166 593 -499 -1058 -77 1115 845 -415 -1564 -974 -84
3639 -84 357 973 775 -95 -1073 -735 -660 435 1381 269 -1115 -1158 -581 27 137 -283 -171 743 989 -330
3659 -330 -1766 -1476 60 849 1134 226 -200 -262 -406 -404 -429 1159 1456 48 -1499 -1656 -462 978 1175
3678 1175 285 -739 -460 627 670 -152 -284 -140 279 112 -34 -106 209 286 -126 512 746 864 -210 -461
3698 -461 -236 451 964 479 -550 -489 910 1288 780 -203 -298 -26 661 711 -206 12 189 292 -531 -486 941
3719 941 1716 870 -602 -1446 -314 1122 625 -19 -231 -181 372 643 -74 -376 -112 329 529 -107 -227
3738 -227 -546 -785 -681 -180 871 533 -339 -1049 -740 46 720 -212 -1112 -780 -330 68 -520 -827 -532 233
3758 233 432 -573 -1011 -387 -163 -219 -751 -1270 -844 582 16 -728 -1195 -564 545 247 -610 -1352 -1017
3777 -1017 -201 68 -378 -616 -99 -18 -310 -499 -85 -164 -344 -659 -1022 254 489 -110 -701 -880 210 639
3797 639 273 -683 -639 -288 496 137 -267 -170 201 324 219 12 79 403 589 -218 -386 -171 447 23 -434
3818 -434 52 735 904 415 110 -187 534 681 -8 -366 220 676 802 -498 -576 150 1320 1428 -193
3837 -193 -1033 -139 684 610 -361 -923 -61 1156 1074 -90 -1120 -216 463 680 417 -580 -838 -318 126 -299
3857 -299 -25 -220 -99 -292 19 -215 -282 -509 -275 253 526 189 -727 -1231 43 994 433 -419 -559 -129
3877 -129 424 470 -1055 -1811 -154 1250 1163 -286 -1484 -812 580 949 -392 -1322 -644 446 617 -495
3895 -495 -1192 -716 500 1186 188 -609 -664 -232 34 -258 297 41 199 75 -46 -276 18 -212 -364 259
3915 259 697 -76 -544 -530 -144 874 1151 117 -560 56 973 391 -685 -364 -146 828 909 -262 -855
3934 -855 -270 687 711 16 158 468 917 594 -435 -726 284 761 263 106 106 761 311 -285 -515 263
3954 263 870 891 76 -706 -679 26 475 483 90 355 1065 249 -765 -1065 304 1145 809 15 -186 -378 348
3975 348 186 466 297 617 616 -176 -135 -334 -31 18 138 719 891 318 -902 -935 216 1156 807 -756 -974
3996 -974 -423 921 890 -435 -1230 175 1250 999 -149 -799 -393 286 429 -199 -838 -252 979 652
4014 652 -761 -1005 -672 526 835 2 -698 -1017 -348 -106 -14 -116 81 -113 378 -166 -928 -1151 -614 -195
4034 -195 950 563 -199 -1166 -1362 -18 1067 957 -211 -1305 -658 114 81 -864 -850 595 1405 746 -584
4053 -584 -1696 -655 1068 1087 -428 -710 -357 288 353 -359 -668 184 1329 605 -805 -901 -146 440 225
4072 225 -417 -544 114 522 595 200 188 -143 -315 -138 337 672 465 -308 -705 -618 341 916 484 204 397
4093 397 255 27 -106 -639 405 901 454 -530 -740 11 355 479 259 282 556 309 -567 -1288 -384 1226
4113 1226 1367 -35 -770 -417 408 652 -37 -454 -525 628 92 -775 -1117 -154 536 788 108 -828 -562
4132 -562 348 227 -591 -798 -586 269 176 -348 -872 -569 62 -91 -586 -511 -383 -421 -304 -465 -551 -438 -713
4153 -713 -673 92 638 175 -828 -1354 -584 367 -51 -306 -1199 -768 371 178 -733 -1137 -139 878 563
4172 563 -786 -1407 -810 477 555 -611 -787 -350 373 -45 -1042 -725 -254 832 261 -860 -1160 -337 474
4191 474 289 262 136 -171 100 142 -470 -33 40 58 -253 -199 390 187 -105 38 82 293 316 -254 -274 -2 544
4214 544 324 -243 -156 21 802 432 -673 -557 504 746 128 -640 -300 131 967 448 -419 -520 496
4233 496 778 4 -727 -90 467 519 137 -461 -388 797 796 118 -327 -21 397 309 12 -391 -110 315 399 -279
4255 -279 -157 -55 267 -50 -62 -323 -573 -78 -278 -396 -227 292 -75 -684 -331 83 470 -41 -673 -390
4275 -390 -237 422 -80 -783 -54 581 479 -694 -928 -572 606 775 -312 -998 -444 266 -8 -258 -428
4294 -428 -297 470 593 -252 -826 -287 512 292 -198 -534 -491 122 -139 -423 -76 494 457 -300 -620 -180 30
4315 30 214 152 -131 -104 520 172 -131 -148 319 491 106 -262 -485 254 718 147 -310 390 684 338 -63
4336 -63 -133 26 588 148 -124 -800 246 839 532 -254 -239 115 449 549 -104 41 835 775 -133 -1117 -83
4357 -83 851 1181 685 -377 -439 1 755 234 -78 59 581 56 -233 -181 -111 843 1015 194 -112 -425 -313
4378 -313 -214 80 380 460 289 -194 -370 336 507 270 -149 -374 76 -318 -548 -406 -52 288 688 -282 -845
4399 -845 -854 258 773 -336 -1095 -762 86 279 -129 -763 -308 513 285 -699 -754 -714 211 423 -204 -1028 -593
4420 -593 -92 136 -31 178 46 21 -340 -647 -352 343 226 -467 -560 -334 -18 -24 -176 -145 465 283 -358 -946
4442 -946 -486 505 513 46 -228 -638 13 179 70 -242 -22 463 308 -615 -919 -576 289 735 62 -338 -631
4463 -631 122 -29 -1 -256 205 219 70 -315 -222 663 714 159 -405 -43 234 168 -211 -183 -71 384 424 59
4485 59 -529 308 715 516 149 -381 -278 318 152 41 -87 -59 81 -163 -108 335 497 575 67 -323 -281 -60
4507 -60 -135 -69 223 83 463 -111 -375 -374 210 624 -249 -763 -399 302 125 -505 -216 -184 -119 316 -397 -777
4529 -777 -527 94 572 -194 -787 -216 131 188 114 -17 -186 228 48 -285 -289 -362 -175 -120 -421 -196 -253 135
4551 135 -300 -290 -139 81 -184 -560 -440 -93 271 -211 -664 -500 229 460 25 -582 -423 115 383 -356
4571 -356 -714 -380 385 600 -301 -732 -122 267 286 143 -365 -402 196 319 -251 -270 604 175 71 -176 -9
4592 -9 167 248 -105 -183 226 498 350 168 -246 224 367 581 -71 -204 435 729 117 -324 -49 349 656
4613 656 539 -383 102 530 807 372 -383 234 364 448 148 177 126 360 555 171 -117 147 404 -54 44
4634 44 132 131 624 73 -165 398 476 283 -162 -355 -306 393 582 147 -182 -236 636 423 -172 -189 237 380 249
4657 249 -113 -400 86 230 -57 -580 -456 174 246 -165 -230 -359 193 369 -328 -391 -444 136 49 -393 -365 -229
4679 -229 70 -69 -411 -219 -132 352 -294 -703 -127 -176 -265 -18 -463 -144 5 86 -363 -471 -114 433 463 -41
4701 -41 -93 -178 232 156 -210 -526 353 507 27 -184 -60 284 520 296 -313 -59 528 392 153 47 298
4722 298 222 406 180 -318 -80 498 168 92 229 481 408 376 94 248 634 535 293 233 234 765 653 364 51
4745 51 559 598 737 130 328 252 558 398 -165 -14 214 459 465 260 -305 206 304 -97 -472 -7 354 349 17
4768 17 -18 -258 480 529 -112 45 13 -85 55 -46 -46 -10 193 37 -689 -158 201 193 -278 -146 116 46 143 -337
4792 -337 -708 -389 192 203 -234 -367 -20 175 50 -371 -637 -497 56 -37 -295 -127 84 -159 -59 -224 -389
4813 -389 -111 10 -164 -170 -154 206 -1 93 -120 64 244 173 -486 -511 -182 113 -249 -221 -300 -12 284 109 -172
4836 -172 -12 287 358 65 -281 295 115 881 362 -129 136 434 297 -297 229 210 342 275 -64 -210 -83
4857 -83 203 110 275 261 578 -5 -371 -185 341 526 395 201 9 326 546 615 -304 -25 480 588 84
4878 84 28 29 -67 668 238 -136 -191 125 588 18 -78 -255 170 279 81 -111 324 120 -293 99 77 31 10
4901 10 118 77 4 395 61 -173 -185 -51 275 119 -338 -799 -159 384 323 -1 -573 -205 216 58 -27 -394
4923 -394 -286 360 181 -504 -377 7 -133 37 -69 -276 -88 -44 -116 -480 15 82 -116 -80 -366 -251 49
4944 49 43 -76 -543 -104 81 -412 -466 -250 -80 303 -59 -329 -302 -83 123 -60 -376 -53 285 403 -68 -476
4966 -476 -217 145 28 141 -339 -254 54 -48 -32 -290 -215 -58 105 248 33 317 -228 -454 -130 -109 347
4987 347 174 156 -14 388 288 171 -494 248 459 329 276 -78 -388 119 636 529 -265 16 384 296 70
5008 70 -35 61 232 933 373 -231 339 185 353 261 136 42 317 95 -149 -50 426 194 31 168 406 400
5030 400 55 -232 -359 5 472 504 -227 -410 243 415 -26 -94 -567 -154 799 130 -242 -444 180 376 -72
5051 -72 -35 4 -8 -37 221 -233 -390 -1 166 112 -55 -75 -9 -183 -60 143 6 -127 169 -257 -25 85 52
5074 52 -363 -176 -377 219 547 -532 -435 -34 518 153 -297 -739 -409 76 193 29 -321 -12 394 97
5094 97 -306 -157 -246 142 259 -86 -82 232 180 -113 -129 66 315 74 187 107 19 198 279 -287 146 401 219
5117 219 -204 -187 -36 283 646 102 -60 -181 77 429 135 266 291 55 654 460 104 -104 407 375 69
5138 69 10 107 71 153 466 437 403 216 -36 157 176 332 70 137 -94 42 318 324 -427 -68 396 242 58 -130
5162 -130 -192 -381 296 35 -151 52 235 235 -117 -386 -273 -48 209 15 -379 -528 -256 60 302 -262 -279
5183 -279 -186 -233 102 -202 -535 -163 -192 -142 96 -11 60 -361 -282 -405 247 -174 -493 -175 -504 262 -85 -271
5205 -271 -494 -246 248 162 -384 -428 -114 268 -210 -591 -45 -60 208 -72 -265 -176 -178 325 56 -48 -179 2
5227 2 19 95 -76 -84 579 115 -24 36 396 87 73 140 139 36 -137 -23 -352 -23 247 296 139 -127 0 117
5251 117 175 -37 -143 248 505 449 -95 0 82 45 -222 -34 29 192 283 -216 -329 81 293 -94 169 -261
5273 -261 -19 43 149 -50 -126 -121 134 159 -234 -286 -150 -39 439 -194 -411 11 232 213 -477 -283 -168 551
5295 551 332 206 -373 -219 89 40 142 -102 -143 -210 -383 15 -45 206 -114 -280 -145 126 -79 -624 -349
5316 -349 -75 -76 -115 18 -258 -285 78 -37 -428 -185 27 -8 -33 -197 -452 -274 196 246 -198 -40 36 -92 15
5339 15 -261 -306 33 363 71 -136 -220 -107 -8 -60 -171 -161 23 -248 -214 -405 -269 -359 -73 32 259 39 9
5362 9 -264 -47 2 52 504 255 -84 99 110 -13 126 8 0 393 269 -113 -97 -220 55 4 -48 -90 193 399
5386 399 -96 -478 -56 334 162 -13 107 129 -63 84 -107 44 20 360 -45 71 -318 33 44 246 33
5407 33 67 113 -82 -15 -382 -61 154 350 213 218 -208 -120 125 6 -104 15 238 -5 2 26 8 54 -35 -15 -130
5432 -130 100 18 132 -143 48 86 -65 -178 -383 -101 13 -19 -644 -178 177 -38 5 -214 -348 74 -2 -66
5454 -66 -73 24 -146 61 -22 -222 -270 -3 155 -15 -463 -320 16 -144 -317 -16 -114 -24 319 -270 -161 -431 -22
5477 -22 1 -95 -131 -79 -192 -89 -93 -69 -63 180 -155 -88 150 44 18 -173 229 192 146 107 -77 -317 111 295 346
5502 346 99 -214 -224 -21 158 98 -155 199 158 -151 -113 -24 253 36 -134 -90 135 61 166 196 -373 -62 -67
5525 -67 101 180 -153 277 -160 105 -291 87 76 194 70 55 -235 168 188 48 100 -33 353 -136 -138 131 171
5548 171 -101 127 -225 224 99 118 186 -188 -112 154 -123 46 -273 -94 97 82 181 -213 -123 -322 -48 -84
5570 -84 157 105 -26 101 -195 -142 -89 -210 -344 -20 -26 -36 -411 75 -422 -293 -127 -117 -138 -205 -236 148 166 -44
5594 -44 -87 57 -141 -134 -183 -93 218 90 2 -242 -193 -163 209 13 -367 -163 315 -212 -42 120 19 -120 29
5617 29 79 -88 -98 401 211 -101 -51 -8 440 313 46 -186 265 -16 33 -58 359 8 -51 -182 -119 60 1
5640 1 174 17 83 404 348 -75 -115 72 -47 316 450 -173 47 4 227 -66 -116 144 123 183 -44 -163 -38
5663 -38 286 285 206 240 148 129 235 136 -291 251 160 265 96 -108 -81 -118 76 74 358 113 468 114 -378 118
5687 118 -6 46 -235 189 -2 341 411 -206 -277 100 99 -180 -49 145 -173 302 -40 -37 12 115 -28 -36 132
5710 132 -390 49 -194 -245 -245 -124 180 -129 -251 -322 33 21 67 -75 -152 68 -360 -158 132 -127 -18 -131
5732 -131 -110 -288 247 47 366 -132 151 120 104 -8 -215 215 360 153 -44 136 -36 105 75 229 45
5753 45 20 246 77 44 69 -5 97 392 224 91 127 -74 -70 -494 158 148 -90 548 15 -61 79 192 -221
5776 -221 -10 545 180 250 146 -204 170 -101 9 73 155 444 158 58 -41 13 179 162 151 -3 425 -319
5798 -319 -7 119 219 145 295 -115 -183 -303 -21 364 31 -250 -78 -232 -98 226 -261 -241 31 -140 142
5819 142 -87 -142 22 157 203 69 -132 -225 -71 -32 -22 -112 -83 -37 -344 166 -198 -40 28 14 -301 -73 200
5842 200 -121 42 -6 -288 -370 169 -82 -45 188 216 -116 -351 -179 -9 -78 36 0 -633 -146 176 -91 -389
5864 -389 76 355 148 -317 50 -237 -159 -185 23 -103 117 80 -231 -255 228 230 258 270 -323 79 -104 383 -75
5887 -75 330 -204 -7 20 181 402 -135 55 -29 -6 37 259 -149 252 -153 241 305 177 163 169 -166 109 83
5910 83 -13 220 -130 -168 53 -9 -27 70 -36 -167 61 227 247 119 193 -167 -113 200 280 114 -39 -80 -78 42
5934 42 -96 -19 280 207 184 -255 27 -275 -24 178 -37 73 314 1 -168 139 29 557 266 -96 8
5955 8 -235 190 125 199 0 268 171 51 558 -151 -111 -64 56 229 48 -86 -247 -158 -197 119 153 -7 161
5978 161 253 87 148 22 -87 -187 342 -117 57 10 -111 -261 33 -112 -253 -104 -153 49 -74 170 -156
5999 -156 24 205 -320 11 140 94 64 267 140 84 -171 -31 208 -151 125 -290 -154 -427 42 127 86 -59
6021 -59 -313 425 193 192 198 -157 -324 -63 499 22 292 13 236 41 135 1 33 473 171 -122 -52 360 26
6044 26 150 73 69 40 98 3 -160 -73 -116 307 114 -34 283 54 -47 39 215 -53 148 -94 -142 -88 15 308
6068 308 335 78 -137 168 263 -78 -62 -161 211 196 247 31 -292 -48 201 125 -46 -56 -65 -163 66 72 73 16 -152
6093 -152 -215 101 -190 391 -63 26 -158 -310 64 -42 -62 -42 -100 -105 -62 -66 -13 -24 301 -361 -183 -89 98 -68
6117 -68 -146 -111 23 -249 -93 -171 -89 59 81 -103 36 -165 -96 -79 298 22 -126 -113 -184 -67 -27 143 -216 -235
6141 -235 98 166 222 -368 8 -63 141 234 41 72 -202 147 246 256 357 -23 -93 24 242 -40 -120 -69 329
6164 329 351 -329 110 202 77 196 -12 -53 -35 135 70 419 446 83 91 -129 145 -90 259 -114 -138 45 -4
6187 -4 233 -132 368 -80 -138 98 37 -7 -111 159 227 443 -40 86 161 -74 255 152 -117 81 209 59
6209 59 -146 0 190 22 -240 62 25 -230 70 20 -107 318 11 -116 -273 61 65 -81 -158 -246 38 -120
6231 -120 130 -78 43 210 197 -89 63 -167 71 26 83 -28 -222 -117 -124 -89 -116 -101 -167 -109 -291 134 226 -112
6255 -112 -252 145 -229 9 -28 -198 -215 -45 214 61 -109 -298 -36 200 308 56 4 -163 236 -239 -12
6276 -12 175 61 77 -16 36 -45 261 71 412 64 -121 -255 -15 104 398 22 87 -14 -288 6 -14 -15 69
6299 69 -31 143 229 189 -124 9 193 262 -108 -257 -23 -386 153 217 -97 -77 -252 272 -85 -173 -26 183
6321 183 -63 209 222 73 219 -72 301 96 -264 -85 -117 -361 -255 -219 -23 83 -214 -238 43 193 -335
6342 -335 -236 -232 -107 -172 -212 -145 -198 201 -210 -235 -87 -383 -51 -106 -216 -330 -46 67 -295 -102 -172 -19 -57 -186
6366 -186 -32 74 -138 -102 -60 -27 33 1 -254 -20 -40 -223 -201 5 -82 294 -86 47 -213 -95 -33 -72 -59 -119
6390 -119 216 -53 155 85 119 -184 -137 134 14 182 228 -118 86 311 -79 92 -110 38 218 46 -137
6411 -137 289 281 12 -117 12 126 24 150 232 -31 87 -90 -153 -196 88 181 98 -162 5 -171 -100 186 -115
6434 -115 147 96 483 69 -309 -251 -251 227 -214 -24 -41 30 153 81 91 -101 -55 -86 179 -104 34 159 -36
6457 -36 -271 -21 -69 -106 -106 -131 72 340 135 -455 -74 69 -71 48 -129 -226 10 -60 283 -8 -50 128 -124
6480 -124 -264 -219 -57 -337 244 -70 -283 -246 26 -180 -171 110 95 -466 25 69 -28 6 5 28 -60 156 159 144 -154
6505 -154 21 12 -164 -77 40 47 -12 -35 243 351 -212 60 80 126 -60 46 156 -167 269 140 -315 93 97 122
6529 122 -199 110 230 24 291 99 396 -283 -18 -272 206 165 129 11 122 94 226 288 92 166 66 56
6551 56 189 79 47 66 -105 153 -123 45 -85 24 205 77 83 -34 52 162 41 119 56 327 -236 6 95
6574 95 113 8 -161 -79 94 70 109 153 56 -71 61 -83 -62 -20 -67 -217 -232 -163 -236 -91 -135 54 87 62 67 -30
6600 -30 -212 122 -67 137 212 -154 -84 -218 81 173 175 111 -164 -197 198 -220 -13 104 -203 -56 -132 24 -43
6623 -43 -54 143 126 129 -256 112 29 48 -99 -154 -224 -26 -91 -156 162 -191 -104 -68 70 29 -120 -239 124 194 -58
6648 -58 233 154 -202 176 -143 380 256 158 -155 62 -292 268 -109 152 115 -46 -70 -97 -125 108 230 180 -25
6671 -25 -46 -37 -37 113 -160 163 -69 -19 -123 -80 -198 45 0 88 1 24 -197 39 -345 -36 -327 36 -290 -32
6695 -32 -9 -151 -82 -79 -38 227 -156 -169 84 279 18 -17 -180 -341 -257 -19 190 162 -35 -293 -261 -139 -403 -181
6719 -181 20 -36 -94 -214 -60 -25 23 43 -136 76 208 -199 14 112 81 25 -20 -246 -333 -157 286 27 -108
6742 -108 11 -296 -24 -122 72 -126 -57 -166 77 -158 27 253 201 67 -268 61 -33 -280 -24 77 -151
6763 -151 11 5 -201 -14 102 -68 -25 -114 -85 -432 -283 175 -35 -92 52 228 7 -71 92 95 166 70 144 -66
6787 -66 33 -136 130 214 273 81 -129 266 -79 27 175 15 -25 -65 49 -9 179 -126 -13 19 33 -285 15
6810 15 -213 3 -129 43 14 121 129 224 -97 44 -92 -224 -35 -211 -288 -19 280 66 -14 -43 69 -262 -83
6833 -83 -33 136 -7 -233 -160 -229 -233 -219 167 -194 -130 -69 -230 -196 -147 -43 -213 -206 -57 -76 96 313 -216 223 -54
6858 -54 173 -116 162 -6 94 -39 110 -47 -39 -57 -94 -194 -136 247 -73 -334 -181 151 5 35 -13 -255 -164
6881 -164 236 68 -250 188 18 -309 57 100 170 64 -103 -242 174 -229 -36 5 200 -152 289 -46 -60
6902 -60 -123 -15 88 77 -122 150 -151 -171 -213 9 186 163 131 -17 -97 -95 -141 148 345 -63 28 26 -98 199 70
6927 70 -305 161 -217 125 32 86 -267 43 -432 -7 102 -176 46 -268 -84 179 -17 -45 -32 -28 -166 74
6949 74 -89 51 -342 155 -328 104 -1 -236 15 74 -25 -390 -47 -184 34 213 102 -51 -128 40 -30 -89
6971 -89 -137 -100 25 408 231 -70 -184 -58 419 113 40 -137 41 313 167 51 -326 99 -18 -117 237 41
6993 41 212 60 263 50 -32 -48 91 151 -113 -17 96 -121 -69 67 128 130 -106 -360 70 46 -91 -98 -331 156
7017 156 -25 97 201 -76 162 265 282 222 131 90 293 175 174 -11 172 95 -166 257 -85 4 -42 255 215
7040 215 161 -172 74 -58 147 -125 192 32 35 103 178 367 -104 -111 89 -45 35 -34 -62 85 -227 190 116 31
7064 31 -173 29 75 99 -232 -20 -285 69 147 39 -89 14 -191 51 -27 -300 -186 -96 306 -19 -145 -317
7086 -317 -357 59 39 -78 -229 -186 -79 -106 20 11 -96 -119 -10 252 156 80 -190 -195 -183 351 139 -173 -46 187
7110 187 180 83 -122 32 18 237 144 -547 -272 -168 37 36 -95 -258 -243 -15 306 11 -196 73 -67 -117 26
7133 26 -242 -302 42 133 86 278 -167 -123 -45 57 143 42 -375 -227 -30 123 171 -220 -48 254 220 -47 -174
7156 -174 -95 -262 23 98 40 10 45 51 325 -59 40 102 -128 -24 194 -105 -2 -64 144 88 129 -150 -35 22
7180 22 128 191 -137 -276 224 265 -26 158 166 36 1 -7 -288 -133 -170 74 114 304 71 -139 236 -49 257
7203 257 58 -264 -34 -454 178 157 -107 -175 -167 48 22 91 -248 -369 162 -159 -126 -71 -114 193 153 -71 181
7226 181 -231 -95 -57 148 173 72 45 -148 -47 316 -185 -163 21 20 -78 119 12 -75 -317 81 123 23 -345
7249 -345 93 176 273 47 113 -413 -100 157 -39 -271 -196 -165 325 330 -121 95 219 -61 149 215 -93 -373 386
7272 386 216 320 -7 -149 21 138 310 358 49 -106 -93 253 179 17 -273 -378 -120 254 178 -184 94
7293 94 -2 141 142 -88 -183 249 -71 117 186 -184 313 168 182 86 -116 -117 46 86 -192 256 -206 81 391 217
7317 217 -101 51 -46 204 113 39 -180 -80 -45 218 -55 -144 13 -76 -55 283 105 -291 -104 153 88 -88 -85
7340 -85 138 -258 202 289 297 -316 -100 -9 -105 402 123 -56 227 51 75 -115 -213 -116 21 30 295 65 -228 -162
7364 -162 -5 90 -23 -48 53 -117 23 162 -6 165 -129 67 228 -37 24 214 245 73 -77 -15 46 205
7386 205 -100 -121 -210 -278 286 -135 308 210 -72 -69 320 141 177 5 -191 226 146 211 21 168 -23 83 -51
7409 -51 281 92 -251 -6 129 316 17 -251 -175 -27 241 -12 -128 -155 52 123 43 68 -40 -127 270 225 -3
7432 -3 56 -22 107 -98 115 -340 -292 -29 -131 347 -108 -20 -208 132 124 -211 260 -244 246 428 355 70 -330
7455 -330 58 100 123 222 -244 -94 -254 243 490 -408 94 -159 -286 22 283 -221 -107 17 -51 -349 -7
7476 -7 210 -139 -278 73 57 -94 -237 45 -182 -139 -84 54 -263 -153 188 11 -273 -414 -82 89 -136 -263
7498 -263 -52 8 181 -118 155 -111 -256 -9 184 -132 -381 -110 66 110 49 191 -185 -193 39 71 19 -136
7520 -136 -70 -11 18 225 -177 -91 -122 122 130 262 -52 -196 9 156 48 206 13 49 -5 69 182 86 227 330
7544 330 307 3 279 124 291 97 87 75 156 -130 158 248 251 27 -78 54 45 99 -50 18 -23 3 36 -90 -398
7569 -398 -18 235 -157 -25 -111 -277 -225 111 297 106 -92 -260 -122 -50 184 -137 -204 -46 61 -114 -443
7590 -443 -227 -108 -301 -72 -201 -86 -92 145 -150 -79 2 -419 -122 -127 -302 -115 -9 -73 -183 -93 -67 -286 -382
7613 -382 71 4 -244 -264 -370 -115 125 232 -129 4 -237 185 45 57 139 -151 75 24 8 17 203 12 31
7636 31 -221 137 -334 -187 12 6 -68 155 -46 172 423 -146 -118 338 77 146 322 -199 43 -60 196 -144
7658 -144 138 95 86 374 72 17 -41 -86 -78 96 62 1 -287 -87 102 69 175 -134 7 246 33 -144 212 20
7682 20 -434 152 25 -10 -110 230 -8 83 189 247 -3 35 -350 -118 -17 65 186 -119 63 8 27 -306 78
7705 78 17 33 22 -3 -113 -51 -91 144 -18 -365 96 79 -29 -65 -271 -36 -166 -134 102 -26 42 -33 116 -4
7729 -4 -312 -118 -57 -88 -343 -212 -68 -202 -148 -52 3 -213 -138 30 327 54 -121 -310 -301 -367 82 -19 9 94
7753 94 -270 58 -158 -34 -99 69 110 76 193 98 132 135 -221 106 140 -294 79 -73 -112 -64 13 326 -162 5
7777 5 -187 30 349 123 238 204 87 240 337 -27 89 -242 -174 -55 327 -2 272 88 -112 -126 475 87
7799 87 105 -38 3 -143 256 -46 199 111 158 242 -103 20 -120 136 -91 -5 -12 47 123 245 -240 133 35 334
7823 334 138 264 38 -178 -187 176 -17 141 206 -142 -141 -174 -194 -27 168 193 -381 -155 -2 -165 141 -91 -187
7846 -187 -393 -289 98 6 89 316 -215 82 105 -254 27 -80 -99 94 346 -283 -362 -141 -243 46 -348 -51
7868 -51 -201 -45 -262 -367 -141 123 167 -148 -204 -221 21 -148 -245 -67 488 -115 84 -1 -199 -190 -296 -380 -26
7891 -26 219 -198 131 -70 215 201 -18 -68 -47 -101 88 -181 249 -119 -236 42 7 29 36 -228 -64 -52 11 120
7915 120 -191 -10 129 254 -37 56 -97 227 366 242 -2 -19 61 101 -198 84 1 63 133 390 118 91 327
7938 327 132 -40 12 56 135 311 68 109 98 96 142 62 -51 -28 -155 51 11 57 -43 127 118 -42 161 67 -163
7963 -163 -75 87 -5 -170 -347 16 -177 -147 -177 -129 23 -121 -176 -145 -32 -159 -45 -78 95 -99 -181 -95 -62 -72
7987 -72 -106 40 -203 -114 151 -429 -19 -216 -37 -16 -100 -130 -125 -34 211 -177 -21 -110 -10 -99 75 -133 122 -132
8011 -132 410 -144 -148 5 -18 -45 -181 205 122 -167 121 84 52 47 -115 107 151 25 -140 -22 206 148 -8 -17
8035 -17 -28 66 111 -16 122 -246 89 167 72 12 -147 38 64 14 238 53 -301 109 89 207 264 136 -68 102
8059 102 -2 299 506 408 -192 99 -157 22 -62 317 -32 15 -142 83 159 -12 284 189 -16 196 -8 226
8081 226 234 -46 -180 -247 38 114 -140 95 29 -471 -192 62 62 -252 -113 109 65 -18 -12 -104 -52 -147 29 -176 129
8106 129 224 64 8 -56 -102 -282 -163 22 -228 -61 -68 190 44 -261 -32 -57 -61 -47 -257 -109 -27 140 -47 301
8130 301 -55 56 59 -61 15 86 -3 116 149 91 46 251 -118 85 -138 159 -82 -46 248 -57 -263 -49 22
8153 22 234 -14 -316 74 -125 -320 117 172 49 136 35 122 170 -24 -6 326 57 -202 42 -30 -89 204 90
8176 90 215 129 -37 284 -28 -13 54 1 65 -48 26 -77 240 119 81
8191H1
##END NTUPLES=NMR FID
##END=
