##TITLE=1H_TG-2294
 CDCl3, 8 sc, 
 31.7.2020
##JCAMPDX= 6.0         $$ Bruker NMR JCAMP-DX V2.0
##DATA TYPE= NMR FID
##DATA CLASS= NTUPLES
##ORIGIN= UXNMR, Bruker Analytische Messtechnik GmbH
##OWNER= root
$$ XWIN-NMR		Version 3.5
$$ Fri Jul 31 10:23:17 2020 Russian Standard Time (UT+4h)  she@DPX200
##.OBSERVE FREQUENCY= 200.1314999998
##.OBSERVE NUCLEUS= ^1H
##.DELAY= (6, 6)
##.ACQUISITION MODE= SIMULTANEOUS
##.ACQUISITION SCHEME= undefined
##.AVERAGES= 8
##.DIGITISER RES= 18
##SPECTROMETER/DATA SYSTEM= spect
##.PULSE SEQUENCE= zg30
##.SOLVENT NAME= CDCl3
##.SHIFT REFERENCE= (INTERNAL, CDCl3, 0, 15.7039)
##AUDIT TRAIL= $$ (NUMBER, WHEN, WHO, WHERE, WHAT)
$$ ##TITLE= Audit trail, XWIN-NMR		Version 3.5
$$ ##JCAMPDX= 5.01
$$ ##ORIGIN= Bruker BioSpin GmbH
$$ ##OWNER= she
$$ F:/spectra/data/she/nmr/H-F/1/audita.txt
$$ ##AUDIT TRAIL=  $$ (NUMBER, WHEN, WHO, WHERE, WHAT)
(   1,<2020-07-31 10:21:57.42 +0400>,<she>,<DPX200>,
      <created by zg, POWCHK disabled, PULCHK disabled
       configuration hash MD5:
       00 E9 B6 7A A2 85 ED C7 34 08 36 98 17 FE 4E 26
       data hash MD5: 16K
       6E 66 1E DA 3C 93 94 C2 9A 7B 4C 27 89 F6 5D F1>)
$$ ##END=
$$ 
$$ hash MD5
$$ C0 99 DE DC E9 37 3F 68 EA 37 F9 A0 4E 79 4A 51
##$RELAX= 
##$RELAX= 
##$RELAX= 
##$RELAX= 
##$RELAX= 
##$RELAX= 
$$ Bruker specific parameters
$$ --------------------------
##$DU= <F:/spectra>
##$EXPNO= 1
##$NAME= <H-F>
##$PROCNO= 1
##$TYPE= <nmr>
##$USER= <she>
##$AMP= (0..31)
100 100 100 100 100 100 100 100 100 100 100 100 100 100 100 100 100 100 
100 100 100 100 100 100 100 100 100 100 100 100 100 100 
##$AQSEQ= 0
##$AQ_mod= 1
##$AUNM= <au_zg>
##$AUTOPOS= <>
##$BF1= 200.13
##$BF2= 200.13
##$BF3= 200.13
##$BF4= 200.13
##$BF5= 200.13
##$BF6= 200.13
##$BF7= 200.13
##$BF8= 200.13
##$BYTORDA= 1
##$CFDGTYP= 0
##$CFRGTYP= 5
##$CHEMSTR= <none>
##$CNST= (0..31)
1 1 145 1 1 1 1 1 1 1 1 1 1 1 1 1 1 1 1 1 1 1 1 1 1 1 1 1 1 1 1 1 
##$CPDPRG= <>
##$CPDPRG1= <>
##$CPDPRG2= <>
##$CPDPRG3= <>
##$CPDPRG4= <mlev>
##$CPDPRG5= <mlev>
##$CPDPRG6= <mlev>
##$CPDPRG7= <mlev>
##$CPDPRG8= <mlev>
##$CPDPRGB= <>
##$CPDPRGT= <>
##$D= (0..31)
0 1.2 0 0 0 0 0 0 0 0.06 0 0.03 0 0 0 0 0.0002 0 0 0 0 0 0 0 0 0 0 0 0 
0 0 0 
##$DATE= 1596176516
##$DBL= (0..7)
120 120 120 120 120 120 120 120 
##$DBP= (0..7)
150 150 150 150 150 150 150 150 
##$DBP07= 0
##$DBPNAM0= <>
##$DBPNAM1= <>
##$DBPNAM2= <>
##$DBPNAM3= <>
##$DBPNAM4= <>
##$DBPNAM5= <>
##$DBPNAM6= <>
##$DBPNAM7= <>
##$DBPOAL= (0..7)
0.5 0.5 0.5 0.5 0.5 0.5 0.5 0.5 
##$DBPOFFS= (0..7)
0 0 0 0 0 0 0 0 
##$DE= 6
##$DECBNUC= <off>
##$DECIM= 24
##$DECNUC= <off>
##$DECSTAT= 4
##$DIGMOD= 1
##$DIGTYP= 9
##$DL= (0..7)
0 120 120 120 120 120 120 120 
##$DP= (0..7)
150 150 150 150 150 150 150 150 
##$DP07= 0
##$DPNAME0= <>
##$DPNAME1= <>
##$DPNAME2= <>
##$DPNAME3= <>
##$DPNAME4= <>
##$DPNAME5= <>
##$DPNAME6= <>
##$DPNAME7= <>
##$DPOAL= (0..7)
0.5 0.5 0.5 0.5 0.5 0.5 0.5 0.5 
##$DPOFFS= (0..7)
0 0 0 0 0 0 0 0 
##$DQDMODE= 0
##$DR= 18
##$DS= 0
##$DSLIST= <SSSSSSSSSSSSSSS>
$$ [...]
##$SUBNAM2= <"">
##$SUBNAM3= <"">
##$SUBNAM4= <"">
##$SUBNAM5= <"">
##$SUBNAM6= <"">
##$SUBNAM7= <"">
##$SUBNAM8= <"">
##$SUBNAM9= <"">
##$SW= 24.9337058888022
##$SWIBOX= (0..15)
0 0 2 0 0 0 0 0 0 0 0 0 0 0 0 0 
##$SW_h= 4990.01996007984
##$TD= 16384
##$TD0= 1
##$TE= 0
##$TE2= 300
##$TE3= 300
##$TEG= 300
##$TL= (0..7)
0 120 120 120 120 120 120 120 
##$TP= (0..7)
150 150 150 150 150 150 150 150 
##$TP07= 0
##$TPNAME0= <>
##$TPNAME1= <>
##$TPNAME2= <>
##$TPNAME3= <>
##$TPNAME4= <>
##$TPNAME5= <>
##$TPNAME6= <>
##$TPNAME7= <>
##$TPOAL= (0..7)
0.5 0.5 0.5 0.5 0.5 0.5 0.5 0.5 
##$TPOFFS= (0..7)
0 0 0 0 0 0 0 0 
##$TUNHIN= 0
##$TUNHOUT= 0
##$TUNXOUT= 0
##$USERA1= <user>
##$USERA2= <user>
##$USERA3= <user>
##$USERA4= <user>
##$USERA5= <user>
##$V9= 5
##$VALIST= <valist>
##$VCLIST= <CCCCCCCCCCCCCCC>
##$VD= 0
##$VDLIST= <DDDDDDDDDDDDDDD>
##$VPLIST= <PPPPPPPPPPPPPPP>
##$VTLIST= <TTTTTTTTTTTTTTT>
##$WBST= 1024
##$WBSW= 4
##$XGAIN= (0..3)
0 0 0 0 
##$XL= 0
##$YL= 0
##$YMAX_a= 368353
##$YMIN_a= -168822
##$ZGOPTNS= <>
##$ZL1= 120
##$ZL2= 120
##$ZL3= 120
##$ZL4= 120
##$ABSF1= 10
##$ABSF2= 0
##$ABSG= 5
##$ABSL= 3
##$ALPHA= 0
##$AQORDER= 0
##$ASSFAC= 0
##$ASSFACI= 0
##$ASSFACX= 0
##$ASSWID= 0
##$AUNMP= <proc_1d>
##$AZFE= 0.1
##$AZFW= 0.1
##$BCFW= 1
##$BC_mod= 2
##$BYTORDP= 1
##$COROFFS= 0
##$CY= 11.3945322036743
##$DATMOD= 1
##$DC= 2
##$DFILT= <>
##$DTYPP= 0
##$F1P= 16.9975609425685
##$F2P= -3.02152046262296
##$FCOR= 0.5
##$FTSIZE= 0
##$FT_mod= 4
##$GAMMA= 1
##$GB= 0.15
##$INTBC= 1
##$INTSCL= 1
##$ISEN= 128
##$LB= 0.24
##$LEV0= 0
##$LPBIN= 0
##$MAXI= 10000
##$MC2= 0
##$MEAN= 0
##$ME_mod= 0
##$MI= 1.114404
##$NCOEF= 0
##$NC_proc= 0
##$NLEV= 6
##$NOISF1= 3.799351
##$NOISF2= 2.8
##$NSP= 1
##$NTH_PI= 0
##$NZP= 0
##$OFFSET= 15.70392
##$PC= 1
##$PHC0= -9793.752
##$PHC1= 14.80092
##$PH_mod= 1
##$PKNL= yes
##$PPARMOD= 0
##$PSCAL= 0
##$PSIGN= 0
##$REVERSE= no
##$SF= 200.130013532006
##$SI= 16384
##$SIGF1= 3
##$SIGF2= 2
##$SINO= 400
##$SIOLD= 16384
##$SREGLST= <1H.CDCl3>
##$SSB= 0
##$STSI= 0
##$STSR= 0
##$SW_p= 3612.71676300578
##$SYMM= 0
##$S_DEV= 0
##$TDeff= 0
##$TDoff= 0
##$TI= <>
##$TILT= no
##$TM1= 0
##$TM2= 0
##$TOPLEV= 0
##$USERP1= <user>
##$USERP2= <user>
##$USERP3= <user>
##$USERP4= <user>
##$USERP5= <user>
##$WDW= 1
##$XDIM= 8192
##$YMAX_p= 0
##$YMIN_p= 0
$$ End of Bruker specific parameters
$$ ---------------------------------
##NTUPLES= NMR FID
##VAR_NAME=  TIME,          FID/REAL,        FID/IMAG
##SYMBOL=    X,             R,               I
##VAR_TYPE=  INDEPENDENT,   DEPENDENT,       DEPENDENT
##VAR_FORM=  AFFN,          ASDF,            ASDF
##VAR_DIM=   8192,          8192,            8192
##UNITS=     SECONDS,       ARBITRARY UNITS, ARBITRARY UNITS
##FACTOR=    0.0002004,     1,               1
##FIRST=     0,             0,               0
##LAST=      1.6414764,     0,               0
##MIN=       0,             -168822,         0
##MAX=       1.6414764,     368353,          0
$$ Real data points
##PAGE= N=1
##DATA TABLE= (X++(R..R)), XYDATA
$$ [...]
2541a977N892n12o202N8L826o0j004p49k031J935M841k425n345K182N687p02k696
2558G18j492j256J935L780k276m662K975M398k067k460M23J068R83K303k949m374
2574b953L029L585k999k135L266J430n07q6k501j710M488K711n574k708L947J869
2590C152j814m48p82N13M389N93p221j756N563K410l282j884p91P39L871O37n275
2607a386p34N547J72m336r19J196M60J752m71l728Q80N110j274m682K021L271
2623B879k087j661j332j348L312M482k513o078K646M059j392j432j35r13J732
2638B19K165m343m218M664N212k392k650J84j69J712J889k904l487M290L096m516
2654a248k397K472J925N77R81k456k198L197J639m691n77M304R58k448q20j003
$$ plain form
2541 -1977 3915 3403 -2799 -2741 1085 1025 21 -728 -2759 -824 4017 1592 -3753 -1571 4116 3414 718
2558 718 -774 -2030 -95 3685 1409 -3253 -278 4120 2053 -407 16 1084 2067 4370 1421 -2953
2574 -2953 76 3661 662 -1473 1793 3223 2716 2630 129 -1581 2907 5618 44 -2664 1283 3152
2590 3152 1338 890 108 621 5010 5603 -1618 -3374 2189 4599 1317 -567 -1358 -619 3252 3889 -1386
2607 -1386 -2120 3427 3599 -737 -1656 -460 0 1752 1281 -2447 -1567 3543 2269 -2413 -392 2879
2623 2879 792 -869 -2201 -3549 -237 4245 1732 -4346 -1700 2359 967 -465 -600 -1513 219
2638 219 2384 -1959 -6177 -1513 3699 1307 -1343 -1159 -1328 384 2273 -631 -4118 172 3268 -1248
2654 -1248 -3645 -1173 752 1329 2310 -146 -2344 853 2492 -2199 -2776 1528 2486 38 -782 -1785
2670a785J321M765M42o506p77M908N51k712o29j6J129K876o12m891P65N810n54
2687D085l915l97J064n51J522k96k992K361M543l407m430K353L568N7j124k061
2703C80k550K086M152k996l156L303L146k445j763m83l61K282K184l748l534L680
2719A77K317l036l08K045p8P10K92m335j908N080K237l950k057K062L56O26Q70
2736A100k374j188M200K83n387n80L354O22p28Q8j537n67M169k78m455O48M190
2753A560j114l332J8j61J377L484j094m862J377M907j350l393J227J079j47P78
2769C54j920l093L674M644k360l986J465K179o88J48r13k418K848L358l684l160
2785c552L720K814j515k76n35j635K001J693l548j664M632J235l528r60J914O38
$$ plain form
2670 -1785 -464 4301 4743 -1763 -2540 2368 2919 207 -422 -438 691 3567 2955 -1936 -1171 4639 4085
2687 4085 170 -227 837 286 1808 1512 -1480 881 5424 2017 -2413 -60 3508 3565 2441 380
2703 380 -2170 -84 4068 1072 -2084 1219 4365 1920 157 -326 -687 1595 3779 31 -3503 177
2719 177 2494 -542 -850 1195 1117 1827 2119 -2216 -4124 956 3193 -757 -2814 -752 -396 230 1100
2736 1100 -1274 -2462 1738 2021 -3366 -3946 -592 30 -698 -610 -2147 -2714 1455 1177 -3278 -2630 1560
2753 1560 446 -2886 -2868 -3029 -1652 1832 738 -4124 -2747 2160 810 -2583 -1356 -277 -424 354
2769 354 -1566 -4659 -985 3659 1299 -2687 -1222 957 269 417 -496 -2914 -66 3292 -392 -3552
2785 -3552 168 2982 1467 1191 656 -979 1022 2715 -833 -2497 2135 3370 -158 -1118 796 1434
2801A434J581P41m680j352M466J408m054o55K520J35P84J77l287j54N116k85m875
2818i80m07K449P3n12M96j484P59L222j084m981J442M145j249k418N9q04P61K870
2836B357j903l266K597L805k452l465J544P07J67J023k064k836L746K994l217
2851b63l045K822J969q94n30k464j520L484L038l907k657L314J631j279k0n34
2867h55j408J956J406l234j436L406R89k709O69R26k65J157K38l110n2M412j000
2884A090m395K84K625P18Q34p08k988J148M258o12m801O88K432m4m88j69j564
2901a692Q20M229j313m086J495K809j406j378L34o96P48K427j935l034L579L038
2917C939l171k155J691M50N0P56k890j623M225L073m064k644K625J613j78k76
$$ plain form
2801 1434 3015 3756 -924 -2276 2190 3598 -456 -1111 1409 1544 2328 2505 -782 -936 4180 3895 -980
2818 -980 -1387 1062 1135 623 1119 -365 394 3616 2532 -2449 -1007 3138 1889 -529 -470 -1274 -513 2357
2836 2357 454 -2812 -215 3590 1138 -2327 -783 -76 91 1114 -950 -3786 -40 2954 -263
2851 -263 -3308 -486 1483 589 59 -2405 -3925 -441 2597 -1310 -3967 -653 978 -301 -321 -855
2867 -855 -2263 -307 1099 -2135 -3571 -165 824 -1885 -1216 -290 -555 602 840 -2270 -2322 2090 1090
2884 1090 -3305 -3021 -396 322 1156 448 -2540 -1392 2866 2254 -2547 -1859 573 529 41 -128 -1692
2901 -1692 -872 3357 2044 -2042 -547 2262 856 -522 -188 -884 -136 2291 356 -2678 901 3939
2917 3939 768 -1387 304 754 804 1560 -1330 -2953 1272 4345 281 -2363 262 1875 1697 1421
2933A421k372j767L958J719l939j615L000J362j579L29m60j310K179P27l674l82
2949b403L833k94k855K26J478O9J196l72l855Q98L937j017l958P59K064M7Q50
2966F03p15k491J296L607j672l842J246K425q83l50n44j590J696L506k212l346
2982c266K546K370j940j269J13j37Q58J969k434k644L746K524l030j647J600L03
2998c38L24P35k546j829L725K218l588r29K894K59n57j70k126k93L528P14m328
3015b307o40L255Q11j162L18q74j64K229j05l677K00L281n73j814O74P57m73J389
3033A125m87k383R15L216j678k921J238J596j103R90l09k042J937K718k428l371
3049b987K090K211r92l98n34j413J844K866k733k866K731K272j481p42p14j035
$$ plain form
2933 1421 -951 -2718 1240 2959 -980 -2595 405 1767 188 517 57 -1253 926 1653 -2021 -2403
2949 -2403 1430 1136 -1719 -1493 -15 54 1250 878 -2977 -2079 1858 841 -3117 -2358 -294 -247 603
2966 603 -112 -2603 -1307 2300 628 -3214 -1968 457 -426 -776 -1320 -2910 -1214 2292 80 -3266
2982 -3266 -720 1650 -290 -1559 -1446 -1583 -725 1244 -1190 -3834 -88 2436 -594 -2241 -641 -338
2998 -338 -14 721 -1825 -3654 71 2289 -1299 -2228 666 925 368 198 -1928 -2221 1307 2021 -2307
3015 -2307 -2947 308 1119 -43 275 -599 -763 1466 1361 -2316 -2116 1165 592 -1222 -548 209 -264 1125
3033 1125 638 -1745 -830 2386 708 -2213 -975 621 -482 508 199 -1843 94 2812 384 -2987
3049 -2987 -897 1314 322 -76 -610 -2023 -179 2687 -46 -2912 -181 2091 610 -132 -846 -1881
3065a881J301K394j852k275L000J621k835m48J170j2N64O43k379j315L327J014
3081B037l570j53K671O37m10k07k022o34L407K60l846J51L280o11r49N51j019
3098d27L37K381l74l963J057L140j403j907O37O17N13J855j260l029J492L079
3114B745j948k656J421J198j76P79j248k241J888L625j983k625J273R96j116J16
3130D8j75j348K106K189k697j817K367P02j523QM50j035J044J130k686j609M138
3147A292J176k860k56P69k37N32K49k884K83L803J7l445o07K652K18q8R9k526
3165a813K37L155k73l216J89K406n17q1M47j108r8K010o35k935J343L013j587
3182E37k096J296K06O0J373r38k279K546K522k716k119P44O34K82J516r01k014
$$ plain form
3065 -1881 -580 1814 -38 -2313 687 2308 -527 -975 195 183 747 1390 -989 -2304 1023 2037
3081 2037 -1533 -1686 985 1622 1212 1005 -1017 -1651 1756 2016 -1830 -1679 1601 990 41 592 -427
3098 -427 -90 2291 1917 -2046 -989 2151 748 -1159 -522 95 608 2463 1203 -1826 -334 2745
3114 2745 797 -1859 -438 760 584 1363 115 -2126 -238 3387 1404 -1221 52 1048 -68 48
3130 48 -127 -1475 631 2820 123 -1694 673 1375 -148 -140 310 -725 319 1449 -1237 -2846 1292
3147 1292 2468 -392 -648 121 -116 416 665 -2219 -1936 1867 1884 -1561 -2168 484 702 614 713 -1813
3165 -1813 -1576 1579 1306 -1910 -1721 685 168 87 534 -574 -672 1338 703 -2232 -889 2124 537
3182 537 -1559 -263 -57 3 1376 438 -1841 705 3227 511 -1608 -864 -230 52 1568 667 -1347
3199a347K338J574k594j467K361J001j116O8j011j442K292J937k475j124K671
3214A666Q10k596j67Kj65K110O75l409n38L149N24k271j43J041J93P50k52l064
3232a685k21L826M7k798nJ391j11O69J33k568L34K618n38k831P15K017o93p49
3250d49P51r03Q53J624j636k618J919J739k061j336J539K92O20J025k563j694
3266b898K603K320k748j525J456O78NK20j696j307L300K085l150j600J420O89
3282a48n51Q40j354j009K094J266k506o45K337J17j103P75m79r00J104K76k199
3299b085O60K866q77k054N26J132k24P23m31k328O49L121q71k853R52K044m58
3316D92J20l8j949O87K855j720k553J502J814j119J39R2p15L78J847j638k071
$$ plain form
3199 -1347 991 2565 -29 -1496 865 1866 750 818 -193 -1635 657 2594 119 -1005 1666
3214 1666 2476 -120 -287 -285 -450 1660 2335 -1074 -1612 1537 2061 -210 -353 688 881 1631 1379 -1685
3232 -1685 -1906 1920 1967 -831 -836 555 444 1113 1246 -1322 -988 1630 1092 -1739 -1024 993 300 -449
3250 -449 302 -601 252 1876 240 -2378 -459 1280 -781 -2117 -578 -286 334 1359 -1204 -2898
3266 -2898 -295 2025 -723 -2248 -792 -114 -109 111 -1585 -2892 408 2493 -657 -2257 -837 -148
3282 -148 -699 141 -1213 -2222 -128 1138 -1368 -2013 324 441 -662 113 -366 -1266 -162 114 -2085
3299 -2085 -1425 1441 564 -1490 -964 168 -56 667 236 -2092 -1443 1678 807 -2046 -1094 950 492
3316 492 612 574 -1375 -688 2167 447 -2106 -604 1210 91 230 322 -393 -15 1832 194 -1877
3333a877K161J488j986p66J145k55P36J025j693j713K813J195k646j089J637K
3349A77J71J007j936j554K905J388k512j75J281j48q40M41q04m74J908R6k300
3366a369j25K772m04j803N02M3l13J441l92k643M46L179q19j851R79L50l61Q69
3384E01q30j815J243K551j672k288R59J445k52J033j161j483J448K034j831k334
3400b452J563J367q89O87k55j871J219J977j578j068J702M42k004j54J109l18
3416e23O69J077j745p54K215J98k223J20J555m20K2j34j216j39K737l7k489O80
3434d07J751j04j071j92r16M93K236j94l027K0K898qr15P6j244l79K260L21k647
3453a049L63K167j304q14J422Q4p85J052m98k010J187J921j388j565J645L81o20
$$ plain form
3333 -1877 284 1772 -214 -980 165 -90 646 1671 -22 -1735 1078 2273 -373 -1462 175 177
3349 177 348 1355 -581 -2135 770 2158 -354 -529 752 604 -236 205 -599 -1073 835 931 -1369
3366 -1369 -1494 1278 874 -929 -427 -384 -697 744 352 -2291 -1845 1334 515 -1336 -357 -7 -368 501
3384 501 -329 -2144 -901 1650 -22 -2310 -1351 94 -158 875 -286 -1769 -321 1713 -118 -2452
3400 -2452 -889 478 -411 276 21 -1850 -631 1346 -232 -1300 402 844 -1160 -1314 -205 -523
3416 -523 146 1223 -522 -1276 939 1137 -1086 -966 589 169 191 57 -1159 -1298 1439 1402 -1087 -407
3434 -407 1344 1240 169 -23 -939 -446 1790 1596 -1431 -1411 1487 1479 564 640 -604 -983 1277 1598 -1049
3453 -1049 -686 1481 177 -637 785 869 84 1136 638 -1372 -185 1736 348 -1217 428 809 189
3470A89M77o77j234J605J843j418k219J499N99j112M34M45n83J119R36k632j236
3487a965K384J159j382o62P5n94R68J271j785n93K500K3j767m21J037o25L29O57
3505F09j562L6K268j90k595M08J985l27j81l14j396K28K581l31k221O8J631k43
3523D54r6M96r92n47J638r34j267J181K032j391j444Q66m11J090J027j156j156
3540f10J217P12j946r89J648P68K9K23r13j232J693Q95k035n12J787P22j191o90
3558d24n57R8K212J473k612j343J670Q9j340N62O09k45P43J19j899m25K390j79
3576I41j439K64Q42m87K45K5j838P84K271o85j958J324P83r40j54K10j078L75
3594e15J965p39k335J460J377r28q64M22j31Q93J129j645k201J299K061j047j56
$$ plain form
3470 189 666 -11 -1245 360 2203 785 -1434 65 664 -448 -14 431 -152 967 1903 -729 -1965
3487 -1965 419 1578 196 -466 -391 -985 -17 1254 -531 -1124 1376 1399 -368 -789 248 -377 -48 609
3505 609 -953 -917 1351 1161 -1434 -1026 959 632 451 137 -1259 -1031 1550 1219 -1002 -934 697 454
3523 454 358 854 -138 -685 953 19 -1248 -67 1965 574 -870 -4 -415 675 1702 546 -610
3540 -610 607 1319 -627 -1616 32 800 829 1052 139 -1093 600 1495 -540 -1052 735 1457 266 -424
3558 -424 -981 -883 1329 2802 190 -1153 517 606 -734 -172 437 192 935 1054 -845 -1270 1120 941
3576 941 -498 -234 608 121 366 391 -1447 -663 1608 923 -1035 289 1072 132 -22 188 -890 -515
3594 -515 1450 711 -1624 -164 1213 285 -579 -157 -288 605 1734 89 -2112 -813 1248 201 45
3611D5M00n30L76O45j141r48J734J115j490j024P52M53l25P38p94j92J521K02
3629A537k402p64K107M41m91L04o56q91J773J8j755L96K139k78j615j92L28J03
3647A02J061k33j983M18K507m32j974L16M42J01R34j71j671J64J915q63j479J070
3665B24P64o39J34n04o04P96J433j754j507J763J400q92m01l57r72J095J375j218
3683A36j285J234N84j408n48J407k6J72P84j718r81K269P26k247p34J513L30j47
3701F1K68j386m95K101J005k216M6R50n41o12M23K70l71J384k82j938L30K107
3719A104k75j580M47N9k66J309j90j922L62K116l81j225N13Q7o84R37k94j216
3737a099P16J849j421j143J284Q39n46m0p5j248J180J246j436j341J137Q03o65
$$ plain form
3611 45 445 -85 291 936 -205 -1153 581 1696 206 -818 -66 387 62 800 6 -186 1335 1537
3629 1537 -865 -1629 478 919 428 732 76 -815 958 976 -779 -383 1756 1478 -137 -329 -1 102
3647 102 1163 930 -1053 -635 1872 1440 -534 -218 224 325 1259 1088 -583 -419 1496 633 -846 224
3665 224 988 349 483 -21 -625 171 1604 -150 -1657 106 1506 614 213 -144 -1116 -21 1354 136
3683 136 -1149 85 669 -739 -1287 120 94 266 1050 -668 -1649 620 1346 -901 -1635 -122 208 61
3701 61 329 -1057 -1552 549 1554 -662 -616 334 -207 -819 -396 -126 -497 887 605 -1333 -1003 1104
3719 1104 829 -751 -304 -245 -511 798 608 -1314 -952 1164 783 -442 71 158 -526 411 117 -1099
3737 -1099 -383 1466 45 -1098 186 1025 479 439 364 -884 296 1542 106 -1235 -98 705 40
3754D0K70N42j014P32L43j008r95J879P45j700m77R14l56J083L28j949m82J669
3772E64P44j766n0N68k79L58P39j237l96J440J67j555o9J406o98j12o9l81K41
3791c85J203k97j921O46J618q10p82K53n1K60R23q20j429J316J366j246p14P90
3809h0N7j34M83p02j189J202J568j549q56R08L56m49N27n52p74J352R79j951o65
3828a469J607L14r21K90J4o38R64Q61j510p76J861j04p30k97P12n21N12L36j317
3847h12K64J839n20k142P08J028j70J38j9j378N47K102q54j657K21J542m79k42
3865A16O4o85k14J722n89j633J240J104m87j018M91k96p9J315j060r82R74J104
3883A087r31r03J214jo08Q86p98j065J620M41j765M1J169L14n58K90q48m26J383
$$ plain form
3754 40 310 852 -162 570 913 -95 -1090 789 1534 -166 -643 271 -85 998 1326 -623 -1105 564
3772 564 1308 -458 -508 60 -219 139 878 -359 -755 685 852 -703 -772 634 -64 -176 -245 -626 -385
3791 -385 818 521 -1400 -754 864 54 -728 -475 -526 -266 657 -163 -1592 -276 1090 -156 -870 -80
3809 -80 -23 -157 326 -376 -1565 -363 1205 -344 -1200 -292 64 -385 142 -410 -1184 168 1147 -804 -1469
3828 -1469 138 452 -469 -179 -165 -803 161 1022 -488 -1264 597 493 -237 -534 178 -343 169 505 -812
3847 -812 -548 1291 771 -1371 -663 365 195 333 314 -1064 -517 1585 731 -926 -705 837 358 116
3865 116 180 -505 -719 1003 414 -1219 21 1125 638 -380 111 -185 -264 1051 -9 -991 -17 1087
3883 1087 156 -747 467 466 -142 744 -54 -1119 501 942 -823 -782 387 701 143 433 -415 -841 542
3902E42N56j789l07J082M82p65n5K20m21R05L18j385m09J430J8j063L18M41m1
3921G7M91j71j610Q7K385l50j627J57J087k30K45l47j039K7K458l74j940L51P45
3940D22n9k12L7o06M94J255p63j447J088Q27q82m56J135q40l69J092q74p38J534
3959F38P87j457o08J300l53m83O06o82j85J411K38j794l32J424J25l96Q2p64m49
3978h92J746J82j723m75J689J11n27L29j017k26J240M85j750K19J193l12n37Q9
3996a76J76m49M82M67q49J69J418j391j151J118P89n31k05J38j055N88J502q80
4014A60j553J560Q87p91k85j72p76Q79J227j122j141J170P28j104Q8M32m77Q74
4032E84L09j330o79J579M59j212L82M12k91J41N07q31o37J138N69j538L78J164
$$ plain form
3902 542 1098 -691 -998 84 566 -199 -254 -34 -455 450 768 -617 -1026 404 422 -641 -323 118 77
3921 77 568 397 -1213 -1126 1259 909 -718 -561 526 296 541 194 -845 -818 1640 1266 -674 -323 422
3940 422 363 151 188 -418 76 1331 568 -879 209 1036 154 -302 833 -7 -376 716 -158 -896 638
3959 638 1425 -32 -640 660 307 -176 430 -252 -437 974 1212 -582 -914 510 635 239 321 -443 -892
3978 -892 854 1036 -687 -1162 527 638 111 440 -577 -803 437 922 -828 -609 584 272 -265 -176
3996 -176 0 -449 33 500 -349 -180 1238 -153 -1304 -186 603 72 -133 5 -1050 -462 1040 160
4014 160 -1393 167 1054 263 -22 -194 -970 -91 1136 14 -1127 43 771 -333 -245 187 -290 584
4032 584 893 -437 -1116 463 922 -290 92 504 213 354 861 30 -607 531 1100 -438 -60 1104
4050A104m62p67L22n5l76J253N1j490J62J048l32l07M33n02p9J076L7j761K02
4069d43J473k61j011N22M22n91K15k21p95J101J454j164j429L93O92m3K1m83o90
4088h38R06J171j251j035P46J033n32L55n10j096Q32J268j362n70J138L64p75
4105a56j67L61j031J018O90j144k83J055j48q29M76O74q28J39J01n22K01J202
4123H09l49j735N44J185r5k11J00n87q4J494p00j389N72J176k19o10J54m59j74
4142e78J682l12j590N58J006m95r62O43K57k35R66q81n71N30Q97n78p36R62k37
4161C26l74O07n03r42J065Q83r84m98R13j04m24N35m73r6L52P09j457l37J713
4180I11m9j086J56J54j3J01M07j494L62J453j64j160K06K78j4K74j19j022N2J752
$$ plain form
4050 1104 642 -125 197 142 -234 1019 1070 -420 -258 790 458 151 584 82 3 1079 1116 -645 -443
4069 -443 1030 769 -242 280 702 111 326 105 -690 411 1865 701 -728 -335 357 314 335 -148 -838
4088 -838 68 1239 -12 -1047 -301 732 200 555 45 -1051 -219 1049 -313 -883 255 619 -156
4105 -156 -323 38 -993 25 715 -429 -712 343 195 -634 -158 516 -312 -173 -72 -594 -393 809
4123 809 460 -1275 -731 454 359 148 248 -339 -423 1071 371 -1018 -446 730 511 -99 55 -404 -578
4142 -578 1104 792 -798 -240 766 271 -691 -48 209 -26 940 59 -512 18 915 337 -399 563 326
4161 326 -48 559 56 -886 179 1062 78 -420 493 389 -35 500 27 -69 283 992 -465 -802 911
4180 911 862 -224 -68 86 73 174 581 -913 -551 902 738 -422 -216 62 48 322 203 -819 -767 985
4200I85p34j040K32N77l5J68n4p88K5J446l95j421M96R22q12K70L60p25p7J187
4220E87m33j096P01P83p93o15Q64o78J38J212p91r52J364L05r70n39O85M28j07
4239I3K27p95o04J380O17j560k59J120J62l87j23j83k05Q76L33j312pJ118Mp67
4259b72J18J94l79J044J00j728M10J110o8j227O36J29k04M94P8j169M34J204l60
4278E44j296O94L58o94L54L52m83J61J004j149o02Q89P36r74R7R7k73J81P66p94
4298c2q47J050P54j021o20O10m7J40N70q24q10J329P42j104m27O37l04L75L38
4317E09r84n47J679j1j005k12P89k14k83M10j07n00M69N66j271K27R84n58k53
4336c12L08Oj53L86o6r01N06J099p60r43Q94M77m94M44j10r02K77J045p60r70
$$ plain form
4200 985 251 -789 -557 20 -15 153 99 -689 -664 782 387 -1034 -538 384 -428 -158 202 -523 -600 587
4220 587 154 -942 -241 542 -251 -866 -2 -680 -542 670 -121 -1073 291 596 -374 -913 -228 200 93
4239 93 320 -475 -1079 301 918 -642 -901 219 381 -6 -129 -312 -517 359 692 -620 -627 491 495 -272
4259 -272 -154 40 -339 705 805 -923 -513 597 529 -698 -62 67 -137 357 435 -734 -300 904 544
4278 544 -752 -58 300 -394 -40 312 -171 -10 994 -155 -757 132 868 -106 -9 88 -185 -4 762 -32
4298 -32 -879 171 925 -96 -716 -106 -153 -13 557 -267 -1077 252 994 -110 -537 100 -204 171 509
4317 509 -475 -1022 657 646 -359 -571 218 4 -279 131 24 -476 -7 559 -712 -485 499 -59 -312
4336 -312 -4 2 -151 235 169 -732 -226 873 113 -830 64 541 47 491 381 -521 -244 801 41 -929
4356i29J299K28l47j93j19k84N55R64r72j073J044Q9l12qJm98M55J016j047j000
4376a131J339M79r46K53k8l07P4P63p02m05J198j40r12M2O16j72j18M21j003j41
4396h20R41L69j355L56J213o28m08M52p84L31Q88J5j360K38J199q02l33N06j68
4415a50J72O81m86j313P03J138l78p98N32K0j84L59P2r86O61P44r09l70O78J59
4435C45k81J85l5p07N49R02j267k06J194j0p38P0J35m83P44N14j077m57J023J21
4455E21p34K44K36m32O39o4q38J97R17q0r32K26O35l64j56M79q73J23J219o98
4475B65j338J137M87k32q4O0o79J51O18J93j441M45J255q68n71P28k35j27Q19
4494E83o08p47N79O38l78l93N71q6m18J50J68o51P25L87r27l66J027n06l7K15
$$ plain form
4356 -929 370 598 251 58 -61 -345 210 1174 202 -871 173 262 -50 -58 -57 -555 -100 916 -131 -1131
4376 -1131 208 687 -259 -6 -34 -341 -267 496 -206 -611 587 447 -465 -423 193 21 -97 324 -679 -820
4396 -820 121 490 -865 -509 704 76 -332 120 -664 -333 555 570 -790 -552 647 -155 -488 18 -150
4415 -150 22 703 217 -1096 -393 745 367 -431 101 121 -63 296 368 -618 43 787 -122 -492 186 345
4435 345 64 249 214 -493 56 958 -309 -515 679 669 -69 1 136 -347 397 911 -166 -623 400 521
4455 521 -213 31 267 -165 474 410 -428 -231 686 606 -326 -100 535 171 15 494 -379 -256 963 265
4475 265 -1073 64 551 319 235 295 -384 -233 385 578 -863 -418 837 -31 -602 126 -109 -236 583
4494 583 -25 -772 -193 445 67 -326 245 159 -259 -109 59 -592 133 520 -407 -773 254 -252 -289 -74
4514g4k97k64R09M47j368l49J108K66n65K15l49j75L74P74r79k99P83R6o76O5
4534c58J53j31M55j7l90j13Q42j74p33L66L70l55j88N22p45j10J111Q1j282P88
4554I2J09l34L35J00k94K57J86n74o73Q44N48n46k29M56m02l9N18l84r79J129
4574A20R08j362j59N66l32L54J93j94p22R67K29q47j51N81k03m25P32k27n99P59
4594A88L74q84Q0Q08m27l54L1Jk85P86P1p02k23R10j76n69M02K80p97N02K11q03
4616e76J66J201o87q34N35Q8j85K84r4o78J80J254p75n59Q64j56j13j27J07m93
4636e98J82Q80n52o16P30M01p04j23O39o55M14L21m08q34J004O24j239o0O69l88
4656c13L62K87o85l14P67K65q30R7O76k72j53K02k86k22P00J21o58j85R30n68
$$ plain form
4514 -74 -371 -635 274 721 -647 -996 112 378 -187 28 -321 -496 -122 652 -327 -626 157 253 -423 -358
4534 -358 -205 -336 119 102 -288 -401 441 267 -466 -100 270 -85 -273 249 -496 -606 505 586 -696 92
4554 92 201 -133 202 302 8 265 451 -123 -796 48 596 50 -179 277 -125 -164 354 -30 -1009 120
4574 120 1028 -334 -493 73 -259 95 288 94 -628 339 568 -279 -430 151 -52 -477 255 28 -571 188
4594 188 562 -322 -242 566 139 -215 -184 -183 -468 318 389 -313 -536 374 198 -371 31 311 -486 16 227 -576
4616 -576 -410 791 104 -730 -195 -107 -292 -8 -102 -780 -600 654 -121 -680 184 28 -85 -212 -105 -598
4636 -598 -416 464 -88 -704 26 427 -277 -400 239 -416 -2 319 -89 -923 81 705 -534 -594 75 -313
4656 -313 49 336 -349 -663 104 369 -461 -364 312 40 -113 89 -197 -419 281 402 -256 -441 489 -79
4676g9l35O02m89J20M38K8q54K73Q83k89m76L00m06K93P40k96j050P15P63n96
4696B85p53P35j50l08K90K64q34N09N59r24k74Q87J28p31L97%m74N0Q25o17p19
4717h55J319M9p55l33M81j33J03O15p21o34J221J14q66oN35l04K34J63p00J12
4737c61O78K35j146K61O86p07L76j31l64q9Q77k09o59Q3Q58o18k23O83p90J5Q76
4758C31j36r21N63L67j47m20M60p2j65K36j41p15P27N84m55p07O38P8l64J39J21
4779Ap20N44Q97q28p28Q44J82m36M16r7o80M26Q88q66m21J051m56l98K04M74n72
4800b75L71N35q93jP30P3j135L67O03l57pL25o08o3P69K0q13L52Nm9M6L28l31
4823hj09M63j52q00Q1J028n87j77N43l87n7P21l60p64P09M51o04k57O08k38l31
$$ plain form
4676 -79 -414 188 -301 -181 257 285 -569 -296 587 298 -178 122 -284 9 749 453 -597 118 881 285
4696 285 -468 267 117 -191 99 363 -471 38 597 -327 -601 286 414 -317 80 80 -394 -344 481 -136 -855
4717 -855 464 513 -242 -575 -94 -227 -124 491 -230 -864 357 471 -395 -401 134 -170 64 227 -473 -361
4737 -361 317 552 -594 -333 353 -354 22 -109 -473 -562 315 106 -553 -470 388 -230 -453 230 -560 -545 331
4758 331 195 -726 -163 204 57 -363 97 25 -140 96 -45 -760 -33 551 96 -611 27 105 -259 -120 1
4779 1 -719 -175 722 -106 -834 10 192 -244 172 75 -605 -179 709 -157 -578 473 17 -381 -177 297 -275
4800 -275 96 631 -262 -263 467 540 -595 -228 375 18 11 336 -272 -335 434 454 -359 -7 -2 -51 -5 323 -8
4823 -8 -117 346 194 -606 -525 503 -84 -261 282 -105 -162 559 199 -565 144 595 -9 -266 342 104 -227
4844b27O91m26m54N85J66n80j78M61K11j53mKo23N96M65p49j93Q44k08l40L29
4865B15l04n58Q13M32p47m86J115k79m89J73K74k92L64j77l58J03N24j22p04N80
4885G7M00m51j05K38m89Q6N65k00o38N74L85n04O6K47o72j08J137m54p88Q12J41
4906C19m05J91p6k19k88J060k90o58K57O63p97N4N40o47M8N31o59l44P85L35n12
4927a12j95P67m67k00M22l17l62O19M69q60k79N71L87k23o7j01o07P22M09q11
4947b35j64N83k13k43L42Jm77N67Q8p92M78J03k31k25M10L45n16K06K5l74K77
4968d5N14n06o84O79K10m57K50J10o60O40N00p80n42O49M98m89O0J48m51J31Q25
4989F00m73p34P80J34m26L3M48o87P9P33m27j30J65J4n70L95L65k50l26K10l77
$$ plain form
4844 -227 464 38 -416 169 335 -245 -423 38 249 96 92 94 -529 67 532 -217 -410 434 226 -114 215
4865 215 -89 -647 166 598 -149 -635 480 201 -288 -115 159 -133 231 54 -304 -201 323 201 -503 77
4885 77 477 26 -79 159 -330 -244 321 121 -517 57 442 -62 4 251 -421 -529 608 154 -634 178 319
4906 319 -86 105 29 -190 -478 582 292 -366 -109 554 -243 -189 351 -296 -248 283 -376 -720 65 400 -112
4927 -112 -307 460 -7 -207 215 -102 -464 155 624 -236 -515 56 443 220 153 52 -555 167 576 -235
4947 -235 -399 184 -29 -272 70 71 -406 161 249 -543 -65 38 -193 -418 -8 337 -179 27 52 -322 -45
4968 -45 469 -37 -721 -42 168 -289 -39 71 -589 51 551 -229 -771 -122 376 -113 -53 95 -356 -225 600
4989 600 127 -607 173 307 -119 -86 362 -325 -246 487 60 -70 95 109 -461 -66 299 49 -277 -67 -444
5010d44L39L09J03m69l17P72m04N3L67l22l65R73k57p57L00O00p68K47J63m46
5030c23J00L36L56p51n5O67n2o46M16M8k62L72k00k98J47O45o49j85L04L63p63
5051d30L59L40p85N72L68m68l56L51K80m37L21k62k50K10O28n23n60Q91j03l02
5071a56J88Q5m88J30M39l43o21Q98J14o18J82L25n40M42J82l90N7N64l87n62L63
5092a36M73m11K75j89m34J19N67o3n40J07N32l52k07K87k00q3M37k33l89K90M35
5113B85m72q4Q61p82r0L98j56j97K75j3l46K4N29j52k54J43k39p7M34J36m96o9
5135c42O04l99j13M66k04l26N56J61m97l57P40l32j37K45q1n27N15L11n17J0N62
5156C38k40l08J83J41m77L68K71m58J8O04k59o41O71k3k79Noj11Q6K87J47o24
$$ plain form
5010 -444 -105 204 307 -162 -479 293 -111 -58 309 -13 -378 595 338 -419 -119 481 -287 -40 123 -323
5030 -323 -223 113 469 -282 -337 330 278 -368 48 96 -166 206 6 -292 -145 500 -149 -334 -30 333 -430
5051 -430 -71 269 -516 56 424 -44 -400 -49 231 -206 115 -147 -397 -187 441 -82 -642 249 146 -156
5071 -156 32 117 -371 -241 198 -145 -766 132 246 -372 -190 135 -405 37 219 -171 -114 450 63 -499 -136
5092 -136 337 -74 201 12 -422 -303 264 201 -339 -232 300 -52 -259 28 -172 -255 182 -51 -440 -150 285
5113 285 -187 -271 590 -192 -282 116 -40 -237 38 25 -321 -297 232 80 -174 -31 -270 -347 87 223 -273 -342
5135 -342 262 -137 -250 216 12 -314 242 403 -94 -451 289 -43 -180 65 -16 -543 -28 283 -234 -224 338
5156 338 98 -210 -27 114 -363 5 276 -182 -164 440 181 -460 211 188 -91 -86 -92 -203 -117 170 317 -307
5178c07L78K10l54L08q1l24Q8M06k98k28M41P0m88l16Q10k45j37K35k60k51M81
5199A38J78l83j55M61l55q5K52m62K00j36P38q60L70L05m06k25L13K18l01L71
5219A76Lp78M83K73j38n18M19J80m88N55k9m17J95J10L2m39L68M48n01N9J72m10
5241b45k31Q70k41p87P65N7n69J81L24k71p1M93j39m24M40J16l40QN62q34K97
5262c9K61k51p30P80M70n34p3K15l50R4K22K11l13J17M39o24j69M51l17oM41k69
5284B6j83K90m8k72Q2N10n05j34K36r9q8M14Q8q28M34L43j45m46N48k08j73N11
5306C53M6o19J72Q63o06j01j42K5j33M37J87n64k49N69k68n42Q06J23o22M02J40
5327B77n97j09N19j33j74N37j77p16M68J18j13j56L46j55j12M73M2n72N8K34o7
$$ plain form
5178 -307 71 281 -73 235 154 -170 -82 324 26 -202 239 309 -179 -495 315 70 -67 168 -92 -343 138
5199 138 316 -67 -222 239 -116 -201 51 -411 -211 -347 391 -469 -99 206 -200 -425 -112 106 -195 176
5219 176 179 -599 -116 157 19 -499 -80 100 -388 167 138 -279 -84 26 58 -381 -13 435 -66 -7 165 -245
5241 -245 -476 394 153 -634 131 188 -381 -200 124 -147 -218 275 136 -288 152 268 -72 -64 498 -336 -39
5262 -39 222 -29 -759 21 491 -43 -116 99 -251 -157 65 276 -37 80 519 -105 -274 177 -140 -146 295 26
5284 26 -157 133 85 -187 -105 405 -100 -234 2 -97 -185 229 317 -511 -77 266 121 -325 223 15 -158 353
5306 353 399 -220 -48 815 209 108 -34 -9 -142 295 482 -82 -331 238 -30 -572 234 357 -265 137 277
5327 277 -320 -429 90 -43 -217 320 143 -573 -105 13 -100 -256 90 -65 -177 296 338 -234 -176 58 -9
5348iJ16p6k10j52M37O9k88J92k31l2K24K7j50k41P87l87m66M12J82j98l14L61
5370E3p9l18O90j47n96J54O65m93o4K76k8l05K58Lk59k72N84j09K03J39j78k02
5392b5J41K00r9K6R4l14k68K10J62m56K67K14k25N09p4o13j67P13k37K21l48J90
5414A21J03k56M46k19n55M20j05j6n0J61J1k45M54j41j52N36l90m71M49J87k63
5435B5R8K34m46m7L15j35k33j00M07j62K5J12k90N9K8k5l84N83L7k01KK62J5m48
5459b69M92J01l14j67N85o77R0L08j54m64O32j3l28k9J22J09k94N25J18l37K7
5480F3j87k55K57N30m10j13K45j74k91M58J89o01M29K84n39l61O41j76m1K15L21
5501D84n99jL78j22k38J43j21L7L63k36j08K54P1n92K80N28j40o44K52J04l26
$$ plain form
5348 -9 107 31 -179 -331 106 175 -113 79 -152 -184 40 67 -83 -324 463 76 -390 22 204 6 -308 53
5370 53 -26 -344 346 199 -397 -243 422 -71 -135 141 113 -192 66 69 -190 -462 122 13 216 355 177 -25
5392 -25 116 316 217 243 337 23 -245 -35 127 -329 -62 152 -73 436 362 -251 -418 295 58 279 -69 121
5414 121 224 -32 414 195 -360 60 -45 -61 -111 50 61 -184 270 129 -23 513 123 -348 101 288 25
5435 25 123 357 -89 -136 179 44 -189 -289 118 -44 -19 93 -197 -138 -110 -135 -519 64 101 -100 -98 164 179 -269
5459 -269 223 324 10 -157 428 -249 -159 149 -5 -469 163 150 -178 -207 -85 24 -270 255 373 36 63
5480 63 -124 -379 -122 408 -2 -115 130 -44 -335 123 312 -289 140 424 -115 -476 165 -11 -52 163 484
5501 484 -115 -116 262 140 -98 45 -76 -39 324 88 -20 234 305 -287 -7 521 381 -263 -11 93 -233
5522b33K03K75k66k06N25P9q50M73L56n04M36l35O8j09L83R7q19M30N71n51j04
5543h1J68j40rM27l39j76K36K69o69K34O41n01m11O06k17m81O37j95j30k07L96
5564E8Q4m20Q3K04l08N87M0o78L64L53o0n59K88O5j83N8K36m86K55m1l0j36J78
5587d8L51n21L12j38k15M02K36j95k07o5L10l42K1M47p08K03K64r6o1J37k3j66
5609a02M2k6k71O95o0k95l92M67K57m47K4O5m1q3M12m30l5N88j59k75J17Q0j99
5632f8l57N58J29p04N82P2k64M8j75J96j51L10j25j00M7K36l61O3M89j20l77M40
5654C68n10Q4K78J38m33L18J3lj26j03J26l10PJ47M1l51P61l16l88O95on53p1
5677a94L04J04j5j20R2m17L02K84l81j8R7N7j20N54m25k48K75J00m23N37j15l28
$$ plain form
5522 -233 -30 245 -21 -227 298 377 -473 0 356 -148 288 -47 21 -88 295 392 -427 3 574 23 -81
5543 -81 87 -53 -62 365 26 -150 86 355 -314 -80 561 60 -351 255 38 -443 194 -1 -131 -338 58
5564 58 142 -278 -195 9 -299 288 328 -350 14 367 307 -252 36 101 -82 -24 212 -274 -19 -60 -90 -226 -48
5587 -48 303 -218 94 -44 -259 143 379 184 -23 -88 222 -120 -99 348 -360 -157 107 11 -50 87 64 -102
5609 -102 -60 -86 -357 338 278 -17 -409 58 315 -132 -108 -43 -84 -167 245 -185 -220 368 209 -66 51 131 -68
5632 -68 -425 133 262 -442 140 212 -52 -4 -179 17 -134 176 51 -49 -2 234 -127 -64 425 305 -72 368
5654 368 -142 -58 220 358 -75 243 256 253 127 24 150 -160 -153 -6 35 -316 445 129 -259 436 430 -123 -194
5677 -194 110 214 199 79 171 -246 56 340 -41 -59 38 95 -25 529 104 -144 131 231 -192 345 230 -98
5699i8KK53km73M60J30n27OK31O1j87K18n2k23K54J27k80K17N9j66m12L77J51
5722A26j97J71p9j30k45N91j71l52N3q2K24J12j9m84N82K54l61j68J59L7n44O64
5744A41k8j08j96L29m87J68L79j88j97L41J06n61J33L50j55k19L35J21n21J40
5764a17J64l24J53lP0l28N77M9k19lK47m39K55J93m16j09L55R0l46L36P7m51L27
5787A38J43l51J26n4p1L25l07M05k93k59L22r3j23L44j61k48K44J5k98M1L81m11
5809a85J48L49o3o33O3O73k97K6J91j14m23L74J1m09M43P7j97j45M97j92m04M08
5831A98j42l50K17K97k58j91L28L1k52K78l33J20j88L89n41O53k88J14r5k23J75
5852f1j83J59L96m44j6J57n3p3j8Q1j17K94J20k92k88N50k66l75O31N1o48N10
$$ plain form
5699 -98 -96 157 155 -318 142 272 -255 -249 -18 43 -144 74 22 -201 53 180 -100 117 176 10 -402 -25 126
5722 126 -71 100 21 -109 -354 237 66 -286 -233 -315 -91 21 2 -482 100 354 -7 -175 -16 21 -523 141
5744 141 113 5 -191 138 -349 -181 198 10 -187 154 260 -301 -168 182 27 -192 143 264 -257 -117
5764 -117 47 -277 -124 -127 -57 -385 192 241 22 19 266 -173 82 275 -141 -250 105 195 -151 185 262 -189 138
5787 138 281 -70 56 2 -69 256 -51 354 61 -198 124 31 -92 252 91 -157 87 102 -196 -155 226 -185
5809 -185 -37 312 249 -384 -321 352 55 81 272 158 -265 109 120 -289 154 231 34 -111 386 194 -210 198
5831 198 56 -294 -77 220 -38 -229 99 130 -122 156 -177 -57 -245 144 -397 256 -32 82 -13 -236 -61
5852 -61 -244 -85 311 -133 -149 8 -45 -118 -136 -55 -172 122 242 -50 -338 212 -54 -429 202 253 -395 115
5874A15j59k77m9N95j88m66O04lo48L36J82j21K17j32k2k24L27J31m73J54J37
5895C6l7P7J19j56o21P23K27o08J89N02k00k30K92L2m13J13J76j63N6k80L9J47
5917B0o0L8j30J88N8j86J9K89m49mN84m4l41l4K68k33J92j29J2j79R8K79k07J44
5941A93m9m02K14L25k69q8NL72m51J90J70j25m3K39j65n74O29j83R2q2n2j42p0
5964b66M35k88j29K50m4k37j2J59k91L35o0j83K15J4q5j7N2J79j05j80L91l23
5986a90R9K04q9l33K86oJ71l67J55l8l81P81J1k22j19J96j9k96K17Q7n28M98J89
6009C06l98l0M44l09r9M08n30J38P7J8k52K11L43k34j35J03j5j0LK6m51J14P62
6032D90n19Q2O6n0K4J37j08j31j90N27m4l80P1J38k00L23j93j14j02L34k98K66
$$ plain form
5874 115 -44 -321 -370 225 37 -429 175 172 -476 -140 42 -79 138 6 -16 -240 87 218 -255 -101 36
5895 36 -1 76 195 39 -582 141 368 -240 -51 451 251 21 313 345 -68 45 221 58 114 -166 -127 20
5917 20 -40 -2 -132 56 114 -72 -53 236 -213 -217 367 323 -18 -52 216 -17 175 46 58 -121 -23 256 49 193
5941 193 144 -258 -44 281 12 -76 -71 301 -150 40 210 85 42 281 116 -458 171 -12 80 -2 -54 -196 -266
5964 -266 169 -119 -248 2 -42 -279 -291 -132 -423 -88 -148 -331 -116 -102 -187 -204 -152 27 -78 -258 133 -190
5986 -190 -91 113 24 -309 -23 -29 142 -225 -70 -108 -489 292 303 81 -38 158 139 -157 60 147 -381 117 306
6009 306 -92 -122 322 13 -86 322 -208 -70 7 25 -227 -16 327 93 -42 61 46 36 39 65 -386 -272 490
6032 490 -29 53 119 69 93 230 122 -9 -199 328 284 -96 -25 113 -87 236 43 -71 -173 161 -137 129
6054A29j10P6l75K13K32j25j1K87pl78J72nl60L33Kk57R4K27j04k60K86J36m25
6077b30M67nk79l4J47k86K1K42J04n92L58J92k42lL77j58l91P62m03R8J56p3l97
6100a69oM14l8k21P4LM9m15N70k19k39L97k29j78O6J69k38N1K45j48J28N5K56
6123C77n52K10L16m80J8j6M00p31M52j83r6K16M62l18o7J54k69J8K31n24N80k19
6145b1J14r2j4K96k71N8J31m3k22JL98l40R4o2K9O0j03Q6k23J73o5P4m27O55k60
6170B6l11N52j44j46j01L28l23J29j6L4j39L83j89j57J62K07k21j1j01J42Q6n7
6192A33Pm84L70k15Q4k15M01k03LJ05J34l02L1J92j61L34j45r1j57M16m96J33
6214a26K41r0k21O1L88k11r7k2K60J17j89J2l07L2L37k07j23K35J51m42J74K2
$$ plain form
6054 129 19 95 -280 -67 165 40 29 316 309 -69 103 98 -262 71 73 -184 -90 137 33 -227 59 195 -230
6077 -230 237 232 -47 -81 66 -220 -199 43 147 -445 -87 105 -137 -140 237 79 -312 450 47 145 301 228 -169
6100 -169 -175 239 201 -20 54 57 106 -309 261 42 -197 200 -29 -207 -141 28 -210 -159 86 -62 66 121 377
6123 377 -175 35 351 -129 -111 -127 273 -458 -6 -189 -285 -69 393 75 8 162 -107 -89 142 -382 198 -21
6145 -21 93 1 -13 283 12 70 201 158 -64 -63 335 -5 89 27 56 116 13 99 -124 49 -16 58 -369 286 26
6170 26 -285 267 123 -23 -124 204 -119 10 -6 28 -111 272 83 -74 88 295 74 63 -38 104 190 133
6192 133 140 -344 26 -189 -105 -320 81 -122 -119 -14 120 -182 -151 41 -120 214 69 -22 -179 237 -259 -126
6214 -126 115 25 -196 -135 253 42 -55 -77 183 300 111 123 -184 -152 185 -22 -145 90 241 -201 -27 -5
6236ej25j17j1K92l03L69n1q4m3p7jk8J72O5r8J42n38R1M4N64j71r4l0j44K59
6261G8k44K75j98J1K14j85l88L24K20p0j86O54o37J61N3j15k00N73k31q4l1K76
6283B70k19k01K00j1j10K70m35mN15j27l34PO30k31n51L95k36O2K91J42j17k54
6305d8J54O9k26J06O0o7j06R8j31M6K59n9l06J21Ol01L05q6J5p8M78l62j04K50
6329I3J77n28K81j17J6R1p9j08J08J86k10o2J53k2L05n78M55n83M79L1l99L70
6351E9k1n4k26j2M18p0o97P11m9J4k37M7K0j54L76K62p21K33M7k36M1K92o6j22
6375a45lk4R4J44j17k10J69K6o7j37J64K63k08J41l19o8J36K57k17N4Q9M9J1p7
6399EJ2r0J4K85l34j9J05L65k53k48J84J71l03J90q5j2J63J43k82o5L88o00J31
$$ plain form
6236 -5 -130 -247 -258 34 -269 100 49 -35 -78 -155 -156 -184 -12 53 -45 97 -441 -350 -306 258 87 -7 -37 -181 78
6261 78 -166 109 -89 -78 136 -49 -437 -113 107 37 -149 505 -132 29 82 -33 -233 340 109 25 -6 270
6283 270 51 -150 50 39 -71 199 -236 -240 275 148 -186 -179 451 220 -331 64 -172 -110 181 323 206 -48
6305 -48 106 175 -51 55 115 48 -58 40 -91 -45 214 155 -151 -30 -24 -325 -20 -106 -91 -169 309 -53 -157 93
6329 93 270 -258 23 -94 -78 13 -66 -174 -66 120 -90 -152 1 -21 284 -294 161 -422 57 88 -311 59
6351 59 38 -16 -242 -254 164 94 -603 108 59 73 -164 -117 -97 -251 125 387 -334 -101 -54 -290 -249 43 -23 -145
6375 -145 -148 -172 -78 66 -51 -261 -92 -66 -133 -270 -106 157 -51 90 -229 -297 -161 96 -121 -67 22 71 82 5
6399 5 17 -73 -59 226 -108 -127 -22 343 90 -158 26 197 -106 84 -1 -13 150 293 11 -54 334 -266 -135
6422a35J79j30OR2J06j55KJ42k23m6K35m5j50K07l7k3M6j51K21l90K94m05M07
6445D7J4N4K5L93k62n70M4L94J06q6L4L0l06J66j09r1n8L32p1j0Q2r1lJ34o5k59
6471a26k08L52j52M1P7Q3J07k76M91n00o1L19o0j60K10J35l45J20K04l04L64j92
6493A19j48j66J97%p5m4L97l19k6J79q5j71J13M8j49J38k34L22k43j57L85k02
6515a21OL02m6j50p2q3K55r4K50l50J59m2j42M58r5k28j09L9J7J48L0k05k73M17
6539G1n0j33o5M14n0m74L89l2j04k3K46k33n8J02j87O9N19m54k05J12O8L39m97
6562b36N7K40l49N29j00l90L54M84n65p8M55m97k18M38m9j24p6K04j05O8k3R3
6584A12j73l22N64Q3l84J69n6k04J58P4k71K21k0K31k76J17M0o2m9m6M9N4QL2
$$ plain form
6422 -135 44 -86 -80 12 118 -37 -35 107 -116 -162 73 28 -122 85 48 25 71 -80 141 -249 45 -360 47
6445 47 61 115 140 533 271 -299 -255 139 245 159 193 223 -83 83 -26 -117 -175 157 86 76 158 67 64 198 133 -126
6471 -126 -334 18 -134 -93 -16 67 174 -102 389 -111 -172 147 87 -73 137 272 -73 47 251 -53 311 119
6493 119 -29 -195 2 2 -73 -117 280 -39 -65 114 29 -142 -29 19 -130 8 -226 96 -147 -304 81 -121
6515 -121 -115 187 141 -9 -81 -164 91 -3 247 -103 56 14 -128 330 235 7 -102 -63 -46 102 132 -73 -346 71
6539 71 21 -112 -177 237 187 -287 102 70 -34 -57 189 -44 -102 0 -187 -118 401 -53 -258 -146 -78 261 -236
6562 -236 -179 61 -288 241 141 -249 105 589 24 -54 401 -96 -314 124 75 -49 -125 79 -26 42 19 112
6584 112 -61 -383 181 264 -120 49 -7 -211 -53 21 -250 -29 -49 182 -94 23 63 1 -48 -94 -45 9 17 49
6608D9k81n1N28n05L12N4o5m3RR7k67N4pq2J76j01p3J75L71o96N21j75j82J90
6632Hk08J59j20K55j34j64J20k2K61n5r4j78J01J6L08k86oL01k60k27K41J8l78
6655c44K99N5Kk13K54k04j35K74N5j30k7P9k49K79n2Q8r6j25M82m5m74M02m01
6678b26L17j31k0l9J62k00o5j05N44k58j18J06R6l08N43l78j01K89K36k54j39
6699d9K64j92m3k9l2k47K33K78k58J40J86l19m1K14J61o93K78J03N0j41K00k01
6721a38J17J6L9M0q6j2j02o7K91J34m74M61N2l80N03j85k63k25M96m0k55n5L06
6744A73r8k37q6q9M3K71R3j61K60j35r1J93L7J84l69L8J78k42J62m1j37K5n1P1
6768iQ9m4j38M6M1j86J47k34M36l36K0K50J21j6n06O02l50k83M99m69J41K52P0
$$ plain form
6608 49 -232 -283 245 -260 52 106 41 -2 7 104 -163 -109 -116 -198 -22 -123 -196 -21 350 -346 175 0 -182 8
6632 8 -200 -41 -161 94 -40 -204 -84 -106 155 100 6 -172 -71 -55 253 -33 -39 262 2 -225 16 34 -344
6655 -344 -45 10 12 -201 53 -151 -286 -12 43 -87 -114 -35 -284 -5 -57 31 -65 -190 292 247 -227 175 -226
6678 -226 91 -40 -60 -99 63 -137 -202 -307 237 -21 -139 -33 63 -245 298 -80 -181 108 344 90 -49
6699 -49 215 23 -20 -49 -81 -328 -95 183 -75 65 251 -68 -109 105 266 -427 -149 -46 4 -137 63 -138
6721 -138 -21 -5 34 74 -12 -24 -126 -193 98 232 -242 219 271 -109 394 209 -54 -279 217 177 -78 -133 173
6744 173 75 -162 -248 -337 -294 -23 70 -91 169 34 -57 136 173 357 -12 26 204 -38 124 83 -54 -29 -80 -9
6768 -9 80 36 -102 -56 -15 -201 -54 -288 148 -188 -168 82 203 187 -319 283 -67 -350 149 -320 -179 73 143
6791A43j03O1m0j4M1k81K55l29O80j69k10j11J70j76m3N06k60k42K72p1k61J73
6813ik9J73j13k05K07J70k44p5J76j18K76j47np8J67j36O4nj82N2Q5q5J5J17Q3
6838A54l07L60K04m42l9r3O0N9n2N52o06P1L75l44O0L05p06J68L62qj45l2K1m9
6862g2l6K01j73r1M97m53R8o1o0L34k28j2m0K21J9n3M8n0P0l02J36q7j00K40J75
6887B21j54j21K93m26P8n6K10k1N8k3n5k52J77L88m10J4j19M27l54Q3K20j50r6
6910f8R9l38K90J23o0j6k48L59q4j3J45n07N13J29k82k83L45k94K17j70J42kJ34
6933A31m0Oj33j96L18j97l5K11K73m12O5j6M6J93k37k78J71M14k04j18R5j17J17
6956E7J80J1k12J27K98m38r2J76Q9n77N71j80K5j62J13J56k32K87k08J56o3J23
$$ plain form
6791 143 40 101 61 47 88 -193 62 -267 413 244 34 -77 93 -83 -126 380 120 -122 150 79 -182 -9
6813 -9 -38 135 22 -183 24 194 -50 -125 51 -67 209 62 57 -21 146 10 74 69 -113 -61 24 -61 -46 71 154
6838 154 -153 207 411 -31 -70 -163 -103 -44 -96 456 -150 -79 296 -48 12 317 -389 -221 141 133 -12 -44 -23 -72
6862 -72 -108 93 -80 -171 326 -127 -29 -90 -150 184 -44 -56 -96 125 144 91 139 89 159 -143 -7 -94 -194 46 221
6887 221 67 -54 239 -187 -109 -165 45 24 82 59 4 -248 -71 317 -93 -79 -198 229 -125 -42 178 28 -68
6910 -68 31 -307 -17 106 46 30 -218 141 57 44 189 -318 195 324 42 -241 104 -190 27 -143 -1 -3 131
6933 131 91 97 -36 -232 86 -111 -146 65 338 -74 -9 -25 21 214 -23 -301 -130 284 80 -38 57 -60 57
6956 57 237 248 36 163 461 23 -69 107 196 -381 190 10 35 -127 -14 142 -90 197 -11 145 82 205
6978B05m57J72J05L46m51P8r2L1L49l79l50K83K82j65k88K01l2J45j70K98O9k76
7000i6J04J53l49J12K23l95M33j37j44J04M23k76o5O3r5p5K6J98j19l39R6M45
7022B90q51N36l3q7N6k2R4k58L06j16l6r2L77k44m5L02l69M11%mj81j02mM6j66
7047a92K27j09lK70j89J45j4j9k24L6n7P7k47N06k00P9o4M0j65J60j23R9J94j63
7071F4j78K44N8j44j98j13K16l69N63L4L4m84L22m6qL52k33j8k21L57j04Q1l06
7094i7q4J11k8J87k53%Q8k32K38L90n72J33j06O91m36j41K53J57n03K34J49k57
7116g8k00L75N3j66J52k56J4L7O4L3l1N1j87R0K02k64J58m74M66j05J36j84J64
7139E0o5n2L71j95k86R3Lj94L37K2m45K78k4l2L06R7j30j57K40j71j37o0L58p0
$$ plain form
6978 205 -252 -80 25 371 -80 -2 -94 -63 286 -93 -443 -160 122 -43 -331 -130 -162 -17 -187 111 180 -96
7000 -96 8 161 -188 -76 147 -248 185 48 -96 8 431 155 90 153 58 -17 9 207 88 -251 -155 290
7022 290 -561 -25 -58 -145 -89 -111 -17 -275 31 -85 -121 -213 164 -80 -125 177 -192 219 219 215 34 -68 -72 -26 -192
7047 -192 35 -74 -77 193 4 149 135 116 -108 -72 -129 -52 -299 207 7 86 22 62 -103 57 -66 33 227 64
7071 64 -114 130 188 44 -154 -267 -51 -420 143 177 211 -273 49 3 -5 347 114 96 -125 232 128 209 -97
7094 -97 -181 -70 -98 89 -164 -164 -76 -308 -70 320 -252 -119 -225 466 30 -111 142 299 -204 30 179 -78
7116 -78 -278 97 150 -16 136 -120 -106 -69 -5 28 -3 48 -139 -49 153 -111 47 -427 39 -66 70 -114 50
7139 50 -15 -67 304 109 -177 -84 -81 -275 62 84 -361 -83 -107 -139 167 264 134 -23 217 46 -91 -151 207 137
7163A37k04M8K1l09M10r1K47k71J76j90j34K74j96K27q1J73l05N1J19j33J97j78
7185a2mq0J33k8j74K73K7m14N3J88K97j34K8k75K25q0k03J36K71j93K62j78j92
7208g4L3j52J71J06j67P0J01R5j55L31m24J98l2R6J19j72l5k48L9J75Nq3k20N1
7232a72P8O4K53l70K57K5j30k9J33j60J05Or9k34J36N3L4N3k34j2O2J0J62J49
7256A40m94L45M4k16m7M46k10J01k90Q1j94Q8N26o11J98J54q5n5P1J10J37l49
7278a10mJ07K0J28r3j15L3K46m32J0M63j84k5L3l07J90L17n1k33o6m6J65j77J84
7302E3R3k38L77o27N74j06j94j77J50J70jk41K16L22m78P2J17J03l19J78L3Q6
7324A63j44K57n01J20J66n52N95m0j78M1L09k93M11l84P7m0m9nn4K64j36J23k93
$$ plain form
7163 137 -67 -19 2 -307 103 12 259 -12 164 -26 -160 114 -82 145 64 237 -68 -17 102 -31 166 -12
7185 -12 -16 -96 37 9 -165 108 135 -279 -226 -38 259 125 153 -122 103 23 -180 -44 227 34 296 118 -74
7208 -74 -41 -193 -22 84 -83 -13 88 183 28 359 -65 133 101 197 316 144 109 -139 -100 75 80 -3 -223 -172
7232 -172 -94 -30 223 -147 110 135 5 -24 109 -51 54 60 -39 -273 -137 -84 -50 3 -231 -243 -181 -171 -9 140
7256 140 -354 -9 35 -181 -228 218 8 109 -181 -100 -294 -206 320 -291 -93 61 -24 -79 -8 102 239 -110
7278 -110 -114 -7 13 141 48 -67 -34 212 -220 -210 253 69 44 77 -230 -40 277 226 -7 -73 -119 46 -131 53
7302 53 146 -92 285 -342 232 126 -68 -245 -95 75 74 -167 49 371 -107 -35 82 185 -134 44 77 163
7324 163 19 276 -225 -105 61 -491 104 64 -114 -73 236 -57 354 -30 47 7 -42 -47 -101 163 27 150 -143
7347a43R0Jj27K91Jj26L6n7K83O4k52n2k25pK26R5l16J19J98j37q4J16m09M48
7371C3N1l31L18k41M18l21J83J84m57p0M75m15r9J54K24l23K68j50P4j78J24p
7393h6o5K23k44L0J0K60j96p6K52K38j18j50o5L0o2Oj22j3K94m27L48k53K45j49
7417i0J59J35j90K51k50p8oO5N9k04p1J77j9j89P37l66l70K72k07L41l8k37J2
7440a07K69k16J94m13L37M6j89lK87Ml63J69J4r9J11o7j49J61Q4Lk16J55j36J26
7464BJ41k5K01k96k1J58m04N74n81M52k15N8k67J69rj45J23K86l08P6j35R9J26
7487E9j01J09k65K41j40J99j65J1k40K00K24k29K50O5j95O4j74l1J01J91j26k12
7509a64K33j20J17m0Q8k53N3j64J15L42l13L20l8k0k41J84j10k44K62p9J6j40
$$ plain form
7347 -143 -53 -52 -179 112 113 -13 23 -34 249 313 61 9 -216 -223 3 98 -218 -99 99 -38 -122 -6 -415 33
7371 33 84 -247 71 -170 248 -73 110 294 -163 -233 242 -173 -272 -118 106 -217 51 -99 -25 -203 -79 -86
7393 -86 -151 72 -172 -142 -132 128 -68 -144 108 346 228 78 13 43 -19 -13 -135 -148 146 -281 67 -186 59 -90
7417 -90 69 204 14 265 15 -63 -69 -4 55 -149 -220 -43 -62 -251 486 120 -250 22 -185 156 118 -119 -107
7440 -107 162 -54 140 -273 64 110 -79 -82 205 209 -154 15 29 -70 41 -26 -175 -14 70 73 -143 12 -124 2
7464 2 143 118 319 23 2 160 -244 330 -251 201 -14 44 -223 -54 -63 -208 -85 201 -107 -31 -166 -67 59
7487 59 -42 67 -198 43 -97 102 -63 -52 -292 -92 132 -97 153 218 23 87 -87 -118 -17 174 48 -164
7509 -164 69 -51 66 26 114 -139 -86 -250 -135 207 -106 214 176 156 -85 99 -11 -255 7 -72 -56 -196
7531a96K24J41r4J50l31j17J98j66M32j69J09n00L50Kr9P4m2j27j4K1K06K95j96
7554A51P2K24l97m1J10P4m27M49j2j66l4l2l1k33M60J46k39k68L78m94L23j60
7576a47J27K2R8P7k17J47J21j95K46j99R5L5MM3j65o6K3j7r3L32n31N03k09Qj30
7601h8R9n4m8K95j22m1K0J00k96J86l97N31j22r7p6L0Q3J88k96K56l15l9N1J12
7625d0q6pJ39K1k7O0L1k47P7J42J30j57P6N2j32J62k21j06J06j12Q9n0Q6j3M56
7650D29o89L12j87J61n3N6J3l45M74j09j97J85j54L15j80j7Jk30J89O4k02K07
7672D3j73J81R6k15Q4n9k7J75j75j3O8j44P4j9J38j20K75l10O5k29N06j59J07
7695A69j64J2j16L01Q2m25K10j76J04K2L71K7k22k7l09K13j47J02J6j7qL23m54
$$ plain form
7531 -196 28 169 75 225 -106 -223 -25 -191 241 72 181 -319 31 33 -66 8 -34 -161 -175 -154 52 347 151
7554 151 223 447 50 9 119 193 -234 215 203 37 3 -29 -60 -293 167 313 74 -194 184 -310 13 -147
7576 -147 -20 2 100 177 -40 107 228 33 279 80 175 210 214 257 92 26 49 32 -61 271 -260 243 34 42 -88
7601 -88 11 -43 -91 204 82 41 61 161 -135 51 -346 185 63 -34 -110 -80 3 191 -105 151 -164 -203 -152 -40
7625 -40 -126 -133 6 27 0 60 91 -156 -79 63 193 36 112 164 32 194 -27 -133 -27 -139 -50 -100 -14 -27 429
7650 429 -260 52 -135 26 -27 29 42 -303 171 62 -135 50 -104 211 31 14 15 -215 -26 38 -164 43
7672 43 -130 51 147 -68 16 -43 -70 105 -70 -83 -15 -159 -85 -104 34 -86 189 -121 -56 -285 221 62 169
7695 169 5 17 -99 202 284 -141 69 -107 -3 19 390 417 195 168 -141 72 -75 27 43 26 18 341 -113
7718a13O5K68j86M3o1K06m30L01l08k0Q8K00j2J11L9j73j35j9J22j81L00l94K07
7741h2K57J62o41K55J75l1l36L84q9p3m3Q0o7qq5J68j52J45j29j74K00J62j47
7764f9J9Q0j93K4J93J68j59o5J40m9n05K27J40l18M46k09L70l70N20r4p0K17k15
7787B28l34K67q1m7J08j69J48m04M51k74J89l15o4N36l1j02q0o6j15L13l84L32
7809A06P7k21q0K42Lj32J35l99L11Q3m42M25l48J39J00L4k13j5K22m3P2k04O0
7832h8M5k64L23j73P9J91k62J70j07J69p1J88m01J37R4k66O9rJ06j10K86l0k24
7855a48O7K80m65l0L05Nj48K85k98K75m1o3j28j16M56k99Q0l9j56P5J56k07K6
7878a28J7L8K46m3j18l8r0K19j32k2J29J39k84o1K82j12k17P7J58%j13J84qk22
$$ plain form
7718 -113 -48 220 34 77 16 222 -208 93 -215 -235 -147 53 41 152 191 18 -117 -136 -14 -195 105 -289 -82
7741 -82 175 337 -304 -49 126 95 -241 143 54 -19 -62 18 -49 -57 -142 26 -126 19 -110 -284 -84 78 -69
7764 -69 -50 30 -163 -139 54 222 63 -2 138 89 -416 -189 -49 -367 79 -130 240 -130 390 296 226 443 228
7787 228 -106 161 80 33 141 -28 120 -284 167 -107 82 -233 -297 239 208 106 26 -40 -155 158 -226 106
7809 106 183 -38 -118 124 127 -5 130 -269 42 125 -317 108 -240 -101 -1 33 -180 -195 27 -16 56 -148 -88
7832 -88 -43 -307 16 -157 -78 113 -149 21 -86 83 12 200 -201 -64 30 -236 -167 -176 -70 -180 106 76 -148
7855 -148 -81 199 -266 -296 9 14 -134 151 -147 128 87 24 -104 -220 236 -63 17 -22 -178 -103 53 -154 -128
7878 -128 -111 -73 173 130 12 -26 -116 103 -29 -51 78 217 -67 -128 154 42 -175 -98 60 60 -53 131 123 -99
7902i9M45m05Q7k0J48j33k59L63k66J52q6J38l0p7n0K40J07l41L3q3K77n9l75
7925b93K05L41l98J51k20M22l83K53Q3k56L05j30J87l81K11k33K6L92m37m2P7
7946a20L7K4m7J77k1p1o9K6R0k7L87l27K0l36M30J8j21J53m74K79j48J31m1p7
7970a07L69j36j36J34j44N9O9j9j99J45P5j00J38P0k05l8L08k46L4j96j36K95
7992C4j3K90m24k2R9J2j7n2J31j94L12J15l50J00k76K19m7PJ31l84K62j93J29
8015a31J20NN7j32q5J66k92M08J45k43k2q1J82j96J03j3M4r0K9J33k0p2Q4N0o
8040A43l14J43R5k13J04k31O58l64M0j9J09j75j72K53jj78p5M26l09ok26K87Q4
8063E9N2n0l60K98j35M8q7L51N1n96J51K56oP0o6l1k4J59l03L27k53j83N22j83
$$ plain form
7902 -99 346 -59 28 8 156 23 -236 127 -139 13 -73 65 35 -42 -92 148 255 -86 -53 -136 141 82 -293
7925 -293 -88 253 -145 6 -214 208 -175 78 161 -95 210 80 267 -114 97 -136 -110 282 -155 -197 -120
7946 -120 -83 -59 -106 71 50 -21 -90 -64 26 -1 386 59 79 -257 173 191 70 223 -251 28 -120 11 -30 -107
7970 -107 262 126 -10 124 -20 39 108 89 -110 35 110 10 148 218 13 -25 283 37 71 -125 -261 34
7992 34 21 311 -113 -135 -36 -24 -41 -93 38 -156 156 271 -79 21 -255 -36 -83 -76 55 -329 -67 -260 -131
8015 -131 -11 -6 51 -81 -166 0 -292 116 261 18 -4 -85 97 -99 4 -9 35 -55 -26 107 87 15 99 149 143
8040 143 -171 -28 67 -146 -42 -273 385 21 61 42 151 -24 -196 57 56 -122 -197 229 -80 -86 -312 -25 59
8063 59 111 61 -299 -1 -136 -88 -175 176 227 -369 -218 38 32 102 36 5 -19 140 -163 164 -89 -272 250 67
8087F7r4J28p7k21N7PpQ4m5J51K87k39O3jj6j26j48K30j26J83m11J69J33n5J64
8112A57k97Q1L85l86N4q6j13m8J54K15r9L4j54j22K64J71k08K2j44J09L43m24
8134i2Q4K14k63L03k54K78j16j45p4N8J19Rk30M8rQ5K77j31k72K19K0j07m4L40
8158C17j23l38J06O7J55m12L27l23K84J12j29j00L60m12J98l6r3J6K75j38l25
8179b12J17p9L30r0j76J60k24P4M8p7j27L49
$$ plain form
8087 67 -27 101 24 -197 -140 -133 -140 -56 -101 50 337 98 161 160 144 18 -130 100 -26 157 -254 -85 48 -7 157
8112 157 -140 -59 326 -60 -6 -92 -205 -253 -99 116 17 51 -103 -225 39 210 2 24 -120 -11 332 -92
8134 -92 -8 206 -57 246 -8 270 154 9 -65 -7 112 121 -109 -61 -70 15 292 161 -111 108 128 21 -23 317
8158 317 194 -144 -38 29 184 -228 99 -224 60 172 43 -57 303 -109 89 53 -40 -24 251 113 -212
8179 -212 -95 -174 156 66 -110 50 -174 -100 -52 -129 -256 93
8191I3
$$ Imaginary data points
##PAGE= N=2
##DATA TABLE= (X++(I..I)), XYDATA
0@%%%%QqQj6J6k4L2m0M9n7P2q8J05j27J51j78K10k44K83l27L79m35M94n63O40
29C40p23Q14r16J029j152J286j434J596j772J967k182K418k676K962l282L637
45A912m033M478m984N564o235P022p961R105j0536J2386j4881J8456k4043L4082
59B0332n7746K13822J91945l33566j07171Q0995J54832J7188o6171j00481L7752
70E1731Q4150j0953r0385J1490N8303K3907k0288l5677m5903K0486K8384n0436
82B4809m0185Q2294O1269n6692o0321J2261K1021K0240k164n5048k8110O2753
94D2127K1047p5870k8728O6821M5550j2710m0519m9781J3235Q7742P304j16715
106d0497n9273P0879P5143O485m3136n4899J1918P8509L059q7429j4732O7072
$$ plain form
0 0 0 0 0 0 8 0 8 -8 8 -16 16 -24 25 -32 40 -48 57 -70 81 -97 113 -131 152 -175 204 -231 263 -300 340
29 340 -383 431 -485 544 -608 678 -756 840 -932 1035 -1147 1271 -1405 1557 -1725 1912
45 1912 -2121 2357 -2627 2937 -3298 3724 -4237 4868 -5668 6718 -8163 10293 -13750 20332
59 20332 -37414 176408 368353 34787 -72384 8611 163443 180631 114460 13979 51731
70 51731 135881 124928 34543 46033 104336 128243 107955 72278 26375 46861 75245 24809
82 24809 -15376 66918 128187 71495 11174 23435 44456 64696 62532 7484 -20626 42127
94 42127 63174 -12696 -41424 25397 70947 58237 17718 -32063 -18828 68914 76218 -40497
106 -40497 -99770 -28891 46252 52737 9601 -45298 -33380 45129 48188 -39241 -53973 13099
118A3099P547m6005j5385K300J6556M3071m523n3001K2334P4717k3256r5553k7763
131h5862N3332P0507K7428o5616q0697M2702R9619p270o4679O128L7068K606j6022
144A9244l6704k6115N4709O6665l6408n6821L5947M8605j6095k7926j1269J984
156A5816L4977J7997n5611l3666N8399L9201l7391j9435K6485J9640P384j9779
168E4017n6866o039P2066K0727o5951k9887M0086L9929J7074k3488o6243q360
180a2935Q3285L0555p7507m9131L1373L4310O135j4613l0293J2626O0894q73p2287
193A539k1952L7831R637j2025k771j1339J963K7289j5717m1922L1836N8552k5633
206C7288o0100m572K0633R340n64k9427j6102N7363M6972o0551o8220L1969O3392
$$ plain form
118 13099 20646 -25359 -40744 -38444 -21888 21183 16660 -36341 -14007 60710 37454 -58099 -85862
131 -85862 -32530 37977 65405 -211 -80908 -38206 61413 54143 -10536 -4408 32660 35266 19244
144 19244 -17460 -43575 11134 77799 41391 -15430 20517 69122 53027 25101 13832 15816
156 15816 50793 68790 13179 -20487 37912 77113 39722 20287 46772 66412 73796 54017
168 54017 -2849 -8888 63178 83905 17954 -11933 28153 68082 85156 61668 -4575 -12935
180 -12935 70350 100905 23398 -25733 5640 39950 46085 31472 1179 13805 74699 73826 1539
193 1539 -20413 17418 27055 15030 12259 920 2883 30172 14455 -27467 4369 62921 37288
206 37288 -22812 -27384 -6751 2589 2025 -27402 -43504 13859 60831 280 -67940 -35971 27421
219B7421J0753l6401n9907k0826O7777N6214n4205o3082L5444N8910M731k8542
231a713l6827j3107M4684K6646n2831l4275M8853L3295k8194j6508J0810J1360
243g807K1233o78m8154j7600M6448J5925l7793r435K1210R690J0708K357k4422
256a8318L971L6877j6020n4356R053M8385J640k4697j3067k382L1873M4466k4944
269B2481o1261J1252N3941m50l6931k1137j492L3119M1360k2197m8759K3239M9977
282D3142j6049m0038L08J5296J2341K290l6176k5618N0599N2750l2274m5416J1452
295g393K5754Q340n798l4698k4904L9506L5874l5473l1365L1233K7713q002j0452
308A0335j2053m516K4451R54m9247j1520N2588K2246k8488j4867L165P737K5532
$$ plain form
219 27421 38174 1773 -58134 -78960 -11183 45031 -9174 -72256 -36812 22098 26829 -1713
231 -1713 -38540 -51647 -6963 19683 -33148 -67423 -18570 14725 -13469 -29977 -19167 -7807
243 -7807 13426 12748 -35406 -53006 -6558 9367 -28426 -37861 -16651 -6961 3747 6104 -18318
256 -18318 -14347 22530 6510 -47846 -38793 9592 11232 -13465 -26532 -28914 2959 47425 22481
269 22481 -38780 -27528 26413 25963 -10968 -32105 -33597 -478 40882 18685 -30074 -6835 43142
282 43142 27093 -12945 -12637 2659 15000 17290 -18886 -44504 6095 58845 26571 -18845 -7393
295 -7393 18361 26701 20903 -13795 -38699 807 36681 1208 -30157 1076 28789 20787 10335
308 10335 -1718 -6234 18217 19171 -30076 -41596 10992 33238 4750 -10117 -6952 785 26317
321B6317L244m0774j0905L6428j930l9771N75L0823J3318L013j2746k4623J6844
334a87M0274k3862n5958R472M6754P302k2270k6566j3355L8413N4311k0386o0965
347b7023K550M0356J217k5168j9024n684L1941L6975k6910m6024K2898M4804j1126
360A9782k7863m269J282R836R774k5718k1889L5577L2686k5511j9701K0243J0876
373A5105q973j1013k0785r80L9045Q795m8953j2452M9269K2943k5412k3069m606
386b1086J9449L4878j4934o3556r363N5877K2959k6211j4409M875J5273K2453
398B6205j5436m8230M797N1898K162m1447j0475J6607J2092J1260o404j9476J9168
411B721L3163k6471m5585J0323L0289R85p773o918o585K3679K4851l0402l4020
$$ plain form
321 26317 29561 -11213 -22118 14310 12380 -27391 -26816 4007 17325 20338 7592 -17031 -187
334 -187 40087 16225 -39733 -30261 16493 23795 1525 -25041 -38396 17 54328 33942 -27023
347 -27023 -24473 15883 17100 -8068 -27092 -32776 -835 36140 9230 -36794 -13896 30908 19782
360 19782 -8081 -12350 -11068 -1232 8542 -17176 -39065 -3488 29198 3687 -16014 4229 15105
373 15105 6132 -4881 -25666 -26646 12399 21194 -27759 -40211 9058 32001 6589 -16480 -21086
386 -21086 -1637 33241 18307 -45249 -54612 1265 24224 -1987 -16396 -11521 3752 26205
398 26205 10769 -37461 -32664 19234 21396 -20051 -30526 -13919 -1827 9433 3029 -16447 2721
411 2721 35884 9413 -36172 -25849 4440 5425 -2348 -9266 -15851 7828 32679 2277 -31743
424c1743L0347L7382j6575l1219j1698N010K7176J6670l1956k0654M2468L2321
436D7529l1995l2079M799J3833J4667M37l2396j1581M2946K0885l7831j9886K6081
449E409K2859J609j4125l0648n539L5846N964l9190j727M2484J2505k1592j4986
462a131o625J1006K7868r748m2331L913L9909l279l2778m738J6875K3128J9643
475D1712k2426m4060Q548L9387j0335l4283N062K0364P682J094j6388j9479K3228
488A06L1669k1618l2019J3512J6870j1614j3160p618K158L1665K2474l3832l0350
501c1757K7343K4976j9814k2254k448R911K3531M773l9370j7513M2726K9677k2377
514G404k0092L693N120Q545m696l1876n193M4344J9365l0795j5501J6368R837
$$ plain form
424 -31743 -1396 35986 19411 -11808 -23506 -18496 8680 25350 -6606 -27260 15208 47529
436 47529 15534 -16545 -11746 2087 16754 17191 -15205 -26786 16160 37045 -786 -20672 5409
449 5409 28268 29877 15752 -14896 -20435 15411 21375 -17815 -19542 22942 35447 13855 -1131
462 -1131 -7756 3250 31118 21370 -20961 -17048 22861 19582 -13196 -17934 -1059 22069 41712
475 41712 19286 -24774 -16226 23161 12826 -21457 -16395 3969 11651 12745 -3643 -23122 106
488 106 31775 10157 -21862 -8350 8520 -3094 -16254 -23872 -21714 9951 32425 -1407 -31757
501 -31757 -4414 20562 748 -21506 -23954 -14043 9488 14261 -25109 -42622 104 29781 7404
514 7404 -12688 -8995 -3875 4670 -26 -31902 -37095 7249 26614 -4181 -19682 -3314 6523
527F523J723m577j7614K228K7285p163l8558K945L7329Q210j1962m283l664R217
541G639J8270j8976l7094J3326M1373k964k7443o122J0104J9790J8018j9434l2251
554a5764J8595L5228j6755l3476J111J4787J1006R693j2098j5242K3687K4508
566D5280k7097l0765J4726K0218j793p935j3885o637K6677J9221k8353j7539L0938
579B3056J9877k0150k1728r093K756K3453R028k7631p998L4493J0740k8271j2852
592d320J1909J1990R032j1972l5559j137M0006Q208l1702m654K4982J1898n034
605B3647j8552k3088J0105L4565p321l8306J165K9285N188r735o476m541J3345
618I281K0116k0299l6050J1312L0736p471j9962N14Q826J4483J1871k0181k3721
$$ plain form
527 6523 8246 3669 -13945 -11717 15568 8405 -30153 -27208 10121 18331 6369 2086 -1578 7639
541 7639 25909 6933 -30161 -16835 24538 21574 -5869 -11991 -1887 17903 35921 16487 -15764
554 -15764 2831 38059 21304 -12172 -11061 3726 14732 24425 12327 -2915 20772 45280
566 45280 18183 -12582 2144 22362 20569 12634 -1251 -7888 18789 38010 9657 -7882 23056
579 23056 42933 22783 1055 -8038 -5282 18171 27199 -432 -8430 26063 36803 8532 -4320
592 -4320 7589 19579 28611 16639 -18920 -20057 19949 28157 -3545 -8199 16783 28681 23647
605 23647 5095 -17993 -7888 26677 19356 -18950 -17785 11500 16688 6953 477 -4064 9281
618 9281 29397 9098 -26952 -15640 15096 7625 -12337 -11823 -2997 11486 23357 3176 -20545
631b0545K0164K3851k1520k4299R084J3824N508J224j6612r709K9545K2410k6730
644F195k4217J4693J2705o028q839j1345K827L2136J1351l5224j6575L0472J8670
657B6821j3857j5095q684J750K1082K860k9021m089L4829J1528k1263q671M874
670C064M420P106q370k4070P160L2615m569l0977K063K5165R270l817j4384j8024
684a3348J1715K6386j4619l2727R110K8549J851j1450p764k809J7812J8455k3289
697G872l1385J5598K6175j0101j7613p8O587J4207J1005j9552j9046K0836J8993
710B3498k0383j8353O550N961L984L649j2823o632K5091J3003k7252j5552J7344
723a915J0973o370j0281j5506J471L0404Q993l0431j0873K6196J2319j2806j1482
$$ plain form
631 -20545 -381 23470 1950 -22349 -13265 559 6067 7291 -9321 -19030 10515 32925 6195
644 6195 -18022 -3329 9376 3348 -5491 -16836 -14009 18127 29478 -5746 -22321 8151 26821
657 26821 12964 -2131 -10815 -9065 12017 14877 -14144 -18233 16596 28124 6861 -1810 3064
670 3064 7484 14590 6220 -17850 -10690 21925 17356 -13621 -11558 13607 22877 19060 4676 -13348
684 -13348 -1633 24753 10134 -22593 -13483 15066 16917 5467 -2297 -5106 12706 31161 7872
697 7872 -23513 -7915 18260 8159 -9454 -9532 -2945 11262 22267 2715 -16331 4505 23498
710 23498 3115 -15238 -8688 -2727 1257 4906 -7917 -14549 10542 23545 -3707 -19259 -1915
723 -1915 9058 2688 -7593 -23099 -21628 8776 17769 -12662 -23535 2661 14980 2174 -9308
736i308q369K657J9105k131k7962J515L2367L568k2437l952J0621Q365L992j6054
750h023k4282J2161L1017r084k7230O377K1716M592n775j2656r529J8508K0531
763A8323k3329l2523J2897K7503J860r130p649k975J7008J4631k2467k3056J9235
776i672K0014j3245j6543L1N935J5023R930j6937j1837K0592J0509k1688j2575
789b0463R128M963L169K530j2219m059K1450O373k1191j010J9681K05j5779j0126
803a7348o006J0537K5176j474k9478j663K7414O361j3384q335m580O114J5459
816H793r781k8595P525L2985K512j8771l390M958O039P017j1317j9334J0712K2129
830A1482j4202k1428J1101J8883M800j629j1561j3609J2128J6921j5641j7089
$$ plain form
736 -9308 -17677 -15020 4085 1954 -26008 -24493 7874 11442 -10995 -14947 -4326 4039 8031 -8023
750 -8023 -32305 -20144 10873 1789 -25441 -19064 2652 7244 1469 -11187 -20716 -2208 18323
763 18323 -5006 -37529 -24632 2871 4731 -4399 -12048 -15023 1985 16616 -5851 -28907 -9672
776 -9672 10342 -2903 -19446 -19415 -13480 1543 11473 -5464 -17301 3291 13800 -7888 -20463
789 -20463 -11335 -6372 -3203 -673 -12892 -16951 4499 10872 -10319 -11329 8352 8557 -7222 -17348
803 -17348 -23354 -12817 12359 10885 -18593 -20256 7158 13519 135 -8200 -12780 -6666 8793
816 8793 -988 -29583 -22058 10927 13439 -5332 -8722 -3764 2275 9292 -2025 -21359 -10647 11482
830 11482 -2720 -24148 -13047 5836 10636 9007 -2554 -16163 -4035 12886 -2755 -19844
842a9844J2941J0981q820n321J906M427J6511P359k5213j7415J8180J3198j3744
855d854q305M110L681R897M769j8501p078K4289J1259j9037j2152K655J32M861
869d274L420r772K299K2690J58k6524l544J9191O705m764q298j5439K90K2496
883D634L010j8707L888K0588j849j3689n784k131R027J4835j1294k6435P357K5221
897H671j149j2395K874N837L444K038j6220j6154J7953K3439j5652k2350N788
910a3876J4173P366L346j0551j1067J3858J2258k1709j7312J5893J5485l712o099
923a947n854n17J6333P062j8829p654J9810M017k1006r619O683J0433J5305j58
937A4059k3634n590K4461P106j8466n564Q192K028l53o341j3775Q213K8591J097
$$ plain form
842 -19844 -6903 4078 -4742 -10063 -8157 -3730 12781 20140 -5073 -22488 -4308 8890 -4854
855 -4854 -13159 -9049 -5368 4529 9298 -9203 -16281 8008 19267 230 -11922 -9267 -9135 -4274
869 -4274 -854 -10626 -8327 14363 14521 -12003 -15547 3644 10349 5585 -2713 -18152 -17862 4634
883 4634 7644 -11063 -7175 13413 11564 -2125 -7909 -10040 -1013 13822 2528 -23907 -16550 8671
897 8671 7522 -4873 -1999 3838 7282 9320 -6900 -23054 -5101 18338 2686 -19664 -13876
910 -13876 297 7663 11009 458 -10609 3249 15507 -6202 -23514 -7621 7864 4152 -1947
923 -1947 -7801 -8318 8015 15077 -3752 -11406 8404 12421 -8585 -18204 -11521 -1088 14217 14059
937 14059 -9575 -15165 9296 16402 -2064 -7628 564 2592 2239 -4102 -17877 -9664 18927 20024
951B0024k3886m792J2018K160j596l146r697L831J5581p193k0071R457K2246O04
965A5540r898n390o096L614J0864q828j4170J4845J6249j4872j6456Q718J5129
978I249J0165j564k2641j7537J9883K0756j5477j7442Q138J2115M704j205j4708
991e564o970K1458J4383k2024j7646R039P784k331K253j466j170J1077K391j9130
1005g916l105J9997K492j6222n327K633K391Q581j221j3209P183K3352o229k6591
1019a3191l563J4843R321J978j2703k0052P955K8175P16k0181m27J1739J706l182
1033C134q029j2690P207K0710m957j8799L302J3159p83q62K020m587J680M034
1047D539j4217j0946J8008J5647j3259j2165P136R501O469j487j7916p881K2938
$$ plain form
951 20024 -3862 -8654 3364 5524 3928 782 -8915 -5084 10497 3304 -16767 -7310 14936 15540
965 15540 5642 252 -5844 -2230 8634 -194 -14364 481 16730 1858 -14598 -5880 9249
978 9249 19414 17850 -4791 -22328 -2445 18311 2834 -14608 -6470 5645 10349 9144 -5564
991 -5564 -12534 8924 23307 1283 -16363 -7324 460 -1871 382 -1084 -2254 8823 11214 -7916
1005 -7916 -11021 8976 11468 -4754 -10081 -7448 -5057 3524 2303 -10906 -3723 19629 13400 -13191
1019 -13191 -16754 -1911 7410 9388 -3315 -23367 -15412 12763 13479 -6702 -7129 4610 6316 3134
1033 3134 -4895 -17585 -10378 10332 5375 -13424 -10122 3037 2254 1392 3412 -1175 505 4539
1047 4539 -9678 -20624 -2616 13031 -228 -12393 -5257 4244 10713 9226 -8690 -16571 6367
1060F367J2717k4259j8729J2232J8583Q421m802j8988n509K5018J1581k2951j4988
1073a5307J1198Q788j389k117p232j7J7790N210j7741l115J3582j837j2436L78
1087d245M703O03M836m542j1744J2191K1897q633k2609N16J2065M133k225j1736
1101d790j1517J5052K2584j0342k2544N693J7230L959m576j2933j3259J0388J8887
1114A3832q902j6691Q028J3024k963k697p97l962M414N857j3072j0221J3921Q315
1128H086j2577m589J0159N511K797k757j5982l945K1270O164k2447j1272J2149
1141g433J1230L719l961j3786j94K2424M648k3587j0285J1725O235j003j242p793
1155i303r81J6182L471j4885N75J2297m847j0662J796K025L04N673m429r821J2243
$$ plain form
1060 6367 19084 -5175 -23904 -11672 6911 15332 10530 -8458 -13967 11051 22632 -319 -15307
1073 -15307 -4109 4679 3290 1173 -6059 -6076 11714 16924 -817 -3932 9650 7813 -4623 -4245
1087 -4245 458 1061 5897 1355 -10389 1802 23699 15066 -7543 -7027 5038 9171 6946 -4790
1101 -4790 -16307 -1255 21329 10987 -11557 -5864 11366 15325 10749 -2184 -15443 -5055 13832
1114 13832 4930 -11761 -3733 9291 6328 3631 2834 -1128 3286 9143 -3929 -14150 -229 8086
1128 8086 -4491 -9080 1079 6590 9387 6630 -9352 -13297 7973 14137 -8310 -19582 -7433
1141 -7433 3797 7516 3555 -10231 -10425 11999 16647 -6940 -17225 -5500 735 -268 -1510 -9303
1155 -9303 -10284 5898 9369 -5516 -4941 7356 2509 -8153 -6357 -4332 -4028 1645 -2784 -12605 -362
1170c62J7063j0704j7436M579J0456K382j979j2604j0785J5597K0629j0203j8084
1183a1451O149J3099L430l065j1906j1357J2601J6639j0596j6192P556J1890M99
1196G296K25l829p164O710Q687j2142j0379J1329O382q400o03N301M10L884J777
1211I484j1657j918J5609m46k0569l464J4131P638n04o399j2061N517K2799j080
1225A7080k4519n533J5145N701n306p963q759Q074K1865j863k1903j773J4720
1238D966J171o718k963m142K350R788n455j3193R259J5603o566r765L934K215
1252D84k226k85p185n962J4281J1424j4457j2521J1432J1262j197m695r390m891
1266a3926J4263Q533j8255j2402J3737J2964k290l799n378k904J1008O530j5870
$$ plain form
1170 -362 16701 5997 -11439 -6860 3596 5978 3999 -8605 -19390 -3793 16836 6633 -11451
1183 -11451 -5302 7797 11227 8162 -3744 -15101 -2500 14139 3543 -12649 -5093 6797 7296
1196 7296 7521 3692 -3472 3238 11925 -217 -10596 733 7115 -1285 -1888 3413 3823 7707 9484
1211 9484 -2173 -4091 11518 11072 -9497 -12961 1170 8808 8304 1905 -10156 -4639 18160 17080
1225 17080 -7439 -12972 2173 7874 2568 -5395 -14154 -6080 15785 13922 -7981 -9754 4966
1238 4966 6137 -581 -3544 -7686 -5336 4452 -1003 -14196 -4937 10666 4100 -5665 -1731 484
1252 484 -1742 -2027 -9212 -15174 -893 10531 -3926 -16447 -5015 6247 5050 355 -9035 -13926
1266 -13926 337 8870 -9385 -21787 -8050 4914 2624 -1175 -6553 -9457 1551 8081 -7789
1279g789r167J3043O108q671j791L512O92O295J429j1474j54J5762k356j8608
1293a3169k320J1395N408J202m252j0378O808J9307m416k1725p22J4950M097m333
1307A852p899r328P454J8708k399j6206L813J2878l017q140k936k919M670R479
1321F010n677j0584R356J0661q843o772O944L468q15r31r661o356J3455Q787j3529
1336d487o738J3416Q739l742o780r546j262J6306O071j8849j0086J4325R207l806
1350B768m338m800J731J4821L304k0311r870J3101O094n957q94J99J810Q028k72
1365E414j4189j85J5230m16j2912j279M876n21J344m48n575Q040J3841q181j7207
1380a2168M265J1144k063n853l364k280J0179J0509j1594j4238J1197J5884n395
$$ plain form
1279 -7789 -16956 -3913 2195 -6476 -8267 -4755 -4063 2232 3661 -7813 -7967 7795 5439 -13169
1293 -13169 -15489 -4094 1314 2516 -1736 -12114 -5306 14001 9585 -12140 -12862 2088 6185 1852
1307 1852 -6047 -15375 -7921 10787 8388 -7818 -4005 8873 5856 -2284 -5220 -8139 -3469 6010
1321 6010 333 -10251 -895 9766 923 -5849 1095 4563 3748 2817 -6844 -13200 255 9042 -4487
1336 -4487 -11225 2191 10930 7188 408 -9138 -10400 5906 11977 -6872 -16958 -2633 6574 2768
1350 2768 -1570 -6370 -4639 10182 13486 -6825 -16695 -3594 2500 -3457 -4351 -4152 -2342 5686 5414
1365 5414 -8775 -8960 6270 5854 -7058 -8337 -3461 -3982 -2638 -3086 -8661 -621 13220 5039 -12168
1380 -12168 -7903 3241 1178 -4675 -8039 -10319 -140 10369 -1225 -15463 -4266 11618 6223
1393F223r821l503n38O659O494j1318j0642J4166J4336p065q561J005K15L069
1407G19L144q792n868J2207O049j2712m977J0201N287m35J78o651l797R573j89
1422C937j5107n80J5935M396o690l627l075K654J1555k36j5664j216J3867k37
1436E912j1084j995L093N446R524k508j3939J437J3495l830j2419J930O119J217
1450B398J158l913p946P594J3413o593j2559N747P798m357n023l146k151R459
1464A879R467j1095j0078J2071J0336p114q226k400K29Q533O211j2239j0271J1577
1478a120R494o240k947L922N1J251N04j0951n038J2917N871j0066k048P786O24
1493D010j911l67m781O77J1311j315j5823j808J1633J430m361J067N8L204P907
$$ plain form
1393 6223 -3598 -7101 -7639 -980 5514 -5804 -16446 -2280 12056 4991 -3570 -2565 -2350 719
1407 719 3863 -4929 -10797 1410 7459 -5253 -10230 -29 5258 4823 5001 -1650 -5447 4126 3937
1422 3937 -11170 -11750 4185 8581 1891 -1736 -4811 -2157 9398 9162 -6502 -7718 6149 5912
1436 5912 -5172 -7167 -4074 1372 10896 8388 -5551 -4114 9381 5551 -6868 -4938 1181 2398
1450 2398 3556 -357 -8303 -709 12704 6111 -6448 -701 7097 2740 -2283 -5429 -7580 1879
1464 1879 11346 251 -9827 2244 12580 5466 -2760 -5160 -4931 3602 9813 -2426 -12697 -1120
1478 -1120 8374 2134 -813 3109 3160 4411 4915 -6036 -11074 1843 7714 -2352 -4400 3386 4010
1493 4010 2099 1732 -3049 -2372 8939 7624 -8199 -10007 1626 3056 -1305 -238 -180 3024 10931
1508A0931o876j5944M223J6430o96j1508l769J225O149R403m207j3353M801J3862
1522A0671l602j1549o40K214J737N071l281p767O467J0714o906r023O091M930
1536E127m175k239k488l053P779O439j0505o655J2279O992o808m356m39n67M797
1551B128J545j1962l207J5820O516j1698o193L632M709O721o35j4059n484J3338
1565A171N209j0183k609N978J925K166J074p341j606R433j757j2279K271J0055
1579C507r80m766j153p89N269J0494n486j4866L503J1477l016q258L9J692M949
1594A616O554o814j0314Q483J2960o188j1314M93L186L072K779o640o964J0168
1608A077J1555q538r051N786M314k440j490l596k906Q530M126j1689l831J3707
$$ plain form
1508 10931 4055 -11889 -7666 8764 8068 -3440 -7209 -5984 165 9568 5361 -7992 -3191 10671
1522 10671 7069 -4480 -5120 -2906 -1169 3902 621 -7146 -679 10035 3129 -5894 197 5127
1536 5127 952 -1287 -3775 -6828 951 7390 -3115 -9770 2509 9501 2693 -1663 -2102 -2669 2128
1551 2128 3673 -8289 -11496 4324 10840 -858 -7051 -3419 1290 8011 7376 -6683 -12167 1171
1565 1171 6380 -3803 -6412 -434 1491 3657 4731 -2610 -4216 5217 3460 -8819 -6548 3507
1579 3507 2527 -2239 -3392 -4181 1088 11582 6096 -8770 -5267 6210 3194 -5064 -5025 -3333 1616
1594 1616 8170 1356 -8958 -475 12485 6297 -5017 -4524 -1338 1734 4513 -2127 -9091 1077
1608 1077 12632 4094 -4957 829 5143 2703 1213 -2383 -5289 3241 7367 -4322 -8153 5554
1622E554O447p023n809j868J183P581Q66j3160l011J3926M516q863l013L634K280
1637C240M315j228j0984j006J0923j011j1321J997R080J982j162l532p076M511
1651a272J2330m888j5036J273J0160O35k650j626l291M804R244n644j1284N111
1665b134R144n480p366K16J654N503O212p748q533Q625R472q211p647L436L291
1680D34J302K21q047n069J1391R095q479n698O382K410m976k444l333R08J1007
1695E104K154j2889m694J1534M162m373j262m74P96M280l252j1839J146J4824
1709E217K150q491j053K687N58K715j810q074M046J1265m815j3025O78Q795M564
1724E407J861l913q681L917J1538l955j1827J405O549Pn06o63l024L855P321n925
$$ plain form
1622 5554 12001 4978 -831 -2699 -1516 6065 6931 -6229 -9240 4686 9202 339 -2674 960 3240
1637 3240 7555 6327 -4657 -5663 5260 4249 -7072 -5075 4005 5987 4825 1293 -5783 -1272
1651 -1272 11058 6170 -8866 -7593 2567 3202 552 -1074 -4365 439 9683 4039 -7245 -2134
1665 -2134 7010 1530 -5836 -5620 -3966 1537 7749 1 -8532 93 9565 1354 -6293 -2857 434
1680 434 1736 1957 -6090 -11159 232 9327 848 -4850 1532 3942 -1034 -3478 -6811 -5903 5104
1695 5104 7258 -5631 -10325 1209 5371 998 -264 -738 58 4338 1086 -10753 -9607 5217
1709 5217 7367 -1124 -2177 510 1068 3783 1973 -6101 -2055 9210 4395 -8630 -7952 843 5407
1724 5407 7268 3355 -5326 -1409 10129 6174 -5653 -4248 2301 2308 1802 1139 -1885 1970 9291 3366
1740C366q326O191O991n261m701P94m24L392L660o568m014J1275P317j0264q542
1755e114K596K853K415J962n926l362R808K140j1717k445J1223N880l110o013
1769A190q619j088J1753L263j0786j685J1357K197p148m079k370L666J0279m21
1783G509j3856k907Q214Q63m472L296L229k95J744l658q434L404R573l953q275
1798h018L118M900j339L23j346l953O044P084q104r267N821P084l151m337j878
1813g019o24Q700P455q573r059O160O253m667m409Q47Q97N859K808j0179o385
1828a1936J1179P974n497l308J642j478o83m09n289R92J2936K823j0807m395N967
1843b89J831j86Q42l878J16O506k837j1600J767J2420L111l549j925l549r39O035
$$ plain form
1740 3366 -4960 1231 8222 2961 -1740 -946 -1370 2022 5682 -886 -4900 6375 13692 3428 -5114
1755 -5114 -2518 335 2750 4712 -1214 -4576 5232 7372 -4345 -6790 4433 10313 7203 1190
1769 1190 -7429 -8517 3236 6499 -4287 -5972 5385 7582 434 -3645 -6015 -2349 7930 7509
1783 7509 -6347 -9254 -1040 -177 -4649 -1353 1876 1581 3325 -333 -8767 -5363 4210 257 -8018
1798 -8018 -4900 0 -1339 -1016 -2362 -6315 -271 6813 -1291 -10558 -4737 2347 -804 -5141 -7019
1813 -7019 -7643 1057 8512 -61 -9120 -2960 3293 -1374 -5783 -4936 -4039 1820 4628 -5551 -11936
1828 -11936 -757 7217 1720 -1588 54 -1424 -2107 -2516 -7805 -6813 6123 8946 -1861 -6256 -289
1843 -289 1542 1356 2198 -1680 -1564 4942 2105 -9495 -7728 4692 7803 4254 2329 -1220 -2159 3876
1859C876j267p488L293Q402l681o907K090L395J998L438l830p276M697P674o903
1874A511q509M023N614J670J89m391m141P627P673q278j0097L861O340L54j119
1889B327m278m089O514P102o326o336P189M686m787l909k950j774O504N775n896
1904b48m022O886O70o862q97N220R76N07k108p877l44R996Q14q293J876Q452n3
1921D693n016m962l883N538J0603m066j2282J278R976P02m333j543kM597N674
1936F974p284j1422M585J0890j122o009o06J331M382M346n210q113M975Q188m863
1951A042o145K211K150O50K538k594l760O453N153o762n358N166J818l167l86
1966i91k33O1O239J919q442k589R302J900o217k208J801O60L009j537p852K100
$$ plain form
1859 3876 2609 -4879 -1586 6816 3135 -3772 -1682 1713 3711 7149 3319 -3957 740 8414 1511
1874 1511 -6998 -2975 2639 4309 4498 107 -4034 3593 11266 2988 -7109 -3248 3092 3446 2327
1889 2327 -1951 -6040 474 7576 1250 -5086 2103 6789 2002 -1907 -4857 -6631 -127 5648 -248
1904 -248 -4270 2616 3286 -3576 -4473 747 1723 2230 122 -7755 -8099 1897 2711 -5582 -3706 4746 4693
1921 4693 -323 -5285 -9168 -3630 6973 2907 -9375 -8097 1879 2581 -1752 -3295 -3297 1300 6974
1936 6974 -310 -11732 -7147 3743 2621 -3388 -3994 -2663 1719 6065 855 -7258 -2283 5905 1042
1951 1042 -5103 -2892 -742 -92 2446 -148 -3908 2545 7698 936 -4422 744 2562 -605 -991
1966 -991 -1224 -1163 5076 6995 -1447 -4036 5266 7166 949 -1259 542 1202 4211 2674 -5178 -3078
1982c078J2734J221j0394l299L986L338J613l290q139K543J1636j071j0380r42
1996c522P783K798m20l309o820K373Q201k972q889K666P690p27k533r04j998K619
2012B036N294m366p336L979M752m262k910L192J473O37J819m040l452O393L245
2027F454q441m165N862K849j083j275l635k80Q851K809r626m435O373K900k741
2042D17k174k689O28P197J974q550k196Q622J861n267k560m66R64M840n52q231
2058f182O62R831J063o522j212J870R92K394j996o939K099Q452k049p316K391
2073b462N168L23l81k231l841L076N767m909p178M826O158k391j707L20p31K890
2089B697K405n659l895O697M256p221m437L698L851K842k8o621k312Q688L734
$$ plain form
1982 -3078 9656 10877 483 -2816 1170 4508 6121 2831 -5308 -2765 8871 7800 -2580 -3522
1996 -3522 4261 7059 6639 3330 -3490 -1117 7084 4112 -4777 -2111 5579 4852 2319 1415 -583 2036
2012 2036 7330 2964 -4372 -393 4359 97 -2813 379 1852 2489 4308 268 -3184 3209 6454
2027 6454 -1987 -6152 -290 2559 1476 201 -3434 -3714 5137 7946 -1680 -6115 258 3158 417
2042 417 -1757 -4446 -3818 3379 5353 -3197 -5393 3229 5090 -177 -2737 -3203 -2239 2601 2049 -6182
2058 -6182 -5520 4311 5374 -1148 -2360 -490 502 2896 900 -6039 -3940 4512 2463 -4853 -2462
2073 -2462 2706 3029 2648 417 -3424 -348 5419 510 -6668 -1842 4316 1925 218 538 -193 2697
2089 2697 5102 -557 -4452 2245 6501 -720 -5157 -1459 2392 5234 5206 -1415 -3727 4961 8695
2104H695r193n614M408M437J839p87o257k281Q886M414p033l389L572M49j157
2119I89L6l061j120O328K002n381l17M997j851l904J674J186o85J554k263n130
2135d946L886P223l207o343L169M371j38j315n416m589O205Q332m866q432L193
2150b873O499Q65j973m476l166O142P041o774q732K922O100M44o28j499j397L295
2166A790L830n431n901M510M048l344r36J353q58J242K079m005r34P135J052p388
2182a758k394L369K70N14M41k576J123O335p79q073N2N783J069k302j338k936
2198c200R40N707r44o682K033P983j037m433j118j037R29L643k412n448M427P041
2214F392l141o408J103L246K773R94m828n738M885O740n067o824L707N770J808
$$ plain form
2104 8695 -498 -6112 -1704 2733 4572 3785 -2472 -4753 4133 8547 1514 -1875 1697 2146 989
2119 989 1025 -2036 -3156 3172 5174 -207 -524 4473 2622 -1282 392 1578 893 2447 184 -4946
2135 -4946 -1060 6163 2956 -3387 -218 4153 4015 2700 -2716 -7305 -1100 7232 2366 -6066 -2873
2150 -2873 3626 4491 2518 -1958 -5124 1018 8059 1285 -7447 -4525 1575 2019 1391 -108 -1505 1790
2166 1790 5620 189 -5712 -1202 2846 -498 -1434 -81 -939 303 2382 -1623 -2557 4578 5630 -1758
2182 -1758 -4152 -783 -513 1 442 -2134 -1011 5324 4545 -3528 -3476 2307 3376 1074 -264 -3200
2198 -3200 -2260 3447 2503 -4179 -2146 5837 4800 367 -751 -1788 -859 2784 372 -5076 -649 6392
2214 6392 3251 -3157 -2054 1192 3965 4959 131 -5607 -722 6018 951 -5873 -2166 3604 5412
2229E412j33o061m695N340O443m445o354L339L217l97p67j423j704M451M005m950
2245A278l365L743l39m353J052L808J98L68r99l730J401P026j751q293J4O135
2261B193K005k092l991m271M187R833q56r744r64N885K241k468l409l347K412
2276b386Q148j087p863K55N787k67j595P5j893O32L294k698n630L047N713k148
2292A384j968K770M1j673mk697j647O313L456p119n057M519M535m23r71l084j014
2309b639O027K636r017m489O206M313j503j944k032j73N017K005p052j819O439
2324A975J382n523j645J284P41L523k48n057R37O431j008o139j61K989J23k29
2340f25j050k908K657O385k985o942K123N495J58k137k563l136K959N089k603
$$ plain form
2229 5412 5279 -782 -5477 -137 6306 1861 -4493 -1154 2063 1666 899 -524 -2228 2223 6228 1278
2245 1278 -2087 1656 1317 -3036 -1984 1824 2022 2390 1391 -2339 -938 6088 4337 -3956 -3942 2193
2261 2193 4198 2106 -1885 -6156 -1969 7864 7008 -2736 -3700 2185 4426 1958 -1451 -4798 -2386
2276 -2386 5762 4675 -3188 -2933 2854 2587 992 1067 -826 -194 3100 402 -5228 -2181 3532 1384
2292 1384 -584 2186 2227 554 550 -2147 -3794 2519 5975 -1144 -6201 -1682 2853 2430 1459 -1625 -2639
2309 -2639 3388 6024 -2993 -7482 -1276 3037 1534 -410 -2442 -2615 2402 4407 -2645 -4464 1975
2324 1975 3357 -2166 -3811 -2527 -1786 1737 1489 -3568 -2631 3800 2792 -3347 -3508 -519 -396 -625
2340 -625 -1675 -4583 -1926 4459 1474 -5468 -3345 2150 2308 171 -2392 -5528 -2569 2520 -83
2355h3n648L567N675j655l437k99r61J785L197l201m045M589L492m756l074M066
2371g88L035Q86o68n589l015O205M094n925l135M210L073r52j139l118K27O338
2387C739J663p787l287N257K833j971j160j750O39N855Q10o677k009N382P63l330
2403a030J26O9m78K322J36l446K360M730l286n246K437L485q79j464k302k126
2419d592M407N506l593o108L382M303j654k385j599j035L714L789n552n010N043
2434a384N302j848l034j164O9K806K295n300m728N017N175k662k880N67J06K027
2450C64K390l558l308L816J868n082o28M096P59j008l5j520k49M809m32o855j5
2467d588N511P99l438n98m39J478M861j238o097Q14N992j141m456O5J199J142
$$ plain form
2355 -83 -5731 -2164 3511 1856 -1581 -1880 -2841 -1056 2141 -1060 -5105 -516 2976 -1780 -4854 -788
2371 -788 2247 3133 2465 -3124 -6139 66 4160 -1765 -4900 -690 2383 1431 292 -2826 -2599 3739
2387 3739 5402 -2385 -5672 -415 2418 447 -713 -2463 -1824 4031 4841 -1836 -3845 1537 2300 -1030
2403 -1030 -904 -835 -1313 1009 1145 -2301 59 4789 1503 -3743 -1306 2179 1300 -164 -2466 -4592
2419 -4592 -185 5321 1728 -4380 -998 3305 1651 -734 -2333 -3368 346 4135 -1417 -6427 -1384
2434 -1384 3918 2070 -964 -2128 -2059 747 3042 -2258 -6986 -1969 3206 544 -2336 -1769 -1663 364
2450 364 2754 -804 -4112 -296 1572 -3510 -4138 -42 717 -291 -326 -1846 -2095 2714 2282 -4573 -4588
2467 -4588 923 1722 -1716 -2314 -2753 -1275 3586 2348 -3749 -2935 3057 1916 -2540 -2475 -1276 -134
2483a34K641j871m896K882O527k247m843J053J595l9N77j886k972L483N015l023
2499A862m451L116K868j287j546p69j135K842K988n086l389N503L905k721k352
2514C48m55j31L311K056n827l219N474L176l548j913J351O15J814J056m004k003
2530a899N118N01n120k09L539L87j019o0k045J302M588j215o684O89M617j55k623
2547b88l17r1J414L388k182n470K663N776j881m659o47N01J680L033k037m186
2563c303K924M768k780m293J555J787J70O82k443l530L259M269k827l071L893
2578A060J217k069q77j150j090L888K404n647k635N132K386l026n87O05L35K673
2594B619l16n969j637O533K625m441k153J205J336K668K1m345j297N479M70n321
$$ plain form
2483 -134 2507 636 -4260 -1378 5149 2902 -1941 -888 707 668 1245 -641 -3613 -130 4885 1862
2499 1862 -2589 527 3395 2108 562 -207 -1342 1500 4488 -598 -3987 1516 5421 2700 348
2514 348 -107 -238 3073 5129 -698 -3917 1557 4733 1185 -728 623 1238 3052 4108 104 -1899
2530 -1899 3219 3720 -1400 -1609 1930 2317 1298 1238 -807 495 5083 3868 -2816 -2127 2490 2335 -288
2547 -288 -605 -696 718 4106 1924 -3546 -883 4893 3012 -1647 -2294 -1793 -113 2920 883 -3303
2563 -3303 -379 4389 1609 -2684 -1129 658 828 1510 -933 -4463 -1204 3065 238 -2833 1060
2578 1060 2277 208 -669 -1819 -2909 979 3383 -2264 -4899 233 2619 -407 -994 -389 -54 2619
2594 2619 2303 -3666 -5303 1230 3855 -586 -2739 -1534 -198 2470 2491 -1854 -3151 2328 2798 -2523
2610b523n12K942Q38M52O0k875N04M459j082m460J187L658j856k969N16N80K514
2627A433L467l197n639K854M834j324l554Q74j09N95J647k910l141N105N044l760
2643B219m090J124R23Q71P68k442k297L660K841m291k445L643K325p17o65k048
2659f21k279L108K175m430r34M948O05l563o59Q79J045L006m98o639p20O053Q76
2676B352m191j35J642O30J604n23m623Q84N642r73n489L19K287J21Q5L37j903
2693a934J365L915l520m549L016M335j383k814m47j311K141L916k285l597K870
2708b82L312l350k476Q50O97J636J110l217k774L879L239l202j591K516L52r49
2724b50l55k273p88M773K243m631k422L236J178m99L67j949p38K983P62m958o55
$$ plain form
2610 -2523 -3035 -93 745 1197 1257 -1618 -1114 3345 2263 -2197 -1010 2648 792 -2177 -1661 -1081 1433
2627 1433 4900 1703 -3936 -1082 3752 2428 -1126 -252 -361 234 1881 -1029 -4170 935 5979 2219
2643 2219 -1871 -747 176 1047 1815 -627 -2924 736 3577 -714 -3159 484 2809 2092 1427 -621
2659 -621 -2900 208 2383 -2047 -2981 1967 2572 -991 -1650 -771 274 3280 2782 -3857 -4577 1476 2352
2676 2352 -1839 -1974 -332 298 1902 1379 -3244 -2360 3282 2309 -3180 -2861 -574 -453 -368 -31 -1934
2693 -1934 -569 3346 -174 -4723 -1707 2628 1245 -1569 -2016 -3327 -1186 2730 445 -3152 -282
2708 -282 3030 -320 -2796 -1946 -1249 387 1497 -1720 -4494 -615 2624 -578 -2169 347 699 -250
2724 -250 -605 -2878 -3666 1107 3350 -1281 -3703 -467 711 212 579 -1370 -2108 875 1637 -3321 -3976
2741c976M898O60k137l1n01k50K919K82m633M11M540j253l918O77K029R83J586
2758B286j225m194J262N000j796m251J173K406k85l47p44j955L038M028k884m667
2774c155J728L138q88j061n42r11K234K531l046l076L475L437k926j692M75m85
2790g64Q40J600k257j736M275J514m116j277L153N39n5k25l437j059M814J469
2806C278m545q64L687N84j294q5j987n68M309P0m913n49M269j54j584N56l39o9
2824a98K448r02m338J277M308j079l756N42J216M69J743j067l056J557L929k728
2840C65m261K146K219p83o3j017j603L004L102l544l493L301K511k231j548p31
2856b626m66L147K567l917l022L983K083k206j058J62j076J483J982l133j593
$$ plain form
2741 -3976 922 1582 -555 -586 -1087 -1337 1582 1864 -2769 -2358 2182 929 -2989 -2312 -283 700 2286
2758 2286 1061 -3133 -1871 3129 1333 -2918 -1745 661 376 29 -715 -2670 368 4396 1512 -3155
2774 -3155 -1427 1711 823 -238 -780 -1691 543 3074 28 -3048 427 3864 938 -754 -279 -764
2790 -764 76 1676 -581 -2317 1958 3472 -644 -1921 1232 1771 1716 1491 -1946 -3005 1809 3278
2806 3278 -1267 -2131 1556 2140 846 761 -1226 -1794 2515 2585 -2328 -2877 1392 1238 -346 210 -129 -198
2824 -198 2250 1348 -2990 -1713 2595 1516 -2240 -1698 -482 -13 1730 663 -2393 -836 3093 365
2840 365 -3896 -1750 469 -314 -377 -1394 -2997 7 3109 -435 -3928 -627 1884 -347 -1895 -2626
2856 -2626 -3092 55 2622 -1295 -4317 -334 1749 -457 -1515 -1353 -2429 -946 1036 -2097 -3690
2871c690L943J231l198J27K087p70j22rj736o93L992k94m581Q97M029L78j576
2888A5k26j585L70L552p88m888O66M041m99j225o0p06J196K669j214m137J254
2905a565L814j683k066R31N98J05J681j047k782K602L095l081k965K291J305m67
2921G66j13j285j249L945K375m244l080L737J986j690j034j428p02L440K420m403
2937e59k128L919J291j942n89J46q12J375R49l013m57L640K04l883R54K008o2
2954A041l31l60k520N3M215j038m222J103L208l83o00n67j419Q85K691j489l988
2971c721J555L139q67j724M79l55J249K288k230l278K350K356k000j689Q77P11
2987h60M65J258j876k409L203K750l124k261J846J194p84K97j642j055L482J867
$$ plain form
2871 -3690 253 1484 -1714 -1587 500 -270 -392 -401 -2137 -2830 1162 868 -3713 -2816 1213 1591 15
2888 15 -211 -1796 -1426 2126 1338 -3550 -2884 1157 658 -567 -627 -1333 -137 2532 1318 -2819 -1565
2905 -1565 2249 566 -1500 -569 29 134 1815 768 -2014 588 3683 602 -2363 -72 1233 766
2921 766 653 -632 -1881 2064 4439 195 -2885 852 2838 1148 114 -1314 -2016 1424 3844 -559
2937 -559 -2687 1232 2523 581 -8 138 -674 701 1650 -1363 -1820 1820 2024 -1859 -905 1103 1041
2954 1041 710 350 -2170 -2117 2098 1060 -3162 -2059 1149 766 166 -401 -1820 -935 1756 267 -3721
2971 -3721 -2166 973 106 -1618 -1139 -1494 -245 2043 -187 -3465 -1115 1241 -759 -2448 -1571 -860
2987 -860 -395 863 -1013 -3422 -219 2531 -593 -2854 -1008 186 -598 -301 -1943 -2998 484 2351
3003B351l520j386L204O36j586l61p27l56K926J254m432o34M248N11k126j25J97
3020G4m85J693l5l090K95M310o93l097J324J782j389N63K51k168M71L352j644
3037A514l376J687K710p58r88Q59j423Q53K751k368l557K243K989j652j304P74
3053I54q09J285K537k905l035K608K861k030j889K08r0J112K135j761k099K103
3069A185J837k957r81J695R0l86L09j186j302L195J119l919l16L344Qr41q94j315
3087a415l23K934K48l199j05L260j38k235M07K9n0J847o06l090L95L505j076k652
3105b264J146J471J41L93r29k596J163L260k010k786J786K008p19j87o70j351
3121b144J967K990k452k735J408J549j125l07O26r17J525K066k669k123K595J449
$$ plain form
3003 2351 -1169 -2555 649 1285 -301 -662 -1389 -1745 1181 2435 -1997 -2631 1617 2128 2 -123 74
3020 74 -411 1282 1247 -1843 -1548 2762 2069 -1028 296 2078 689 1252 1503 -665 -194 3158 1514
3037 1514 -1862 -175 2535 1777 789 1648 225 1078 3829 1461 -2096 147 3136 1484 180 954
3053 954 145 1430 3967 1062 -1973 635 3496 1466 -423 -215 -305 807 2942 1181 -918 1185
3069 1185 3022 65 -916 779 869 483 792 -394 -1696 1499 2618 -1301 -1617 1727 1735 794 -100 -1415
3087 -1415 -1738 1196 1444 -1755 -1860 1400 1262 -973 -566 -537 -587 1260 654 -2436 -2041 1464 388 -2264
3105 -2264 -1118 353 494 887 -42 -2638 -1475 1785 -225 -3011 -1225 783 64 -123 -793 -2144
3121 -2144 -177 2813 361 -2374 -966 583 -542 -849 -223 -1140 385 2451 -218 -2341 254 1703
3137A703j967n30J044n33N25P74j657j227L967J139l611q57J780L48p57N66j515
3154h08n30L857M10m075n61L438O2r11l30j500k03L214j19l915P84L286l39j458
3172C02O34p91m86J502m38k704J482K721j509j842J102R06n64J002r63j815J627
3189A66K708k961k943K316J359k67P75n46k157J563J813k684j508K614J468j965
3205b49r79k8l87J790J663k361j591K735R12k982n65J185K84P18P74k585p20L280
3223H94M75k916k64J659J02J1m35k468P28L542O02m055J29K655l39m98j99j160
3241a537J3K446k74k716P08K428j144j117R09J24m02J752j218k583K134J983j954
3258d48j745K183R27l66Oj149j840K698K436l026k120K291R86q59Q2q56p45K586
$$ plain form
3137 1703 -264 -794 250 -283 242 1016 -641 -1868 2099 3238 -373 -1230 550 898 141 707 -808
3154 -808 -1338 2519 2929 -1146 -1707 1731 1793 882 552 -948 -1151 2063 1944 -1971 -1187 2099 1760 302
3172 302 936 145 -341 1161 723 -1981 -499 2222 713 -1129 -27 879 315 1317 354 -1461 166
3189 166 2874 -87 -3030 -714 645 378 1153 607 -1550 13 1826 -858 -2366 248 1716 -249
3205 -249 -1228 -1256 -1643 147 1810 -551 -2142 593 1505 -1477 -2042 -857 -573 145 919 -1666 -2386 894
3223 894 1369 -1547 -1811 -152 -50 -39 -474 -2942 -2214 1328 1930 -2125 -1996 659 320 -178 -377 -1537
3241 -1537 -1524 922 648 -2068 -1360 1068 -76 -1193 -284 -160 -562 1190 -28 -2611 -477 1506 -448
3258 -448 -2193 -10 917 551 557 -592 -2432 266 2702 -324 -2444 -153 833 -26 56 -800 -1545 1041
3276A041K066l914j584K134J176j067L27m72j168K138J061k518j170K715O06j928
3292e57K01L51r01R74P02j713L98K599q26k579O56J557m56o6j76j508N22K814
3310A992j017k941J324K110k35q36J43j374J35K470j055k865J529K353j099r81
3326c47P61o70M09J662j503k162J937K140k405p33J384L09n3P51j549j077J941
3343G95J376k585j524K218R38p68M82j318o81K430J189k821q37J791Q7r30M46
3360B88k78o68J691M32k207k03K728n26k224K69J123o91Q46j97k251Q15K888o37
3378A198k391O35J198q01P6k23r53Q86K399j745k491J528J874n66n01l16j268
3395a461P96K146j475k474J790J615o08o05L61j300P42J681j171j641K035R65
$$ plain form
3276 1041 3107 -807 -2391 -257 919 -148 179 -293 -1461 677 1738 -780 -1950 765 1371 -557
3292 -557 -356 -5 -906 68 770 -943 -545 2054 1228 -1351 -695 862 406 340 164 -1344 -822 1992
3310 1992 975 -1966 -642 1468 1233 397 540 -834 -699 1771 716 -2149 -620 1733 634 -347
3326 -347 414 -256 153 1815 312 -1850 87 2227 -178 -911 473 782 729 1480 -69 -1146 795
3343 795 2171 -414 -1938 280 1218 450 932 -386 -1067 1363 2552 -269 -1106 685 772 -158 288
3360 288 10 -658 1033 1465 -742 -945 1783 1257 -967 -698 425 -266 580 383 -1868 -1053 1835 1198
3378 1198 -1193 -558 640 -161 -85 -308 -1261 -375 2024 279 -2212 -684 1190 624 123 -193 -1461
3395 -1461 -665 1481 6 -2468 -678 937 329 -276 85 -1215 -473 1208 37 -1604 431 1396
3411A396k571o5J821k33o8P54j516q69K236Q15k552j07J807k74o97K91m22j16
3429c70K251r3k550J09K190l45j612J97K9J16K408n22l101P74K617K15j793k85
3447B35m1m13J920L05k498K98J836l35j336J166N68r81N3L7j538J347J738j125
3465A236k226J793Q86j138j57J07j077J517J517k145k035K019J234j678N26O29
3481A008q12M08M71k192p43K361J486k466p72Q07j74O95J001j611j007K338L82
3498A180k856J93J424j07m54P11j089l90K294m20k627N58K365l67j361K94q38
3515a490K54K278j63k898M49K436m73j184M38j18n86R58O5j668J695J678j428
3532B43j901J004Q78l27P24n19j545J301J422j985o14K004R38o97m26m19j098
$$ plain form
3411 1396 -1175 -1240 581 348 280 1034 -482 -1351 885 1700 -852 -959 848 574 -123 168 -254 -370
3429 -370 1881 1788 -762 -653 1537 1192 -420 -223 -194 -78 2330 1808 -1293 -519 2098 2313 520 235
3447 235 194 -219 1701 2006 -492 -194 1642 1307 -29 1137 1705 724 777 814 -724 623 2361 1236
3465 1236 -990 803 1689 551 394 501 -576 941 2458 313 -1722 297 1531 -147 379 1008
3481 1008 196 604 1075 -1117 -1860 501 1987 -479 -1251 -444 -618 77 1078 -533 -1540 798 1180
3498 1180 -1676 -1483 -59 -166 -620 91 -998 -1388 906 486 -2141 -1583 782 415 -946 -652 -1490
3515 -1490 -1236 1042 879 -2019 -1570 866 393 -791 -353 -471 -1057 -99 -34 -1702 -7 1671 243
3532 243 -1658 -654 224 -103 621 102 -1443 -142 1280 -705 -1319 685 1623 926 500 81 -1017
3549a017J200J586k041o46K273K96j755n12N49K60J664R32k876j443K254N10j365
3566a31N15M44r4K84K80j750j01K262J39k147K26J070oq29M64r58K64K282p59
3585A455k247N14J700r04m93K1k8J51J260r73j818J377J632j358j342Q85K65L11
3603D08O13j519k073J666K650r36j486N62j24m02O06l95j128J532J101j868j109
3620a902J607K91p08L97p4m32R48L59k187j049K657Q49j264r9J01n87P87P15j672
3639a263J78J870n75j930L62R92M7R28o1k107M36K137m58j780J74J066k39L62
3657A39K49j527J87J986n84j647J342R85q54r64M35o16P58J390j475j236J655
3674B23J645j275j147O49p10P97J299q80j896J609R85j872k31J933j87o13L01
$$ plain form
3549 -1017 183 1769 -272 -918 1355 1651 -104 -616 -67 193 1857 2789 -87 -1530 724 1234 -131
3566 -131 384 828 734 1018 1298 -452 -553 1709 1848 -299 -73 997 991 162 626 -332 -68 2214 1455
3585 1455 -792 -278 1422 518 25 46 18 169 1429 456 -1362 15 1647 289 -1053 -168 97 408
3603 408 1021 -498 -2571 -905 1745 809 -677 -115 -239 -641 -35 -430 -1558 -26 1075 -793 -1902
3620 -1902 -295 -4 -712 -315 -389 -821 127 486 -1701 -2750 -93 756 -508 -607 -506 -1093 -306 409 -1263
3639 -1263 -1085 785 210 -1720 -1358 -366 -319 609 548 -1559 -1123 1014 556 -1224 -1050 16 -223 139
3657 139 388 -1139 -952 1034 450 -1197 145 1130 276 -688 -253 -869 -111 1279 -196 -1432 223
3674 223 1868 593 -554 95 -615 182 1481 601 -1295 314 1299 -573 -804 1129 942 329 630
3691F30j049p65K065M50j759q68K142K62p66K5o63m67J609Q47j923r69J528k42
3709H7p66Q16L85n51N49K15j957P96J954q57j980N39O26M44K98m42j493N59J869
3728A091l72j522L93K92l78J40L52q48N62J052r24j444J224J104j111k84O1l99
3746a011Q06J196j417j149J406J053r51o28L88l43M10M93r71o54J968M01j843
3763h46l84J369j24J56J03j199r51J959Q20j773k35J081K76l28N58r65o32J428
3781C13K71j632j94J802n22j097P56J10k66J247l27j888O21K021o72j687Q11N38
3799B05n45N89Q7j323M53J866p11j450M20R40o14K54Nj324J191J340j160j397
3817a174J115J079r30j29j31q00J285P51j259j097J734J184j664J86J2m38M51
$$ plain form
3691 630 -419 -1184 881 1331 -428 -1296 846 1108 342 367 -296 -763 846 1693 -230 -1199 329 87
3709 87 -679 137 522 -29 520 735 -1222 -426 1528 671 -1309 -770 -144 300 598 156 -1337 -778 1091
3728 1091 719 -803 -410 -118 -496 -356 -4 -852 -290 762 -162 -1606 -382 722 -389 -673 -612 -1011
3746 -1011 -205 991 -426 -1575 -169 884 -67 -695 -307 -650 -240 253 -718 -1372 596 997 -846
3763 -846 -1230 139 15 171 274 -925 -1876 83 903 -870 -1105 -24 252 -76 482 -483 -1115 313
3781 313 584 -1048 -1242 560 38 -1059 -303 -193 -459 788 461 -1427 -806 1215 543 -1144 -333 205
3799 205 -340 249 336 -987 -534 1332 621 -829 -409 531 -83 171 176 -1148 43 1383 223 -1174
3817 -1174 -59 1020 90 -39 -170 -970 315 1066 -193 -1290 444 1628 -36 150 162 -276 175
3834A75N94q84q08J528L50j410L61P64m58N67J15j041o4J621n83k024L35J922
3852A060q9o21n14k31J17J734l56k135K73J922o26l13l31k50M1J432o41j507Q46
3871a89J317p66r94M29J43k0O18m13j083O48J147r58q05J430j7p57J34r0q24Q69
3891a81J056j245o34J600L7j061K14k09o6P27O11j628o02J671N20j509L02J80
3909b17l42R62L65j796k21J522M58j642M11R89m16M6l4p81q8J956n09j729M12
3928f54J019l28J64l75o27P13J559n68k080J85J623k34j64K82n37j88R68k60j381
3947h83O84J485q11p48L72J47l72M64R5j113J608Q07k058l76J370J84o40M97m11
3966C01N9O91r6j509k58J593L56p16l58j74l20J340M25j674m73J603N95j386K47
$$ plain form
3834 175 769 -115 -923 605 955 -455 -94 670 212 779 894 -147 -211 1410 827 -1197 -862 1060
3852 1060 971 350 -164 -395 -278 1456 1100 -1035 -762 1160 534 221 -110 -360 -319 1113 472 -1035 -189
3871 -189 1128 362 -632 -203 -60 -80 538 125 -958 -310 837 -121 -926 504 487 -270 -136 -226 -1050 -181
3891 -181 875 -370 -1004 596 633 -428 -214 -423 -489 238 849 -779 -1381 290 810 -699 -397 -217
3909 -217 -559 403 768 -1028 -1249 273 731 -911 -500 489 73 119 85 -696 -784 1172 663 -1066 -654
3928 -654 365 37 201 -174 -801 -88 1471 903 -1177 -992 631 397 233 515 -22 -210 758 498 -883
3947 -883 -199 1286 475 -273 99 246 -126 338 433 -680 928 1735 -323 -699 671 855 215 712 301
3966 301 360 1051 955 -554 -812 781 1137 421 63 -111 -431 909 1334 -340 -813 790 1385 -1 246
3985B46k80n95J259M42j200r10J799j79j448Q96L11l62L64K42r26j2J112j184
4003d25p94J155J020p50l90p2n32N71J223j147j119P73J392j085l49j63J34N21
4021c7J062j082j175J008P53j009k29P16m85L56M45r35q49J595Q06j293m56R32
4039A23j11n33M85n39m08J126M35j222l31J961n81r92J97J35k63J142q3j639J29
4058i69J509l8r14M04Q1j80P34j56j211O3J365l74p85M94M27m57K37J70r15J122
4078F07J062j044j505P55N13J23r8p5p32Q13Q40j015j230J182Q03n42k69k58o14
4097f84Q07J031r04j017J269N66j268j6L57l88K46R66r37r76J083N30j195J30
4115d00J055o18j64L64m21k61O38J81j659P20J654q05q42j4J68j42Q75k44j567
$$ plain form
3985 246 -34 -629 630 1072 -128 -1038 761 582 -866 30 341 -21 343 585 -341 -353 759 -425
4003 -425 -1219 -64 956 206 -184 -256 -788 -217 1006 -141 -1260 -487 905 -180 -529 -692 -558 -37
4021 -37 1025 -57 -1232 -224 529 -480 -709 7 -478 -122 323 -612 -1461 134 940 -353 -809 123
4039 123 12 -521 -36 -575 -983 143 578 -644 -975 986 405 -587 -390 -255 -518 624 541 -1098 -969
4058 -969 540 502 -412 -8 73 -107 627 471 -740 -677 688 314 -471 23 450 -7 230 400 -515 607
4078 607 1669 625 -880 -125 388 511 413 338 -394 419 1259 244 -986 196 999 457 188 -70 -684
4097 -684 123 1154 250 -767 502 1068 -200 -216 141 -247 -1 965 28 -948 135 665 -530 -400
4115 -400 655 37 -127 237 -184 -445 193 374 -1285 -565 1089 284 -558 -572 -404 -546 329 85 -1482
4134a482N04J503n02n79j15M0K60J007m09j502K57J389o03q96P40L56l63J90m3
4153b48q94L07J517r40q75O17M36l44J75J0m49L61J018r07j144J408m7m76O3L85
4173b7m18L39M30j122K9J005M03j455K05P82l79m3O09j060J08J227K25j726O62
4192b06O56k32l27K38o68n4J467l4j586M01J163j69p83J52j70l89J754n22j648
4211i57O75J256q60M3O7n54L67L76J7j415J062J064j297n78Q17L15o01M31R0j009
4231f91J062O53j267m80Q43J90l67K21m14l03P96N54j244m26J445J93j229K35
4249b29l57J58L00R62j223l50J321j52q97j32N41J18J96j12j026K5J527l37j206
4268h73O83P92j008M0N28q26k13J313l38q08K34Q79m75NJ47k37j46O92p32p54
$$ plain form
4134 -1482 -978 525 23 -556 -671 -631 -371 636 227 -1275 -1018 371 -232 -1128 -388 -32 -395 -205 -248
4153 -248 -1142 -835 682 -258 -1133 -516 -80 -424 -249 -239 -688 -327 691 -216 -1360 48 1 -475 -412 -27
4173 -27 -445 -106 324 -798 -769 236 639 -816 -611 171 -208 -251 358 -702 -594 633 858 -868 -206
4192 -206 450 218 -109 129 -539 -593 874 840 -746 -345 818 649 -134 18 -152 -541 1213 691 -957
4211 -957 -282 974 114 157 224 -330 37 413 430 -985 77 1141 -156 -734 83 398 -203 228 318 -691
4231 -691 371 1024 -243 -723 120 310 -57 164 -250 -553 243 797 -447 -873 572 765 -464 -229
4249 -229 -586 -428 -128 834 -389 -739 582 430 -467 -599 -58 60 256 144 -882 -857 670 333 -873
4268 -873 -190 602 -406 -366 162 -664 -877 436 98 -710 -476 403 -72 -67 80 -157 -303 389 -343 -1097
4288a097J509M80j089m25P06j54k58P08m32j196J389P61j189l18M01L94j60M73
4306E03n70l12N99J013j218n59Q17K08o12N46l04o57Q26R82j026m72N76M89q05
4325B4K85L3p03P17O22j231k9J086j44j116N85K01n68M31K91o03J46R86r57p24
4345f68Q53M54k83l14K91r38O24N37j63j173Q17J047p81o98L00k62M45J044j025
4364A07j111Q52R15q01j26N54m02J23N97j082j85O12Q51j295N0N36m62K00L94
4383C27m11o50J035K16j073L72L53Q0l27k10P3l54J033Q5j173K43O90k00p53M61
4403a83J78m83O28l6r68L29Q15j26o24N71J13o61M02l41k82L87J042l72j127M29
4423c09K59p9L22j26m32J14Q68o90p71Q18J54l93M41j27k70K48O11m31p38Q62
$$ plain form
4288 -1097 412 892 -197 -622 84 -70 -328 380 -52 -1248 141 902 -287 -605 -204 190 30 503
4306 503 -67 -379 220 1233 15 -544 273 481 -131 415 111 -546 280 1262 236 -236 340 829 24
4325 24 309 342 -361 356 978 -253 -282 804 660 -456 129 330 -238 193 484 -119 27 1013 56 -668
4345 -668 185 639 356 42 333 -605 19 556 393 -780 37 1084 303 -395 -95 -357 88 1132 107
4364 107 -1004 -152 763 -38 -164 390 -12 111 708 -374 -559 53 904 -391 -341 195 -267 -67 327
4383 327 -84 -734 301 517 -556 -184 169 249 -78 -288 -215 -569 464 549 -624 -381 309 109 -644 -183
4403 -183 -5 -488 140 104 -864 -535 280 154 -470 101 214 -447 -45 -386 -668 -281 761 389 -738 -309
4423 -309 -50 -129 193 67 -365 -251 617 -73 -844 -26 128 -265 176 49 -221 27 638 207 -531 331
4443C31K19n74n64L64N2M73O44r97q10R59M43j034J95O28l09o6N86p40k06R32
4463E26m9j028L52O67k24l14J48k93j61Q09k90q96N46J011o82n12P53o14l49J439
4483H39o34n99L13Q68n31p33M02L90o95O36l3r94J79J470p16r96Q75K50p54N37
4503G4J23n77K78P43p38m20P37K41p13m3L76k06K09L63r75o19J670j8r96Q1L28
4524h2l35L14N23r95m06J030K40o31J48K1r3N2M89o20o56J372k51j119N60L12
4544a27Pn88O89k69j07P02k00j311Q02Q73q71J40N53m94j95O99k76q09O22R82
4564H22p07m34Q7M05o20Q18m98o11P69N19n76m69O77j01j13J87J38p15O19N75
4584G72j057j70R55j14n73J24K31o9L65N69j834R9J412j77o95J79k9j35N68M81
$$ plain form
4443 331 550 -24 -588 -224 -172 301 945 -52 -862 97 540 -494 -299 329 20 -46 540 -200 -406 526
4463 526 477 -551 -199 468 244 -70 78 -215 -376 433 143 -753 -207 804 122 -390 363 -251 -600 839
4483 839 205 -394 -81 787 256 -477 -75 315 -380 256 223 -771 -592 878 162 -834 41 291 -463 74
4503 74 197 -380 -102 641 -97 -517 220 461 -252 -295 81 -125 84 447 -528 -1147 523 505 -491 -410 -82
4524 -82 -417 -103 420 -575 -981 49 289 -342 -194 -173 -266 -214 275 -345 -1001 371 120 -999 -439 -127
4544 -127 -120 -708 -19 -288 -395 307 107 -1204 -402 471 -400 -260 293 -201 -396 303 27 -782 -160 822
4564 822 115 -319 -232 173 -447 371 -127 -738 31 550 -26 -495 182 81 -32 155 293 -422 197 772
4584 772 -285 -455 500 386 -187 -63 168 99 464 1033 -801 -702 710 533 -162 17 -12 -147 421 902
4604I02j144p1R07j44q81N84M25n40J40N3l69q8Q60j75r64Q27J91n99J09J33o39
4625d83K72O98l35o19N61L34o70k08M19J8m71P94m08r18J129L78o80n94Q49k86
4645b20j5M66o22o74J265L95r97o58J069j23m50P25o46o90R58O93j174k64J058
4664I6o63k14Q19J72o94J92P00q96l57R60j26o90O67p7j07K72L41j203K09J329
4684G30o38m99K53N96m79N06P4p53J09O45k36o38K16N34l14p9M70q06L36O89o55
$$ plain form
4604 902 -242 -313 594 450 -431 153 578 38 178 231 -138 -226 634 459 -505 322 513 -86 23 156 -483
4625 -483 -211 487 152 -467 94 428 -242 -450 -31 -13 -484 310 -98 -1016 113 491 -189 -783 66 -220
4645 -220 -235 231 -391 -1065 200 595 -402 -1060 9 -114 -564 161 -485 -1175 -217 476 -698 -962 96
4664 96 -567 -781 38 210 -484 -292 408 -488 -845 115 -11 -701 -34 -111 -218 54 395 -808 -599 730
4684 730 92 -407 -154 442 -37 469 543 -210 -101 544 308 -330 -114 420 106 27 497 -309 27 716 61
$$ [...]
8191A0
##END NTUPLES=NMR FID
##END=
