##TITLE=1H_TG-2293-AH
 CDCl3, 8 sc, 
 27.7.2020
##JCAMPDX= 6.0         $$ Bruker NMR JCAMP-DX V2.0
##DATA TYPE= NMR FID
##DATA CLASS= NTUPLES
##ORIGIN= UXNMR, Bruker Analytische Messtechnik GmbH
##OWNER= root
$$ XWIN-NMR		Version 3.5
$$ Mon Jul 27 10:49:47 2020 Russian Standard Time (UT+4h)  she@DPX200
##.OBSERVE FREQUENCY= 200.1315
##.OBSERVE NUCLEUS= ^1H
##.DELAY= (6, 6)
##.ACQUISITION MODE= SIMULTANEOUS
##.ACQUISITION SCHEME= undefined
##.AVERAGES= 8
##.DIGITISER RES= 18
##SPECTROMETER/DATA SYSTEM= spect
##.PULSE SEQUENCE= zg30
##.SOLVENT NAME= CDCl3
##.SHIFT REFERENCE= (INTERNAL, CDCl3, 0, 15.7039)
##AUDIT TRAIL= $$ (NUMBER, WHEN, WHO, WHERE, WHAT)
$$ ##TITLE= Audit trail, XWIN-NMR		Version 3.5
$$ ##JCAMPDX= 5.01
$$ ##ORIGIN= Bruker BioSpin GmbH
$$ ##OWNER= she
$$ F:/spectra/data/she/nmr/H-F/1/audita.txt
$$ ##AUDIT TRAIL=  $$ (NUMBER, WHEN, WHO, WHERE, WHAT)
(   1,<2020-07-27 10:48:33.51 +0400>,<she>,<DPX200>,
      <created by zg, POWCHK disabled, PULCHK disabled
       configuration hash MD5:
       00 E9 B6 7A A2 85 ED C7 34 08 36 98 17 FE 4E 26
       data hash MD5: 16K
       01 DF 3A 2E F0 05 9F 39 90 00 4F 3E 4A EE 99 AE>)
$$ ##END=
$$ 
$$ hash MD5
$$ F1 30 C2 37 51 9B AA 11 9D BB DC 04 B5 1C 33 81
##$RELAX= 
##$RELAX= 
##$RELAX= 
##$RELAX= 
##$RELAX= 
##$RELAX= 
$$ Bruker specific parameters
$$ --------------------------
##$DU= <F:/spectra>
##$EXPNO= 1
##$NAME= <H-F>
##$PROCNO= 1
##$TYPE= <nmr>
##$USER= <she>
##$AMP= (0..31)
100 100 100 100 100 100 100 100 100 100 100 100 100 100 100 100 100 100 
100 100 100 100 100 100 100 100 100 100 100 100 100 100 
##$AQSEQ= 0
##$AQ_mod= 1
##$AUNM= <au_zg>
##$AUTOPOS= <>
##$BF1= 200.13
##$BF2= 200.13
##$BF3= 200.13
##$BF4= 200.13
##$BF5= 200.13
##$BF6= 200.13
##$BF7= 200.13
##$BF8= 200.13
##$BYTORDA= 1
##$CFDGTYP= 0
##$CFRGTYP= 5
##$CHEMSTR= <none>
##$CNST= (0..31)
1 1 145 1 1 1 1 1 1 1 1 1 1 1 1 1 1 1 1 1 1 1 1 1 1 1 1 1 1 1 1 1 
##$CPDPRG= <>
##$CPDPRG1= <>
##$CPDPRG2= <>
##$CPDPRG3= <>
##$CPDPRG4= <mlev>
##$CPDPRG5= <mlev>
##$CPDPRG6= <mlev>
##$CPDPRG7= <mlev>
##$CPDPRG8= <mlev>
##$CPDPRGB= <>
##$CPDPRGT= <>
##$D= (0..31)
0 1.2 0 0 0 0 0 0 0 0.06 0 0.03 0 0 0 0 0.0002 0 0 0 0 0 0 0 0 0 0 0 0 
0 0 0 
##$DATE= 1595832512
##$DBL= (0..7)
120 120 120 120 120 120 120 120 
##$DBP= (0..7)
150 150 150 150 150 150 150 150 
##$DBP07= 0
##$DBPNAM0= <>
##$DBPNAM1= <>
##$DBPNAM2= <>
##$DBPNAM3= <>
##$DBPNAM4= <>
##$DBPNAM5= <>
##$DBPNAM6= <>
##$DBPNAM7= <>
##$DBPOAL= (0..7)
0.5 0.5 0.5 0.5 0.5 0.5 0.5 0.5 
##$DBPOFFS= (0..7)
0 0 0 0 0 0 0 0 
##$DE= 6
##$DECBNUC= <off>
##$DECIM= 24
##$DECNUC= <off>
##$DECSTAT= 4
##$DIGMOD= 1
##$DIGTYP= 9
##$DL= (0..7)
0 120 120 120 120 120 120 120 
##$DP= (0..7)
150 150 150 150 150 150 150 150 
##$DP07= 0
##$DPNAME0= <>
##$DPNAME1= <>
##$DPNAME2= <>
##$DPNAME3= <>
##$DPNAME4= <>
##$DPNAME5= <>
##$DPNAME6= <>
##$DPNAME7= <>
##$DPOAL= (0..7)
0.5 0.5 0.5 0.5 0.5 0.5 0.5 0.5 
##$DPOFFS= (0..7)
0 0 0 0 0 0 0 0 
##$DQDMODE= 0
##$DR= 18
##$DS= 0
##$DSLIST= <SSSSSSSSSSSSSSS>
$$ [...]
##$SUBNAM2= <"">
##$SUBNAM3= <"">
##$SUBNAM4= <"">
##$SUBNAM5= <"">
##$SUBNAM6= <"">
##$SUBNAM7= <"">
##$SUBNAM8= <"">
##$SUBNAM9= <"">
##$SW= 24.9337058887773
##$SWIBOX= (0..15)
0 0 2 0 0 0 0 0 0 0 0 0 0 0 0 0 
##$SW_h= 4990.01996007984
##$TD= 16384
##$TD0= 1
##$TE= 0
##$TE2= 300
##$TE3= 300
##$TEG= 300
##$TL= (0..7)
0 120 120 120 120 120 120 120 
##$TP= (0..7)
150 150 150 150 150 150 150 150 
##$TP07= 0
##$TPNAME0= <>
##$TPNAME1= <>
##$TPNAME2= <>
##$TPNAME3= <>
##$TPNAME4= <>
##$TPNAME5= <>
##$TPNAME6= <>
##$TPNAME7= <>
##$TPOAL= (0..7)
0.5 0.5 0.5 0.5 0.5 0.5 0.5 0.5 
##$TPOFFS= (0..7)
0 0 0 0 0 0 0 0 
##$TUNHIN= 0
##$TUNHOUT= 0
##$TUNXOUT= 0
##$USERA1= <user>
##$USERA2= <user>
##$USERA3= <user>
##$USERA4= <user>
##$USERA5= <user>
##$V9= 5
##$VALIST= <valist>
##$VCLIST= <CCCCCCCCCCCCCCC>
##$VD= 0
##$VDLIST= <DDDDDDDDDDDDDDD>
##$VPLIST= <PPPPPPPPPPPPPPP>
##$VTLIST= <TTTTTTTTTTTTTTT>
##$WBST= 1024
##$WBSW= 4
##$XGAIN= (0..3)
0 0 0 0 
##$XL= 0
##$YL= 0
##$YMAX_a= 726712
##$YMIN_a= -277069
##$ZGOPTNS= <>
##$ZL1= 120
##$ZL2= 120
##$ZL3= 120
##$ZL4= 120
##$ABSF1= 10
##$ABSF2= 0
##$ABSG= 5
##$ABSL= 3
##$ALPHA= 0
##$AQORDER= 0
##$ASSFAC= 0
##$ASSFACI= 0
##$ASSFACX= 0
##$ASSWID= 0
##$AUNMP= <proc_1d>
##$AZFE= 0.1
##$AZFW= 0.1
##$BCFW= 1
##$BC_mod= 2
##$BYTORDP= 1
##$COROFFS= 0
##$CY= 11.3945322036743
##$DATMOD= 1
##$DC= 2
##$DFILT= <>
##$DTYPP= 0
##$F1P= 16.9975609425685
##$F2P= -3.02152046262296
##$FCOR= 0.5
##$FTSIZE= 0
##$FT_mod= 4
##$GAMMA= 1
##$GB= 0.15
##$INTBC= 1
##$INTSCL= 1
##$ISEN= 128
##$LB= 0.24
##$LEV0= 0
##$LPBIN= 0
##$MAXI= 10000
##$MC2= 0
##$MEAN= 0
##$ME_mod= 0
##$MI= 1.114404
##$NCOEF= 0
##$NC_proc= 0
##$NLEV= 6
##$NOISF1= 3.799351
##$NOISF2= 2.8
##$NSP= 1
##$NTH_PI= 0
##$NZP= 0
##$OFFSET= 15.70392
##$PC= 1
##$PHC0= -9798.19
##$PHC1= 24.20092
##$PH_mod= 1
##$PKNL= yes
##$PPARMOD= 0
##$PSCAL= 0
##$PSIGN= 0
##$REVERSE= no
##$SF= 200.130013532006
##$SI= 16384
##$SIGF1= 3
##$SIGF2= 2
##$SINO= 400
##$SIOLD= 16384
##$SREGLST= <1H.CDCl3>
##$SSB= 0
##$STSI= 0
##$STSR= 0
##$SW_p= 3612.71676300578
##$SYMM= 0
##$S_DEV= 0
##$TDeff= 0
##$TDoff= 0
##$TI= <>
##$TILT= no
##$TM1= 0
##$TM2= 0
##$TOPLEV= 0
##$USERP1= <user>
##$USERP2= <user>
##$USERP3= <user>
##$USERP4= <user>
##$USERP5= <user>
##$WDW= 1
##$XDIM= 8192
##$YMAX_p= 0
##$YMIN_p= 0
$$ End of Bruker specific parameters
$$ ---------------------------------
##NTUPLES= NMR FID
##VAR_NAME=  TIME,          FID/REAL,        FID/IMAG
##SYMBOL=    X,             R,               I
##VAR_TYPE=  INDEPENDENT,   DEPENDENT,       DEPENDENT
##VAR_FORM=  AFFN,          ASDF,            ASDF
##VAR_DIM=   8192,          8192,            8192
##UNITS=     SECONDS,       ARBITRARY UNITS, ARBITRARY UNITS
##FACTOR=    0.0002004,     1,               1
##FIRST=     0,             0,               0
##LAST=      1.6414764,     0,               0
##MIN=       0,             -277069,         0
##MAX=       1.6414764,     726712,          0
$$ Real data points
##PAGE= N=1
##DATA TABLE= (X++(R..R)), XYDATA
0 0 0 0 0 0 -7 8 -3 8 -8 15 -16 24 -27 32 -40 49 -59 71 -84 99 -116 136 -156 181 -209 240 -274 310 -353
29 -353 400 -452 507 -569 639 -711 793 -883 980 -1088 1208 -1335 1479 -1639 1813 -2007
45 -2007 2227 -2473 2752 -3073 3443 -3877 4394 -5024 5811 -6830 8197 -10149 13179 -18565
59 -18565 31042 -121407 112002 364001 -5223 -277069 -244935 -22169 23790 -79336 -155563
70 -155563 -16394 111408 24866 -177103 -183260 -1381 174851 162615 1896 -114474 -32470
81 -32470 67312 6258 -75607 17557 132705 91536 -26522 -53737 24552 117164 97744 -17946
93 -17946 -52253 51420 101225 14957 -54966 -10483 80168 134169 92453 -24517 -67220 26542
105 26542 94704 37373 -24197 -314 48872 59198 21466 -22184 7243 82260 73232 -3641
117 -3641 -16988 15118 1439 -9922 29393 49959 31029 21585 8636 -8095 23241 61510
129 61510 26786 -27302 -17443 23713 41233 26296 -10150 -10802 54656 79774 4038 -45584 6011
142 6011 47505 20705 -4266 -3199 9350 40741 48108 2201 -16597 31173 50225 10113 -11572
155 -11572 2021 15959 24475 11301 -17447 9017 71077 49535 -34249 -40260 28270 56066
167 56066 22116 -22134 -33263 14927 63626 23053 -44697 -18516 53030 54732 3615 -34198
179 -34198 -35309 14417 65180 28092 -42353 -20400 48945 41841 -13114 -24004 8810 41225
191 41225 33761 -20737 -47102 9265 56334 19995 -16555 5349 24690 14792 -222 -19425
203 -19425 -18576 28498 47102 -14011 -52055 -3048 44829 31852 -2661 -22890 -11423 22857
215 22857 15833 -36943 -37013 27145 43444 -2625 -24235 -10901 4846 20308 13045 -23188 -24901
228 -24901 14467 15735 -16438 -12462 14293 21379 16949 -1240 -29005 -13457 28456 13963 -29038
241 -29038 -12426 27918 19204 -5141 -7903 -1875 12871 23429 -2511 -28652 -5467 18457 587
254 587 -9567 5922 9122 7457 9316 -11738 -27631 5488 27162 -8613 -30293 -3489 11482
267 11482 -1253 -9983 -13231 -3445 20726 10285 -37400 -40705 5366 18390 -6021 -17550 -18791
280 -18791 -12919 10356 9971 -25611 -25802 12475 10987 -24918 -30154 -10952 2398 9157 -4008 -25302
294 -25302 -7170 22845 -2121 -37904 -13753 19322 6547 -17324 -23234 -15900 11232 28052
306 28052 -7793 -39227 -6468 28993 7221 -26052 -29965 -10943 19790 25316 -18438 -41725
318 -41725 1913 30483 -3340 -27202 -8698 3724 1409 -3395 -19154 -20334 10365 18421 -11154
331 -11154 -16033 6901 4157 -12096 -11417 -5779 4229 19781 -227 -37164 -16778 35312 29577
344 29577 -12875 -20099 -910 12533 13885 -7598 -28576 -2363 35079 19405 -13803 -11196 3287
357 3287 9716 20446 11208 -18552 -16388 10353 7138 -6555 7977 16351 2688 1098 6833 -115
371 -115 -1089 770 -12374 -9098 19024 15345 -17606 -14106 14831 17819 7327 -1994 -21301 -21149
385 -21149 11150 19928 -11032 -19634 2125 15848 17787 8054 -19371 -23025 11256 20129 -8499
398 -8499 -15413 879 2073 5086 18414 8578 -9134 -1237 5689 -4460 -2207 4421 -8045 -8308
412 -8308 13201 14612 920 433 -2999 -11369 6345 20297 -8256 -30707 -7299 16147 12996
425 12996 4003 -9851 -17150 5891 24744 -1576 -28443 -14975 4343 8326 8894 -3677 -20050
438 -20050 -1723 24605 9374 -14901 -8015 -1535 -6959 -50 4941 -5778 -4259 7657 3321
451 3321 1478 12834 2244 -18342 -7325 11948 4698 -4779 -3161 -6683 2920 26542 16605 -16686
465 -16686 -13906 12298 14433 1893 -6998 -14615 -978 27005 21304 -10112 -9594 8798 8552 5506
479 5506 7067 -6808 -13693 6616 15445 1623 2458 10243 632 -1626 11173 6435 -7503 -3616
493 -3616 1324 1111 12357 12477 -10614 -10072 19955 23188 -1086 -8943 -4545 -1099 12628 15046 -8482
508 -8482 -14890 11091 20730 6715 492 -1630 -3544 8345 13187 -7549 -12189 9525 11418 -4617
522 -4617 1555 12155 3019 -2102 2080 -1489 -1504 4156 -7915 -16987 4886 20282 1113 -12482
536 -12482 -5028 92 5386 8329 -11822 -27482 -3883 18478 1291 -16068 -6330 5876 10049
549 10049 7536 -11766 -22480 -419 13743 -5243 -13081 3197 6901 997 4204 860 -4904
562 -4904 5754 8023 -11655 -12791 8094 9321 -3033 580 6668 6396 9826 1963 -16606 -7898
576 -7898 18101 10110 -13618 -9235 5864 8521 8807 3723 -8959 -1382 14917 1861 -17883 -7510
590 -7510 6965 4248 2418 1611 -6889 -1633 11846 1487 -12937 -948 9089 -4215 -8812 -855
604 -855 -337 3213 9444 -655 -9282 5200 9818 -7133 -9166 4233 5272 1664 5799 513 -4270
619 -4270 8777 12117 -4590 -4897 8202 2852 -6174 568 4029 3287 11299 8195 -7807 -3145 12394
634 12394 3437 -9616 -2035 3716 -341 3497 2818 -7661 -504 14087 4468 -9733 -3813 827
648 827 -2807 2489 2268 -7657 -1915 11788 3199 -7466 2349 4829 -5983 -2720 5335 -598 -1841
663 -1841 2985 -3240 -4932 9734 10341 -5583 -6141 1901 584 975 3383 -7200 -9269 10234 11655
678 11655 -9833 -13448 2442 7135 5421 985 -12924 -16414 3022 9771 -5032 -8322 -1571 -3311
692 -3311 -1802 4025 -5331 -13402 -95 4550 -9485 -10212 348 -2452 -5757 2971 3590 -2373 -2208
707 -2208 -7478 -13411 690 12087 -3942 -15764 -1291 9124 5460 4538 -2332 -11652 1124 16771
721 16771 1342 -18015 -8993 7634 13313 12339 650 -10965 537 15469 3221 -8951 315
734 315 4305 -1547 3828 7329 -1286 703 11133 6372 -106 4311 -704 -11305 -732 14203
748 14203 9818 1574 -1262 -4757 5194 21944 10320 -14170 -8466 12270 10626 -5 -2274 -1527
762 -1527 7739 21247 12646 -8312 -5430 9161 8309 3980 4970 -1351 -3382 8555 11153 3452 7567
777 7567 10338 -2199 -4509 8946 7153 -7121 -6215 3136 8387 13076 5042 -13642 -9151 14105
791 14105 13901 -6542 -13743 -9306 -2890 8847 7920 -11500 -13354 8694 11282 -7281 -13341 -8825
805 -8825 -6393 146 2224 -8537 -11748 -1467 -1072 -5603 1780 1844 -12649 -13515 -2301 -3363 -5922
820 -5922 -1677 -7200 -11338 3911 11112 -7344 -17655 -7260 1901 4154 852 -14157 -19549 1267
834 1267 14317 -702 -11143 -4077 -432 345 2410 -6908 -16141 -3146 9253 437 -6945 -2607
848 -2607 -2994 -2359 6230 4420 -6097 -4480 -2599 -8215 -2002 10023 1639 -9357 777 10205 4094
863 4094 -1553 -4295 -7772 1798 13621 1694 -12556 -3657 9226 9204 7808 3111 -6731 -1957 10516
878 10516 3422 -8455 -1172 7605 4772 6169 7927 -1386 -2811 6611 5577 -295 3911 1205 -8638
893 -8638 -2172 11563 7646 795 2399 262 -1949 4554 1568 -10370 -5166 9037 5627 -2986
907 -2986 -2182 -3482 -1616 9482 8049 -8779 -10535 628 323 -3351 1272 278 -2850 5235 6097
922 6097 -5590 -6409 1872 -379 -3582 2186 -309 -7055 -498 4898 -355 1585 7271 -1696 -8861
937 -8861 -1309 1644 -3946 -1595 1794 -2399 1721 7267 -2192 -9640 1401 6249 -2295 -4856 -3979
952 -3979 -6741 -760 7887 1154 -5657 2072 4592 -4767 -5597 -1240 -3475 -961 4761 -3261 -7472
967 -7472 3626 6591 -3132 -1975 3888 -1388 -4557 -221 -3626 -3913 7425 7762 -4326 -3085 5671
982 5671 3064 -432 1800 -845 -1909 5193 2992 -6750 316 11170 4543 -2410 2480 2882 -1145
997 -1145 2471 1822 -4369 2168 9859 -41 -7359 2464 7351 3245 2569 -643 -5213 1883 7672 -3715
1013 -3715 -7880 5346 9387 289 -1385 512 -961 2697 5588 -2836 -5201 4111 2417 -5985 -160
1028 -160 7863 3418 716 1652 -3366 -2081 6333 1407 -9650 -1297 10556 4005 -5003 -3825 -450
1043 -450 5458 9197 -2059 -13528 -3645 8097 941 -5469 -956 587 807 5103 -825 -9744 -3559
1058 -3559 4514 -2884 -6429 251 -1045 -5631 -1112 1118 -1658 1287 27 -10570 -8390 4511
1072 4511 1413 -9676 -6068 1417 1732 2924 -708 -11509 -7130 7804 5275 -8600 -9268 -3230
1086 -3230 -360 5003 4030 -7161 -6797 6081 4646 -6468 -5701 -1897 -3156 1295 5703 -2020 -5460
1101 -5460 1467 1815 -1128 3635 2833 -8087 -7112 2345 2398 -368 1696 -2224 -3655 6298 8228 -5669
1117 -5669 -9741 337 4700 2871 1422 -4986 -6841 6262 12272 544 -5063 -550 281 681 4816
1132 4816 55 -6544 1646 9158 3285 110 3243 -832 -2229 5759 6491 -2389 -3095 1201 937 5906
1148 5906 9558 -267 -7310 3560 9397 1588 -1947 -1508 -2840 3651 11346 1798 -8613 -848 7809
1163 7809 5436 3005 -849 -7197 -2331 8534 3739 -4990 -186 3508 78 2850 4774 -3200 -5561
1178 -5561 3073 3223 -1584 -135 -1261 -5429 1315 9141 2721 -4101 -1992 -1784 -1002 5601 2037 -9457
1194 -9457 -5790 7278 6535 -1104 -2324 -3047 -1080 7173 5034 -8354 -8562 2077 3904 1154 1920
1209 1920 -2504 -4889 4208 6903 -3392 -6119 483 -482 -1880 3127 796 -5221 -406 4724 1424
1224 1424 1518 2333 -5670 -7001 4314 6355 -2536 -3460 507 1039 4686 6592 -3456 -7919 3387
1239 3387 8307 -232 -4194 -2195 -1298 5068 9517 7 -5616 2841 6332 -506 -402 2191 -1770
1254 -1770 -613 5609 2502 -769 4041 3088 -2589 1978 7021 -744 -5771 -17 2653 2779 5367
1269 5367 222 -6460 2031 10042 1462 -7018 -2654 1532 1700 3224 -1285 -6618 1538 9455 1317
1284 1317 -5875 -1041 788 -1565 701 -232 -4452 133 4423 -2474 -4634 3265 2641 -4955 -3391
1299 -3391 356 -1430 -1427 -729 -5818 -3703 5914 2296 -8251 -5979 661 -692 -1565 -1813 -7031 -5505
1315 -5505 3808 929 -8266 -5060 2330 -1130 -3960 -2942 -5262 -3982 1881 -1767 -7340 -1415 2468
1330 2468 -4053 -6032 188 -384 -3489 -1256 -2401 -5585 189 3206 -3796 -4618 1847 1210 -2627 -946
1346 -946 -1037 -3596 1494 3547 -4235 -3290 4838 2882 -3369 -306 2726 -17 1007 1499 -3230 -395
1362 -395 5756 1945 -3056 2081 4818 276 880 2522 -1771 -117 6693 2805 -4284 513 5161
1377 5161 2160 1888 3903 -285 251 4676 1111 -2244 3053 5124 -955 1209 6039 1979 -774
1392 -774 3959 2612 -1208 3648 5035 -1662 -1282 5450 4569 2254 3160 523 -500 6074 5820 -3442
1408 -3442 -3081 5038 4237 1547 2987 199 -1992 5214 7594 -805 -3912 1428 1447 190 2524 540
1424 540 -2094 3145 5349 -1508 -1629 3373 -548 -3125 2336 2587 -3170 -1536 1924 -112 1744 5067
1440 5067 -1239 -6305 -721 3054 -332 -1293 -1852 -3481 1596 7447 -376 -7163 -277 4376 -293
1455 -293 -1676 -1700 -4681 -2123 5298 2145 -3753 -836 1240 -1150 484 737 -4575 -4060 2423 832
1471 832 -2820 1369 242 -4518 -448 5911 306 -6134 -3471 -1378 -138 3100 187 -6472 -2291
1486 -2291 5238 1608 -2857 -1977 -2732 -2247 3812 1834 -6945 -4924 4372 3800 -514 23 -1559 -3041
1502 -3041 1815 2900 -2530 -2039 1228 -1132 -893 5013 2529 -4055 -1235 2978 1008 891 1177 -4306
1518 -4306 -3805 5501 6971 -1776 -3615 66 2344 4556 2905 -5225 -5464 4638 6306 -1781 -3205
1533 -3205 644 1114 3236 5069 -1633 -5713 1295 3966 -1036 -542 1840 -1632 -962 3308 2040 -524
1549 -524 1430 -647 -3972 1868 5187 -2329 -5647 1151 3873 2309 1622 -2529 -5608 1904 6996
1564 6996 -1444 -7582 -2296 2090 2295 2486 -1838 -5524 687 5661 -882 -5364 -1608 -847 -2732 1216
1580 1216 1198 -3160 -2015 1269 -1319 -1567 1762 -2179 -6510 -1292 2583 -1203 -2336 -1215 -2753 -59
1596 -59 4778 -411 -8257 -3129 2781 446 -2026 -1470 -3426 -1114 4856 1924 -4070 -1794 1153 -1495
1612 -1495 -624 973 -2811 -3603 2700 3308 -1100 533 1424 -2272 -626 3845 -144 -3681 300 1563
1628 1563 478 2890 2520 -2287 -1019 4492 2187 -2593 -651 90 -874 3472 4627 -1330 -2080 3046
1644 3046 2936 577 1526 -231 -2766 1588 4456 -810 -2108 3063 2986 908 2868 1132 -2459 266
1660 266 3723 -26 -1152 3249 1118 -999 2398 4005 13 422 2310 -1308 -670 3598 776 -3630
1676 -3630 819 4375 1110 31 136 -1866 712 4283 104 -5118 -621 3484 192 -879 442
1691 442 -674 -21 3346 -772 -5239 -115 2954 -1653 -2531 1071 358 -434 1439 -965 -2795 2095
1707 2095 2913 -3846 -4239 1331 527 -1246 91 -664 -1726 2151 2461 -3759 -3117 2232 821 -2735
1723 -2735 -710 -389 -1431 1412 1782 -2859 -1155 3145 -269 -4265 -1129 1531 -942 50 289 -2766
1739 -2766 182 4336 -21 -4381 -275 2517 -437 -1361 -616 -2053 688 4378 -80 -3557 948
1754 948 2958 -1038 -1262 1046 -945 -644 2277 -280 -2006 2445 2709 -1841 -736 2571 540 -1801
1770 -1801 -159 -503 -571 4010 2504 -3567 -1382 4464 2142 -1862 -1359 -893 -31 3331 1630 -4308
1786 -4308 -1095 4832 2226 -1363 -84 -393 -1296 1307 904 -2753 -584 3323 -8 -1799 1678 1936
1802 1936 -1702 -1105 200 -461 562 1176 -3255 -3179 3849 4132 -2230 -3342 -217 147 1575 988 -4509
1819 -4509 -4121 3146 3842 -2129 -3058 147 631 1242 1095 -3139 -4037 1255 1601 -2382 -724 2001 -1258
1836 -1258 -1883 1169 -110 -1619 -161 -1462 -3339 914 3064 -2452 -4469 683 2460 515 -83
1851 -83 -3449 -4584 1124 4196 -1720 -4711 -537 1913 727 945 -1103 -3730 83 3742 -751 -3356
1867 -3356 -795 142 -570 2280 1567 -2125 -603 1804 -309 -538 1885 -747 -3206 561 3196 96
1883 96 -620 642 -717 902 4103 506 -4505 -1300 2989 1696 529 355 -2359 -311 5166 2684
1899 2684 -3062 -1684 2112 1301 1158 1142 -1935 -1163 3804 3430 -845 41 1478 -589 394 2630 88
1916 88 -1612 1080 1701 -239 2538 2800 -1700 -1524 2902 2247 -893 -1141 -1145 -633 4121 4145 -2594 -3188
1934 -3188 2542 3580 -82 -877 -2112 -1752 2296 3337 -1937 -3625 1791 2385 -259 41 -931 -2312
1950 -2312 -58 1352 -1829 -1417 1528 -529 -2715 714 2231 -1319 -2262 -1188 -1403 -153 1563 -2497
1966 -2497 -4969 419 3716 -94 -2844 -2262 -1634 514 1868 -2492 -5454 -470 2946 -809 -2096
1981 -2096 -806 -1446 -536 1385 -1337 -3746 -272 901 -2038 -1502 1342 -349 -2360 -267 -202 -1009
1997 -1009 620 -418 -3995 -1381 3310 659 -3199 -1416 952 799 1639 -428 -3915 -751 3843
2012 3843 938 -2800 -899 1098 1009 1850 653 -2285 -661 3040 332 -2393 838 2470 24 188
2028 188 1616 439 762 2258 -399 -1181 2882 2869 -1171 -973 1860 1781 1697 1958 -1125 -1454 3206 3444
2046 3444 -2042 -1797 2073 1921 1125 975 -1158 -868 3176 2461 -1615 -697 2316 701 -869 720 485
2063 485 -383 1847 1095 -1934 -30 2712 97 -2192 197 583 -460 841 -120 -2224 218 2949
2079 2949 -575 -2861 163 766 -985 -316 -179 -1713 57 2094 -1040 -2573 697 1171 -1288 -876
2095 -876 -45 -1234 -289 824 -1641 -1754 2127 1311 -2473 -1840 323 -812 -523 528 -1521 -1656 1512
2112 1512 1058 -2149 -718 1037 -77 -811 299 -1486 -1577 1363 807 -1325 -65 1543 -762 -951
2128 -951 1389 440 -1146 542 225 -1326 802 2483 -51 -1215 1236 1305 -238 911 -385 -1789
2144 -1789 1167 2967 -201 -1739 1015 1554 668 1030 338 -1820 440 2864 58 -1502 710 1095
2160 1095 492 1570 995 -1499 -256 1942 -359 -837 1593 661 -1765 179 2130 280 153 492
2176 492 -1241 -658 2336 391 -2920 -736 1912 1395 386 -191 -1848 -348 3145 950 -3352 -1603
2192 -1603 1223 742 18 329 -1381 -901 2393 1109 -2278 -1311 608 -801 -748 884 -286 -1730 178
2209 178 149 -1248 1008 1082 -2614 -2539 1136 964 -1165 -1069 -897 -744 1915 1313 -3084 -2905 1113 1449 -930
2228 -930 -1581 -2033 -1834 1113 2010 -2069 -2818 713 676 -1349 -673 -546 -1685 -347 1023 -895 -1067 523
2246 523 -759 -1858 1079 1198 -1653 -1987 -328 -113 543 1383 -1216 -2758 934 2935 -841 -2349
2262 -2349 -865 -288 1006 1792 -1010 -3037 476 2548 268 -651 225 -536 -534 1551 539 -2049 347
2279 347 1371 -306 273 1834 -184 -1037 911 1162 90 279 53 -1589 880 3578 1036 -1602
2295 -1602 311 1472 840 1385 326 -2111 256 3341 1627 -1277 257 1036 982 1650 1418 -1127 -554
2312 -554 2481 1074 -188 1511 937 -327 999 2465 -253 -892 795 496 -130 1500 993 -1237
2328 -1237 38 1721 1219 112 528 -1060 -1158 1971 1807 -1926 -1102 982 350 297 634 -1028 -1924 742
2346 742 1283 -1217 -1455 -211 -276 -28 1119 -417 -2062 300 1062 -1139 -819 283 -1266 -1314 1172
2363 1172 620 -1444 -821 293 -1100 21 808 -1380 -2083 237 439 -952 -111 -217 -1674 78 1838
2380 1838 -466 -2300 -268 815 -890 -12 135 -1692 -258 1797 -129 -1354 105 337 -994 444
2396 444 748 -1137 -759 1064 -133 -950 1386 852 -1073 165 1523 -388 -864 560 -101 -245 1791
2413 1791 1137 -985 -39 1494 369 -93 945 -168 -403 1614 1108 -1171 -118 1932 225 320 1123
2430 1123 86 -634 1212 1139 -823 594 1856 -234 -576 1614 741 -157 984 404 -1188 162 1554
2447 1554 -806 -1036 985 907 -256 168 284 -957 528 1392 -669 -1312 1139 882 -1072 99 731
2464 731 -667 -141 512 -964 -1408 888 304 -1415 -206 862 -350 -206 463 -1188 -1096 1062 279
2481 279 -2153 -528 924 -305 -720 271 -942 -1101 896 80 -1869 -660 599 -681 -792 565
2497 565 -348 -1003 334 12 -1257 137 1032 -1336 -1318 1007 401 -904 -428 -109 -645 733 1030 -1676
2515 -1676 -1425 874 762 -998 -130 43 -427 442 1340 -1030 -1111 1101 496 -830 268 462 -550 207
2533 207 1167 -289 -248 1012 174 -1043 905 1449 -786 -781 648 314 357 1278 -323 -1406 1130 1756
2551 1756 -799 -1092 188 58 432 1524 -467 -1673 719 1577 -49 -485 446 -469 -455 1286 421
2568 421 -924 162 974 -425 113 867 -641 -1014 638 872 -510 -321 193 -699 408 1773 -168
2585 -168 -1682 13 672 -448 133 269 -1614 -559 1467 280 -1259 40 -53 -722 759 723 -1929
2602 -1929 -1354 898 195 -678 -138 32 -1190 577 1221 -1060 -1717 249 -305 -966 602 137 -1472
2619 -1472 -378 1093 24 -693 -20 -1102 -1535 679 913 -1443 -1118 663 393 135 571 -1143 -1614
2636 -1614 749 1350 -903 -1267 -154 265 239 1458 -308 -1279 364 1095 -774 -697 556 -680 -614 969
2654 969 794 -343 278 408 -494 414 1416 -640 -1633 832 1176 105 199 211 -970 978 1973 -424
2672 -424 -1489 693 1090 319 703 383 -770 293 2278 304 -1005 158 559 -387 356 923 -338
2689 -338 -191 1503 50 -233 1198 357 -1204 400 1626 60 -339 662 468 333 1708 932 -1388
2706 -1388 -248 1525 535 -347 191 -467 -290 1528 671 -1326 -223 1145 258 -518 378 -385 -984 534
2724 534 599 -1063 -52 921 -258 -629 757 -89 -1091 -334 201 -675 378 187 -1274 -1318 903 583
2742 583 -1476 -633 -451 -999 97 239 -1438 -1455 385 603 -1075 -686 -133 -860 -347 478 -1194 -1268 316
2761 316 10 -1250 -34 645 -709 -839 121 -617 -819 261 -178 -1406 166 748 -667 -706 428 -295
2779 -295 -97 688 -122 -1312 479 1440 -546 -982 554 591 33 502 238 -765 657 1216 -582 -223
2797 -223 1332 148 -675 717 726 -93 622 1079 -789 -137 1352 484 -577 145 1067 455 789 587 -552
2816 -552 317 1540 461 -692 761 1030 59 256 1007 -236 -298 1248 309 -467 688 1006 -402 129
2834 129 1031 -130 -148 834 99 -874 866 478 -780 -314 640 33 -403 778 -266 -812 132 882 -707
2853 -707 -602 349 -320 -799 680 -153 -1103 219 714 -1013 -626 412 -494 -1260 240 -182 -1060 -148
2871 -148 260 -682 -754 470 -513 -1332 53 -419 -948 143 238 -1410 -800 966 -170 -1533 -105 156
2889 156 -591 368 -81 -971 -761 769 342 -1083 -301 121 -830 157 184 -970 -818 811 -82 -1160 576
2908 576 586 -1091 -472 987 -107 -415 73 -272 -675 902 730 -1086 -558 891 356 -27 505 -259
2926 -259 -536 1453 1285 -843 -438 814 396 45 733 494 -455 606 971 -405 448 1117 102 -486
2944 -486 1173 851 -313 446 908 -113 485 1065 -303 -708 992 1294 142 164 206 -144 535 1405 -281
2963 -281 -977 772 1229 -232 359 443 -100 218 842 12 -868 700 472 -619 461 964 -319 -203
2981 -203 583 25 -356 548 -214 -1097 66 1145 -139 -1130 -56 30 -58 706 -104 -1786 -74 885 -248
3000 -248 -621 178 -218 -553 791 277 -1344 -324 999 -451 -827 481 -504 -1002 255 529 -432 -254
3018 -254 288 -745 -618 676 -294 -1158 -200 412 -127 70 208 -1060 -654 865 250 -1371 -437 198
3036 198 -286 -42 338 -721 -545 677 472 -1045 -68 257 -565 222 784 -327 -863 519 155 -372
3054 -372 424 520 -854 -569 846 91 -580 404 -13 -982 825 1086 -653 -303 593 536 -408 -17 0 -721
3074 -721 430 945 -428 -209 630 327 -124 699 186 -921 69 1097 -187 -118 745 -200 -435 676
3092 676 707 -582 -184 523 -303 -137 919 -204 -724 663 849 -459 -93 -4 -498 -459 555 -43 -933
3111 -933 158 372 -369 -181 395 -755 -279 601 83 -1041 -96 404 -713 85 594 -302 -661 494
3129 494 9 -915 197 210 -759 -302 641 -248 -778 575 213 -738 306 461 -888 -478 671 101 -335
3148 -335 465 -228 -665 329 657 -584 -628 490 65 -491 580 34 -556 367 814 -319 -225 769 -260
3167 -260 -669 373 93 -557 166 322 -359 -162 1162 -92 -667 282 828 -350 71 243 -136 277 786
3186 786 6 -638 686 683 -315 359 737 -88 -108 839 289 -546 1057 449 -512 42 939 2 -62 797 22
3207 22 -309 525 544 -841 -143 978 60 -359 316 141 -239 604 547 -739 -32 840 -198 -397 208 295
3227 295 -426 300 589 -465 12 514 -280 -369 535 60 -623 -97 253 -424 -108 295 -375 -582 555 335
3247 335 -636 -274 131 -644 -203 229 -611 -865 499 268 -775 13 231 -332 -304 465 -442 -1053 133
3266 133 -376 -570 -71 458 -865 -772 317 -42 -673 131 -215 -837 44 568 -911 -587 142 214 -328 449
3286 449 202 -727 28 537 -60 -566 610 -114 -325 162 254 -765 12 516 -214 -516 252 -27 -418 456
3306 456 555 -314 -159 320 -197 -105 873 258 -698 357 820 190 383 273 -330 -350 877 84 -878 207
3326 207 899 -9 282 656 -346 -169 878 659 -465 -3 186 -379 386 855 7 -312 655 634 37
3345 37 442 544 -591 -76 754 -93 -406 316 252 -66 438 913 -14 -369 378 254 -275 147 109 -735 -18
3366 -18 673 -508 -327 58 -43 -478 525 199 -845 -43 401 -250 -444 248 -160 -399 262 274 -744
3385 -744 -260 227 -422 -204 399 -221 -858 47 293 -841 -571 239 -472 -399 358 -71 -847 44 468 -462
3405 -462 -266 75 -717 -497 530 -25 -887 -136 17 -355 -108 414 -671 -533 1 316 -482 -83 442
3424 442 -489 44 430 86 -333 458 4 -388 315 429 -624 -532 728 -81 -227 202 -9 -264 400 362
3444 362 -678 -386 737 -56 -353 194 -34 -291 613 830 -554 -289 528 214 -276 549 386 -215 338
3463 338 736 -234 322 771 -162 -527 711 659 -158 70 889 194 48 755 -40 -550 380 750 -281 324
3483 324 489 163 188 585 317 -314 350 384 -321 -65 536 -2 -381 413 288 -418 418 56 -663 -47 646
3504 646 -39 -790 162 59 -207 276 -56 -583 -101 605 -334 -659 277 68 -169 -290 258 -395 -223 627
3524 627 -352 -446 542 59 -678 204 320 -518 -399 429 -409 -436 219 -19 -624 90 497 -474 -435 275 -222
3545 -222 -286 259 112 -736 -94 73 -374 -136 231 -152 -545 652 436 -416 -97 225 -101 -139 377 19
3565 19 -591 113 148 -575 -151 552 -198 -439 614 16 -187 257 287 -396 105 700 -365 -409 266 247 -322
3586 -322 180 340 -380 445 383 -129 -283 376 145 -254 485 481 -53 8 547 -214 121 466 -9 -197 -5
3607 -5 306 -332 -95 341 -242 -363 347 217 -380 -13 666 -284 -55 494 -452 -549 792 126 -355 127 389
3628 389 -181 120 151 -71 -462 305 248 -674 298 446 -361 -341 371 -228 -314 -30 263 -382 266 179 -167 -587
3650 -587 241 168 -346 180 -67 -468 151 708 -576 -402 347 -6 -315 287 -147 -437 369 466 -5 -521
3670 -521 132 -19 -364 55 -52 -332 -258 376 -356 -123 359 -32 -451 140 288 -209 -14 329 -156 -55
3690 -55 436 -22 -512 177 1064 -76 -234 -83 -210 105 609 -70 -449 79 635 -148 -471 530 -3 -84
3710 -84 431 512 -106 569 478 -367 -99 664 117 -374 169 368 -347 568 258 -391 44 670 -19 -254 23
3731 23 -83 41 45 313 -300 -216 612 354 -186 178 129 -311 257 404 -458 -64 546 -216 -413 76 365 -420
3753 -420 -107 261 -229 -188 239 -205 -392 489 228 -503 -254 296 -161 -30 362 -297 -578 298 296 -634 -328
3774 -328 173 18 -228 150 -134 -569 319 176 -376 -204 220 -489 -170 116 -454 -505 204 76 -502 40
3794 40 376 -95 -568 259 -2 -243 50 -4 -608 -111 283 -80 -340 174 190 -288 -128 79 -310 -281 404
3815 404 9 -141 312 29 -485 131 249 -407 -78 307 -98 -389 470 638 -135 397 365 -137 -259 214
3835 214 -14 -110 452 466 -422 -282 375 -243 -90 432 -352 -451 223 575 -310 34 694 -178 -31 403 24
3856 24 -132 483 331 -337 236 771 -5 9 704 -94 -185 56 128 -129 -26 758 83 -513 158 236 -14 295
3878 295 -93 -287 307 604 -289 -600 249 245 -489 125 106 -575 -241 424 -623 -552 559 135 -444 67 67
3899 67 -153 -163 463 -361 -393 26 118 -703 126 -72 -310 -442 159 -356 -278 393 16 -589 -48 562 -63 -219
3921 -219 33 -143 -21 384 -62 -471 297 208 -404 -195 298 74 -335 315 -146 -349 -111 150 -600 -442
3941 -442 201 228 -382 229 264 -181 455 357 -295 -251 622 122 -378 207 337 100 209 445 -188 -87 463
3962 463 142 -221 205 195 7 261 551 -90 366 749 314 -60 363 709 -240 -31 394 -5 0 491 226
3983 226 -365 342 523 -180 103 516 51 386 653 -122 -57 350 655 -577 -14 361 -121 -258 569 -46
4003 -46 -409 211 367 -263 -461 272 -68 -461 215 376 -52 -27 116 -378 -213 484 -235 -368 139 122 -10
4024 -10 124 134 -413 -318 405 -180 -296 83 220 -415 -140 244 -549 -281 216 -165 -651 314 -116 -494 -14
4045 -14 217 -98 -110 145 -369 -464 366 40 -484 -227 298 -100 -86 193 -231 -453 147 227 -562 -98 310 -80
4067 -80 -301 50 -321 -700 203 356 -481 179 179 -11 -171 -99 65 -526 220 -64 -311 -125 397 -328 -254 266
4089 266 -278 -202 190 337 -366 -68 510 -197 -360 211 374 -262 171 -24 -111 -316 716 -173 -334 195
4109 195 219 -521 88 225 -659 84 335 47 -420 392 152 -154 390 185 -139 4 370 54 -259 474
4129 474 193 -258 89 351 -110 54 461 -325 -200 572 281 -576 -18 549 -144 109 306 -225 -319 287
4149 287 325 -289 212 86 -152 -107 380 146 -265 -72 87 -526 -54 301 -245 -602 235 115 -269 236 97
4170 97 -575 71 236 -148 -365 258 365 -648 91 214 -249 -73 174 -54 -336 330 117 -278 193 -90
4190 -90 -469 -132 282 -99 -591 623 31 -506 -28 350 -253 182 179 -281 -154 291 208 -508 -160 304 -692
4211 -692 -128 171 22 -475 375 234 -580 -96 422 6 -446 189 -87 -162 23 -71 -252 281 375 -300 114
4232 114 533 -130 39 372 296 -214 250 602 -403 -181 322 323 -46 249 151 -2 77 304 -238 -28 352
4253 352 189 -509 313 141 -288 170 217 -86 -104 232 453 -224 134 250 -239 310 271 -378 -198 298 -86
4274 -86 -451 497 345 -554 29 415 -92 -143 141 97 -557 228 131 -219 200 140 19 -464 17 -157 -198 212
4296 212 49 -365 -42 470 -462 -419 394 165 -533 -15 175 -654 -335 471 -210 -594 48 26 -508 -81 -5
4317 -5 -364 -267 319 -200 -469 46 138 -169 -42 55 -326 -402 405 -100 -335 201 143 -244 299 421 -221 -92
4339 -92 445 100 -205 248 322 -173 4 220 -297 137 542 -66 -407 189 182 185 -34 472 -399 -418 208 156 -341
4362 -341 289 504 -148 -110 399 213 -229 437 -114 -163 393 542 -161 219 255 -287 -175 417 112 -394 474
4383 474 333 -383 22 758 -198 -377 31 494 -179 326 122 -541 -110 621 -155 -383 399 257 -277 37
4403 37 311 -95 3 319 42 -291 49 112 -348 -42 -161 -273 25 205 -109 -298 90 -151 -394 218 249
4424 249 -97 -383 365 -33 -280 181 -110 -723 33 216 -153 -517 -64 10 -411 -136 -144 -362 65 6 -262
4445 -262 -221 140 -112 -345 326 211 -593 71 249 -206 -153 307 -44 -96 56 235 -462 -120 126 -275 -278 35
4467 35 161 -131 172 167 -265 17 326 -104 -79 241 52 -73 305 185 -287 -24 260 -58 -156 282 -17 -293
4489 -293 350 461 -334 136 613 -22 -237 488 301 -352 142 549 -29 -244 174 -138 -200 584 140 -230
4509 -230 209 111 -131 43 177 70 -74 580 85 -614 -62 213 -154 -265 239 86 -189 198 230 -456 345
4530 345 109 -235 8 308 29 -111 146 76 -589 73 275 -379 -220 264 -304 -143 175 389 -437 -77
4550 -77 63 -142 -261 274 208 -567 -39 150 -285 -185 346 -644 -78 -101 117 -383 311 301 -327 -308 307 -193
4572 -193 -130 235 126 -698 208 165 -365 -39 95 -16 -386 173 -144 -263 140 232 -326 -81 223 -87 -79 274
4594 274 107 -329 78 41 -484 173 208 -233 -474 325 581 -210 -180 420 -40 8 587 -114 -215 416 138
4615 138 -233 17 319 -502 176 548 116 -197 279 418 -468 229 293 -255 -40 229 -411 -198 76 238
4635 238 -198 111 521 12 200 607 -13 129 90 165 -457 -176 599 -40 40 358 -271 -324 205 687 -136
4656 -136 22 406 -13 88 460 58 -224 251 43 -192 187 372 -367 -312 339 111 -535 58 52 -197 -189 166
4678 166 -213 -241 373 93 -136 0 168 -440 -127 90 -72 -578 561 55 -448 97 -74 -264 50 231
4698 231 -46 -659 498 -31 -333 87 259 -354 62 13 -260 -149 418 -392 -298 593 197 -273 -446 389
4718 389 -78 -414 -146 -157 -574 5 72 103 -405 328 63 -37 311 -339 -336 185 335 -288 -79 342 214 -53
4740 -53 299 -55 -364 -28 395 -106 -125 570 53 -358 300 290 -291 359 507 -196 -172 271 112 -191 330
4761 330 554 -2 153 664 -69 -226 201 85 -497 -75 688 -351 17 162 -127 24 471 -58 -412 53
4781 53 431 -148 220 210 -79 -641 297 -114 -448 -158 490 -248 -224 196 -443 -172 248 77 -85 140 452
4802 452 -532 -237 344 -307 -191 -29 160 -614 -14 183 -491 -285 264 5 -462 26 215 -524 12 262
4822 262 -385 34 104 -81 -510 -9 327 -369 10 82 -147 -85 71 191 -525 94 41 -142 159 419 -46
4843 -46 -215 115 -199 -53 369 143 -125 121 309 -247 -162 401 -358 -252 74 369 -352 157 370 50 -146
4864 -146 256 231 -26 577 45 -154 311 305 148 -48 260 -3 -63 353 515 -89 -130 499 -66 -315 376 200
4886 200 -38 38 267 -272 162 585 22 104 604 471 -364 110 468 -284 286 237 -86 -35 88 -65 -66 44
4908 44 11 -190 126 320 -127 -34 360 9 -14 -55 321 -212 -144 152 110 -101 393 296 -357 -146 617 -106 -309
4931 -309 291 -141 76 310 63 -462 76 257 97 -437 228 -26 -393 208 97 -699 19 191 -314 -397
4951 -397 264 84 -305 149 270 -354 -140 -127 -235 -239 391 102 -438 63 225 -106 -227 48 -651 -226 299
4972 299 -16 -285 213 500 -424 -75 274 -350 -287 142 -42 -149 117 -102 -554 57 257 -68 -85 149 -173
4993 -173 -129 123 407 -134 -267 66 -45 -376 178 214 -300 155 211 -21 35 259 84 -79 341 99 -395
5014 -395 295 295 -320 -217 251 196 -293 373 208 -35 11 285 49 219 91 -181 -259 293 402 -415 24 435
5036 435 -109 104 243 -11 -269 509 215 -289 -100 161 -400 73 124 -98 75 230 210 -205 113 342 -409
5057 -409 -303 90 45 -475 18 113 -386 187 -14 -262 -430 0 54 -182 -268 34 -114 52 -67 -213 -185 192
5079 192 52 -408 121 -108 -515 -250 41 -399 -494 -113 -75 -164 435 187 -248 -191 383 64 -394 100 136 -401
5101 -401 271 297 -112 -495 424 -93 -83 188 203 -177 -57 95 -175 65 287 161 -299 439 31 -451 38
5122 38 424 -172 -1 363 -27 -195 484 497 -124 -21 412 -215 173 107 -225 -347 2 437 -272 -253 770
5143 770 -38 101 310 20 -144 -70 337 -225 -110 141 -355 -99 100 321 -227 214 172 -325 -98 194 -74
5164 -74 -192 102 10 -99 134 418 -482 243 455 -289 -35 80 -173 -126 176 87 -372 -29 286 -226 105
5185 105 5 64 -315 -46 -9 -421 -144 236 -156 -138 128 -42 -296 225 159 -105 -59 78 -226 -60 147 -373
5207 -373 -624 -141 489 -118 -45 86 -94 -206 -83 -297 -400 -319 126 -208 -120 140 -306 -283 -179 225 -339
5228 -339 80 316 10 -163 188 -281 -131 11 203 -572 29 135 -246 39 311 -37 -337 -296 174 -292
5248 -292 180 325 -406 241 336 201 -110 -21 260 -58 -122 506 -87 -127 287 -11 66 374 255 -238 110 -13
5270 -13 -195 -52 216 262 -101 70 484 34 117 631 -111 57 446 216 -84 438 174 -5 4 36 186 -324
5292 -324 234 412 -118 190 561 -248 -205 469 42 -282 444 183 -137 7 205 -21 -352 224 18 15 134
5313 134 75 -323 284 36 -15 -278 309 -156 -393 -58 447 -81 -238 251 -380 60 96 -274 -229 -321 218 -366
5335 -366 -152 165 52 -118 291 219 -257 -138 281 -218 -212 -155 -523 -276 185 -3 -638 61 164 -143 97
5356 97 189 -56 -394 -130 -74 -134 472 -24 -201 155 43 -99 -297 256 44 -80 87 405 -418 -532 311
5377 311 -28 -111 81 -103 -368 120 521 -422 -397 230 125 -100 168 -69 -134 133 136 -82 0 -34 73 -197
5399 -197 123 200 -289 290 394 -260 -97 347 52 64 15 136 -168 326 265 -227 -126 64 -6 -172 447 339
5421 339 -174 53 369 -117 -343 259 36 -341 141 156 116 19 440 -510 -212 500 -67 -288 128 297 -242
5442 -242 -71 261 1 -18 164 -180 -490 -362 -25 -55 -98 177 -272 -276 237 94 -388 67 218 -553 146 212
5464 212 -293 -124 -19 6 -411 33 -128 -207 -437 305 -146 -389 320 -117 -278 46 120 -257 34 328 -59
5485 -59 -423 106 7 -223 -5 81 -25 -68 -67 -147 -126 75 22 -373 -35 22 -51 -142 613 68 -86 121 285 -104
5509 -104 51 382 -13 177 191 -51 -210 518 45 -110 21 96 185 161 256 1 -138 200 349 -167 -102 45
5531 45 6 -75 394 157 -64 138 211 -129 135 355 -117 -66 497 104 -203 105 221 -170 -62 255 -45 7
5553 7 -57 145 -806 243 46 -293 -13 439 -182 8 110 237 -96 119 16 -249 -208 221 211 -432 431
5574 431 -204 65 316 413 -430 -163 71 29 -374 38 -33 -350 -109 -140 -362 -99 -87 -132 -275 133 27 -278
5596 -278 -181 23 -244 -183 223 -252 -368 211 -126 -217 -35 489 -286 -99 87 -181 -414 -86 132 -579 -15
5617 -15 -31 -223 120 154 32 -274 101 126 -275 91 236 -293 204 215 115 -238 -184 326 -225 168 307 163
5639 163 -224 556 -105 -19 70 335 -122 184 121 -76 -124 283 -192 -97 315 493 -226 -148 393 -104 -259 167
5661 167 91 -40 160 121 -70 -171 296 4 120 187 103 -332 280 124 -87 -185 203 -139 -88 4 130 -30
5683 -30 -133 111 -34 82 132 -54 -270 167 -123 -408 -20 264 -129 78 136 -333 -166 154 76 -81 20
5704 20 295 182 -168 375 -363 -475 242 279 -57 -25 55 -169 -38 252 -16 -361 39 -79 -290 -96 307
5725 307 -373 -197 100 -269 -145 -2 -168 -300 -142 204 -67 -364 116 116 -85 -66 -65 -296 -9 62 -347 -310
5747 -310 298 -75 -306 -82 -178 -410 -361 259 -374 -91 195 -21 -28 -17 200 -62 17 248 72 -229 452 -37
5769 -37 -339 180 420 -160 245 -115 -256 -271 293 -11 -335 235 458 -118 -144 456 74 -25 283 17 -183
5790 -183 293 313 -153 -19 -4 -36 -228 58 126 29 80 208 143 28 318 30 -502 164 92 -41 318 337 -151
5813 -151 136 354 23 -167 208 68 -4 -120 37 123 -276 402 213 -61 105 245 -120 117 253 -333 -429
5834 -429 235 156 -381 291 103 -278 29 213 10 -203 175 128 -203 161 270 -341 -327 128 -164 -463 -151
5855 -151 230 -12 224 -86 -401 -237 126 -272 -322 32 256 -390 -104 313 -234 -280 201 -28 -326 70 -7
5876 -7 -476 -204 56 -366 -7 120 -94 -97 465 -69 42 176 450 -160 -89 253 -352 -445 313 -168 -269 -41
5898 -41 15 -183 240 529 -112 -136 95 528 -25 145 93 -232 -39 352 52 -277 -30 300 -218 25 59 -307
5920 -307 -223 328 341 -289 350 -43 30 22 217 -75 -311 123 163 18 302 62 68 -297 485 87 -241 536 57
5943 57 -55 332 342 -464 -141 181 92 -109 158 -173 14 398 84 -9 -69 405 -163 -98 8 61 -232 -26
5965 -26 344 -158 -190 27 -190 -9 324 168 -256 261 202 -40 -190 244 -159 -355 361 47 -204 -60 144
5986 144 -196 -386 111 106 -66 37 131 -435 -176 288 -241 -3 310 -136 -438 3 182 -46 44 232 -224
6007 -224 67 104 -67 -354 264 118 -287 187 104 -93 -365 316 106 -269 232 5 -66 118 377 326 -111
6028 -111 -25 132 -45 73 200 -267 -20 176 77 -3 124 386 206 244 269 -120 61 311 154 -50 297 123
6050 123 -267 -15 76 -190 -356 347 7 177 486 312 -119 245 59 -324 -107 298 -322 -44 45 70 -86
6071 -86 -178 298 -80 15 -3 101 -196 474 226 90 -136 75 -105 -224 49 -106 -206 97 146 -334 -119 181
6093 181 -5 -149 230 211 -162 69 -33 -191 -73 106 -291 -440 367 -77 -114 120 -210 -372 64 351 -384
6114 -384 -384 506 -37 -340 107 -17 -466 -180 106 -115 -380 60 -76 -208 125 169 -336 60 37 249 -290
6135 -290 -167 127 -437 -33 217 -337 -332 46 18 -247 152 -30 -128 250 182 -526 -356 178 -392 -218 243 257
6157 257 -224 233 142 -288 -40 170 8 -476 210 -270 -218 244 50 116 -133 145 0 142 403 119 -41
6178 -41 196 326 -378 -143 291 238 -219 230 234 -59 -178 174 -123 -319 254 79 -258 68 107 -227 40 436
6200 436 -53 23 359 -37 -121 120 347 -362 148 386 -71 -271 -11 -294 -262 82 26 -25 -67 315 -65 -317
6222 -317 469 -83 -134 394 198 -223 206 316 -115 183 162 -156 -172 162 -113 -263 20 302 -95 -332 2
6243 2 41 -328 100 -227 -281 -188 161 -231 -341 101 -106 -323 336 68 -94 -176 -11 -65 -96 2 -121 -458 23
6266 23 298 29 -254 -11 -238 -5 372 69 -261 -35 75 -158 -203 241 203 -365 -62 282 -149 144 11
6287 11 -436 261 309 -142 -576 230 410 -73 6 173 -278 -59 387 130 -15 -79 184 -29 312 425 159
6308 159 -226 193 19 -201 148 -224 -138 51 517 41 -10 243 -244 63 323 108 119 65 210 23 -270
6329 -270 192 -9 121 389 -173 -176 32 329 124 -114 205 65 -88 -37 202 -367 -473 189 -126 -165 46
6350 46 135 -116 167 80 -223 46 70 -127 -192 363 25 -462 -149 278 -314 66 307 -659 -239 137 147 -272
6372 -272 99 120 -75 -153 206 125 -278 116 15 -238 40 355 12 -151 140 -266 -307 -77 29 -264 -107
6393 -107 267 -164 -75 190 105 59 -141 -139 -178 270 207 35 -317 50 96 -393 97 -17 -158 -82 -46 -5 -365 -227
6417 -227 183 53 98 187 -323 82 253 -22 -26 277 244 -254 -57 356 -166 349 426 -16 -236 53 -201 -249
6439 -249 -27 353 -30 237 41 -93 -103 449 -132 -135 93 344 -14 23 332 336 -293 184 252 -65 143 -123
6461 -123 -100 -20 485 -306 -76 -14 194 -408 -97 153 -6 -97 304 -40 15 109 155 -134 114 46 -257 57 104
6484 104 -322 -78 -236 235 -229 217 182 -506 30 169 -134 -36 151 -57 -293 -14 223 -80 -302 81 132
6505 132 -166 -14 -72 -237 -299 207 54 -8 305 175 -447 73 20 -183 -117 184 45 -8 216 -57 44 190
6527 190 72 55 120 222 -294 -130 293 -289 74 -175 330 -309 -20 242 6 -223 220 -219 -143 150 384
6548 384 84 -76 197 -259 -112 329 180 -224 321 230 -178 -123 393 232 -59 160 227 -5 126 152 -115
6569 -115 213 139 117 -160 146 538 -415 31 255 -219 -272 204 -161 -138 -31 -64 -102 105 107 -37 -3 -76 -25 -188
6593 -188 111 -114 -198 104 -33 81 -249 -72 12 -72 270 -206 23 -2 -11 50 -289 23 -279 73 -168 -84 -462
6616 -462 -192 431 142 -274 109 -190 -371 -7 44 -377 -141 52 -323 -107 -24 -61 -110 111 144 -64 204 -164
6638 -164 19 -149 247 95 -149 42 165 -166 -125 -248 -193 -97 -6 -99 -335 -220 323 -285 162 331 199 -164
6660 -164 -132 -10 -92 45 204 -238 49 -41 -79 -229 127 -26 -229 -83 481 -398 -11 168 128 -504 -93 -79
6682 -79 -50 245 439 -103 -91 95 153 -20 -13 74 -127 151 378 -133 -23 146 177 114 12 240 -455 174 186
6705 186 -76 -212 203 -268 -338 100 63 -92 -43 253 -229 -58 137 73 -68 -114 186 -89 -82 -69 -205 -117 -11
6728 -11 -208 211 -118 -1 -4 -127 -102 -196 94 293 205 -107 -248 -149 -173 -30 -140 -163 -231 5 238 -603 -170
6751 -170 233 -277 1 331 -186 -279 124 185 -224 88 66 -161 -190 201 -126 27 -15 365 -225 238 351 -265
6773 -265 -364 12 -108 -329 132 98 -132 89 226 -126 -534 244 54 -100 129 33 -153 354 375 -234 -79
6794 -79 212 -256 -397 245 -30 -100 62 10 -297 199 252 40 -140 22 76 -188 267 50 -213 -161 166 -204
6816 -204 -421 258 248 -15 -129 229 -253 -238 177 100 -113 324 -127 57 12 291 193 7 384 -138 185 -137
6838 -137 65 -352 -232 194 -65 -4 307 -222 -141 -32 108 370 280 198 204 -441 220 110 62 270 100 -380
6860 -380 156 77 -61 2 29 -55 -210 330 38 -255 -109 95 51 -133 72 10 -473 -309 217 -231 -162 206
6882 206 135 -323 55 107 -353 -312 -75 -55 -70 -91 -68 -185 229 -84 132 -46 -104 -179 -207 281 -141 -355 85
6905 85 -28 -347 43 258 -43 -95 286 200 -36 -12 -182 -154 97 221 -100 -39 26 -15 -594 -154 327 -263 -216
6928 -216 26 34 -87 255 -136 -467 -88 -6 -482 15 18 5 92 264 110 -526 353 280 63 77 280 55 -293
6951 -293 137 28 57 268 14 -150 24 332 109 37 170 528 -197 159 303 -306 398 230 -250 -300 -114
6972 -114 207 -46 -87 500 126 52 297 269 -25 213 30 -55 201 529 35 50 438 -173 -78 177 248 -428
6994 -428 252 208 294 -400 -122 -44 -23 67 -38 -111 303 157 -48 -284 76 -194 -57 200 220 -326 -296 -94 -215
7017 -215 -325 279 31 -529 -65 262 -34 -177 111 -104 -212 216 -176 -294 77 168 -295 -8 -39 -378 -79
7038 -79 133 214 -410 -22 112 -206 15 220 142 -199 24 190 13 -11 185 -266 -303 -46 5 22 -66 -288 -16
7061 -16 135 -32 -254 -207 192 69 20 11 118 -216 125 298 -131 -83 227 133 67 -46 204 -196 -127 339 -222
7084 -222 -225 168 -84 -175 206 195 -209 83 445 156 -159 77 51 -285 -65 23 -337 47 -90 -288 -177 244
7106 244 141 -17 331 338 146 48 197 -281 12 195 252 -159 -34 174 -291 -37 -35 -27 -136 148 30 -206 209
7129 209 -22 107 86 213 -85 -204 -119 236 -299 -184 108 -436 -39 149 -226 -187 239 -10 -667 67 -103
7150 -103 -150 134 21 320 -130 -142 -147 -283 35 -37 -433 195 313 -42 -125 119 -139 -244 37 294 -125 -47
7172 -47 -46 -152 -247 64 47 -426 69 -16 131 127 -20 276 -56 39 329 -165 -44 -25 -2 123 210 67 -34 -36 314
7197 314 75 87 234 -90 -321 115 -67 -24 119 230 112 351 450 -142 -246 116 45 -14 -34 220 -163 -12
7219 -12 -6 -40 85 458 337 -85 81 372 -247 -194 295 -114 2 195 159 55 -142 382 -87 -171 310 -436
7241 -436 -3 355 17 -183 158 -34 -79 179 334 -16 92 126 -213 -266 45 572 -13 -213 135 8 -274
7262 -274 189 295 -81 -20 61 -71 -124 62 -201 -217 319 67 -19 -179 269 29 -73 126 83 -360 101 8
7284 8 -291 144 0 -94 20 81 -207 -106 163 157 -309 -162 -256 -57 -177 -171 -99 -364 135 71 -276 150 280 9
7308 9 88 343 52 -313 -16 373 -255 357 304 -118 -135 115 168 15 120 107 52 -19 303 81 -31 87 -2
7331 -2 1 -290 114 -32 25 192 22 -122 110 350 -337 7 168 -143 -60 -196 36 -224 241 -153 48 281
7353 281 75 -108 -36 -62 -18 55 11 62 -133 249 356 -23 -80 194 -140 -183 135 130 -309 -313 -76 -40 -86 -8 -64
7378 -64 -194 289 370 33 17 86 -36 -446 -76 70 -120 63 -107 -79 50 -148 -139 -69 130 -185 -231 185 -161
7401 -161 -164 -117 -81 -57 -517 185 -39 -201 -88 69 -271 36 101 -37 -367 22 -5 110 102 -230 -141 157 140 193
7425 193 -75 83 119 182 -65 125 -529 -241 384 -99 -152 30 36 130 185 66 -216 -263 264 452 -302 296 101
7448 101 -182 26 443 -31 -284 176 200 136 361 70 -327 300 419 -156 -395 69 77 71 -51 234 -267 122
7470 122 39 -179 135 286 -263 -86 295 159 117 21 72 -177 87 92 27 10 295 -79 175 -106 -72 -158 99
7493 99 84 -24 65 -129 106 -260 212 -160 -52 -43 242 270 -117 -194 117 -179 80 22 9 100 -77 108 -144
7516 -144 -38 115 62 153 -245 0 -219 -36 209 -57 -159 31 -40 -112 19 -20 -159 -171 74 -403 -11 149
7538 149 -141 -67 -183 -161 -25 302 -132 -427 90 319 -213 -103 -104 -148 -245 134 111 -135 204 93 -283 -191 24
7561 24 -479 45 209 62 -288 -143 316 -96 -143 -69 48 -62 7 94 -70 -75 168 -198 -203 253 155 -21 317
7584 317 58 -450 181 328 -130 32 56 143 63 -22 230 -29 154 72 -120 80 6 -191 -220 104 316 -233
7606 -233 291 40 -313 -145 -125 -21 -248 224 97 -108 123 16 -107 9 293 -116 259 156 218 -405 -177
7627 -177 347 167 -126 -229 -91 -121 -142 335 -36 24 135 62 -121 100 92 -56 -93 -26 165 42 184 27 -156
7650 -156 299 -115 -358 -73 113 -221 -136 99 -190 -345 -98 278 -455 -133 163 -415 -215 2 -148 -292
7670 -292 224 256 -202 -174 -147 164 34 361 125 -97 266 -85 -322 47 107 -99 -441 288 3 -254 173
7691 173 227 -85 -135 444 135 58 220 -354 -104 -9 46 -180 -346 405 -302 -194 212 -92 -59 -98 173 -205
7713 -205 -157 86 59 -118 118 -53 -61 153 262 -300 -131 328 -16 66 135 -204 60 153 213 -225 -234 227 239 127
7737 127 -176 -131 276 -38 258 36 -203 171 -77 63 117 43 4 -373 161 100 206 260 -56 -41 48 -18 -324
7760 -324 -186 -80 -202 -20 28 126 -334 317 212 -123 -33 100 -329 -9 18 -291 -190 217 75 -77 35
7781 35 158 -96 -164 42 140 -312 -258 7 -189 -86 -13 -109 -294 189 10 -23 -217 158 -40 -36 164 -131 -133 -237
7805 -237 240 -78 -22 51 -89 205 130 51 -229 309 144 -200 92 76 -436 -362 -104 -57 17 212 314 -283 17
7828 17 152 -280 118 63 16 6 74 -18 -221 254 -4 -103 -121 -114 13 12 68 238 -208 197 39 188 44 44 -3
7853 -3 -196 62 176 140 -153 296 1 -65 377 177 -39 236 192 52 -35 60 -140 -208 90 32 -275 34 265
7876 265 110 173 -120 -69 -153 -47 238 -24 113 275 -157 43 73 121 -206 152 76 197 -60 89 6 -101
7898 -101 249 51 -144 -103 153 -406 -29 156 -134 149 231 120 -276 99 -9 -61 -100 214 -343 -64 9 -23
7920 -23 -152 87 -16 -58 -67 -108 -201 92 179 -234 -108 -66 -179 -211 -77 152 25 -97 134 -297 216 107 -158
7943 -158 -472 -49 -340 -157 217 92 243 -206 71 149 -244 240 17 -98 -161 189 -256 15 86 -28 -84
7964 -84 -36 277 -35 107 19 -55 19 222 -132 20 116 186 50 -109 -43 287 -170 465 216 118 9 -126 -27
7987 -27 -88 387 202 -331 543 336 -114 -104 204 -251 -155 224 -3 -127 -77 221 -17 -48 21 -117 33 380
8009 380 143 -59 16 65 -378 -7 277 -13 -113 103 113 -377 6 283 -106 -55 278 24 -47 -25 -102 -254
8031 -254 -121 75 -139 -61 77 -252 -244 -191 250 -242 76 -75 -142 -141 1 -268 -315 188 98 -4 -54 -177 -347
8054 -347 398 -64 -150 -66 173 -97 -104 -243 -14 338 -325 109 22 -4 -231 40 -208 90 -70 -199 297 77
8076 77 148 13 -43 199 21 38 -70 -140 -2 233 47 -103 233 48 -262 35 184 -329 -107 7 -25 -109
8098 -109 -91 18 -40 -90 -34 230 -20 102 -203 -157 143 139 -311 188 252 40 -172 292 217 -90 165 86 -184
8121 -184 -90 238 -244 -169 238 -278 75 109 374 -26 -136 179 100 138 295 171 128 106 126 239 -341 98 -240
8144 -240 -260 304 -116 -77 -79 352 -238 -148 185 -88 44 -195 -49 -171 65 -5 -46 77 -97 -47 -219 33 -86
8167 -86 27 110 25 -119 -59 171 -147 8 37 436 -171 -137 -35 57 -259 -10 -21 45 105 -131 -114 -149 368 -103
8191a03
$$ Imaginary data points
##PAGE= N=2
##DATA TABLE= (X++(I..I)), XYDATA
0 0 0 0 0 -8 8 -8 8 -16 16 -24 32 -40 48 -60 75 -88 105 -128 152 -176 208 -241 279 -324 372 -426 484
27 484 -551 625 -704 792 -891 999 -1116 1245 -1389 1543 -1714 1903 -2108 2334 -2585 2861
43 2861 -3167 3512 -3896 4327 -4824 5393 -6056 6839 -7783 8945 -10415 12347 -15010
56 -15010 18935 -25316 37496 -69206 326355 726712 135089 -99382 26542 317112 311541
67 311541 182162 95887 225084 299009 182845 -6210 48698 242198 342380 218292 26037
78 26037 -58616 59032 166559 105571 13164 92685 180321 102110 -29023 -24396 71116 132200
90 132200 76230 -35889 -52535 57910 98382 1518 -58555 13184 95256 94786 16053 -82248
102 -82248 -89456 20849 81420 4829 -62968 -23400 30625 22451 -22099 -50592 -18864 39226
114 39226 15605 -69625 -77763 -22728 -19220 -35824 -5279 9934 -24768 -44575 -44074 -49035 -26958
127 -26958 -45 -37078 -86253 -60997 -9167 -3213 -30049 -56295 -49387 813 11826 -63258
139 -63258 -103314 -35786 14705 -21594 -52408 -35500 -14674 2565 954 -39547 -53282 -4745
151 -4745 15278 -28637 -47957 -18096 2240 2295 -7219 -23916 -3454 41246 13899 -62867 -53424
164 -53424 26983 44996 -7064 -44160 -32697 14805 46476 1196 -59430 -25612 45754 30792
176 30792 -35151 -56799 -29613 18228 45611 319 -63995 -35009 36914 21928 -41470 -42957
188 -42957 1607 22637 1703 -42491 -50790 9142 49782 3207 -40858 -12685 14116 -3322
200 -3322 -19600 -22233 -12316 23428 32503 -22925 -51003 8097 54064 21184 -22824 -28587 -7043
213 -7043 21066 14114 -28473 -23166 38527 46126 -11981 -33005 -3542 14995 16578 4440 -23451
226 -23451 -20853 18998 22277 -13522 -11575 18361 17333 -1563 -16239 -28736 -11025 26832 13005
239 13005 -30311 -13245 29746 15757 -17611 -14695 378 8210 11031 -10103 -29054 -1534 26585
252 26585 7097 -8819 8557 14358 4098 3178 -6309 -14828 14936 35215 144 -21646 10705
265 10705 29877 10004 -1661 3734 11838 24455 12762 -25056 -20743 29140 38102 1207 -12622
278 -12622 -2015 6334 18912 15348 -15879 -17418 19520 18214 -20281 -21412 7912 18063 11993
291 11993 -1426 -17331 -3040 23249 846 -32308 -6244 29377 10002 -18788 -13831 3223
303 3223 20882 26158 -7054 -32558 2334 37352 8493 -26819 -15815 12382 30727 24340 -14958
316 -14958 -31521 13968 40781 877 -26504 -586 17580 7251 -1284 -7866 -5380 18469 22960
329 22960 -8934 -17225 8217 8848 -10758 -7775 4142 8263 12271 -3735 -30304 -7955 38485
342 38485 23829 -26286 -28481 2576 13023 4295 -12353 -22514 2558 33929 11865 -26121
354 -26121 -17544 8024 10518 8378 -712 -22701 -16476 15102 14595 -4902 4197 14489 -1301 -7348
368 -7348 2169 -1474 -5613 -51 -4767 -2691 18739 14549 -17177 -13717 18435 16850 -5765 -13678
382 -13678 -18877 -13012 15671 21133 -12084 -20532 6487 17103 4669 -9194 -25105 -22306 10511
395 10511 17999 -14245 -22247 1394 6640 324 5723 -2380 -20431 -11480 2041 -6672 -8142 1723
409 1723 -4342 -6588 11755 12080 -7738 -9604 -3658 -7583 3868 15325 -8224 -25697 2951 27927
423 27927 14055 -3382 -9665 -9763 8685 22336 -4103 -28060 -6277 19052 14617 5131 -3715
436 -3715 -13381 2109 24141 5511 -22228 -11597 4643 -585 1134 7636 -2115 -3668 8713
449 8713 4984 -2920 3661 -1475 -18017 -5934 16758 7606 -6813 -1229 3044 7258 21332 10261
463 10261 -20465 -14046 17374 17355 -1888 -6636 -2453 10223 28934 18502 -13556 -11757 14052
476 14052 14191 2780 3608 -2579 -6231 12975 21860 3538 -1771 8682 1871 -4047 6932 4835
490 4835 -9588 -4536 6231 4166 7026 6689 -11390 -11649 15638 15649 -13485 -20159 -5235 1500 7697
505 7697 7714 -11663 -15670 10581 18931 -2191 -10935 -5153 -2800 4949 9206 -6753 -11027 11429
519 11429 15699 -3078 -605 12521 3953 -4596 2684 3242 503 6115 1138 -5169 12836 25093
533 25093 3014 -12746 434 9881 8252 6812 -6572 -15875 8359 28850 7599 -12934 1012
546 1012 15192 11438 2733 -9883 -14406 7810 22460 1930 -9227 8810 14928 3104 2528
559 2528 3216 -2415 4579 8967 -6251 -7152 14787 16877 -539 1116 10256 6656 3827 -385 -11503
574 -11503 -2608 21428 12837 -12713 -6365 14217 13177 4971 367 -7717 -2575 11859 1323 -17081
588 -17081 -4848 13800 6860 -2006 -1688 -6547 -3713 7347 -1242 -16525 -4847 7261 -6013
601 -6013 -12952 -1588 1233 -1868 1131 -6816 -15577 -3306 3958 -12019 -15400 1096 2553 -5855
615 -5855 -3996 -5176 -10323 -554 3067 -12317 -14207 585 -1630 -12395 -4595 2030 -2082 422
629 422 -1382 -15064 -11189 5891 -1465 -16175 -7178 2773 -2598 -3171 -1758 -9233 -5838 6753 -2738
644 -2738 -18330 -10095 112 -4324 -3734 -1400 -9058 -6202 6183 -1898 -15199 -5812 1045 -9927
658 -9927 -8670 1621 -3180 -7895 -1640 -3655 -7205 3735 5375 -11248 -12505 661 777 -2959
672 -2959 -77 -5622 -7664 8606 10300 -11047 -13442 6767 10806 1460 -3494 -10117 -9061 9464
686 9464 15411 -1829 -7802 3415 3835 1086 4721 -731 -8059 3843 10158 -3739 -6118 7218
700 7218 6174 -929 5022 6244 -2516 -3519 -2200 -4448 5802 15006 -365 -12408 4024 15609
714 15609 6227 -137 -2474 -7171 3779 17098 2523 -15027 -908 18886 17955 8263 -1665 -8180
728 -8180 4104 18355 6524 -7117 4130 13056 6045 7552 12829 5163 4283 13848 9667 -485
742 -485 3998 5057 -1568 7413 21567 12767 -447 -213 2423 8836 18396 6241 -16023 -6999 16992
757 16992 13127 -2458 -2584 3264 8945 14584 4618 -14646 -9483 9500 8131 -1633 -702 -1943 -3307
772 -3307 7179 10167 -1359 -1895 3126 -6347 -9179 4944 4893 -9056 -6653 6346 8502 5117 -2604
787 -2604 -14895 -8872 12392 9821 -13835 -17493 -3823 4200 8863 4392 -12232 -13050 7610 8979
801 8979 -12995 -17611 -5194 -736 1348 1858 -7629 -11202 259 2177 -5842 -3093 -1339 -13170
815 -13170 -13154 602 1427 -5139 -2191 -3508 -7719 3168 8009 -10049 -19006 -3403 7087 3315
829 3315 -3170 -12088 -12298 7337 17645 -1254 -14282 -2835 4464 946 677 -4669 -9905 2617
843 2617 14283 2717 -7210 -119 2891 1071 5851 4019 -7052 -5562 1635 -962 1567 10974
857 10974 3692 -8551 371 10288 1096 -6859 -5572 -4104 3106 11084 -377 -13529 -2184 12312
871 12312 7569 -443 -3527 -8888 -4135 7919 2377 -9908 -1353 9625 4436 809 2157 -4183
885 -4183 -6235 3975 4762 -3278 -1011 660 -6115 -460 12569 7104 -4818 -2724 -871 -3259 1565
900 1565 1372 -8141 -2845 11027 6393 -6210 -4350 147 41 6202 4260 -10991 -11418 3469 5314
915 5314 -1690 1128 2234 -1884 2255 3720 -6644 -8224 2915 2006 -3776 1148 1577 -4957 155
930 155 7313 792 -1549 3435 -2753 -9492 -509 5823 -563 149 5187 1525 1407 6488 -1419 -7903
946 -7903 2799 9209 -854 -4643 556 782 4217 10802 3814 -5014 1988 6228 -3105 -4287 3097
961 3097 2679 2051 6114 1010 -4187 5371 8702 -2041 -3489 4035 252 -4056 1470 1893 187 7824
977 7824 7997 -4106 -4641 6079 4093 -1830 668 929 -1018 4618 4486 -4053 1116 11539 4048
992 4048 -5649 155 3515 -1097 994 2573 -1827 2298 8817 297 -7294 2441 8855 1511 -2082
1007 -2082 -1759 -4175 1316 6713 -2468 -7503 5234 10136 -2484 -6154 -439 -331 526 2812 -3677
1022 -3677 -7043 2531 3094 -5722 -1043 6806 1492 -4690 -2464 -3717 -3579 3692 508 -8937 -1661
1037 -1661 10557 2266 -8391 -4381 1830 3999 4171 -5191 -13314 -1367 11391 2562 -6553 -384
1051 -384 3233 809 2370 -1117 -8634 -2067 6968 535 -5147 2092 3102 -2453 1032 4111 -510
1066 -510 -191 438 -6900 -4605 7777 5408 -6983 -2992 6737 5021 1238 -1641 -7635 -3480 10062
1081 10062 6218 -8691 -7336 3055 5520 5685 3680 -5324 -5284 7049 6066 -6078 -5302 2729 2400
1096 2400 3043 6326 -325 -4670 2498 4886 -587 1521 2422 -5994 -4850 6377 6238 -85 1002
1111 1002 410 -2363 4574 5996 -6997 -9858 3017 7648 1206 -1907 -4207 -4079 6176 9896 -3382
1126 -3382 -10815 -2725 1136 -629 1064 -1449 -6801 250 7642 -286 -6223 -1356 -2175 -4442 1923
1141 1923 2997 -6161 -6355 1144 1534 2175 3671 -4504 -10131 797 7424 -2741 -7462 -2762 -1048
1156 -1048 2449 6820 -1710 -10867 -2106 7794 2272 -3804 -5019 -6898 -2196 7338 2549 -7667 -3338
1171 -3338 3546 -302 -1638 1101 -4680 -6621 1894 3546 -3352 -2597 -388 -3361 1211 7531 -83
1186 -83 -8061 -3655 101 -428 3227 1059 -8022 -4256 9026 6623 -3792 -4171 -975 842 5595
1201 5595 3174 -7829 -6473 6511 7677 1401 385 -729 -2177 4844 7315 -3225 -5906 3208
1215 3208 4657 786 3385 3100 -2301 1244 7102 2725 -503 1176 -3441 -3996 6704 8652 -1810
1230 -1810 -3205 3387 4009 3631 4061 -3741 -7194 4032 9032 -1449 -5454 386 3115 5381 6648
1245 6648 -1667 -7454 1740 6545 -1239 -3281 1741 64 -748 4857 2931 -2385 1325 2222 -3383
1260 -3383 -653 4629 -1620 -6792 787 4877 2006 1465 -1844 -6232 401 8267 -986 -10077 -2859
1275 -2859 3442 1279 131 -2201 -5808 683 7363 -1409 -9439 -2592 1916 -1805 -1689 -480 -3950
1290 -3950 -962 3615 -2475 -6564 1613 1960 -6213 -4637 1502 -405 -2000 -561 -3393 -2220 5334
1305 5334 1973 -8824 -5625 3696 1616 -1950 -1074 -3396 -2133 5293 3170 -6285 -3060 5014 1541
1320 1541 -3604 -905 -780 -649 3916 1984 -4539 314 6185 -1095 -3845 2953 3525 -1410 271 1208
1336 1208 -1629 1868 5714 -1091 -3431 4053 3766 -1507 40 1529 -746 2742 4848 -1625 -2074
1351 -2074 6018 4915 -2989 -343 4607 1414 411 1927 -909 170 5899 3238 -2827 1412 5302
1366 5302 166 -975 2179 -438 -427 5485 2555 -4762 98 5944 1815 -948 1562 -839 -1738 2745
1382 2745 1244 -3139 1296 4076 -1752 -1695 3646 550 -3696 987 1156 -3282 -220 2813 -2740 -3289
1398 -3289 3846 2805 -2237 -1183 -1142 -2891 2354 3030 -5481 -5226 4015 3943 -2152 -864 -1154 -3144 1927
1415 1927 4647 -3780 -6763 522 1778 -1071 525 328 -2465 1096 3259 -3200 -4730 1371 -59
1430 -59 -3945 828 2553 -3592 -2340 2738 711 -639 1697 -2800 -6896 -622 4139 -525 -2929
1445 -2929 -703 -1373 1504 5484 -1299 -8354 -850 5113 -286 -3741 -845 -1898 -81 5972 2633
1460 2633 -4514 -1591 2512 -50 -951 936 -2447 -2571 3886 3108 -1749 468 1995 -2765 191 5927
1476 5927 364 -6154 -1462 2957 2634 3201 1014 -4198 -399 6796 2649 -3908 -1661 451 447 3989
1492 3989 3137 -4890 -2505 6930 5165 -1820 -1757 -225 -1311 2232 3656 -1715 -2222 2484 1271 -62
1508 -62 4244 2448 -4468 -1420 4356 1283 -1120 277 -2251 -1845 6093 6283 -3207 -4877 1382 3513
1524 3513 1750 235 -5061 -4237 5135 6469 -2981 -4680 1393 1923 1367 2091 -3266 -6470 883 4265
1540 4265 -1463 -2630 995 -934 -1836 2181 1056 -3225 -1650 -1396 -3889 72 3699 -3109 -6604
1555 -6604 830 4148 -237 -2618 -3475 -4839 1016 5506 -3068 -8955 -1378 4168 1860 -254 -2893
1570 -2893 -5136 535 5400 -1829 -7055 -1382 1696 -913 1076 1927 -2616 -2095 2135 200 -2014
1585 -2014 697 -784 -4443 249 4804 371 -2193 618 18 708 3928 -510 -6963 -1314 5976
1600 5976 2243 -2078 -514 -87 1064 4983 1996 -4163 -1730 3452 763 -679 1711 -321 -1564
1615 -1564 4116 4577 -1240 -862 1924 -1052 -358 3681 1160 -2892 897 3840 1348 1739 2000 -2252
1631 -2252 -1518 4347 1952 -3693 -1101 1649 568 2238 3425 -1794 -3230 2730 2734 -1745 -1091 -582
1647 -582 -2484 1039 3793 -1068 -3612 1631 2693 -1394 -538 -780 -3425 -1189 2452 -1076 -3101 1088
1663 1088 747 -2646 127 2082 -2081 -2542 256 -2101 -2473 1991 21 -4547 -554 3589 -660 -3021
1679 -3021 -1125 -1832 -1037 2236 -667 -5723 -1012 3888 -289 -2894 -41 -581 -908 1124 -1361 -5005
1695 -5005 -389 3426 -1536 -3279 1079 1162 -1069 284 -513 -2633 962 2089 -3594 -4002 2213 2571
1711 2571 -1402 -508 178 -936 1196 1925 -3294 -3185 2996 2205 -2875 -715 1334 59 1283 2061
1727 2061 -1957 -1381 3116 411 -3692 317 3593 575 -81 1300 -653 572 3970 479 -3851
1742 -3851 106 3831 158 -1347 382 323 1446 4410 366 -3475 816 3582 -1013 -2087 1370
1757 1370 312 -217 2457 1069 -1714 1693 3013 -1787 -1433 2714 853 -2335 312 990 495 3233
1773 3233 2170 -3306 -1554 4487 2270 -3320 -1710 724 1123 2526 1006 -3377 -941 4953 2090
1788 2090 -3136 -1489 279 -1071 1087 1194 -1734 -942 3309 571 -2983 912 1816 -2303 -1892 1207
1804 1207 -75 -10 583 -2250 -2049 3913 3694 -3586 -4546 557 1573 471 27 -3495 -2710 3878 3985
1821 3985 -3261 -3885 1045 1262 -35 67 -2673 -3251 2037 3016 -1850 -1303 2127 -572 -2005 1019
1837 1019 272 -1816 -414 -528 -1867 810 3362 -1842 -4244 1720 3382 -503 -1669 -2619 -2637 2025
1853 2025 4602 -1912 -4639 701 3403 744 -375 -1108 -3160 601 3488 -1020 -4144 -277 1602
1868 1602 71 1362 1057 -2397 -1465 1540 290 -1526 778 -235 -2737 578 3367 -258 -2273
1883 -2273 351 280 64 2425 -895 -4669 -1156 3775 1859 -1078 -767 -1495 -236 3863 1626 -4606
1899 -4606 -2616 2262 1203 -504 -447 -1828 -1093 3071 2533 -2669 -2061 702 -690 -1066 1426 -226
1915 -226 -2570 368 1590 -906 136 922 -2633 -2693 1968 1104 -2627 -2576 -850 187 2731 1910 -3933
1932 -3933 -4307 1756 3050 -1558 -3179 -1807 -1449 2074 2250 -2901 -3678 1429 2548 -1687 -1861 -1209
1948 -1209 -2380 -290 1868 -992 -1615 1271 -166 -2558 -18 2372 -1511 -3178 -67 164 294 1270
1964 1270 -1171 -3439 1407 4631 -656 -3658 -1133 306 1333 2186 -1338 -3844 1315 4875 518
1979 518 -2380 123 675 516 1547 -15 -2239 719 3374 277 -343 2400 1208 -854 1069 1900
1995 1900 539 1348 1220 -1509 274 4924 2143 -1776 221 3236 2312 1347 432 -2050 755 5127
2011 5127 2195 -2217 139 2996 1766 1565 1188 -1503 68 3869 1354 -2230 942 3248 456
2026 456 -363 1632 489 229 1163 -565 -1222 1955 2422 -1842 -1422 1847 1605 -164 162 -1316 -1590
2043 -1590 1834 2032 -2591 -2834 1761 1579 -473 -761 -1688 -1276 1526 1102 -3085 -2817 1180 -125 -2346
2060 -2346 -634 2 -1360 -138 -166 -2772 -1820 1540 -604 -3777 -1009 -123 -1533 -1071 -820 -2608 -315
2077 -315 1846 -1773 -4211 -812 1011 -1654 -1498 -529 -1463 -611 1173 -1209 -3198 93 1113 -1797
2093 -1797 -1924 123 -627 -301 418 -1211 -1780 1224 1038 -2855 -1750 1332 33 -792 625 -643 -1071
2110 -1071 1801 1406 -1590 -1062 1528 118 -1054 159 -388 -626 1653 1700 -1257 -400 1900 -249 -1317
2127 -1317 1264 813 -1266 187 1022 -721 710 2224 -391 -1564 1154 1302 -438 -179 -160 -974 978
2144 978 3023 -330 -2231 962 1833 -236 -211 15 -1746 239 2221 -276 -2145 829 1846 -31
2160 -31 137 250 -1830 -745 1742 -36 -1414 882 727 -1511 0 1780 -79 -1276 8 -1000
2176 -1000 -887 1580 253 -2631 -537 2418 629 -1263 -597 -1160 -378 2257 547 -3453 -1546 1901
2192 1901 937 -971 -402 -708 -865 1603 370 -2638 -1220 1274 -293 -921 792 -164 -1623 -66
2208 -66 591 -956 71 680 -2073 -2032 1657 1615 -1770 -914 -132 122 1276 864 -2612 -2571 2259 2431 -940
2227 -940 -1739 -447 -220 1521 2249 -1947 -2491 1473 1675 -1218 -359 333 -605 228 1574 62 -971
2244 -971 1259 513 -1100 1148 2058 -780 -1605 1491 1488 615 1267 -308 -1193 1795 3413 -685 -2469
2261 -2469 9 1508 1727 1725 -396 -1656 1494 3485 744 -1032 590 768 157 1710 1029 -969 707
2278 707 2467 270 -27 1523 436 -1199 1095 1935 33 -180 1024 -403 994 3423 476 -2356
2294 -2356 -125 1974 547 -95 -65 -1421 173 3292 1102 -2134 -596 1528 480 272 185 -1666
2310 -1666 -735 1761 734 -1164 248 736 -598 122 1281 -842 -1902 209 213 -524 271 434 -2063
2327 -2063 -877 1469 372 -1341 -848 -944 -1217 1155 830 -2099 -1755 918 626 -807 -110 -620 -2004
2344 -2004 505 1337 -1601 -2111 432 507 -254 546 -40 -1922 -309 1308 -1062 -1306 530 -471 -795
2361 -795 832 951 -1468 -863 884 -77 -120 856 -418 -1806 807 1353 -337 -31 320 -835 -38 1855
2379 1855 -356 -1797 366 1731 137 -324 495 -920 72 2038 497 -1361 260 1208 -548 354
2395 354 1044 -403 -846 1192 722 -604 748 996 -918 36 1325 -121 -964 420 305 -305 1339
2412 1339 1041 -1406 -555 1738 396 -970 323 -98 -1005 802 1247 -1193 -617 1674 162 -1136
2428 -1136 -119 -45 -1053 227 469 -1088 -581 1227 -399 -1233 769 650 -927 -387 195 -1384 -663
2445 -663 1175 -648 -1987 534 1045 -1224 -729 -269 -1282 -546 1020 -878 -2014 535 1108 -953
2461 -953 -611 500 -641 -486 704 -772 -1051 680 1013 -1201 -799 1152 -229 -736 97 -473 -642
2478 -642 1345 592 -1814 -218 1758 121 -690 288 283 -491 982 757 -1157 -302 1736 114 -550 1272
2496 1272 594 -233 869 979 -636 171 1525 -311 -884 1777 1470 -421 233 833 153 751 1351 -958
2514 -958 -1138 2094 1773 -617 -74 815 182 804 1454 -454 -759 1332 1393 -613 237 1016 -69 216
2532 216 1493 -24 -604 1098 143 -814 774 1398 -682 -1056 1368 753 -14 625 -460 -1253 791
2549 791 1718 -1189 -1593 413 670 -85 588 -545 -1436 442 1584 -750 -1434 116 -427 -924 413
2566 413 362 -1630 -195 975 -443 -902 258 -1008 -1707 154 979 -1233 -879 407 -543 202 883
2583 883 -670 -2138 -355 549 -598 -671 -98 -1424 -835 1772 28 -2010 -641 168 -801 -55 162
2600 162 -1770 -1578 1252 815 -922 -527 172 -765 -176 601 -1131 -1440 402 295 -506 161 572 -1098
2618 -1098 -214 1332 80 -1034 95 -180 -934 1083 1471 -764 -895 1265 811 206 307 -608 -1059
2635 -1059 1189 1882 -655 -895 1036 1109 534 796 -2 -1319 686 1826 5 -451 851 564 -27
2652 -27 1332 950 -429 129 1063 -173 194 1475 -220 -1249 1204 2012 277 -111 498 46 798 1791
2670 1791 -218 -1510 610 2039 442 424 600 -441 333 1765 -197 -1586 33 1126 -365 255
2686 255 773 -350 -333 1294 185 -814 246 305 -890 -126 1552 -209 -870 116 306 -350 1003 28
2704 28 -1766 -837 1037 -28 -1246 -512 -337 -354 709 178 -1609 -793 1352 -29 -1282 -329 -498 -1130
2722 -1130 -33 471 -1158 -848 492 -722 -1313 359 -181 -1405 -414 259 -701 -405 263 -975 -900 1024
2740 1024 410 -1549 -958 124 -350 -453 610 -1202 -845 942 1061 -1091 -888 377 -137 -20 453
2757 453 -647 -822 911 681 -1028 -290 903 -486 -881 980 37 -501 630 416 -851 288 1468
2774 1468 -599 -963 705 736 -140 337 153 -791 694 1916 -135 -843 617 860 40 19 298 -336
2792 -336 421 1329 -406 -496 1032 480 -926 540 1245 -416 69 773 -339 -740 1341 321 -846
2809 -846 235 955 -8 -163 572 -780 -332 1028 420 -1392 292 1126 -610 -143 558 -231 -656 667
2827 667 160 -968 -145 701 -725 -765 640 -107 -996 206 -403 -839 67 367 -1205 -481 918 216
2845 216 -875 433 157 -1168 -4 665 -677 -688 246 -154 -712 383 150 -1219 -12 894 -452
2862 -452 -536 442 -215 -778 693 658 -1048 -92 456 -231 -391 734 -138 -1141 211 592 -387 -50 471
2881 471 -651 -52 1226 288 -950 -71 1021 -22 64 293 -437 -300 1121 717 -629 -9 760 -531
2899 -531 291 526 -257 -89 860 436 -757 654 930 -646 -311 952 393 -501 160 429 -345 934
2917 934 772 -1090 -967 1051 237 -606 187 -214 -357 1045 1065 -980 -776 987 604 -464 38 95 -525
2936 -525 76 385 -782 -346 740 -43 -747 643 659 -897 -381 173 -342 98 759 -709 -1205 600
2954 600 863 -753 -821 -109 -674 41 688 -802 -1120 356 957 -657 -471 154 -295 -574 758 -334
2972 -334 -1306 -207 312 -421 -182 427 -334 -850 383 -165 -933 208 -348 -932 154 957 -161 -1110
2990 -1110 130 611 -292 315 -322 -1018 -479 1255 21 -932 366 273 -397 620 496 -1102 -170 800
3008 800 -251 -998 373 101 -501 514 953 -473 -460 217 -86 -478 865 536 -740 46 1215 439
3026 439 117 646 -283 -378 1411 581 -1192 -152 1161 475 281 946 -321 -224 903 910 -814 172 1047
3045 1047 -194 -67 1139 -9 -784 626 1082 -264 52 804 -371 -738 1344 642 -572 267 473
3062 473 -154 597 946 -591 -568 867 538 -510 -89 76 -401 388 946 -529 -1009 452 157 -627 118
3081 118 315 -621 -32 1007 -190 -266 240 -40 -823 121 219 -1333 -706 355 -134 -375 254 -255 -1160
3100 -1160 32 619 -722 -606 1 -401 -610 427 -211 -1263 -67 754 -504 -581 70 -605 -976 620
3118 620 32 -1163 -456 277 -554 -360 321 -454 -805 375 297 -976 -184 260 -542 -177 660 11 -712
3137 -712 312 400 -380 215 542 -499 -554 858 232 -367 335 401 -359 401 842 -488 -748 800 347
3156 347 -607 484 527 -206 336 1149 -573 -536 411 140 -670 299 615 -298 187 373 -168 -165 920 482
3176 482 -725 864 818 78 140 893 20 299 1013 176 -625 333 969 -418 -232 747 290 -135 694 106
3196 106 -541 456 657 -512 -28 587 258 -538 147 240 -427 812 858 -706 -594 784 -178 -821 -136
3215 -136 168 -447 475 684 -666 -233 816 -134 -853 105 251 -450 142 399 -569 -537 519 -423 -1064
3234 -1064 378 120 -927 -421 545 -502 -573 145 -809 -765 190 260 -1008 -319 -146 -311 -456 407 -391
3253 -391 -794 312 623 -587 -230 93 -504 -384 328 160 -914 121 489 -108 13 657 -440 -791
3271 -791 740 371 -263 83 327 -328 192 1077 -38 -506 726 211 -186 422 128 -753 320 1104 -17
3290 -17 -677 496 567 -301 571 880 -484 -354 534 37 -214 762 433 -522 721 731 -245 -281 615 9
3310 9 -144 806 349 -728 303 1030 -92 -23 349 -51 -258 610 297 -618 -271 783 -220 34 628
3329 628 -160 -714 493 645 -759 -283 455 98 -263 513 -47 -646 354 560 -512 -189 55 -624 -485
3348 -485 767 196 -645 78 167 -483 8 405 -779 -726 530 300 -704 -137 12 -431 15 306 -402
3367 -402 -917 393 43 -636 157 2 -823 -230 634 -249 -742 87 60 -526 -30 303 -814 -357 350 -168
3387 -168 -286 293 111 -981 115 709 -667 -580 590 -58 -609 390 52 -785 48 439 -139 -11 124
3406 124 -268 -324 504 127 -897 132 461 -218 -202 558 -255 -337 585 488 -584 103 457 -159 -138 703 114
3427 114 -389 212 167 -320 208 456 -310 -187 600 448 -366 94 -158 -265 366 735 -535 121 758 195
3447 195 -117 228 404 -404 349 308 -390 -319 476 143 -600 278 469 -268 -265 341 -258 -142 591 -257 -492
3468 -492 339 227 -493 -512 405 -127 -243 283 -133 -839 367 351 -575 -342 234 -103 -480 416 -199 -630
3488 -630 -163 134 -677 -173 382 -457 -759 301 2 -479 125 283 -822 -270 676 -227 -720 199 154 -431
3508 -431 -181 113 -326 -25 569 -120 -1009 136 179 -392 245 655 -550 -340 444 -85 -746 443 504 -676
3528 -676 227 387 -147 -247 475 -131 -357 643 522 -445 -217 452 -130 -137 640 -7 -262 461 593 -612
3548 -612 323 606 51 -68 492 149 -491 462 591 -317 -149 550 33 -295 478 225 -327 800 460 -256
3568 -256 -27 541 -178 -259 658 534 -506 53 381 -369 129 709 -162 -525 81 248 -54 58 125 -327
3588 -327 -50 359 139 -417 371 134 -365 133 400 -600 -427 210 96 -446 380 89 -652 -304 211 -317
3608 -317 -392 110 -326 -585 -47 -34 -697 -349 489 -172 -347 -194 -522 -504 229 -157 -850 -99 204 -360 -434
3629 -434 243 -273 -290 -12 -16 -697 -405 22 -433 -220 152 -203 -601 -147 41 -468 -55 182 -624 -507 236
3650 236 -96 -425 125 164 -378 29 392 -522 -627 250 129 -412 -122 288 -647 300 545 -372 -369 481 84
3671 84 -294 124 179 -71 -96 557 130 345 787 329 -422 167 495 -171 -41 472 77 83 896 347 -781
3692 -781 308 653 -15 -224 20 169 147 314 9 -437 189 813 -329 -88 539 59 -190 444 68 -454
3712 -454 6 606 -167 -277 696 307 -510 -2 246 -291 -200 284 -384 -297 725 35 -623 -146 388 -250
3732 -250 -167 401 -513 -320 579 -72 -416 73 211 -585 -82 262 -442 -356 228 -142 -607 93 391 -711
3752 -711 40 565 -228 -380 -57 -190 -689 -2 328 -642 -513 290 -74 38 -135 -1 -613 112 262 -350
3772 -350 -271 424 146 -67 307 -12 -431 183 521 -358 -613 420 70 -329 264 477 -286 311 115 -229
3792 -229 69 567 90 -486 288 460 32 42 354 -38 186 479 76 -151 265 248 -81 121 652 -412
3812 -412 -62 528 -89 -462 320 568 -222 434 180 -39 -277 397 39 -178 164 329 -96 87 423 -43
3832 -43 -139 185 -39 -269 596 276 -232 -13 733 158 -242 272 -27 -148 65 371 -362 -266 124 -167 -50
3853 -50 134 -157 -507 40 270 -230 -266 334 -280 -562 38 136 -482 91 -11 -364 -194 362 -313 -549 34
3874 34 11 -363 161 79 -176 -512 551 -279 -835 460 499 -420 -231 50 -628 -186 165 -460 -584 54 54
3895 54 -836 -190 -6 -267 -169 84 9 -173 230 193 -733 -2 329 0 -138 48 -27 -243 240 47 -480 13
3917 13 650 -208 -353 23 -3 105 388 313 -482 250 648 -144 -113 46 -15 -82 43 382 -518 306 971 -341
3939 -341 -329 581 104 -561 266 375 -237 326 256 -373 -277 685 407 -163 109 266 9 -143 357 -296 -134
3960 -134 629 357 -638 3 395 35 -35 330 -108 -109 578 111 -336 448 499 -156 -324 329 -93 217 48
3981 48 198 -458 265 116 -244 -268 136 -3 -391 278 -118 -353 -20 378 -370 -384 206 80 -250 156 259
4002 259 -393 58 311 -402 -90 339 -136 -516 -12 -58 -437 -241 134 -242 -510 283 -76 -628 -31 84
4022 84 -229 21 128 -101 -45 683 -13 -571 106 187 -616 -130 145 -147 -23 354 353 -513 215 -21 -233 -84
4044 -84 475 -94 -339 377 -117 -95 427 630 -476 -121 531 -241 -435 350 44 -429 300 425 -71 101
4064 101 348 24 -129 581 113 -154 322 531 -137 -225 691 84 -234 324 84 -98 -45 488 -299 63 308
4085 308 -150 -157 205 219 -216 232 561 -390 204 336 -355 -488 132 370 198 -302 304 -283 -131 402 247
4106 247 -545 271 122 66 -44 383 -179 -216 344 53 -360 33 -55 -150 -126 474 198 -191 103 -103 -388 40
4128 40 176 -810 -223 375 -6 -157 -41 -332 -337 -195 334 -724 -359 350 -115 -736 288 -166 -453 -25
4148 -25 28 -569 -214 -176 -146 -368 231 77 -368 102 197 -402 21 638 -410 -523 124 139 -591 113 71 -332
4170 -332 67 508 -383 -332 322 204 -407 -76 380 -128 45 286 25 -529 310 85 -236 -42 353 44
4190 44 -422 231 -248 -162 136 547 -334 3 231 -84 -262 452 269 -159 204 -95 -447 312 890 -36 -5
4211 -5 361 222 -159 487 195 -264 207 774 57 -101 375 85 -155 375 128 -206 -98 214 -234 -216 300
4232 300 215 -494 302 215 135 281 107 -478 -72 234 -36 -413 -126 -54 -292 -337 284 -261 -475 352 92 -216
4254 -216 179 153 -286 -307 -124 -348 -408 426 -22 -415 156 181 -327 -253 260 -162 -377 -44 -163 -394 -86 302
4276 302 -253 -484 350 -28 -575 -97 -167 -606 -61 296 -422 4 243 -236 -146 222 107 -688 -66 339 -469
4297 -469 -233 96 -284 -438 260 141 -252 -276 349 -256 -157 520 -186 -349 171 246 5 124 41 148 -6
4318 -6 200 127 -451 50 392 7 -60 144 -288 -75 309 64 53 -7 13 -240 -94 512 -115 -418 619 194
4340 194 -184 411 125 -80 0 561 27 -89 438 149 -221 118 219 -579 -136 279 -97 -300 371 246
4360 246 -348 500 388 -355 -438 422 316 6 303 -209 -317 303 393 -687 -65 353 -70 -211 -230 -239 -258 177
4382 177 164 -141 -482 214 -224 -467 370 42 -49 -175 -140 -432 -36 74 -279 -176 152 323 -417 -42 -108
4403 -108 -456 29 458 -511 -449 -12 -89 -262 -282 -154 -203 -191 309 -110 -255 65 336 -283 -8 445 -178 -438
4425 -438 151 -234 -106 313 312 -306 10 533 -227 -527 173 -198 -190 -89 -201 -262 -171 263 -111 -26 237 224 -195
4448 -195 242 159 -213 -156 513 -232 -195 273 338 -437 142 470 -118 169 415 -44 -192 473 -38 -451 306
4469 306 265 46 -102 310 170 -161 603 488 -108 167 641 107 -163 75 10 28 266 -85 -134 -89 391 -220
4491 -220 -151 199 -225 87 446 591 -595 150 518 -20 -378 261 -148 -395 146 248 -422 58 442 -258
4511 -258 -188 194 -286 -546 346 -111 -214 -124 249 -335 -438 369 -251 -245 243 -125 -585 -481 5 -398 -6
4532 -6 203 -8 -494 61 127 -337 -218 155 -164 -324 201 36 -667 -76 312 -404 105 239 -105 -165 353
4553 353 -93 -542 -24 477 -472 -77 142 -79 -408 268 216 -315 132 194 -206 -307 278 164 -211 248 420
4574 420 -12 500 528 -491 140 329 -128 -160 308 156 -95 194 227 -185 -35 449 211 67 569 352 -71
4595 -71 73 385 -269 -89 301 -21 -255 22 224 -179 -162 346 -319 -212 518 -94 -375 138 378 -255 -6
4616 -6 350 -38 -28 340 -226 -435 280 508 -118 -48 -26 -394 -141 409 245 -822 -4 81 -443 65 511 -418
4638 -418 -412 391 50 -375 -104 66 -414 -208 166 -123 -37 -15 22 -301 301 17 -463 -419 369 -165 -264 -259 166
4661 166 -539 -40 45 -352 -21 266 -188 -205 -4 374 -404 -203 349 -117 75 310 -303 -86 219 109 -265
4682 -265 -149 262 -230 -227 274 -176 -228 268 151 -411 -219 318 -226 -91 51 -15 -286 490 141 -264 179
4703 179 255 76 -10 472 16 34 383 394 198 167 407 157 -241 183 358 -471 307 -148 -22 298 690 44
4725 44 -257 32 285 -54 300 177 -155 146 242 -288 -177 135 -32 -198 178 234 -344 -51 208 -189 -200
4746 -200 448 -176 -395 224 615 -324 -119 330 -206 -232 225 199 -356 -65 376 -422 -243 424 -102 -175 213
4767 213 -50 -438 -104 233 -507 -154 313 -485 -472 -12 -184 -625 25 8 -327 -158 328 -180 -325 8 322
4788 322 -84 -109 187 -226 -690 -179 -341 -291 12 -125 -350 72 414 -380 -390 90 96 -310 305 111 -145 -135
4810 -135 232 -366 -135 312 -125 -295 -86 -139 -79 -198 151 -276 -100 118 -176 -118 0 179 53 106 578
4831 578 81 -85 355 -91 -100 159 -32 -165 140 164 187 -286 481 -36 -92 286 139 -327 130 769 -27 68
4853 68 304 349 -186 182 331 137 -55 383 -190 -65 404 401 -155 66 513 -35 -249 344 113 -172 326
4874 326 -4 -175 -97 452 -195 -118 374 111 -258 449 76 -453 -305 186 -174 -167 -74 -13 21 201 96 -89
4896 -89 -468 -127 -207 -2 307 -232 -426 143 62 -271 -173 534 -235 -152 433 -77 46 -57 -32 -67 323 129
4918 129 -68 -376 200 22 72 124 138 -117 -219 74 4 -323 -381 -43 -473 350 175 -586 -212 226 -246 -534
4940 -534 253 118 -156 111 350 -387 60 88 -88 -132 -8 -59 -255 341 122 -131 -263 407 -167 -202 404
4961 404 88 -16 -47 364 241 33 101 -247 -234 131 262 -323 -163 522 -262 23 140 -187 -6 426 395
4982 395 -427 135 497 -312 449 291 326 -364 -242 45 -102 425 463 -419 -169 481 151 -409 97 273 -152
5003 -152 91 75 157 -333 333 99 -246 172 -22 -186 139 -48 -253 -305 114 -48 -251 -9 364 -341 25
5024 25 340 -268 156 145 -133 -367 -48 104 -153 -393 236 80 -3 235 -225 -349 -36 8 -242 285 265 -401
5046 -401 -5 -4 186 -493 -57 362 -142 -253 264 -575 -202 272 49 -82 289 139 -261 99 247 44 -269
5067 -269 -7 30 -404 20 -4 103 210 308 -96 -306 186 -55 -284 -116 511 -240 -199 344 251 -459 -24 247
5089 247 -204 24 313 -50 63 378 -15 -232 313 410 -47 381 136 241 -10 219 45 -125 153 208 17
5110 17 146 21 217 -269 281 259 -493 324 318 -78 -86 118 76 94 287 193 -538 296 195 -122 2 346 31
5133 31 -140 247 192 -251 172 215 -294 -190 67 -94 -261 101 -75 -409 -1 359 -144 -340 45 -348 -311
5154 -311 -50 91 -171 21 96 -673 119 206 -287 -439 273 9 -337 -374 103 7 -19 505 -296 -166 -11 140
5176 140 -45 -106 5 -265 54 464 -125 -280 218 167 -202 151 224 -369 -76 146 -181 -176 -14 183 -365 -98
5198 -98 107 -335 -323 217 8 -252 115 344 -176 30 398 143 -109 357 -186 -200 194 328 -366 230 187
5219 187 165 -43 243 -176 -239 54 214 -188 -166 307 -8 -71 286 192 -224 174 252 -323 -121 315 -224 -216 356
5242 356 353 -142 38 375 -420 -140 174 -68 19 289 132 -324 -289 304 156 -93 385 -157 -215 339 -166 -195
5264 -195 -9 320 -293 -53 615 109 -249 234 661 -133 422 261 -526 -38 157 -56 -113 387 11 -304
5284 -304 -72 137 -442 -151 335 232 -107 381 -280 -163 -124 34 -115 -193 144 22 -85 102 10 -126 76
5305 76 213 -190 -529 -145 -66 -170 202 128 -659 94 154 -9 -415 288 -56 -186 87 113 -172 233 173 -46
5327 -46 35 140 -226 -460 86 40 -359 -183 150 -195 -293 205 118 -259 -329 280 -253 15 40 88 -69 204 -10
5350 -10 -556 -69 6 -303 22 453 -76 -240 255 335 178 -15 435 -78 -93 476 0 -79 271 293 177 65
5372 65 457 -55 -109 396 161 -81 -163 234 119 290 349 -134 25 392 266 -339 -34 384 -94 138 284
5393 284 -235 -236 61 29 -26 227 -23 -270 106 -56 -213 13 93 -10 -81 298 163 -276 -143 344 -275 -227
5415 -227 80 -81 63 -6 -77 -160 -168 286 27 -265 200 -7 -416 155 -11 -299 19 200 120 -247 343 327
5437 327 -487 -180 256 143 -375 128 -27 -532 38 167 -332 -245 -135 -331 49 287 -169 -417 305 304 -118
5458 -118 -1 99 24 -162 473 127 -221 403 -40 -187 228 267 -155 -247 263 186 -250 194 11 -174 -141 303
5480 303 40 57 268 -93 -350 692 -8 -48 172 360 34 -333 117 12 -2 1 273 -227 -104 232 -102
5501 -102 -234 162 325 -205 84 170 -284 -256 255 233 -348 119 -173 -212 -45 -18 -325 -167 114 84 -98 259
5523 259 -13 -7 -41 268 -385 -331 76 -124 -174 211 185 6 67 233 72 -320 219 -204 -431 147 107 -612 -193
5546 -193 287 -248 -145 93 18 -95 -263 -245 56 76 186 -347 102 135 -132 -130 -43 294 -405 -164 -291 -480
5568 -480 -316 144 -65 -310 -41 -121 -264 -26 356 -369 -243 188 -32 -225 26 -45 -245 -101 105 -180 -420
5589 -420 -135 -102 -86 221 283 -392 134 288 -303 -107 87 296 -71 135 214 -192 52 302 -10 159 516
5610 516 -61 -234 231 259 -127 98 205 117 -370 498 43 -154 77 391 -218 -49 191 45 -178 267 115
5631 115 -198 -118 356 -82 -118 63 -269 -23 202 384 -280 310 313 -95 -245 -167 -277 -184 386 181 -37 56
5653 56 82 -72 122 476 -52 -138 203 29 16 449 244 -466 -189 155 52 -180 -15 49 -294 38 206 -422
5675 -422 -103 195 -35 -181 192 356 -260 94 250 -236 -242 -6 -79 38 166 -109 -380 16 36 10 -77 -42
5697 -42 -110 -138 -18 37 -484 -79 4 327 -302 545 -259 -299 63 84 -267 -214 -91 128 -439 126 19 -457 103
5720 103 20 1 -45 -14 -266 -289 4 62 -1 233 236 -230 -234 432 164 -64 127 73 -341 -223 242 83 29 126 -36
5745 -36 -324 163 285 110 72 86 -38 -2 508 -12 -490 280 355 10 -2 245 -29 191 102 103 -111 172 81
5768 81 -230 327 188 -169 -23 86 -347 -178 163 316 -121 11 399 113 -65 120 112 -164 115 308 -384
5789 -384 96 19 -354 -7 57 172 -252 280 87 -486 -67 328 -390 -222 8 -41 -279 -71 59 -42 -58
5810 -58 40 -162 -361 148 -165 -310 137 -22 -338 23 216 -101 -225 222 130 -118 165 -70 -102 31 206
5831 206 -111 -193 334 -25 -293 -21 59 -146 121 342 64 -135 61 227 -34 -93 292 13 -100 226 -18
5852 -18 -108 -111 190 -23 191 391 197 -231 7 -67 -132 157 274 -125 98 349 -237 101 206 193 -135 162
5874 162 -141 -19 385 416 -241 -126 92 -150 -160 344 387 -472 -35 368 246 -26 215 -85 -461 617 427
5895 427 -230 73 117 126 -94 59 124 -314 187 163 -134 -46 113 92 145 382 18 -225 -146 -49 250 101 206
5918 206 -83 42 12 138 -235 117 268 -61 -51 344 103 -242 219 16 -536 -130 -178 -393 -184 426 96
5939 96 -330 -206 -198 -358 -25 161 -377 -319 293 27 -419 15 -373 -419 419 -84 -444 -56 380 -50 -160 21
5961 21 -21 -276 12 79 -103 -187 -16 -61 -318 -11 162 -427 75 405 -434 -375 -97 -202 -135 200 252 -314 -333
5984 -333 167 68 -248 165 -143 -63 -10 506 -308 -270 351 -23 -181 180 51 23 167 409 120 8 351 -81
6006 -81 -143 340 302 -5 183 440 14 -36 111 185 -251 605 88 -48 64 123 6 -238 223 -182 -209 259
6028 259 46 -101 -51 398 -37 69 275 11 -105 314 79 -170 189 235 -147 -29 310 111 -156 194 151
6049 151 -348 119 143 -116 -170 -145 140 -67 -167 190 -400 -121 336 -291 -287 64 -157 -379 246 51 -573 -62
6071 -62 388 -73 25 35 305 -24 145 258 -66 -228 279 6 -23 59 178 -332 34 100 -327 225 86 -79
6093 -79 -141 175 61 -320 259 200 -286 67 97 -479 -369 5 90 -128 10 -28 -344 112 337 -323 -323 180 77
6116 77 -141 25 27 -427 -91 298 -192 9 44 369 -107 172 191 -223 -95 311 -123 -333 -177 76 -201 228
6138 228 226 -69 -93 215 379 35 2 103 -167 323 243 215 -129 273 -17 111 495 68 -185 323 555 -220
6160 -220 -167 395 103 -240 346 379 -107 -114 326 120 -4 17 -210 -139 104 174 -225 -177 270 -148 -226 385 -102
6183 -102 -161 179 -61 -292 -74 -16 -47 -524 131 26 -450 92 -17 -172 -142 186 -107 -60 -45 -206 -343 93
6205 93 188 10 75 -168 -150 -438 -1 -107 -488 54 -70 -515 -156 339 25 -584 158 208 -137 24 145 -323
6227 -323 105 299 -452 -245 255 -386 -536 -294 286 -258 -122 423 -98 -268 105 42 18 9 250 -460 -39
6248 -39 70 140 0 138 281 -71 167 325 -269 -330 406 276 -41 118 14 -219 -51 226 61 -457 137
6269 137 10 -61 167 320 -93 33 23 206 75 187 343 59 267 117 -110 -232 173 325 -159 13 -7
6290 -7 -70 228 123 304 -79 245 -183 -54 425 382 -187 321 343 -164 -473 398 -171 50 331 282 -199 65
6312 65 155 -378 -198 -35 -79 -105 71 95 -71 209 -8 -508 -15 139 121 -281 333 76 -20 -79 127 -351 -37
6335 -37 -112 -301 -243 -48 174 -321 156 271 -199 -59 303 -86 -114 143 -107 -180 -261 391 -282 -393 177 -192
6357 -192 -471 243 14 -456 -268 393 -223 -199 242 316 -30 112 453 -100 27 189 -9 -163 325 13 -211
6378 -211 35 197 -64 -208 175 -127 75 92 -26 -153 -237 147 -191 156 155 -63 -165 535 106 -247 49
6399 49 -68 -194 471 -82 -230 -91 352 184 -238 296 -21 -290 -106 269 192 -66 252 -16 136 39 287
6420 287 18 -169 170 386 2 269 -2 -70 209 74 19 -164 252 47 59 -87 46 6 163 244 -335 -169
6442 -169 -55 141 -43 146 -98 -256 127 136 -261 7 63 -43 -249 344 67 -80 -46 125 -137 -257 -14
6463 -14 -292 -323 -115 198 144 -165 -5 -273 -214 -216 119 -198 -130 190 -232 -53 43 110 -157 224 -18 -383 83
6486 83 197 -185 91 285 -104 -131 270 -164 -30 34 98 -529 190 12 118 66 237 -130 -188 231 162 -275
6508 -275 33 9 58 -220 137 183 -177 9 276 -152 128 439 36 -141 402 -52 -96 95 143 -46 -107 124
6530 124 21 47 312 16 -225 -36 602 -148 -121 203 -97 -83 29 -44 -384 149 296 -273 -196 178 -94 24
6552 24 73 328 -138 66 490 -254 25 167 38 -178 -67 278 -116 196 106 -255 -257 229 108 -159 -59 161
6574 161 -154 -115 372 -45 -240 64 -29 -292 228 309 -62 183 186 -191 -286 120 -36 -345 32 -18 -272 256
6596 256 192 -114 -213 -22 -2 -351 4 220 -175 42 345 -156 -279 308 -139 -331 -283 -107 -339 259 155
6617 155 -96 -137 36 84 -419 308 303 -296 -14 368 -80 -291 295 -134 120 -73 377 43 -250 292 -129
6638 -129 -56 296 -145 -47 63 328 72 -312 -26 -232 -36 257 215 119 -8 277 -15 88 365 -110 -562
6659 -562 341 361 15 203 -139 129 59 -18 39 -168 125 128 156 -14 -66 -218 -24 192 -38 -40 -281 28 -460
6682 -460 -240 -32 -82 -225 224 533 -98 -427 -12 200 -29 280 -129 -302 408 88 -114 237 -179 -163 40
6703 40 325 260 -433 -41 55 17 286 247 -257 -73 221 -7 -281 -8 -9 -240 88 377 -467 -127 -112 -148 -138
6726 -138 -33 -5 32 -41 88 -63 107 -48 -298 136 101 218 -213 -64 75 -40 30 138 -228 -34 74 322
6748 322 -252 21 17 80 120 72 -109 -365 123 280 -139 -125 -106 -221 -100 38 246 -336 123 215 -156 211 295
6771 295 -378 -162 -34 176 -2 -94 92 -89 213 199 -262 -191 590 412 -55 108 33 -328 46 373 -37
6792 -37 94 149 393 123 190 319 -336 18 16 -195 -133 7 127 -60 115 301 119 -34 220 -46 -42 157 -26
6815 -26 -444 341 162 -125 -132 177 41 -98 122 -119 -104 10 268 130 -173 -93 -285 -221 -60 -243 -96 169
6837 169 144 -339 -21 149 -37 -185 155 -124 -215 182 58 -244 256 -49 -224 -269 -215 109 -373 -212 -192 -73
6859 -73 -67 41 -112 -332 78 121 -222 -31 -20 -590 -379 136 -255 -203 -42 52 -287 -125 302 -183 -118 -109 -96 6
6883 6 355 -108 15 99 298 -78 -162 4 336 -168 154 58 -335 82 385 46 -385 39 41 -19 126 288 -279
6906 -279 -186 203 134 160 274 -90 121 64 -18 -303 -180 -12 -48 -33 65 -102 -100 205 108 -120 140 125 172 53
6930 53 -15 -73 56 24 242 -260 74 84 -43 -16 390 81 131 135 -107 211 -87 172 -331 -239 234 -17 -127
6953 -127 35 165 -57 44 209 245 -215 21 -44 -235 -97 84 -109 164 319 -88 -197 129 -11 -137 -194
6974 -194 110 -78 -463 260 -183 12 50 -322 -94 -93 518 -154 -272 -162 -93 -56 91 174 -64 -275 37 63
6996 63 -150 -64 -175 -199 -68 79 -469 -241 314 122 -346 -51 -82 -125 -70 104 -24 127 104 -17 -320 171
7018 171 -49 -368 200 113 8 -114 131 8 -187 -31 307 -266 -40 29 -21 -201 228 149 49 202 175 39
7040 39 -277 189 39 162 524 86 -214 211 301 98 98 20 5 -182 258 -12 105 41 -138 39 110 459 -353
7063 -353 -223 1 -20 -105 13 321 84 232 539 -59 -298 308 171 225 107 -167 -255 186 199 -179 -51 38
7085 38 -113 -213 113 308 -415 -6 16 -80 -14 77 -24 -175 252 254 -373 -160 115 21 -201 -59 278 69 -81
7108 -81 327 -251 -26 -4 -258 -54 212 -155 1 -246 -105 -423 -77 -44 -83 -357 90 86 -141 -374 72 -360
7130 -360 -105 303 -132 -242 31 -119 -277 -33 -226 -331 -120 222 93 -49 22 205 -297 -162 247 -44
7150 -44 -286 207 166 -262 -101 128 -78 -21 49 85 19 280 9 -235 -50 268 -306 115 382 -327 19 167
7172 167 5 312 136 -43 -53 254 -72 -141 -104 98 50 -38 403 92 -194 162 105 208 -183 -65 -101 -133 416
7195 416 201 17 -152 58 -137 57 121 15 -460 -25 222 -68 82 194 97 112 250 29 -287 135 15
7216 15 -190 -157 -201 32 -228 -28 103 -202 -258 64 -138 -240 173 -126 -121 348 137 -211 -38 2 -62 97 58
7239 58 -236 -418 -1 -128 -323 -101 32 127 -232 196 -174 -162 50 -98 -185 -246 74 -174 -213 150 200 55
7261 55 185 113 -409 48 48 -168 -75 187 48 -106 241 81 -29 -123 183 -139 -157 69 103 -139 116 36 -402
7284 -402 -61 277 -18 -101 333 -89 -216 204 164 -259 -71 302 184 38 -211 255 -176 -7 302 -7 -12
7305 -12 45 -38 -131 -158 231 -143 166 219 -292 -72 124 -53 -81 219 55 -227 66 412 41 38 263 -370 1
7328 1 77 352 -302 -87 51 -286 -55 141 -43 -252 144 23 -1 -102 -26 -100 -15 139 -180 -124 275 75 -81
7351 -81 -22 131 -203 -1 229 205 -271 118 -158 -558 -10 177 -117 -57 166 -270 -44 52 221 -402 -109 180
7373 180 -238 -178 330 37 53 415 278 -435 -184 116 -127 69 10 27 -154 44 178 -156 -58 -28 -17 -246
7395 -246 -95 -3 -424 202 259 -51 87 90 78 183 221 6 -76 -89 -17 -137 -276 28 -58 44 167 267 199 132
7419 132 125 2 -73 117 -150 -314 57 234 -56 -40 -27 -178 -107 287 -110 -233 271 192 -96 105 130 -90 182
7442 182 57 50 -70 84 -16 -68 -146 167 -245 -111 113 -179 -114 -44 149 -101 -85 14 -93 -144 192 8 103
7465 103 -95 50 -408 117 282 -112 -74 102 -37 -316 -70 106 -320 -30 329 111 71 303 123 -108 5
7486 5 -139 -274 -5 -9 -271 -135 -39 -191 -190 -64 -70 -477 -258 134 65 -182 136 100 -248 -47 36 206 -44 -227
7510 -227 22 -43 60 294 -186 -273 137 1 -199 63 -201 10 156 -308 -463 189 4 22 22 0 -167 -197
7532 -197 58 92 -23 -43 321 46 -187 44 193 51 120 -103 -179 191 292 -257 -105 355 21 -158 16
7553 16 235 -194 -275 238 155 -356 237 207 -203 59 -235 -222 -94 211 44 -37 245 -57 -150 -120 143 -69 -199
7576 -199 385 -68 -40 290 299 -28 -71 392 -12 69 252 -170 -215 74 0 -289 -37 78 -60 43 124 -198 -387
7599 -387 149 -288 -232 24 -222 50 14 72 123 -167 2 28 -35 -374 334 -282 73 28 83 -86 -140 106 -36
7622 -36 -111 283 -109 -343 89 -25 -23 -116 78 -281 21 -124 107 52 136 -84 -356 96 82 -104 281 -71 -26
7645 -26 -144 249 -132 -311 29 -52 89 -117 371 -373 -91 9 67 40 216 104 -209 -295 132 -110 101 402
7667 402 -49 -5 140 59 100 82 225 26 -142 -28 40 -138 63 50 -14 194 409 1 -170 166 -73 76
7689 76 363 5 200 9 156 90 -33 66 188 -203 -61 139 78 -86 311 117 -200 294 232 34 87 89 -99
7712 -99 112 3 -264 -258 109 -11 -129 25 41 -296 -49 100 42 -64 74 20 -250 -125 412 -164 66 475
7734 475 -166 -173 73 191 -20 -312 165 -209 122 121 -33 114 559 32 -125 23 355 -130 -85 -120 -191 -361
7756 -361 385 65 -162 253 217 185 -87 23 168 -129 140 119 -127 -30 214 38 -115 -184 -18 -228 79 155
7778 155 -193 -82 311 -354 -325 197 36 -263 -291 118 -158 1 96 4 -6 29 153 -244 61 138 30 38 352
7801 352 227 31 -146 133 59 159 31 -89 -52 348 -54 -89 183 -24 94 -214 134 -40 57 -99 171
7822 171 84 -118 283 294 139 275 -103 -100 20 -168 85 279 -112 108 -133 213 139 -64 102 118 -58 120
7844 120 181 -42 82 351 -375 -186 -130 55 -272 -94 68 43 277 108 -13 -97 -57 -194 -256 51 -44 -155
7866 -155 -103 198 -85 -273 336 -94 -271 -5 -98 -70 -21 8 -106 6 187 -178 -278 357 192 -179 -237 183
7888 183 76 121 -54 -112 -148 8 192 -178 -127 -19 19 179 -89 97 -121 212 40 -187 -30 22 -154 -29
7910 -29 91 169 -286 -342 167 -193 -35 211 45 -202 298 59 -233 -174 191 12 -195 161 112 -436 360 36
7932 36 160 43 103 -65 -175 252 -172 80 136 302 -55 217 -61 169 -116 38 -44 -97 104 -5 -121 -43
7954 -43 142 -111 2 339 212 -165 176 215 -90 345 150 -109 110 164 58 -34 139 -51 55 -105 109
7975 109 104 101 -23 -23 -3 -9 67 -124 -186 -23 -60 245 285 19 -269 69 -204 -98 -118 -4 -185 -66 57 65 -427
8000 -427 70 215 240 190 45 -372 -290 195 -159 -268 2 266 -30 -66 292 -239 -127 -234 235 154 -410 126
8022 126 82 39 -34 203 -318 -104 -208 -187 97 334 -179 -97 3 -167 -238 -137 92 94 -231 -366 -157 -129 138
8045 138 223 -40 81 -51 128 84 201 -169 -184 -155 133 -220 -37 285 -176 10 158 -75 -143 518 -25 -188
8067 -188 56 -366 177 -124 207 -263 -107 29 -109 -2 276 384 23 91 67 -251 -161 69 222 -67 -96
8088 -96 327 14 52 -217 -97 -198 192 18 63 -34 88 322 -311 448 -44 5 -75 267 -68 -111 128 -162
8110 -162 137 -32 -192 -210 312 5 -82 -55 -27 -76 -16 49 29 -136 128 578 -24 -25 76 -50 117 -237 31
8133 31 -180 221 -70 56 -79 168 -18 -222 56 -184 -19 -294 -210 -62 -5 75 -13 205 -36 392 -36 -67
8155 -67 184 -108 -128 -8 -115 14 117 -341 79 -84 40 106 -9 155 -79 -101 181 117 -24 -74 235 27
8177 27 48 -120 -53 -231 -65 96 -177 -16 -154 -70 -139 -144 -304 -75
8191g5
##END NTUPLES=NMR FID
##END=
