##TITLE=1H_TG-2293-A13
 CDCl3, 8 sc, 
 28.7.2020
##JCAMPDX= 6.0         $$ Bruker NMR JCAMP-DX V2.0
##DATA TYPE= NMR FID
##DATA CLASS= NTUPLES
##ORIGIN= UXNMR, Bruker Analytische Messtechnik GmbH
##OWNER= root
$$ XWIN-NMR		Version 3.5
$$ Tue Jul 28 12:35:32 2020 Russian Standard Time (UT+4h)  she@DPX200
##.OBSERVE FREQUENCY= 200.1315
##.OBSERVE NUCLEUS= ^1H
##.DELAY= (6, 6)
##.ACQUISITION MODE= SIMULTANEOUS
##.ACQUISITION SCHEME= undefined
##.AVERAGES= 8
##.DIGITISER RES= 18
##SPECTROMETER/DATA SYSTEM= spect
##.PULSE SEQUENCE= zg30
##.SOLVENT NAME= CDCl3
##.SHIFT REFERENCE= (INTERNAL, CDCl3, 0, 15.7039)
##AUDIT TRAIL= $$ (NUMBER, WHEN, WHO, WHERE, WHAT)
$$ ##TITLE= Audit trail, XWIN-NMR		Version 3.5
$$ ##JCAMPDX= 5.01
$$ ##ORIGIN= Bruker BioSpin GmbH
$$ ##OWNER= she
$$ F:/spectra/data/she/nmr/H-F/1/audita.txt
$$ ##AUDIT TRAIL=  $$ (NUMBER, WHEN, WHO, WHERE, WHAT)
(   1,<2020-07-28 12:34:25.39 +0400>,<she>,<DPX200>,
      <created by zg, POWCHK disabled, PULCHK disabled
       configuration hash MD5:
       00 E9 B6 7A A2 85 ED C7 34 08 36 98 17 FE 4E 26
       data hash MD5: 16K
       49 12 23 F4 92 62 8F B4 C8 BF CE 0D 09 76 D0 0B>)
$$ ##END=
$$ 
$$ hash MD5
$$ F1 B0 40 88 00 E4 DE F0 3F 7A D5 54 18 50 CE 3A
##$RELAX= 
##$RELAX= 
##$RELAX= 
##$RELAX= 
##$RELAX= 
##$RELAX= 
$$ Bruker specific parameters
$$ --------------------------
##$DU= <F:/spectra>
##$EXPNO= 1
##$NAME= <H-F>
##$PROCNO= 1
##$TYPE= <nmr>
##$USER= <she>
##$AMP= (0..31)
100 100 100 100 100 100 100 100 100 100 100 100 100 100 100 100 100 100 
100 100 100 100 100 100 100 100 100 100 100 100 100 100 
##$AQSEQ= 0
##$AQ_mod= 1
##$AUNM= <au_zg>
##$AUTOPOS= <>
##$BF1= 200.13
##$BF2= 200.13
##$BF3= 200.13
##$BF4= 200.13
##$BF5= 200.13
##$BF6= 200.13
##$BF7= 200.13
##$BF8= 200.13
##$BYTORDA= 1
##$CFDGTYP= 0
##$CFRGTYP= 5
##$CHEMSTR= <none>
##$CNST= (0..31)
1 1 145 1 1 1 1 1 1 1 1 1 1 1 1 1 1 1 1 1 1 1 1 1 1 1 1 1 1 1 1 1 
##$CPDPRG= <>
##$CPDPRG1= <>
##$CPDPRG2= <>
##$CPDPRG3= <>
##$CPDPRG4= <mlev>
##$CPDPRG5= <mlev>
##$CPDPRG6= <mlev>
##$CPDPRG7= <mlev>
##$CPDPRG8= <mlev>
##$CPDPRGB= <>
##$CPDPRGT= <>
##$D= (0..31)
0 1.2 0 0 0 0 0 0 0 0.06 0 0.03 0 0 0 0 0.0002 0 0 0 0 0 0 0 0 0 0 0 0 
0 0 0 
##$DATE= 1595925264
##$DBL= (0..7)
120 120 120 120 120 120 120 120 
##$DBP= (0..7)
150 150 150 150 150 150 150 150 
##$DBP07= 0
##$DBPNAM0= <>
##$DBPNAM1= <>
##$DBPNAM2= <>
##$DBPNAM3= <>
##$DBPNAM4= <>
##$DBPNAM5= <>
##$DBPNAM6= <>
##$DBPNAM7= <>
##$DBPOAL= (0..7)
0.5 0.5 0.5 0.5 0.5 0.5 0.5 0.5 
##$DBPOFFS= (0..7)
0 0 0 0 0 0 0 0 
##$DE= 6
##$DECBNUC= <off>
##$DECIM= 24
##$DECNUC= <off>
##$DECSTAT= 4
##$DIGMOD= 1
##$DIGTYP= 9
##$DL= (0..7)
0 120 120 120 120 120 120 120 
##$DP= (0..7)
150 150 150 150 150 150 150 150 
##$DP07= 0
##$DPNAME0= <>
##$DPNAME1= <>
##$DPNAME2= <>
##$DPNAME3= <>
##$DPNAME4= <>
##$DPNAME5= <>
##$DPNAME6= <>
##$DPNAME7= <>
##$DPOAL= (0..7)
0.5 0.5 0.5 0.5 0.5 0.5 0.5 0.5 
##$DPOFFS= (0..7)
0 0 0 0 0 0 0 0 
##$DQDMODE= 0
##$DR= 18
##$DS= 0
##$DSLIST= <SSSSSSSSSSSSSSS>
$$ [...]
##$SUBNAM2= <"">
##$SUBNAM3= <"">
##$SUBNAM4= <"">
##$SUBNAM5= <"">
##$SUBNAM6= <"">
##$SUBNAM7= <"">
##$SUBNAM8= <"">
##$SUBNAM9= <"">
##$SW= 24.9337058887773
##$SWIBOX= (0..15)
0 0 2 0 0 0 0 0 0 0 0 0 0 0 0 0 
##$SW_h= 4990.01996007984
##$TD= 16384
##$TD0= 1
##$TE= 0
##$TE2= 300
##$TE3= 300
##$TEG= 300
##$TL= (0..7)
0 120 120 120 120 120 120 120 
##$TP= (0..7)
150 150 150 150 150 150 150 150 
##$TP07= 0
##$TPNAME0= <>
##$TPNAME1= <>
##$TPNAME2= <>
##$TPNAME3= <>
##$TPNAME4= <>
##$TPNAME5= <>
##$TPNAME6= <>
##$TPNAME7= <>
##$TPOAL= (0..7)
0.5 0.5 0.5 0.5 0.5 0.5 0.5 0.5 
##$TPOFFS= (0..7)
0 0 0 0 0 0 0 0 
##$TUNHIN= 0
##$TUNHOUT= 0
##$TUNXOUT= 0
##$USERA1= <user>
##$USERA2= <user>
##$USERA3= <user>
##$USERA4= <user>
##$USERA5= <user>
##$V9= 5
##$VALIST= <valist>
##$VCLIST= <CCCCCCCCCCCCCCC>
##$VD= 0
##$VDLIST= <DDDDDDDDDDDDDDD>
##$VPLIST= <PPPPPPPPPPPPPPP>
##$VTLIST= <TTTTTTTTTTTTTTT>
##$WBST= 1024
##$WBSW= 4
##$XGAIN= (0..3)
0 0 0 0 
##$XL= 0
##$YL= 0
##$YMAX_a= 369007
##$YMIN_a= -132514
##$ZGOPTNS= <>
##$ZL1= 120
##$ZL2= 120
##$ZL3= 120
##$ZL4= 120
##$ABSF1= 10
##$ABSF2= 0
##$ABSG= 5
##$ABSL= 3
##$ALPHA= 0
##$AQORDER= 0
##$ASSFAC= 0
##$ASSFACI= 0
##$ASSFACX= 0
##$ASSWID= 0
##$AUNMP= <proc_1d>
##$AZFE= 0.1
##$AZFW= 0.1
##$BCFW= 1
##$BC_mod= 2
##$BYTORDP= 1
##$COROFFS= 0
##$CY= 11.3945322036743
##$DATMOD= 1
##$DC= 2
##$DFILT= <>
##$DTYPP= 0
##$F1P= 16.9975609425685
##$F2P= -3.02152046262296
##$FCOR= 0.5
##$FTSIZE= 0
##$FT_mod= 4
##$GAMMA= 1
##$GB= 0.15
##$INTBC= 1
##$INTSCL= 1
##$ISEN= 128
##$LB= 0.24
##$LEV0= 0
##$LPBIN= 0
##$MAXI= 10000
##$MC2= 0
##$MEAN= 0
##$ME_mod= 0
##$MI= 1.114404
##$NCOEF= 0
##$NC_proc= 0
##$NLEV= 6
##$NOISF1= 3.799351
##$NOISF2= 2.8
##$NSP= 1
##$NTH_PI= 0
##$NZP= 0
##$OFFSET= 15.70392
##$PC= 1
##$PHC0= -9799.522
##$PHC1= 24.00092
##$PH_mod= 1
##$PKNL= yes
##$PPARMOD= 0
##$PSCAL= 0
##$PSIGN= 0
##$REVERSE= no
##$SF= 200.130013532006
##$SI= 16384
##$SIGF1= 3
##$SIGF2= 2
##$SINO= 400
##$SIOLD= 16384
##$SREGLST= <1H.CDCl3>
##$SSB= 0
##$STSI= 0
##$STSR= 0
##$SW_p= 3612.71676300578
##$SYMM= 0
##$S_DEV= 0
##$TDeff= 0
##$TDoff= 0
##$TI= <>
##$TILT= no
##$TM1= 0
##$TM2= 0
##$TOPLEV= 0
##$USERP1= <user>
##$USERP2= <user>
##$USERP3= <user>
##$USERP4= <user>
##$USERP5= <user>
##$WDW= 1
##$XDIM= 8192
##$YMAX_p= 0
##$YMIN_p= 0
$$ End of Bruker specific parameters
$$ ---------------------------------
##NTUPLES= NMR FID
##VAR_NAME=  TIME,          FID/REAL,        FID/IMAG
##SYMBOL=    X,             R,               I
##VAR_TYPE=  INDEPENDENT,   DEPENDENT,       DEPENDENT
##VAR_FORM=  AFFN,          ASDF,            ASDF
##VAR_DIM=   8192,          8192,            8192
##UNITS=     SECONDS,       ARBITRARY UNITS, ARBITRARY UNITS
##FACTOR=    0.0002004,     1,               1
##FIRST=     0,             0,               0
##LAST=      1.6414764,     0,               0
##MIN=       0,             -132514,         0
##MAX=       1.6414764,     369007,          0
$$ Real data points
##PAGE= N=1
##DATA TABLE= (X++(R..R)), XYDATA
$$ [...]
$$ plain form
2134 -1240 204 1106 -934 -844 930 228 -744 658 562 -588 465 1349 -227 76 1238 294 -332 1287
2152 1287 1192 -624 347 1386 452 205 1552 652 -431 1431 1627 -206 331 1522 717 349 1648
2169 1648 341 50 1471 1283 -69 313 1669 140 74 1329 699 -17 774 1188 -155 585 1713
2186 1713 132 -361 1090 1050 -98 646 397 -992 48 1845 -103 -827 857 499 -490 223 501
2203 501 -726 -383 680 -158 -1101 609 71 -1131 167 415 -654 -703 475 -753 -1242 492 -70
2220 -70 -1506 -65 513 -1006 -1216 -71 -953 -1235 -27 -313 -1645 -673 515 -922 -1175 148 -768
2237 -768 -1304 -60 -404 -1878 -637 190 -1210 -944 167 -540 -1521 -13 -127 -1248 -344 -63 -1085
2254 -1085 -980 596 -118 -1219 5 206 -887 -247 688 -903 -658 877 86 -1131 404 397 -399 471
$$ packed form
2134a240J444R02k040R0J774p02r72J402r6j150J053Q84j576L03J162r44o26J619
2152A287r5j816R71J039r34k47J347r00j083J862J96j833N37J191q05l68J299
2169A648j307k91J421j88j352L82J356j529o6J255o30p16P91M14j343P40J128
2186A713j581m93J451m0j148P44k49j389J040J797j948p24J684l58r89P13K78
2203E01j227L43J063q38r43J710n38j202J298K48j069m9J178j228m89J734n62
2220g0j436J441N78j519k10J145q82k82J208k86j332R72J188j437k53J323r16
2237g68n36J244l44j474J241Q27j400K66J111p07r81J508j14j121R04K81j022
2254a085J05J576p14j101J224K01j093O40R35j591K45J535p91j217J535pp96Q70
$$ plain form
2272 471 1035 -283 -354 716 90 -533 1018 1259 -425 53 1087 368 -107 1286 814 -229 723 1446
2290 1446 -222 204 1494 290 34 1395 847 -452 858 1151 -83 554 1669 312 -54 1233
2306 1233 1115 -196 1082 1129 -28 277 1205 317 -425 905 578 -494 488 870 -299 -185 1126 93
2324 93 -740 848 570 -844 177 418 -714 -546 635 -189 -611 396 141 -951 108 575 -694
2341 -694 -998 217 -589 -1289 29 37 -1343 -397 219 -1116 -1145 -15 -636 -1369 -41 -543 -1499 -725 -203
2360 -203 -1315 -1120 -121 -840 -1588 -568 -294 -1214 -499 -167 -1026 -1080 331 -268 -1391 -68 -22 -1157 -579
2379 -579 40 -1247 -971 305 150 -894 -108 174 -1222 -258 254 -552 -749 342 -211 -608 189 309
2397 309 -681 -355 727 -142 -390 647 -111 -580 703 932 -101 93 1122 319 -98 824 670 -190
$$ packed form
2272D71N64j318p1J070o26o23J551K41j684M78J034p19m75J393m72j043R52P23
2290A446j668M26J290j204k56J361n48j299J310K93j234O37J115j357l66J287
2306A233j18j311J278M7j157L05R28q88p42J330l27j072R82L82j169J14J311j033
2324I3q33J588k78j414J021K41j132J68J181q24m22J007k55j092J059M67j269
2341f94l04J215q06p00J318Qj380R46O16j335k9J130o21p33J328n02r56P74N22
2360b03j112J95R99p19p48J020K74r20P15L32q59n4J411n99j123J323M6j135N78
2379e79O19j287K76J276j55j044P86K82j396R64N12q06j97J091n53l97P97J20
2397C09r90L26J082q69k48J037p58m69J283K29j033J94J029q03m17R22j54q60
$$ plain form
2415 -190 846 1150 -124 22 1046 630 293 1037 856 -242 825 1191 64 498 1646 397 -75
2432 -75 983 1160 -59 431 1255 63 487 1240 308 -176 1216 1444 -60 383 1016 46 -93 988
2450 988 451 -602 611 677 -183 90 966 -295 -399 871 75 -785 402 306 -816 -448 640 -366
2468 -366 -812 443 -132 -918 -59 165 -727 -214 562 -518 -910 -97 -82 -872 -60 329 -1216 -957 168
2487 168 -742 -974 4 -408 -1373 -614 54 -1123 -916 126 -757 -1108 325 -245 -1389 -724 -126 -783 -578
2506 -578 61 -811 -1021 358 171 -1227 -466 371 -380 -727 204 -354 -967 457 374 -723 -89 320 -450
2525 -450 -340 776 -187 -680 300 84 -487 161 1017 -249 -578 825 477 -363 457 -69 -402 628 997
2544 997 -370 -220 816 676 44 696 392 23 611 1109 80 36 1239 581 187 568 806 -155 391
$$ packed form
2415a90J036L04j274J46J024m16l37P44j81j098J067L66j127M34J148j249m72
2432g5J058J77j219M90Q24j192M24P53r32m84J392K28j504M43O33r70j39J081
2450I88n37j053J213O6q60K73Q76j261j04J270p96q60J187r6j122L68J088j006
2468c66m46J255n75p86Q59K24q92N13P76j080l92Q13J5p90Q12L89j545K59J125
2487A68r10k32R78m12r65P59O68j177K07J042q83l51J433n70j144O65N98o57K05
2506e78O39q72k10J379j87j398P61Q37p51l47R31n58o13J424q3j097O34M09p70
2525d50J10J116r63m93R80k16n71O48Q56j266l29J403l48q40Q20n26l33J030L69
2544I97j367J50J036j40o32O52l04l69N88M98j029m4J203o58l94L81K38r61N46
$$ plain form
2563 391 986 245 37 1183 571 -346 360 1076 -167 346 879 59 -71 1286 331 -650 582 1006 -364
2582 -364 270 482 -209 -69 709 367 -533 855 797 -702 -167 575 -164 -514 577 21 -958 137 345
2601 345 -956 -389 431 201 -958 -50 -258 -833 35 213 -1007 -459 365 -274 -864 115 -185 -858 -339
2620 -339 274 -904 -933 235 -622 -1197 -96 -180 -1008 -213 -106 -501 -810 30 -262 -1031 -93 221 -767 -329
2640 -329 106 -792 -772 337 -433 -618 12 73 -729 -224 368 -408 -541 467 -41 -772 -8 360 -506 -63
2660 -63 605 -277 -15 728 264 -97 278 545 -298 -134 805 -75 30 525 862 -474 771 910 -220
2679 -220 312 839 506 -24 1066 701 -402 639 835 -276 120 1030 520 150 1178 467 -13 481
2697 481 852 -106 312 976 580 -233 616 591 -110 668 514 131 124 898 69 -598 530 728 -323 249
$$ packed form
2563C91N95p41k08J146o12r17P06P16j243N13N33q20j30J357r55r81J232M24j370
2582c64O34K12o91J40P78l42r00J388n8j499N35P42p39l50J091n56r79J095K08
2601C45j301N67Q20k30j159R08k08n75Q68J78j220N48Q24o39n90R79l00o73N19
2620c39O13j178k9J168q57n75J101q4q28P95J07l95l09Q40k92p69R38L14r88M38
2640c29M35q98K0J109p70j85O30O1q02N05N92p76j33J008n08p31P64L68q66M43
2660f3O68q82K62P43m64l61L75K67q43J64R39q80J05M95L37j336J245J39j130
2679b20N32N27l33n30J090l65j103J041J96j111L96R10n10l70J028p11m80M94
2697D81L71r58M18O64l96q13Q49k5p01P78j54l83pP74q29o67J128J98j051N72
$$ plain form
2717 249 393 -401 -147 782 44 -680 472 355 -491 -248 188 -518 -326 668 -316 -648 -92 14 -530 -430
2737 -430 411 -682 -802 475 -362 -951 174 -161 -1091 -522 195 -632 -969 100 -538 -902 178 -105
2755 -105 -1062 -669 163 -677 -725 66 -591 -1129 -98 -54 -988 -610 -18 -421 -789 312 -206 -901 -53 168
2775 168 -701 -411 475 -767 -549 267 226 -756 -167 294 -255 -117 852 -206 -573 781 318 -401 135
2794 135 724 -334 89 1004 50 -362 729 747 -342 219 946 -74 160 1032 476 -21 625 396 26
2813 26 532 1071 -188 -75 733 679 -82 614 870 -221 571 1036 437 -377 799 585 31 462 685 -278
2833 -278 375 757 -33 35 630 231 -527 491 432 -443 227 628 -16 -214 814 114 -772 375 642 -304
2853 -304 96 -55 -160 -525 569 16 -781 -116 17 -765 -618 -5 -674 -644 -53 -156 -1143 73 80 -758
$$ packed form
2717B49J44p94K54R29p38p24J152j17q46K43M36p06J92R94r84l32N56J06n44J00
2737d30Q41j093j20J277q37n89J125l35r30N69P17q27l37J069o38l64J080k83
2755a05r57L93Q32q40m8P91o57n38J031M4r34L78N92m03l68J101n18o95Q48K21
2775A68q69K90Q86j242K18Q16m1r82N89M61n49J38R69j058l67J354m63p19N36
2794A35N89j058M23R15r54m12J091J8j089N61P27j020K34Q72n56m97O46k29l70
2813B6N06N39j259J13Q08n4p61O96K56j091P92M65n99q14J176k14n54M31K23r63
2833b78O53L82p90O8N95l99p58J018n9q75O70M01o44j98J028p00q86J147K67r46
2853c04M00j51j05l65J094n53p97O65J33p82J47O13o69L0N91j03r87J216Pq38
$$ plain form
2873 -758 -830 472 -401 -835 77 -133 -1114 -188 -7 -1163 -711 173 -326 -768 -298 -465 -695 170 118 -1060
2893 -1060 -515 116 -390 -1102 -247 -279 -699 98 173 -732 -188 10 -459 -626 250 62 -464 -80 62 -243
2913 -243 -94 411 -310 -506 441 642 -444 86 446 -192 -158 365 -36 -229 549 433 -210 -188 928 58
2933 58 239 938 267 -9 676 684 -73 266 1147 150 -122 868 618 94 471 718 79 481 890 171 -306
2954 -306 761 482 -206 658 438 56 222 1048 136 -310 617 387 52 181 542 -444 -219 831 -428
2973 -428 -345 504 274 -628 170 413 -225 143 388 -70 -507 606 413 -658 31 500 -314 -249 340 -449
2993 -449 -644 289 -280 -854 -337 206 -513 -352 278 -425 -751 214 -42 -946 -80 295 -601 -565 86 -486
3013 -486 -623 153 -2 -888 -80 108 -468 -793 95 -255 -717 -211 -91 -869 -226 70 -686 -802 419 -338
$$ packed form
2873g58p2J302q73m34R12k10r81R26J81j156M52Q84m99m42M70j67k30Q65n2j178
2893a060N45O31n06p12Q55l2m20P97P5r05N44J98m69j67Q76j88n26L84J42l05
2913b43J49N05p21j96R47K01j086N30L60o38L4N23m01j93P78j16o43K2J116q70
2933E8J81O99o71k76O85Qp57L39Q81r97k72R90k50n24L77K47o39M02M09p19m77
2954c06J067k79o88Q64k20l82J66Q26r12m46R27k30l35J29L61r86K25J050j259
2973d28Q3Q49k30r02P98K43o38L68K45m58m37J113j93j071O89M69q14O5N89p89
2993d49j95R33n69n74N17N43p19J61O30p03l26R65k56r04Q66L75q96L6O51n72
3013d86j37P76j55q86Q08J88n76l25Q88l50m62N06J20p78O43K96p56j16J221p57
$$ plain form
3033 -338 -757 292 -137 -242 61 411 -360 -474 453 284 -556 64 456 -565 -238 620 -132 -447 420
3052 420 337 -507 128 461 -188 -37 846 287 11 710 528 -646 514 750 -242 -92 628 146 -84 529
3072 529 260 -103 789 745 -82 348 896 198 -422 679 911 32 435 578 -115 275 482 450 24 564
3092 564 316 -137 348 690 -108 -154 586 247 -319 241 430 -281 32 527 -163 -127 670 23 -179 156 504
3113 504 -525 174 596 -357 -312 468 -83 -556 41 -127 -767 -260 348 -181 -483 106 -162 -635 -372 23
3133 23 -938 -450 281 -321 -671 291 -272 -775 -20 -57 -790 -384 199 -581 -787 -486 -118 -949 -296 260 -704
3154 -704 -331 40 -308 -1116 -49 -335 -833 112 29 -641 -435 153 -119 -488 84 -118 -333 150 353 -580
3174 -580 -282 551 184 -434 310 113 -386 225 301 -186 -331 370 -39 31 255 604 -202 131 629 -274 -117
$$ packed form
3033c38m19J049m29j05L03L50p71j14R27j69q40O20L92j021L27Q58p52l15Q67
3052D20q3q44O35L33o49J51Q83n59k76O99j82j174J160K36r92J50P20m82k30O13
3072E29k69l63Q92m4q27M30N48o98o20J101K32q79M03J43o93L90K07l2m26N40
3092E64k48m53M85L42p98m6P40l39n66N60J89p11L13M95o90L6P97o47k02L35L48
3113E04j029O99M22r53M5P80n51m73N97j68o40N07O08n29l02N89k68m73K63L95
3133B3r61M88P31o02l50R62n63n03P55l7p33M06N83p80k06L01L68q31O53N56r64
3154g04L73L71l48q08J067k86m98R45q3o70K06N88k72l69N72k02k15M83K03r33
3174e80K98Q33l67o18P44j97m99O11P6m87j45P01m09P0K24L49q06L33M98r03J57
$$ plain form
3195 -117 605 -198 -239 592 504 160 214 656 367 235 318 292 -235 585 530 -368 366 729 -46 -60 717 445
3217 445 88 363 314 -72 216 799 -139 -254 475 222 -4 586 261 -133 141 525 -39 -369 364 319 -412
3238 -412 80 17 -461 -109 441 -185 -508 172 -3 -598 -163 174 -552 -235 368 -382 -703 -181 -43 -719
3258 -719 -376 5 -546 -224 68 -434 -427 -8 -32 -730 -16 67 -730 -102 154 -311 -625 222 -276 -852 -336
3279 -336 145 -584 -285 -144 -410 -553 11 87 -471 -46 128 -335 -625 228 -213 -520 -87 93 -660 53
3299 53 135 22 -450 97 9 -536 216 191 -296 128 353 -188 -45 208 265 -120 115 304 -23 169 479 -8
3321 -8 -71 269 44 -163 200 393 454 208 365 120 -89 647 475 -260 474 601 -59 200 611 184 -13
3342 -13 572 419 -148 462 666 -589 24 491 153 144 289 156 -283 412 371 -421 -105 438 445 51 375 88
$$ packed form
3195a17P22q03m1Q31q8l44N4M42k89j32Q3k6n27Q20n5q98P34L63p75j4P77k72
3217D45l57K75m9l86K88N83r38j15P29k53k26N90l25l94K74L84n64l30P33m5p31
3238d12M92o3m78L52N50o26l23O80j75n95M35L37p26L17O03p50l21N22J38o76
3258g19L43L81n51L22K92n02PM19k4o98P14Q3p97O28K56m65l14Q47m98n76N16
3279c36M81p29K99J41k66j43N64P6n58M25J74m63k90Q53m41l07M33J80p53P13
3299E3Q2j13m72N47q8n45P52k5m87M24K25n41J43K53N7l85K35J89l27J92L10m87
3321ho3L40k25k07L63J93O1k46J57k45k09P36j72p35P34J27o60K59M11m27j97
3342a3N85j53n67O10K04j255O13M67l38rJ45j33m39O95m1p92L16N43Pl94L24k87
$$ plain form
3364 88 -254 -49 300 -560 -94 306 59 -557 337 139 -417 -105 264 -293 -313 411 -13 -514 140 152 -560
3385 -560 82 134 -544 -230 292 -461 -422 -92 -170 -611 36 234 -601 -525 333 -493 -561 105 -34 -355 -164 252
3407 252 -190 -655 -2 -225 -663 175 128 -581 -311 182 -484 -207 270 -329 -618 -74 -15 -606 -167 320 -304
3428 -304 -495 -257 193 -393 -49 115 -421 -21 254 -71 -26 247 -25 -208 232 126 8 -87 547 -24 -71
3449 -71 426 256 70 129 441 -79 -121 451 345 78 605 202 -130 410 593 175 64 249 223 -165 502
3470 502 609 -76 402 681 96 364 577 277 -109 387 236 -157 97 568 3 -47 480 234 -6 310
3490 310 278 -90 143 196 -74 -231 -75 58 -292 267 158 -309 -67 98 -379 -356 404 -251 -657 -35 68
3511 68 -134 -304 -32 -365 -432 44 -194 -643 -111 335 -352 113 -181 -480 -560 7 -195 -490 -202 -123 -649
$$ packed form
3364H8l42K05L49q60M66M00k47o16Q94j98n56L12L69n57k0P24m24n01O54J2p12
3385e60O42N2o78L14N22p53L9L30p8m41O47J98q35P6Q58q26o8O66j39l21J91M16
3407B52m42m65O53k23m38Q38m7p09K70M93o66K77M77n99k89N44N9n91M39M87o24
3428c04j91K38M50n86L44J64n36M00K75l25M5K73k72j83M40j06j18r5O34n71m7
3449g1M97j70j86N9L12n20m2N72j06k67N27m03l32N40J83m18j11J85k6l88O67
3470E02J07o85M78K79n85K68K13l00l86M96j51l93K54M71n65n0N27k46k40L16
3490C10l2l68K33N3k70j57J56J33l50N59j09m67K42J65m77K3P60o55m06O22J03
3511F8k02j70K72l33o7M76k38m49N32M46o87M65k94k99q0N67k02k95K88P9n26
$$ plain form
3532 -649 -407 279 -294 -504 207 40 -388 -88 9 -425 -671 62 -365 -228 295 -342 -455 -33 214 -187
3552 -187 -440 168 -181 -566 216 -222 -576 -106 94 -176 -69 36 -126 -464 331 169 -450 334 302 -346
3572 -346 -157 325 148 -146 241 148 -220 180 644 -14 27 323 457 -183 563 83 -222 349 614 -154 -142
3593 -142 495 113 11 494 759 -118 254 539 9 -137 598 272 -203 609 376 207 248 185 -107 51 494
3614 494 448 -47 371 182 -319 246 529 -143 15 295 193 -56 84 470 -524 -212 25 -139 -55 246 -60
3635 -60 -308 206 9 -498 -367 226 -54 -418 109 -295 -457 0 57 -752 -196 -94 -218 -395 -320 -234 -429
3656 -429 -366 18 -387 -494 80 -536 -472 -145 -165 -560 1 -77 -440 -251 132 -277 -397 -201 -111 -500 -309 318
3678 318 -308 -244 234 -375 -342 162 102 -533 -204 322 -184 -277 455 -221 -144 154 -14 -84 -288 218 -132 -392
$$ packed form
3532f49K42O86n73k10P11j67m28L00R7m34k46P33m27J37N23o37j13M22K47m01
3552a87k53O08l49l85P82m38l54M70K00k70J07J05j62l38P95j62o19P84l2o48
3572c46J89M82j77k94L87r3l68M00M64o58M1K96J34o40P46m80l05N71K65p68J2
3593a42O37l82j02M83K65q77L72K85n30j46P35l26m75Q12k33j69M1o3k92J58M43
3614D94m6m95M18j89n01N65K83o72J58K80j02k49J40L86r94L12K37j64Q4L01l06
3635f0k48N14j97n07J31N93k80l64N27m04j62M57N7q09N56J02j24j77P5Q6j95
3656d29O3L84m05j07N74o16O4L27k0l95N61p8l63J89L83m09j20J96R0l89J91O27
3678C18o26O4M78o09L3N04o0o35L29N26n06r3P32o76P7K98j68p0k04N06l50k60
$$ plain form
3700 -392 465 92 -592 404 418 -447 161 572 -166 -99 542 257 88 95 291 -175 392 503 57 105 792 482
3722 482 -320 448 641 -25 108 295 173 154 368 147 214 176 414 -51 218 293 -55 -308 294 0 46 69
3744 69 73 193 100 369 153 -71 473 286 -251 -10 514 -179 1 -16 -284 154 187 399 -611 243 258 -367
3766 -367 -300 168 107 -325 150 28 -525 -197 -171 -280 -190 -39 -205 -466 -145 4 -331 -155 -242 -229 -411 -280
3788 -280 34 -446 194 -332 -500 -212 -99 -241 -310 252 -241 -107 17 145 -277 -152 203 -445 -332 107
3808 107 -166 -418 85 -105 -415 -227 95 -409 -253 247 71 -374 121 98 -486 27 281 -122 -427 149
3828 149 180 -165 -18 378 -17 68 180 -113 -77 221 291 -112 134 408 10 206 438 -111 -163 348 241 -24
3850 -24 509 372 -95 197 422 109 115 803 435 298 565 502 -45 67 406 -88 -156 418 546 68 96 84
$$ packed form
3700c92Q57l73o84R96J4q65O08M11p38O7O41k85j69PJ96m66N67J11m46M8O87l10
3722D82q02P68J93o66J33J87j22j9K14k21O7l8K38m65K69P5l48k53O02k94M6K3
3744F9MJ20r3K69k16k24N44j87n37K41N24o93J80j7k68M38L3K12j010Q54J5o25
3766c67O7M68o1m32M75j22n53L28K6j09R0J51j66k61L21J49l35J76q7J3j82J31
3788b80L14m80O40n26j68K88J13j42o9N62m93J34J24J28m22J25L55o48J13M39
3808A07k73k52N03j90l10J88L22n04J56N00j76m45M95k3n84N13K54m03l05N76
3828A49L1l45J47L96l95Q5J12k93L6K98P0m03K46K74l98J96K32n49n2N11j07k65
3850b4N33j37m67K92K25l13OO88l68j37K67o3n47J12L39m94o8N74J28m78K8j2
$$ plain form
3872 84 52 289 -40 157 -215 381 -36 -169 207 218 -90 48 365 -44 -421 372 275 -320 -144 259 -223
3893 -223 -22 -13 37 -372 -197 292 -136 97 185 -88 -319 293 221 -120 -260 53 -395 -307 37 -132 -282 123
3915 123 -92 -406 -126 116 -421 -120 234 -161 -563 -108 114 -447 -50 45 -294 -165 0 -240 -517 236
3935 236 -102 -389 -82 174 -333 -253 229 -368 -518 216 233 -480 -243 210 -179 -187 286 -318 -207 47 55 -396
3957 -396 122 -37 -55 -205 273 -137 161 433 -261 -83 -24 278 68 100 286 32 55 23 55 74 -165 477
3979 477 21 0 276 72 -249 241 163 -124 399 566 66 25 383 127 -112 145 267 75 91 338 -47
4000 -47 -180 247 -34 -234 433 -7 -207 -174 228 20 -315 149 -91 -113 321 249 -201 35 211 -117 -48 41
4022 41 -200 -19 -18 154 0 -217 -303 -274 -284 73 135 -70 -24 -33 -237 -297 235 -468 -295 88 -102 -676 -106 55
$$ packed form
3872H4l2K37l29J97l72N96m17j33L76J1l08J38L17m09l77P93r7n95J76M03m82
3893b23K01RN0m09J75M89m28K33Q8k73k31O12p2l41j40L13m48Q8L44j69j50M05
3915A23k15l14K80K42n37L01L54l95m02M55K22n61L97R5l39J29J65k40k77P53
3935B36l38k87L07K56n07Q0M82n97j50P34J7p13K37M53l89qM73o04J11K54Qm51
3957c96N18j59j8j50M78m10K98K72o94J78N9L02k10L2J86k54K3l2L2J9k39O42
3979D77m56k1K76k04l21M90p8k87N23J67n00m1L58k56k39K57J22j92J6K47l85
4000d7j33M27k81k00O67m40k00L3M02k08l35M64k40k2M34p2m50K36J76l28O9Q9
4022D1k41J81JJ72j54k17q6K9j0L57O2k05M6rk04o0N32p03J73L83j90n74N70J61
$$ plain form
4046 55 -641 -213 -24 -158 -336 59 -133 -599 -223 84 -525 -234 -208 -212 -108 -58 -32 -370 1 178 -123 -65
4068 -65 -5 -291 -489 -168 -43 -210 23 -35 64 -225 24 60 -238 105 -57 -213 83 273 -87 -335 70 -164
4090 -164 -264 242 120 115 145 102 -53 -116 403 111 -161 -105 251 90 -92 301 284 137 404 -146 -322 141
4112 141 231 21 6 363 168 181 269 58 -38 152 178 -167 27 409 124 51 236 274 -274 295 447 187 -88
4135 -88 166 -98 -5 447 308 -42 248 129 -5 -68 139 -148 -66 221 -104 -172 83 70 -52 -297 204 -269
4157 -269 33 -38 75 -470 105 11 -377 -301 -71 -126 -156 296 -52 -176 -268 228 -24 -111 176 61 -239 -257 -211
4180 -211 -102 -353 -102 -126 -353 125 -99 -369 22 -230 -321 -325 -83 -139 -289 -27 -379 -94 -269 292 -124 -168
4202 -168 381 -320 -257 369 -9 -295 121 2 -145 -153 222 -426 155 421 -82 -154 -16 104 -223 -27 31 228
$$ packed form
4046E5o96M28J89j34j78L95j92m66L76L07o09K91K6mJ04N0K6l38L71J77l01N8
4068f5O0k86j98L21J25j67K33n8R9k89K49L6k98L43j62j56K96J90l60k48M05k34
4090a64j00N06j22nL0m3j55o3N19k92k72N6L56j61j82L93j7j47K67n50j76M63
4112A41R0k10j5L57j95J3Q8k11r6J90K6l45J94L82k85p3J85L8n48N69J52k60k75
4135h8K54k64R3M52j39l50K90j19j34o3K07k87Q2K87l25o8K55j3j22k45N01m73
4157b69L02p1J13n45N75r4l88P6K30n5l0M52l48j24r2M96k52q7K87j15l00j8M6
4180b11J09k51K51k4k27M78k24k70L91k52r1mK42n6j50K62l52K85j75N61m16m4
4202a68N49p01O3O26l78k86M16j19j47qL75o48N81K66n03p2J38J20l27J96N8J97
$$ plain form
4224 228 144 213 341 -83 197 595 332 146 329 248 -114 411 157 -46 313 117 -137 174 492 270 -154
4245 -154 495 277 -337 31 248 32 60 245 133 -221 11 313 -150 224 56 145 59 362 183 -37 245
4266 245 225 -73 5 508 -98 -214 253 -41 -151 -141 138 -46 344 -45 -64 -450 219 -211 -273 -198 47 -383
4288 -383 -86 81 -295 -224 0 -33 -260 -151 267 -318 -558 -173 -318 -300 162 -54 -228 -119 -80 -380 -502
4309 -502 213 -61 -485 14 -289 -292 -66 -290 -324 14 -94 -180 -157 83 209 -414 -226 91 -115 -141 193 35
4331 35 -360 198 -96 -399 84 -235 -113 -232 -103 -390 -341 -193 49 -364 80 121 -76 -331 273 159 -35
4352 -35 341 315 -114 422 591 -431 -59 75 69 -218 -11 15 73 -126 244 -54 139 -76 35 -397 162 158
4374 158 -136 203 395 -22 72 419 170 -36 -23 330 -234 67 113 -341 112 308 238 -165 -100 269 35 -206
$$ packed form
4224B28q4O9J28m24K80L98k63j86J83q1l62N25k54k03L59j96k54L11L18k22m24
4245a54O49k18o14L68K17k16K8J85j12l54K32L02m63L74j68Q9q6L03j79k20K82
4266B45k0k98P8N03o06j16M67k94j10J0K79j84L90l89j9l86O69m30o2P5K45m30
4288c83K97J67l76P1K24l3k27J09M18n85k40L85j45J8M62k16j74J09L9l00j22
4309e02P15k74m24M99l03lK26k24l4L38j08q6K3K40J26o23J88L17k06k6L34j58
4331C5l95N58k94l03M83l19J22j19J29k87M9J48K42m13M44M1j97k55O04j14j94
4352c5L76k6m29N36J69j022L72J34ok87K07K6N8j99L70k98J93k15J11m32N59m
4374A58k94L39J92m17R4L47k49k06J3L53n64L01M6m54M53J96p0m03O5L69k34k41
$$ plain form
4396 -206 198 129 -130 204 287 -192 449 99 -386 -237 308 83 -171 230 -33 -25 -58 -92 -294 -112 393 -39
4418 -39 15 102 -1 -317 71 127 -221 -77 278 -42 -271 283 96 -376 -204 -30 -366 -181 -79 7 -464 63
4440 63 136 -168 -297 -47 -194 -2 -10 -280 -230 0 -269 -124 -354 142 -307 -46 100 31 -20 104 243 -314
4462 -314 34 14 -117 -205 198 404 -135 65 -80 -156 91 34 -480 -140 0 101 -316 274 284 -134 374 177
4484 177 -329 82 215 -244 -331 219 116 -91 433 84 136 -281 257 145 49 282 309 -263 -134 590 21
4505 21 136 552 193 -234 195 406 -94 -241 398 93 1 -79 436 24 10 243 -40 96 521 70 124 247
4527 247 1 -62 33 194 197 -265 319 -20 -116 150 -121 -170 118 295 -191 -14 247 -258 -351 193 18 -145
4549 -145 33 442 25 -169 107 287 -133 90 120 -456 -333 78 -279 -338 188 57 -312 66 -161 -359 -79
$$ packed form
4396b06M04o9k59L34Q3m79O41l50m85J49N45k25k54M01k63Ql3l4k02J82N05m32
4418c9N4Q7j03l16L88N6l48J44L55l20k29N54j87m72J72J74l36J85J02Q6m71N27
4440F3P3l04j29K50j47J92qk70N0K30k69J45k30M96m49K61J46o9n1J24J39n57
4462c14L48k0j31q8M03K06n39K00j45p6K47n7n14L40J40J01m17N90J0m18N08j97
4484A77n06M11J33m59q7N50j03k07N24l49N2m17N38j12r6K33K7n72J29P24n69
4505B1J15M16l59m27M29K11n00j47O39l05r2q0N15m12j4K33k83J36M25m51N4J23
4527B47k46o3R5J61Lm62N84l39r6K66k71m9K88J77m86J77K61n05r3N44j75j63
4549a45J78M09m17j94K76J80m20K23L0n76J23M11l57n9N26j31l69L78k27j98K80
$$ plain form
4570 -79 98 -281 -94 34 -12 -367 -341 -34 -401 6 214 -424 -271 198 138 -33 94 361 -329 -56 253
4591 253 -91 -245 18 -22 -156 158 53 -250 -73 310 -86 -338 87 -114 -19 16 194 -282 -3 92 -107
4612 -107 -72 -7 -10 -243 186 143 25 139 331 139 104 180 183 168 28 249 -64 122 64 198 6 161 234 61
4636 61 30 221 -77 -98 354 -54 111 318 264 -1 174 250 -81 52 261 109 -258 301 138 -115 177 210
4658 210 71 -58 445 166 -106 -34 342 -25 -222 295 -174 -116 50 131 -301 200 153 18 -189 209 -325
4679 -325 -308 36 -100 54 242 316 -103 59 80 -294 -403 -114 101 -327 21 76 -79 -256 -138 -23 -202
4700 -202 -22 -201 -86 157 356 -473 -116 -229 -75 -503 111 112 -229 -143 -7 26 -236 -121 62 -311 56
4721 56 -143 -300 254 -2 -299 13 214 -618 -419 464 -39 -142 -65 255 -29 50 -23 -56 -255 223 5 -95
$$ packed form
4570g9J77l79J87J28m6l55K6L07l67M07K08o38J53M69o0j71J27K67o90K73L09
4591B53l44j54K63m0j34L14j05l03J77L83l96k52M25k01R5L5J78m76K79R5j99
4612a07L5O5lk33M29m3j18J14J92j92l5P6Lj5j40K21l13J86n8J34j92J55P3j73
4636F1l1J91k98k1M52m08J65K07n4k65J75P6l31J33K09j52l67N59j63k53K92L3
4658B10j39j29N03k79k72P2L76l67j97N17m69N8J66Q1m32N01m7j35k07L98n34
4679c25J7L44j36J54J88P4m19J62K1l74j09K89K15m28L48N5j55j77J18J15j79
4700b02J80j79J15K43J99q29L57j13J54m28O14Jl41Q6J36L3k62J15J83l73L67
4721E6j99j57N54k56k97L12K01q32J99Q83n03j03P7L20k84P9p3l3j99M78k18j00
$$ plain form
4743 -95 120 -8 190 46 350 161 -325 116 160 -35 249 147 60 129 24 293 -129 210 219 40 250 376
4765 376 -227 -80 198 38 49 313 115 -139 66 432 126 -125 216 -2 -25 136 -39 76 9 -41 -244
4786 -244 -145 169 79 -53 -156 -34 -122 26 99 -138 -328 -118 299 -188 244 125 -151 -306 144 -326 -115
4807 -115 5 201 -123 -49 344 -148 142 -57 184 -106 -129 -184 -215 -261 152 -478 -44 -41 -194 -111 -361 41 -298
4830 -298 -136 256 -89 -191 49 -255 -55 -253 -120 56 15 117 28 -4 -190 -59 -250 8 441 -336 -151
4851 -151 -158 -17 -317 -36 132 -274 -49 -52 -159 -392 491 -9 -163 124 29 -242 24 307 -66 218 -109 -163
4873 -163 -81 271 63 -66 137 160 293 130 256 19 -37 285 26 -173 58 -58 -141 61 257 456 -133
4894 -133 289 336 -37 -39 43 -5 -85 552 65 -39 -309 225 -146 -227 164 233 -1 345 149 23 228 81 220
$$ packed form
4743i5K15j28J98j44L04j89m86M41M4j95K84j02q7O9j05K69m22L39Rj79K10J26
4765C76o03J47K78j60J1K64j98k54K05L66l06k51L41k18k3J61j75J15o7n0k03
4786b44R9L14r0j32j03J22q8J48P3k37j90K10M17m87M32j19k76j55M50m70K11
4807a15J20J96l24P4L93m92K90j99K41k90k3n5l1m6M13o30M34Lj53Q3k50M02l39
4830b98J62L92l45j02K40l04K00j98J33J76m1J02q9l2j86J31j91K58M33p77J85
4851a51pJ41l00K81J68m06K25lj07k33Q83n00j54K87r5k71K66K83l73K84l27n4
4873a63Q2L52k08j29K03K3J33j63J26k37n6L22k59j99K31j16q3K02J96J99n89
4894a33M22M7l73kQ2m8q0O37m87j04k70N34l71q1L91O9k34L46j96j26K05j47J39
$$ plain form
4917 220 -60 -99 40 -17 255 210 317 -42 65 -333 260 161 -268 -145 60 149 -19 -56 -17 -129 54 -4 4
4940 4 -72 -127 3 80 -65 256 -256 -58 146 -321 -181 55 27 -515 165 -291 -416 -238 143 -210 -1 128
4962 128 -364 -119 70 -279 -367 -38 11 -180 -139 118 168 -214 -319 83 -341 -253 329 -117 -256 219 51 -110
4984 -110 -7 -12 -47 -31 -100 139 -89 -13 53 -177 44 121 -157 157 254 -211 -50 55 101 -160 33 247 235 -234
5008 -234 308 134 -132 305 174 -164 -96 185 -27 -329 381 -257 -291 171 360 216 14 167 -71 61 28
5029 28 -149 -124 244 289 32 -56 285 -22 43 22 92 -52 160 391 191 -56 116 -253 -65 344 23 -145
5051 -145 177 -107 123 164 331 -11 167 209 -115 -67 75 264 56 -104 -259 74 0 153 -29 -285 118
5072 118 199 -19 15 180 -78 -81 532 -211 -215 134 166 -394 -388 -101 -112 -190 40 -13 -289 360 -175 58 -88 -166
$$ packed form
4917B20k80l9J39n7K72m5J07l59J07l98N93r9m29J23K05Q9j68l7L9j12J83n8Q
4940Dp6n5J30P7j45L21n12J98K04m67J40K36k8n42O80m56j25J78L81l53K09J29
4962A28m92K45J89l49q8L29M9j91M1K57N0l82j05M02m24Q8N82m46j39M75j68j61
4984a10J03nl5J6o9K39k28P6O6k30K21P7k78L14R7m65J61J05M6k61J93K14j2m69
5008b34N42j74k66M37j31l38O8K81k12l02P10o38l4M62J89j44k02J53k38J32l3
5029B8j77K5L68M5k57q8L41l07O5k1P0j44K12K31k00k47J72l69J88M09l21j68
5051a45L22k84K30M1J67l42J78M2l24M8J42J89k08j60j55L33p4J53j82k56M03
5072A18Q1k18L4J65k58lO13p43mL49L2n60OK87j1p8K30n3k76O49n35K33j46p8
$$ plain form
5096 -166 -80 -321 81 -144 -456 -136 23 20 -312 151 -408 -1 -160 174 -121 240 158 -166 -230 -20 -288 -241
5118 -241 34 181 -264 -146 82 -100 35 -78 -192 -327 -20 32 94 -320 250 -73 -194 -216 232 39 240
5139 240 106 130 -41 0 10 -21 147 -19 -33 318 105 -158 -67 276 -13 -183 -25 106 31 348 146 83 -70
5162 -70 269 0 -24 192 192 113 135 287 -192 -251 358 -80 59 -73 26 104 136 265 73 94 44 84 82 -43 -5
5187 -5 -48 -141 219 -130 -48 125 -26 -357 133 232 -97 -294 43 -78 -213 -173 19 -119 23 -166 -41 171
5209 171 -99 87 -114 254 -328 -293 177 154 -68 -48 -21 -133 77 247 -309 -310 72 -153 -296 -95 267 -127
5231 -127 -97 34 35 19 -199 126 -228 -70 205 -65 40 373 26 -201 -203 -122 -102 285 -113 -530 -285 49 -247
5254 -247 -161 -191 78 -246 116 262 -89 -209 -1 320 -197 4 -107 -27 158 51 299 120 115 -56 80 230
$$ packed form
5096a66Q6k41M02k25l12L20J59ll32M63n59M07j59L34k95L61q2l24o4K10k68M7
5118b41K75J47m45J18K28j82J35j13j14j35L07N2O2m14N70l23j21k2M48j93K01
5139B40j34K4j71M1J0l1J68j66j4L51k13k63R1L43k89j70J58J31p5L17k02o3j53
5162g0L39k69k4K16%p9K2J52m79n9O09m38J39j32R9P8L2J29j92K1n0M0kj25L8
5187em3r3L60l49Q2J73j51l31M90R9l29j97L37j21j35M0J92j38J42j89J25K12
5209A71k70J86k01L68n82L5M70k3k22K0K7j12K10J70n56jL82k25j43K01L62l94
5231a27L0J31Jj6k18L25l54J58K75k70J05L33l47k27kQ1K0L87l98m17K45L34k96
5254b47Q6l0K69l24L62J46l51j20K08L21n17K01j11Q0J85j07K48j79nj71J36J50
$$ plain form
5276 230 -26 -136 190 319 -48 -230 -153 197 -83 254 114 -208 -239 306 15 -27 210 221 -82 94 344
5297 344 -81 -115 536 165 -101 608 213 156 312 35 43 -155 280 222 -84 166 -259 -100 102 -57 -4 -282
5319 -282 -10 -49 -119 34 340 58 -131 -59 -262 -83 -181 45 71 -473 26 -169 -63 114 -275 -359 371 -10
5341 -10 -190 43 -54 -98 45 71 -162 150 -187 -106 -241 -63 329 1 -247 27 -60 188 5 4 -373 -128 181
5364 181 -137 -18 194 165 -152 475 -138 -272 240 88 -178 -143 -48 -87 18 202 -290 -338 -120 -6 -21 -104
5386 -104 124 107 -70 92 171 355 -224 306 -12 -30 84 -24 -185 -93 -283 -54 208 97 -21 76 29 -220
5408 -220 -36 -42 225 134 18 -155 -84 212 144 -169 30 -22 -113 59 113 235 -193 -114 202 67 0 312 161
5431 161 184 181 209 -55 -10 238 -42 -298 112 1 -104 -135 54 -21 -272 259 221 -149 -46 89 69 -152 14
$$ packed form
5276B30k56j10L26J29l67j82P7L50k80L37j40l22l1N45k91m2K37J1l03J76K50
5297C44m25l4O51l71k66P09l95n7J56k77Qj98M35n8l06K50m25J59K02j59N3k78
5319b82K72l9p0J53L06k82j89P2k03J79r8K26K6n44M99j95J06J77l89q4P30l81
5341a0j80K33r7m4J43K6k33L12l37Q1j35J78L92l28k48K74q7K48j83jl77K45L09
5364A81l18J19K12k9l17O27o13j34N12j52k66L5R5l9J05J84m92m8K18J14j5q3
5386a04K28j7j77J62P9J84n79N30l18j8J14j08j61R2j90K29K62j11j18R7m7k49
5408b20J84oK67r1j16j73P1K96o8l13J99n2r1J72N4J22m28P9L16j35o7L12j51
5431A61K3lK8k64M5K48k80k56M10j11j05l1J89p5k51N31l8l70J03J35k0k21J66
$$ plain form
5454 14 -79 -18 -106 43 -278 -45 373 -252 -65 -74 212 -75 251 -112 -127 -14 -114 157 -210 -178 -100 2 281
5477 281 -177 -68 -197 -187 -447 -294 -122 94 -128 2 30 -283 118 32 -175 225 256 35 -182 -296 40
5498 40 -304 -277 -185 -228 34 275 -268 21 4 -241 -141 -232 195 93 31 26 36 -23 84 -131 -141 54 30 -123
5522 -123 -3 -8 160 310 158 164 41 234 82 -142 -69 46 270 -114 40 224 -83 316 86 300 298 248 -38
5545 -38 180 192 -48 10 198 -7 126 -44 317 84 69 176 193 -185 112 172 -102 -118 145 -126 -36 81 207
5568 207 -3 92 308 -57 47 53 63 -172 153 -117 -163 -258 421 64 -61 25 268 49 241 -25 23 150 26
5591 26 -250 -237 31 -360 -128 -336 -73 -24 10 488 -8 -105 97 27 -27 -103 101 -326 -60 -447 -90 -409 -47
5614 -47 44 -79 -78 -129 -90 -187 24 21 -24 -60 60 -148 19 -208 9 226 14 203 -40 199 199 115 291 165 108
$$ packed form
5454A4r3O1q8J49l21K33M18o25J87rK86k87L26l63j5J13j00K71l67L2P8J02K79
5477B81m58J09j29J0k60J53J72K16k22J30K8l13M01q6k07M00L1k21k17j14L36
5498D0l44K7R2m3K62K41n43K89j7k45J00r1M27j02o2nJ0n9J07k15j0J95k4j53
5522a23J20nJ68J50j52Oj23J93j52k24P3J15K24l84J54J84l07L99k30K14kn0k86
5545c8K18J2k40N8J88k05J33j70L61k33j5J07J7l78K97O0k74j6K63k71R0J17J26
5568B07k10R5K16l65J04OJ0k35L25k70m6r5O79l57j25Q6K43k19J92k66M8J27j24
5591B6k76J3K68l91K32k08K63M9L4M78m96r7K02p0n4p6K04m27K66l87L57l19L62
5614d7R1j23Jn1L9r7K11lm5l6J20k08J67k27K17K17k12J89k43K39%q4J76j26n7
$$ plain form
5639 108 43 43 77 57 -75 204 -348 169 305 -76 48 17 68 28 -77 -159 -42 175 34 20 -52 85 341 -159
5663 -159 91 -60 -7 76 321 6 -43 85 345 62 244 31 120 138 37 -36 7 322 -192 -131 -63 135 -59
5686 -59 -37 164 32 -36 -140 -139 -142 239 74 303 -304 -32 3 144 112 85 68 26 -53 61 -125 161 -253 -142
5710 -142 247 -51 -358 -84 73 -90 -189 -147 -197 114 9 34 -199 4 -82 22 -82 -109 -57 -36 -225 7 -134
5733 -134 -450 69 -325 -110 3 15 -261 65 183 -357 80 -319 -412 165 -180 23 -120 -74 77 -42 -220
5754 -220 116 57 133 -65 -59 68 -64 87 320 41 157 49 -319 60 0 -1 119 160 72 -148 74 16 -149
5777 -149 54 48 -143 -28 81 -350 5 221 77 -79 68 -13 92 39 -6 179 -90 83 -99 -91 149 -67
5799 -67 -60 39 -250 -75 119 188 15 122 -11 -166 -154 -22 129 -203 -244 -27 -59 -308 119 172 44 -158 -89
$$ packed form
5639A08o5%L4k0j32K79n52N17J36l81J24l1N1m0j05q2J17K17j41j4p2J37K56n00
5663a59K50j51N3Q3K45l15m9J28K60k83J82k13Q9J8j01p3M3L15n14O1O8J98j94
5686e9K2K01j32o8j04JlL81j65K29o07K72L5J41l2k7j7m2p9J14j86K86m14J11
5710a42L89k98l07K74J57j63r9M2n0L11j05K5k33K03q6J04j04k7N2K1j89K32j41
5733a34l16N19l94K15J13J2k76L26J18n40M37l99r3N77l45K03j43M6J51j19j78
5754b20L36n9P6j98OJ27j32J51K33k79J16j08l68L79o0jJ20M1q8k20K22n8j65
5777a49K03oj91J15J09m31L55K16j44j56J47q1J05n3m5J85k69J73j82QK40k16
5799f7PR9k89J75J94O9j73J07j33j55J2J32J51l32m1K17l2k49M27N3j28k02O9
$$ plain form
5822 -89 302 -65 109 -126 -49 -198 64 -77 -193 70 293 179 25 16 -381 -64 207 -280 20 -1 -326 -226
5844 -226 77 -26 -192 384 284 -102 -108 -167 -298 -44 352 -63 -98 37 105 -71 77 3 0 -202 34 61 -86
5867 -86 -218 135 -36 1 133 -238 -88 277 -177 -148 25 -6 -126 -244 236 158 -80 -203 156 -213 -109 64
5889 64 -66 -47 151 -59 -356 169 -367 16 156 -245 102 -166 -77 -139 -290 -154 98 -257 105 0 61 -85
5911 -85 355 108 67 -40 304 346 -64 144 -24 172 -9 -50 16 120 -63 49 259 106 178 -6 73 -47
5933 -47 -265 -110 -21 -211 -37 -271 -442 -243 281 267 136 213 -171 -99 70 -86 97 -163 7 84 93 210 67
5956 67 -174 187 -127 -31 2 -85 79 -299 415 -189 396 84 -46 -325 -255 -55 -143 -246 27 -20 30 -85 75
5979 75 -193 -19 1 -94 -103 15 93 -300 124 125 82 -276 -42 6 -161 172 0 -63 -302 92 -120 369 100 4
$$ packed form
5822h9L91l67J74k35P7j49K62j41j16K63K23j14j54rl97L17K71m87L00k1l25J00
5844b26L03j03j66N76j00l86on9j31K54L96m15l5J35O8j76J48p4lk02K36K7j47
5867h6j32L53j71L7J32l71J50L65m54K9J73l1j20j18M80p8k38j23L59l69J04J73
5889F4j30J9J98k10k97N25n36L83J40m01L47k68Q9o2j51J36K52l55L62j05O1j46
5911h5M40k47m1j07L44M2m10K08j68J96j81m1O6J04j83J12K10j53P2j84P9j20
5933d7k18J55Q9j90J74k34j71J99N24j4j31P7l84P2J69j56J83k60J70P7RJ17j43
5956F7k41L61l14R6L3q7J64l78P14o04N85l12j30k79P0K00q8j03K73m7N0j15J60
5979G5k68J74K0r5rJ18P8l93M24Jm3l58K34M8j67L33j72o3k39L94k12M89k69r6
$$ plain form
6003 4 -60 -31 135 -51 281 62 -186 22 61 156 42 193 95 -73 191 122 -182 -225 132 36 -206 132 247
6026 247 -41 196 130 82 -347 16 -46 -162 117 87 -221 -210 444 90 -2 -49 -6 -304 411 264 -365 -90 -42
6049 -42 -195 133 289 130 -41 212 242 93 -125 265 57 -12 44 149 -200 -1 205 171 -42 116 -3 -194
6071 -194 -106 -422 353 -222 47 -111 141 152 83 -146 -91 228 71 30 -115 -79 -223 45 15 -355 27 -4 -84
6094 -84 -27 -114 81 -89 -96 -100 -417 -29 -1 82 -64 -93 313 88 -101 -106 -148 -17 -112 -12 -54 -350 -4 -17 32 -83
6120 -83 86 -232 -75 -306 -311 177 -146 40 -30 51 -137 57 170 -214 -79 93 59 -192 -107 97 -63 152
6142 152 64 -43 46 170 -397 167 13 56 -17 -159 31 261 -366 -159 -42 151 218 14 -91 -146 -38 -143
6164 -143 -144 105 110 -66 -49 -26 -28 -14 80 79 99 180 196 474 -51 -30 71 73 27 -46 268 48 -25 -40 276 -24 -25 -114
$$ packed form
6003Do4K9J66j86L32k19k48K08L9R5j14J51r8j68K64o9l04m3L57r6k42L38J15
6026B47k88K37o6m8m29L63o2j16K79l0l08J1O54l54r2m7M3k98P15j47o29K75M8
6049d2j53L28J56j59j71K53L0j49k18L90k08o9N6J05l49J99K06l4k13J58j19j91
6071a94Q8l16P75n75K69j58K52J1o9k29N5L19j57m1j45L6j44K68l0l70L82l1q0
6094h4N7q7J95j70pml17L88K8Q3j46k9M06k25j89nm2J31r5J00m2k96L46j3M9j15
6120h3J69l18J57k31nM88l23J86p0Q1j88J94J13l84J35J72l4k51Q5K04j60K15
6142A52q8j07Q9J24n67N64j54M3p3j42J90K30o27K07J17J93O7k04j05n5J08j05
6164a43jK49Nj76J7K3kJ4R4jK0Q1J6K78n25K1J01Km6p3L14k20p3j5L16l00jq9
$$ plain form
6192 -114 354 -95 118 219 122 -176 172 265 398 -518 353 -84 -128 103 172 -277 -96 110 43 -14 -95 -119 27
6215 27 41 89 264 83 -171 104 -261 -323 -163 -366 -208 163 -148 -50 -252 -31 -375 -130 -160 -185 -99 -315 -68
6238 -68 -268 -126 -166 -116 -235 264 48 -156 -37 -70 -36 -93 21 -127 115 -115 -169 -39 3 -324 15 -109 -101
6261 -101 -124 92 -198 -85 200 101 -74 -388 -17 -229 -74 -299 -349 -389 -16 -112 13 -10 -74 -14 -405 21 239
6284 239 -72 2 -15 -187 -159 -98 -95 -105 -101 -261 -224 74 157 113 -10 81 -121 -18 15 15 2 189 -145 -169 120 8
6310 8 -130 61 53 112 -182 85 -114 -121 178 -7 159 -115 183 61 -11 -68 41 205 -1 5 -188 30 -114 31
6334 31 -108 238 -2 -21 -82 -58 -20 -45 124 142 -205 137 227 -312 -51 174 -113 -99 110 178 56 -62 30 -306
6358 -306 -12 108 35 -147 -248 -17 31 -82 311 -57 88 -67 54 14 74 33 187 -195 123 207 48 79
$$ packed form
6192a14M68m49K13J01r7k98L48R3J33r16Q71m37m4K31O9m49J81K06o7n7q1k4J46
6215B7J4M8J75j81k54K75l65o2J60k03J58L71l11R8k02K21l44K45l0k5Q6k16K47
6238f8k00J42m0N0j19M99k16k04J19l3L4n7J14j48K42k30n4J30M2l27L39j24Q
6261a01k3K16k90J13K85r9j75l14L71k12J55k25n0m0L73r6J25k3o4O0l91M26K18
6284B39l11P4j7j72K8O1Lj0Mj60L7K98Q3m4j23R1k02J03L3%j3J87l34k4K89j12
6310Hj38J91qN9k94K67j99pK99j85J66k74K98j22p2n7J09J64k06Oj93K18j44J45
6334C1j39L46k40j9o1K4L8k5J69J8l47L42R0n39K61K25k87J4K09O8j22j18R2l36
6358c06K94J20p3j82j01K31M8j13L93l68J45j55J21m0O0m1J54l82L18Q4j59L1
$$ plain form
6380 79 1 -30 77 148 -9 186 30 -150 -344 -270 183 -15 187 -75 -75 108 12 179 -145 -46 151 63 -114
6403 -114 87 29 218 -73 126 -15 250 -72 -19 -161 -31 -134 103 -81 -140 23 8 287 -161 172 68
6424 68 -78 366 129 -310 -352 111 -120 85 -142 -128 222 -361 363 40 -18 109 72 85 -257 2 22 72 142
6447 142 139 -1 -194 181 -64 355 -45 141 -20 101 -59 -156 -104 95 94 -182 86 98 127 88 -54 -104 50
6470 50 -4 62 111 249 33 -14 232 -118 -185 11 -235 -176 151 -119 -188 61 -107 18 -262 13 -31 -53 -54 134
6494 134 -144 197 -153 249 -92 32 300 53 -114 216 -92 156 295 153 30 -175 -213 -204 -47 16 169
6515 169 323 43 -181 42 -292 402 280 33 5 189 80 -230 199 -8 -31 -25 284 -91 145 -151 -171 -1
6537 -1 -233 -452 -82 -163 -174 -29 169 103 -106 -14 170 257 -52 26 -87 -131 79 -70 -12 144 29 -115 -317
$$ packed form
6380G9p8l1J07P1j57J95j56j80j94P4M53j98K02k62%J83r6J67l24R9J97q8j77
6403a14K01n8J89k91J99j41K65l22N3j42J30j03K37j84n9J63j5K79m48L33j04
6424F8j46M44k37m39m2M63k31K05k27J4L50n83P24l23n8J27l7J3l42K59K0N0P0
6447A42lj40j93L75k45M19m00J86j61J21j60r7N2J99jk76K68J2K9l9j42n0J54
6470E0n4O6M9J38k16m7K46l50o7J96k46N9L27k70o9K49j68J25k80K75m4k2jJ88
6494A34k78L41l50M02l41J24K68k47j67L30l08K48J39j42j23k05l8RJ57O3J53
6515A69J54k80k24K23l34O94j22k47k8J84j09l10M29k07k3OL09l75K36k96k0J70
6537ak32k19L70q1j1J45J98o6k09R2J84Q7l09P8j13m4K10j49N8J56j15j44k02
$$ plain form
6560 -317 -200 -47 45 -228 -235 126 -65 343 -52 -63 72 42 -23 -115 136 9 -93 115 107 34 119 76 173 -100
6584 -100 23 -200 -128 -52 -102 -139 187 267 29 231 127 168 -113 -47 242 66 31 -194 -5 1 -38 17 -101 -36
6608 -36 -282 121 68 -33 -350 150 -68 -41 159 88 127 -135 133 148 -316 48 367 -439 -140 5 139 42
6630 42 68 -62 -98 83 50 -51 3 47 153 -83 -12 23 -43 198 -70 90 31 -185 -13 -48 186 9 -157 321
6654 321 111 -231 -246 -57 69 -190 194 494 32 -142 99 -48 -210 -53 4 75 136 -125 -110 145 -120 -103
6676 -103 63 -59 167 17 -1 149 -6 51 100 -136 -6 14 -122 117 248 36 308 181 49 -173 -7
6697 -7 -63 128 -231 120 -8 288 120 -125 69 -59 59 -130 57 239 -229 55 126 -38 -138 -30 203
6718 203 -67 -326 27 -349 -13 11 20 100 -11 -48 -162 150 75 84 -22 1 73 165 -69 356 71 -212 -79 -28
$$ packed form
6560c17J17J53R2k73pL61j91M08l95j1J35l0o5r2K51j27j02K08qp3Q5m3R7k73
6584a00J23k23P2P6n0l7L26Q0k38K02j04M1k81O6K89j76l5k25J89Ol9N5j18O5
6608c6k46M03n3j01l17N00k18K7K00p1L9k62K68J5m64L64L19q06K99J45J34r7
6630D2K6j30l6J81l3j01N4M4J06k36P1L5o6K41k68J60n9k16J72l5K34j77j66M78
6654C21k10l42j5J89J26k59L84L00m62j74K41j47j62J57N7P1O1k61J5K55k65J7
6676a03J66j22K26j50j8J50j55N7M9k36J30K0j36K39J31k12K72j27j32k22J66
6697gn6J91l59L51j28K96j68k45J94j28J18j89J87J82m68K84P1j64j00J08K33
6718B03k70k59L53l76L36K4RQ0j11l7j14L12p5Rj06K3P2R2k34M25k85k83J33N1
$$ plain form
6742 -28 178 -94 243 99 -53 -165 -222 112 -53 -23 136 -290 16 -116 63 -45 199 -115 -258 21 -202
6763 -202 -225 2 138 -24 137 -143 -264 -115 55 -43 111 -97 229 -211 -112 211 11 -163 -45 225 172
6784 172 196 -61 41 -163 -122 -68 -174 89 -60 -151 11 39 -89 66 -179 -458 -112 -21 75 -137 -46 -73 55
6807 55 -33 -41 -148 -188 204 -40 -83 23 -85 8 -5 94 -131 -218 170 13 -28 -69 -200 94 -183 -217 -28 -310
6831 -310 200 65 30 318 30 -170 -156 -27 180 -123 127 -137 105 271 322 77 303 242 149 6 -126 -55
6853 -55 198 -50 -149 -182 128 62 121 -218 67 -7 -219 102 30 -55 -51 -37 174 116 91 -184 -57 40 285 15 -1
6878 -1 33 51 -69 -103 -134 -95 -177 -98 386 226 -43 47 31 -9 -15 24 -184 -106 -145 202 92 -350 -189 -47 26 17 284
6905 284 28 56 21 51 -8 23 79 -122 5 35 -280 177 -25 -249 14 -15 222 -170 213 -80 13 -98 -100 42
$$ packed form
6742b8K06k72L37j44j52j12n7L34j65L0J59m26L06j32J79j08K44l14j43K79k23
6763b02k3K27J36j62J61k80j21J49J70r8J54k08L26m40R9L23k00j74J18K70n3
6784A72K4k57J02k04M1N4j06K63j49r1J62K8j28J55k45k79L46R1R6k12R1k7J28
6807E5q8qj07m0L92k44m3J06j08R3j3R9k25q7L88j57m1m1j31K94k77l4J89k82
6831c10N10j35l5K88k88k00J4J29K07l03K50k64K42J66N1k45K26o1r3j43j32P1
6853e5K53k48r9l3L10o6N9l39K85p4k12L21p2q5MJ4K11n8k5k75J27R7K45k70j6
6878aL4J8j20l4l1L9q2P9M84j60k69R0j6m0oL9k08P8l9L47j10m42J61J42P3rK67
6905B84k56K8l5L0n9L1N6k01J27L0l15M57k02k24K63k9K37l92L83k93R3j11kJ42
$$ plain form
6929 42 162 76 -341 -64 -144 -21 282 -122 -14 94 124 -58 15 225 -82 -165 178 96 79 307 -82 -387 -194
6952 -194 8 -111 -163 -423 -126 -213 -151 18 -71 -142 51 -66 -154 215 64 -18 406 -211 -112 266 135 183 -75
6975 -75 50 27 -38 -99 322 -35 12 42 -219 -230 119 134 55 119 -70 -142 -7 -71 244 -340 45 -43 -357 -24
6999 -24 57 -308 18 179 46 136 -145 -196 -1 318 -185 45 48 -87 -67 192 -245 62 -164 -12 73 210 -1
7022 -1 -151 -21 248 -111 -69 6 -38 -82 -394 61 122 -38 -199 75 -214 -335 -9 -32 -24 164 13 114 -90
7045 -90 102 215 116 -79 -24 -23 188 97 -239 17 63 51 123 104 31 129 -35 141 199 -242 -104 -136 -223 -479 71
7070 71 322 -153 50 399 64 96 -25 17 0 -43 113 37 135 102 115 48 29 13 -102 217 62 -371 141 141 340
7095 340 224 258 3 -14 -76 -153 46 -61 146 -37 -184 -74 43 97 159 54 152 29 77 78 -19 -123 -126 19
$$ packed form
6929D2J20q6m17K77q0J23L03m04J08J08L0j82P3K10l07q3L43q2j7K28l89l05J93
6952a94K02j19n2k60K97q7O2J69q9p1J93j17q8L69j51q2M24o17R9L78j31M8k58
6975g5J25k3o5o1M21l57M7L0k61j1L49J5p9O4j89p2J35o4L15n84L85q8l14L33
6999b4Q1l65L26J61j33R0k81n1J95L19n03K30Lj35K0K59m37L07k26J52Q5J37k11
7022aj50J30K69l59M2P5m4m4l12M55O1j60j61K74k89j21L26k3QJ88j51J01k04
7045i0J92J13r9j95N5JK11r1l36K56M6j2P2j9p3R8j64J76N8m41J38l2q7k56N50
7070G1K51m75K03L49l35L2j21M2j7m3J56p6R8l3J3o7j9j6j15L19j55m33N12%J99
7095C40j16L4k55j7o2p7J99j07K07j83j47J10J17N4O2j05R8j23M8Jr7j04lJ45
$$ plain form
7119 19 -107 404 27 -111 169 307 189 -46 19 73 155 159 -20 -244 61 215 44 280 332 15 -34 28 -275
7142 -275 260 1 -28 -34 58 203 -54 -61 150 -134 -15 -87 172 -51 -321 238 -54 133 126 168 158 -4 -29 -159
7166 -159 -158 56 107 106 -103 83 85 160 19 -186 -5 59 -99 177 -37 -229 263 -34 0 -131 -117 -79 -292 153
7190 153 47 -27 36 7 -82 -209 -130 -149 112 114 168 -126 136 159 -22 -8 -112 -26 106 116 -154 26 -113 79
7214 79 25 -12 -38 96 -121 62 19 -45 -61 -209 -251 136 15 -52 214 118 -90 -150 33 -15 -62 22 114 122 -173 -45
7240 -45 -318 -88 -183 -181 90 -31 -12 49 -24 91 -220 -52 -17 -68 -11 34 67 -90 -94 -52 -91 -36 87 -186 91 36
7266 36 106 49 -195 58 24 131 154 -353 38 35 178 -290 -121 -119 100 36 269 18 -337 56 -283 73 -161
7289 -161 334 -53 114 16 315 287 -142 146 -237 43 -114 55 200 26 -65 -136 23 110 64 1 223 192 -11
$$ packed form
7119A9j26N11l77j38K80J38j18k35O5N4Q2Mj79k24L05J54j71K36N2l17m9O2l03
7142b75N35k59k9oR2J45k57pK11k84J19p2K59k23k70N59k92J87pM2j0j62k5j30
7166a59JK14N1jk09J86KP5j41k05J81O4j58K76k14j92M92k97L4j31J4L8k13M45
7190A53j06p4O3k9q9j27P9j9K61KN4k94K62K3j81J4j04Q6J32J0k70J80j39J92
7214G9n4l7k6J34k17J83m3o4j6j48m2L87j21o7K66r6k08o0J83m8m7Q4R2Qk95J28
7240d5k73K30r5KK71j21J9O1p3J15l11J68L5n1N7M5L3j57mM2l9N5J23k73K77n5
7266C6P0n7k44K53l4J07K3n07L91lJ43m68J69KK19o4K33k51l55L93l39L56k34
7289a61M95l87J67r8K99k8m29K88l83K80j57J69J45j74r1p1J59Q7m6o3K22l1k03
$$ plain form
7312 -11 -213 23 27 10 -25 180 -23 -17 135 80 62 133 -107 -158 -10 14 -30 22 148 32 -22 115 -58 225 -172
7337 -172 -91 -328 -337 -159 -233 -53 -143 71 115 -116 -33 -162 -160 -38 310 52 34 135 128 209 -342 84 -175 102
7361 102 86 113 -142 205 39 -56 -333 -171 145 42 -242 -71 -10 134 -180 -47 -203 -60 297 -36 47 -30
7383 -30 1 150 358 -289 -289 256 -195 148 35 -226 -114 53 -6 -178 -246 4 169 21 36 122 37 -14 0 -87
7407 -87 -153 36 343 -160 -60 -21 48 -195 -212 183 43 -6 174 -56 -100 -113 -217 32 -222 -210 98 349 -106
7430 -106 90 90 104 -118 306 -14 -7 -256 -17 149 19 -80 -169 -164 111 76 -153 -7 -12 -87 252 -77 234 330 -35
7455 -35 -391 261 -26 -186 11 77 1 84 74 60 -29 32 -178 53 305 78 50 -41 -115 -31 -105 130 -14 107
7479 107 -142 56 -89 -107 -111 71 94 39 12 111 214 67 -99 203 -120 55 -33 -53 74 311 132 97 121 214
$$ packed form
7312a1k02K36Mj7l5K05k03OJ52n5j8P1k40n1J48K4m4N2J26j16n4J37j73K83l97
7337a72Q1k37rJ78p4J80r0K14M4k31Q3j29KJ22L48k58j8J01pQ1n51M26k59K77
7361A02j6K7k55L47j66r5k77J62L16j03k84J71O1J44l14J33j56J43L57l33Q3p7
7383c0L1J49K08o47%N45m51L43j13k61J12J67n9j72o8K50J65j48J5Q6q5n1J4q7
7407h7o6J89L07n03J00L9O9k43j7L95j40m9J80k30m4j3j04K49k54J2L08K51m55
7430a06J96%J4k22M24l20Pk49K39J66j30r9q9NK75l5k29J46np5L39l29L11R6l65
7455c5l56O52k87j60J97O6p6Q3j0j4q9O1k10K31K52k27k8r1p4Q4p4K35j44J21
7479A07k49J98j45j8mJ82K3n5k7R9J03j47j66L02l23J75q8k0J27K37j79l5K4R3
$$ plain form
7503 214 -285 -77 -82 -202 353 86 292 78 99 -119 22 6 88 -331 54 -118 176 -99 -269 -8 -221 143
7525 143 -157 -84 362 31 70 108 124 76 215 -206 -19 -56 230 5 124 179 185 44 -130 221 19 226 -227
7548 -227 80 -102 -230 87 -125 -293 113 150 -46 129 272 -49 160 120 365 220 -37 174 221 227 15 -3
7570 -3 16 -165 -113 133 142 -50 -119 44 -105 74 11 96 113 -21 20 -69 -91 -94 -74 -1 -5 108 -35 50 15 -149 29
7597 29 -74 49 -2 -157 259 -272 -18 49 -374 328 52 9 -59 -128 46 83 202 111 -111 268 -164 -124 -50
7620 -50 -23 12 -74 17 82 32 145 -81 -70 83 -186 -146 215 90 112 -33 89 -125 -107 149 -264 131 -52 9
7644 9 -89 -204 81 -165 -295 -4 -298 299 -91 -45 -324 -184 -31 -306 -28 -64 -9 132 -178 142 209 -93
7666 -93 -79 372 -23 67 51 159 71 -137 96 106 -257 301 108 658 112 184 -191 -253 176 -94 -195 -38 21
$$ packed form
7503B14m99K08nj20N55k67K06k14K1k18J41j6Q2m19L85j72K94k75j70K61k13L64
7525A43l00P3M46l31L9L8J6m8J39m21J87l7K86k25J19N5Oj41j74L51k02K07m53
7548b27L07j82j28L17k12j68M06L7j96J75J43l21K09m0K45j45k57K11M7Ok12j8
7570cJ9j81N2K46Rj92o9J63j49J79o3Q5J7j34M1q9k2lK0P3mJ13j43Q5l5j64J78
7597B9j03J23n1j55M16n31K54O7m23P02k76m3o8o9J74L7J19r1k22L79m32M0P4
7620e0K7L5q6R1O5n0J13k26J1J53k69M0L61j25K2j45J22k14J8K56m13L95j83O1
7644Ir8j15K85k46j30K91k94N97l90M6k79J40J53k75K78l6N5J41l10L20O7l02
7666i3J4M51l95R0j6J08q8k08K33J0l63N58j93N50n46P2l75o2M29k70j01J57N9
$$ plain form
7689 21 15 187 -99 -123 170 218 -52 -107 -33 221 239 -12 131 -266 -110 -68 171 122 30 77 -357 7 -132 -43
7713 -43 25 26 -209 -133 32 190 -88 -15 389 35 76 -205 -30 -72 4 -278 -170 -256 10 112 133 -184 -8 -152
7737 -152 77 -47 -159 -97 111 -159 -56 -154 -50 83 -27 174 136 -296 184 136 -138 -204 -72 119 32 -35
7759 -35 -17 -69 -48 503 103 -253 -19 -156 21 -80 158 74 -4 -167 -275 116 -199 -94 -271 10 -214 -77
7781 -77 60 38 33 -220 378 158 161 -51 95 -276 128 281 13 67 -318 148 -23 126 88 167 -110 -207 -111 -132
7805 -132 44 59 -245 208 -111 -44 -49 -204 -215 -181 -58 -264 226 -171 -280 -146 0 -118 -148 67 68 -96 230
7828 230 -32 -4 -6 -48 109 -286 -105 74 -40 -182 -95 25 -168 -2 -50 -42 20 -432 -184 -55 -376 160 -262
7851 -262 48 -190 -194 27 -66 40 -120 -1 134 -156 94 -161 -136 -172 -8 44 -27 31 39 146 -38 315 55
$$ packed form
7689B1oJ72k86k4K93M8k70n5P4K54J8k51J43l97J56M2K39m9r2M7m34L64j39Q9
7713d3O8Jk35P6J65J58k78P3M04l54M1k81J75m2P6k82J08q6K66J02K1l17J76j44
7737a52K29j24j12O2K08k70J03r8J04J33j10K01l8m32M80m8k74o6J32J91q7o7
7759c5J8n2K1N51m00l56K34j37J77j01K38q4p8j63j08L91l15J05j77K81k24J37
7781g7J37k2nk53N98k20Lk12J46l71M04J53k68N4l85M66j71J49l8P9k77r7R6k1
7805a32J76J5l04M53l19O7nj55j1L4J23k06M90l97j09J34J46j18l0K15Jj64L26
7828B30k62K8km2J57l95J81J79j14j42Q7J20j93J66m8QO2m52K48J29l21N36m22
7851b62L10k38mK21r3J06j60J19J35k90K50k55K5l6J64N2p1N8QJ07j84L53k60
$$ plain form
7874 55 7 87 135 60 -134 95 172 217 41 91 -151 -300 -41 197 -180 10 -17 285 49 -17 146 -207 -291 207
7898 207 -183 -65 150 -92 198 -12 -105 295 19 -24 396 50 123 -44 97 -74 334 158 -9 -97 263
7919 263 97 -160 1 19 -74 -173 178 38 -4 12 50 160 -91 178 284 -142 -30 -261 106 -196 -64 -94
7941 -94 161 -301 129 -44 -300 41 -27 109 -15 -85 180 -72 -90 -41 -74 212 -44 168 31 63 210 -98
7963 -98 85 -159 -193 -61 3 31 -111 106 204 451 -294 30 -71 -25 50 23 194 -130 7 160 92 -31 -186
7986 -186 15 -203 253 75 -178 -344 -71 -40 -62 91 -87 -156 154 156 -25 195 -86 139 249 -94 -103 -5 108
8009 108 0 16 225 -63 250 -20 -11 234 139 -31 -269 -19 190 -13 -208 -131 7 12 42 27 120 -296 -144
8032 -144 -108 224 26 -106 46 53 48 248 217 -170 -112 197 -232 -94 -205 -29 209 -70 23 -86 -21 -211 -44
$$ packed form
7874E5m8Q0M8p5j94K29P7M5j76N0k42j49K59K38l77J90k7L02k36o6J63l53q4M98
7898B07l90J18K15k42K90k10r3M00k76m3M20l46P3j67J41j71M08j76j67q8L60
7919B63j66k57J61J8r3r9L51j40m2J6L8J10k51K69J06m26J12k31L67l02J32l0
7941i4K55m62M30j73k56L41o8J36j24p0K65k52j8M9l3K86k56K12j37L2J47l08
7963i8J83k44l4J32O4K8j42K17R8K47p45L24j01M6P5k7J71l24J37J53o8j23j55
7986a86K01k18M56j78k53j66K73L1k2J53j78o9L10Kj81K20k81K25J10l43rR8J13
8009A08j08J6K09k88L13k70RK45r5j70k38K50K09k03j95P7J38NL0j5R3m16J52
8032a44L6L32j98j32J52PnK00l1l87N8L09m29J38j11J76K38k79R3j09O5j90J67
$$ plain form
8055 -44 -34 130 -138 73 -253 50 -20 -10 -24 164 155 31 165 -188 142 -3 -177 -159 63 305 163 -212 -91
8078 -91 55 53 -232 54 118 -43 156 -198 -194 -58 -131 80 -57 -90 40 134 -293 -137 -300 -170 60 216 -95
8101 -95 -243 -73 -47 59 -64 267 -194 -40 32 -65 -193 80 177 91 156 -161 -247 -141 -14 15 34 -73 -84 -328
8125 -328 363 -171 29 -171 -78 142 19 -334 -139 -325 -218 -100 42 -147 -80 231 -55 -56 123 -19 -154
8146 -154 -51 -157 -78 -228 214 174 -130 -179 -177 128 188 47 127 12 -10 -19 -302 61 -152 -155 -62 -99 359 125 133
8171 133 11 147 30 -58 -403 226 190 -113 128 -27 90 138 -350 324 103 -60 -414 86 150 -200
$$ packed form
8055d4J0J64k68K11l26L03p0J0j4J88rj24J34l53L30j45j74J8K22K42j42l75J21
8078i1J46kk85K86O4j61J99l54MJ36p3K11j37l3J30R4m27J56j63J30K30J56l11
8101i5j48J70K6J06j23L31m61J54P2r7j28K73R7q6O5l17q6J06J27K9J9j07j1k44
8125c28O91n34K00k00R3K20j23l53J95j86J07J18J42j89O7L11k86jJ79j42j35
8146a54J03j06P9j50M42m0l04m9KL05O0j41Q0j15k2rk83L63k13lR3l7M58k34Q
8171A33j22J36j17q8l45O29l6l03K41j55J17M8m88O74k21j63l54N00O4l50
8191b00
$$ Imaginary data points
##PAGE= N=2
##DATA TABLE= (X++(I..I)), XYDATA
$$ plain form
0 0 0 0 0 0 7 0 8 -8 8 -16 16 -24 24 -32 40 -48 56 -70 80 -96 112 -128 150 -174 199 -228 260 -294 334
29 334 -377 425 -478 535 -599 667 -744 827 -919 1018 -1129 1251 -1385 1534 -1698 1881
45 1881 -2088 2320 -2585 2890 -3243 3663 -4170 4788 -5575 6606 -8028 10116 -13512 19969
59 19969 -36740 173059 369007 65800 -35625 23795 160257 168333 111478 46607 105301
70 105301 160772 102969 -757 40581 141139 169903 102011 21135 -16894 44491 105801 65419
82 65419 305 43703 98141 61837 2001 2748 32964 63861 55957 -3779 -32280 27711 64006
95 64006 15515 -19969 7215 31927 37065 23665 -20988 -40173 10949 38966 -8837 -35874
107 -35874 -3875 14852 3878 -8188 -24569 -21831 12958 12530 -32941 -35570 -758 -9757 -33495
$$ packed form
0@%%%%PpQj6J6k4L2m0M8n6P2q8J04j26J50j76K08k40K78l24L73m27M88n54O28
29C34p11Q02r03J013j134J266j411J571j746J937k147K380k636K919l232L579
45A881l969M408m905N475o133O906p833Q958j0363J2181j4634J8144k3628L3481
59A9969n6709K09799J95948l03207j01425N9420J36462Q076n6855o4871N8694
70A05301N5471n7803j03726M1338J00558K8764o7892q0876l8029O1385O1310m0382
82F5419o5114M3398N4438l6304n9836P47L0216L0897p904n9736k8501N9991L6295
95F4006m8491l5484K7184K4712N138j3400m4653j9185N1122K8017m7803k7037
107c5874L1999J8727j0974j2066j6381K738L4789m28m5471k629L4812q999k3738
$$ plain form
120 -33495 -18075 -5355 -14537 -10157 -13262 -37664 -25747 6301 -11414 -43450 -26951 -4721 -10243
133 -10243 -14307 -22591 -34647 -12229 11357 -21002 -47304 -13372 7201 -18914 -26757 -11496 -8952
146 -8952 -1315 6653 -17708 -31333 624 13158 -14670 -16799 3751 1962 -2401 -1009 -15911
159 -15911 -12082 25420 23715 -22410 -23677 14522 18438 780 -3969 -7865 -518 20955 7281
172 7281 -28880 -13048 27705 19705 -5095 -5549 -4379 -497 18253 9374 -20712 -5368 28777
185 28777 11773 -17932 -5837 13617 16190 15002 -2115 -19990 4257 30340 5287 -15495
197 -15495 9657 24280 8801 3436 464 -7003 12864 29037 -2833 -25503 5286 28263 12809
210 12809 1219 -593 -3190 12104 19540 -9270 -18246 17191 25389 -6285 -12327 3798 6124
$$ packed form
120c3495J5420J2720r182M380l105k4402J1917L2048j7715l2036J6499K2230n522
133a0243m064q284j2056K2418K3586l2359k6302L3932K0573k6115p843J5261K544
146h952P637P968k4361j3625L1957J2534k7828k129K0550j789m363J392j4902
159a5911L829L7502j705m6125j267L8199L916j7658m749l896P347K1473j3674
172G281l6161J5832M0753q000k4800m54J170L882J8750q879l0086J5344L4145
185B8777j7004k9705J2095J9454K573j188j7117j7875K4247K6083k5053k0782
197a5495K5152J4623j5479n365k972p467J9867J6173l1870k2670L0789K2977j5454
210A2809j1590j812k597J5294P436k8810q976L5437Q198l1674o042J6125K326
$$ plain form
223 6124 10849 14050 -8683 -17080 10567 14425 -10788 -8392 11094 7102 846 652 -13578 -11894
237 -11894 16312 12856 -18503 -13084 9355 -25 -9902 -398 -2633 -7691 3922 -1056 -19579 -6908
251 -6908 11751 -3576 -14958 -2526 -3821 -10483 288 -2206 -18802 -5429 10435 -10329 -21690
264 -21690 402 6096 -9026 -9735 -10246 -15970 -1295 8605 -12912 -21584 -84 1132 -15468 -9411
278 -9411 -2211 -9947 -2584 4237 -15714 -21305 3529 5825 -13912 -9331 1397 -6367 -5900 -216
292 -216 -9199 -4660 15775 4418 -21520 -8783 12051 3418 -2667 2946 -4173 -2454 14974 5309
306 5309 -16344 -1014 20137 7741 -5036 -694 -1068 4916 19387 6358 -13873 4201 21520
319 21520 1568 -9829 6640 11595 7575 12888 5671 -5698 9303 19498 -1775 -7173 13716
$$ packed form
223F124M725L201k2733q397K7647L858k5213K396J9486l992o256j94j4230J684
237a1894K8206l456l1359N419K2439r380r877R504k235n058J1613m978j8523J2671
251f908J8659j5327j1382J2432j295o662J0771k494j6596J3373J5864k0764j1361
264b1690K2092N694j5122p09n11n724J4675R900k1517q672K1500J216j6600O057
278i411P200p736P363O821j9951n591K4834K296j9737M581J0728p764M67N684
292b16q983M539K0435j1357k5938J2737K0834q633o085N613p119J719J7428r665
306E309k1653J5330K1151j2396j2777M342l74N984J4471j3029k0231J8074J7319
319B1520j9952j1397J6469M955m020N313p217j1369J5001J0195k1273n398K0889
$$ plain form
332 13716 15779 4149 5009 3219 151 17944 22013 -5542 -11697 13196 14050 -2988 -216 7314
346 7314 5858 13826 12794 -9537 -10459 12273 10484 -5241 -242 3659 -4778 1877 9117 -3564
360 -3564 -3918 12726 3478 -15433 -4892 6318 -3093 -3857 2962 -4023 -4199 5674 -4931 -16715
374 -16715 39 9315 -8841 -11997 -342 -4392 -5653 3850 -4862 -17393 -3773 5386 -10559
387 -10559 -12769 -226 -5458 -10401 51 -1879 -9552 -343 -176 -16457 -9921 8651 -1952 -16294
401 -16294 -4863 980 -6657 -2044 -1669 -12402 -3682 11867 -2454 -18252 -6127 3721 -842 1162
415 1162 -885 -12935 -3400 13576 -537 -15136 543 9650 -2173 -3512 1293 -3688 2495 13293
429 13293 2135 -6379 8694 10593 -5626 -2938 8927 5046 4568 9325 -1572 -4550 16427 19245
$$ packed form
332A3716K063j1630Q60j790l068J7793M069k7555o155K4893Q54j7038K772P530
346G314j456P968j032k2331r22K2732j789j5725M999L901q437O655P240j2681
360c564l54J6644r248j8911J0541J1210r411p64O819o985j76R873j0605j1784
374a6715J6754R276j8156l156J1655m050j261R503q712j2531J3620R159j5945
387a0559k210J2543n232m943J0452j930p673R209J67j6281O536J8572j0603j4342
401a6294J1431N843p637M613L75j0733Q720J5549j4321j5798J2125R848m563K004
415A162k047j2050R535J6976j4113j4599J5679R107j1823j339M805m981O183J0798
429A3293j1158q514J5073J899j6219K688J1865l881m78M757j0897k978K0977K818
$$ plain form
443 19245 -2646 -4402 8960 6429 3428 7199 995 242 16944 14954 -5172 -2441 12635 7588
457 7588 2180 7923 1596 -3317 11362 15166 290 2361 13820 5010 -2420 5817 4713 -1004
471 -1004 7772 8629 -3071 3901 14823 2734 -5308 7902 7383 -2959 1799 4046 -4928 1200
485 1200 12129 -27 -8562 3455 5422 -3203 68 903 -8191 -1753 9125 -2033 -9638 2396
499 2396 2849 -8525 -2824 3121 -6466 -6791 2003 -5082 -9595 1467 473 -10195 -3674 2441 -7722
514 -7722 -9077 79 -5260 -9361 329 -1745 -14469 -7243 3218 -5684 -8944 -857 -4502 -8878 170
529 170 -1045 -11825 -5177 2916 -6679 -7768 2014 -2999 -9101 37 1489 -9629 -3624 5026 -5014
544 -5014 -8335 2454 762 -5921 1154 1835 -7381 -1837 4843 -5930 -6909 5992 3730 -5143 1141
$$ packed form
443A9245k1891j756J3362k531l001L771o204p53J6702j990k0126K731J5076n047
457G588n408N743o327m913J4679L804j4876K071J1459q810p430Q237j104n717
471a004Q776Q57j1700O972J0922j2089q042J3210n19j0342M758K247q974O128
485A200J0929j2156q535J2017J967q625L271Q35r094O438J0878j1158p605J2034
499B396M53j1374N701N945r587l25Q794p085m513J1062r94j0668O521O115j0163
514g722j355R156n339m101R690k074j2724P226J0461q902l260Q087l645m376R048
529A70j215j0780O648Q093r595j089R782n013o102R138J452j1118O005Q650j0040
544e014l321J0789j692o683P075O81r216N544O680j0773r79J2901k262q873O284
$$ plain form
559 1141 2623 -5829 99 9310 -1297 -6131 5111 4282 -3104 2723 5793 -869 3271 8881 -2669
574 -2669 -5163 9312 8826 -1326 4623 9346 1813 3806 10238 2051 -570 11747 10003 -1000
588 -1000 4323 10304 3946 5808 11137 3070 543 12004 8941 -2420 5450 13245 4379 2807 8768
603 8768 3122 -627 8356 6645 -2392 4631 10506 821 -98 8196 3548 -968 5914 2454 -6906
618 -6906 1692 9210 -1582 -4814 4676 2762 -2803 2815 671 -7507 -568 4936 -5533 -6840 4038
633 4038 1540 -5000 573 -1219 -9222 -2199 4443 -6267 -8974 1001 -1861 -9174 -2077 1106 -5987
648 -5987 -3849 -1332 -10003 -8859 2668 -3090 -12203 -4389 485 -7901 -6543 -1692 -8344 -7643 2962
663 2962 -2167 -13180 -6076 314 -5456 -4584 228 -6699 -7059 2416 -1394 -9010 -955 3202 -6405
$$ packed form
559A141J482q452N928R211j0607m834J1242q29p386N827L070o662M140N610j1550
574b669k494J4475m86j0152N949M723p533J993O432q187k621J2317j744j1003
588a000N323N981o358J862N329q067k527J1461l063j1361P870P795q866j572N961
603H768n646l749Q983j711r037P023N875r685r19Q294m648m516O882l460r360
618f906Q598P518j0792l232R490j914n565N618k144q178O939N504j0469j307J0878
633D038k498o540N573j792q003P023O642j0710k707R975k862p313P097L183p093
648e987K138K517q671J144J1527n758r113P814M874q386J358M851o652P01J0605
663B962n129j1013P104O390n770Q72M812o927l60R475l810p616Q055M157r607
$$ plain form
678 -6405 -4947 3071 -2479 -5463 3285 2172 -3950 1746 4036 -5533 -3268 6175 1176 -3491 2942
693 2942 1785 -2876 4777 7085 -3871 -2249 7526 2852 -3079 3244 4126 -1452 4801 8811 -691
708 -691 -1584 5595 2038 5 8167 6186 -3513 2360 9226 2407 1491 7649 1882 -2465 6347 6880
724 6880 -1903 1772 9040 3750 2014 5989 -39 -3407 6600 7000 -2839 916 6608 -153 -821
739 -821 7420 2927 -3667 2686 4121 -4325 -1304 4781 -2227 -3035 5287 2265 -4529 -433 -273 -6314
755 -6314 -973 5140 -4666 -8413 1110 964 -4781 -785 -276 -7711 -3693 2204 -5330 -8929 -1167 -1229
771 -1229 -5942 -459 -812 -9014 -5709 2243 -3902 -7871 -1192 -2306 -8151 -2152 886 -7300 -6351 833
787 833 -2883 -6250 -1254 -3487 -8942 -1442 1714 -6250 -5193 1610 -3660 -7245 791 212 -6761 -2492
$$ packed form
678f405J458Q018n550k984Q748j113o122N696K290r569K265R443m999m667O433
693B942j157m661P653K308j0956J622R775m674n931O323Q82n578O253M010r502
708f91q93P179l557k033Q162j981r699N873O866o819r16O158n767m347Q812N33
724F880q783L675P268n290j736L975o028l368J0007M00r839L755N692o761o68
739h21Q241m493o594O353J435q446L021O085p008q08Q322l022o794M096J60o041
755f314N341O113r806l747R523j46n745L996N09p435M018N897p534l599P762o2
771a229m713N483l53q202L305P952o145l969O679j114n845N999L038q186R49P184
787H33l716l367M996k233n455P500L156p964J057O803n270l585Q036n79o973M269
$$ plain form
803 -2492 1168 -5142 -3901 2622 -2605 -6497 1762 3241 -3605 -1486 737 -4718 -934 6418 -638
818 -638 -6345 2917 5789 -1630 -255 3393 -930 1708 7456 515 -5148 3734 7482 658 3102
833 3102 6499 752 421 6202 1461 -1924 6926 8216 -1341 502 7297 3464 1692 5751 2480
848 2480 -911 5984 5059 -3246 910 9194 4470 -77 3835 1210 -1543 5701 5854 -3611 -793 6433
864 6433 1678 -2310 3183 2071 -2138 2609 2490 -4912 -1543 5122 -1093 -4363 2458 1306 -4902
879 -4902 -738 979 -4902 -2479 3190 -3422 -6515 1247 1016 -5691 -3024 -703 -5434 -3421 1141
894 1141 -5289 -7409 984 -115 -7471 -4144 63 -5476 -5586 -1718 -5414 -6720 694 -1314 -8316
909 -8316 -3505 1611 -5274 -6687 -1525 -4039 -5501 -59 -2763 -8768 -1990 4023 -3630 -6926 -613
$$ packed form
803b492L660o310J241O523n227l892Q259J479o846K119K223n455L784P352p056
818f38n707R262K872p419J375L648m323K638N748o941n663Q882L748o824K444
833C102L397n747l31N781m741l385Q850J290r557J843O795l833j772M059l271
848B480l391O895r25q305M156Q284m724m547L912k625k753P244J53r465K818P226
864F433m755l988N493j112m209M747j19p402L369O665o215l270O821j152o208
879d902M164J717n881K423N669o612l093P762k31o707K667K321m731K013M562
894A141o430k120Q393j099p356L327M207n539j10L868l696j306P414k008p002
909h316M811N116o885j413N162k514j462N442k704o005O778O013p653l296O313
$$ plain form
924 -613 -1093 -4110 -378 -2571 -6491 470 4745 -4055 -6094 2460 2026 -2549 -78 -345 -3684 1718
940 1718 4516 -4613 -4924 5321 5086 -1706 200 1589 -840 3141 4610 -3189 -2595 6824 4625 -2727
956 -2727 1486 5021 2005 3581 5552 -876 -784 6572 3655 -2583 3156 7335 2317 2177 5020 1041
972 1041 1297 7330 2979 -2836 3688 7240 115 -434 5017 3314 2245 5994 1738 -3947 2610 6660
988 6660 161 -420 4423 1604 -668 4136 1439 -2772 2731 4966 -2641 -2587 3871 405 -2700 2720
1004 2720 2394 -2748 -173 1306 -4602 -2420 4056 -478 -5526 -136 1290 -3151 -1147 -38 -5803
1019 -5803 -3396 3011 -1235 -6509 -1027 815 -4036 -1898 -91 -5053 -4427 976 -3129 -7118 -569
1034 -569 470 -5370 -2981 601 -4582 -5548 -1021 -3236 -5859 203 194 -6920 -4713 491 -2610 -3725
$$ packed form
924f13m80l017L732k193l920O961M275q800k039Q554m34m575K471k67l339N402
940A718K798r129l11J0245k35o792J906J389k429L981J469p799N94R419k199p352
956b727M213L535l016J576J971o428R2P356k917o238N739M179n018j40K843l979
972A041K56O033m351n815O524L552p125n49N451j703j069L749m256n685O557M050
988F660o499n81M843k819k272M804k697m211N503K235p607N4O458l466l105N420
1004B720l26n142K575J479n908K182O476m534n048N390J426m441K004J109n765
1019e803K407O407m246n274N482J842m851K138J807m962O26N403m105l989O549
1034e69J039n840K389L582n183r66M527k215k623O062rp114K207N204l101j115
$$ plain form
1050 -3725 -278 -3555 -6489 300 789 -6359 -4055 2641 -622 -2902 92 -2871 -5163 1678 3642
1065 3642 -3873 -3044 1851 -1105 -2281 2675 915 -2800 2622 3338 -3031 -1341 4093 726 -1572
1080 -1572 3570 2826 -1263 2143 3353 -1359 1681 6717 1046 -2778 2759 4081 827 3359 4067
1095 4067 -920 2063 7758 1650 -2830 3320 5100 1127 2799 3655 -1146 1866 7390 3049 -1145
1110 -1145 3631 3629 -870 2052 4564 156 903 6027 2092 -993 3785 3402 -2218 589 4595 306
1126 306 -813 2703 -73 -1337 4069 3216 -3378 -1418 3067 -909 -2180 1679 -1273 -3159 2669
1141 2669 2797 -4008 -2350 1692 -1599 -2835 1428 -1598 -5112 -529 840 -4004 -1658 1691 -3673
1156 -3673 -4856 947 -828 -5482 -2006 -118 -4069 -1994 962 -4871 -5148 1360 -118 -5315 -2736
$$ packed form
1050c725L447l277k934O789M89p148K304O696l263k280K994k963k292O841J964
1065C642p515Q29M895k956j176M956j760l715N422P16o369J690N434l367k298
1080a572N142p44m089L406J210m712L040N036n671l824N537J322l254K532P08
1095D067m987K983N695o108m480O150J780l973J672Q56m801L012N524m341m194
1110a145M776km499K922K512m408P47N124l935l085M778l83n620K807M006m289
1126C06j119L516k776j264N406q53o594J960M485l976j271L859k952j886N828
1141B669J28o805J658M042l291j236M263l026l514M583J369m844K346L349n364
1156c673j183N803j775m654L476J888l951K075K956n833k77O508j478n197K579
$$ plain form
1171 -2736 -773 -4043 -1555 838 -4413 -5336 1242 104 -5162 -2098 387 -3068 -2497 436 -2794
1186 -2794 -3379 1801 -690 -5638 -1029 2804 -1821 -2327 1176 -1184 -1831 2583 -150 -4207 726 4796
1202 4796 -851 -2753 1314 869 943 4081 1017 -3581 1659 5177 -294 -1432 3683 2442 -164 3024
1218 3024 1503 -1583 3306 5877 -194 -1299 4175 2558 -434 2755 3204 -218 3394 4730 -877
1233 -877 -558 5990 3272 -1665 1898 3013 -464 2163 3700 -699 134 5177 2182 -2262 1831 3229
1249 3229 -1079 352 2479 -1212 -553 4056 741 -3259 1507 3276 -1999 -1712 1746 -1068 -1779 1795
1265 1795 -741 -3370 1642 2402 -3537 -2702 1226 -1215 -3081 -31 -1242 -3543 788 779 -4979 -3473
1281 -3473 1916 -1468 -4758 -1525 -1443 -3625 -345 -455 -5573 -2874 2339 -2363 -5992 -2139 -746 -2968
$$ packed form
1171b736J963l270K488K393n251r23O578j138n266L064K485l455N71K933l230
1186b794n85N180k491m948M609L833m625n06L503k360o47M414k733m057M933M070
1202D796n647j902M067m45P4L138l064m598N240L518n471j138N115j241k606L188
1218C024j521l086M889K571o071j105N474j617k992L189M49l422L612J336n607
1233h77L19O548k718m937L563J115l477K627J537m399Q33N043k995m444M093J398
1249C229m308J431K127l691O59M609l315m000M766J769n275K87L458k814p11L574
1265A795k536k629N012P60n939Q35L928k441j866L050j211k301M331rn758J506
1281c473N389l384l290L233Q2k182L280j10n118K699N213m702l629L853J393k222
$$ plain form
1297 -2968 -854 -631 -4837 -2337 1843 -2310 -5850 -788 823 -3180 -1902 -779 -3697 -1464 2163
1312 2163 -1813 -4787 772 890 -3869 -2502 1112 -968 -580 1912 -1672 -3488 2053 2165 -3060 -1467
1328 -1467 2270 -535 -977 1629 -1195 -2277 3627 3501 -2478 -817 3028 472 -317 2683 715 -1281
1344 -1281 2986 3283 -1745 286 4353 988 -395 3588 1475 -1197 2272 3086 -649 1842 4859
1359 4859 439 -1599 2905 3136 345 2254 2072 -1211 1368 4938 418 -1362 3836 2971 -423 1328
1375 1328 1845 -1437 534 4197 604 -1748 2557 2349 -1266 1352 2493 -1403 -605 2327 -470 -1961
1391 -1961 2262 1034 -2906 229 2426 -1897 -2195 978 -1394 -2279 1436 462 -3936 -966 1576 -1754
1407 -1754 -2159 580 -2590 -3452 986 235 -4541 -1880 1414 -2059 -1926 620 -2514 -4386 64 253
$$ packed form
1297b968K114K23m206K500M180m153l540N062J611m003J278J123k918K233L627
1312B163l976k974N559J18m759J367L614k080L88K492l584j816N541J12n225J593
1328a467L737k805m42K606k824j082N904j26n979J661L845k556p89L000j968j996
1344a281M267K97n028K031M067l365j383L983k113k672L469Q14l735K491L017
1359D859m420k038M504K31k791J909j82l283K579L570m520j780N198q65l394J751
1375A328N17l282J971L663l593k352M305k08l615K618J141l896P98K932k797j491
1391a961M223j228l940L135K197m323k98L173k372q85L715r74m398K970K542l330
1407a754m05K739l170q62M438p51m776K661L294l473J33K546l134j872M450J89
$$ plain form
1423 253 -3990 -2101 142 -2736 -2769 787 -1492 -3849 -259 -134 -3366 -1733 687 -3072 -3207 942
1439 942 -492 -3076 -781 -384 -3376 -888 1865 -2589 -3372 647 -10 -2518 54 161 -2945 -92
1455 -92 2862 -1256 -2957 1204 746 -1594 1094 1605 -2158 -384 2731 -325 -1060 2947 1508 -1851
1471 -1851 1462 2836 -988 257 2863 367 -287 3480 1700 -1794 1086 3787 953 678 2850
1486 2850 206 -95 3791 2570 -1706 1445 3725 572 598 2986 423 -323 4115 2713 -1153 1103
1502 1103 3138 166 526 3544 1239 -851 2633 1821 -819 1433 3018 -787 -980 2777 1161 -1539
1518 -1539 1981 1337 -1403 1005 2338 -2260 -2172 1866 171 -2144 496 386 -2318 -310 1454 -2441
1534 -2441 -2455 792 -601 -3275 -121 104 -3215 -1631 328 -1976 -2276 739 -1800 -3808 -308 478
$$ packed form
1423B53m243J889K243k878l3L556k279k357L590J25l232J633K420l759j35M149
1439I42j434k584K295L97k992K488K753m454p83M019o57k508K572J07l106K853
1455i2K954m118j701M161m58k340K688N11l763J774L115l056p35M007j439l359
1471a851L313J374l824J245K606k496o54L767j780l494K880K701k834k75K172
1486B850k644l01L886j221m276L151K280l153K6K388k563p46M438j402l866K256
1502A103K035k972L60L018k305k090L484q12k640K252J585l805j93L757j616k700
1518a539L520o44k740K408J333m598Q8M038j695k315K640j10k704K008J764l895
1534b441j4L247j393k674L154K25l319J584J959k304l00L015k539k008L500P86
$$ plain form
1550 478 -3595 -2499 143 -1739 -1949 411 -1574 -4108 -28 860 -3434 -2490 144 -1845 -2752 245
1566 245 -1070 -3313 46 720 -3279 -2362 1058 -1271 -2525 512 -647 -2435 -278 474 -2569 -968
1582 -968 2110 -715 -2380 941 610 -1624 358 1261 -1862 -354 2627 -501 -1852 1788 1738 -871
1598 -871 919 2254 -935 213 2943 608 -604 2643 2492 -822 1202 3082 308 377 2906 1042
1614 1042 -645 2920 2474 -1120 1235 3410 751 304 2857 1161 -310 2399 2088 -633 1132 3612
1630 3612 366 -704 2792 1744 -341 1778 1495 -812 826 2438 -529 -1262 2508 1546 -1024 1226
1646 1226 1064 -1272 552 2254 -1303 -2041 1603 533 -1994 309 986 -1484 -616 1168 -1750 -2086
1662 -2086 1333 -551 -3296 -322 1165 -2027 -1728 28 -1391 -1771 637 -1168 -3900 -684 889
$$ packed form
1550D78m073J096K642j882k10K360j985k534M080Q88m294R44K634j989r07K997
1566B45j315k243L359O74l999R17L420k329j254L037j159j788K157P52l043J601
1582i68L078k825j665L321l31k234J982R03l123J508K981l128j351L640n0k609
1598h71J790J335l189J148K730k335j212L247j51l314K024J880k774O9K529j864
1614A042j687L565m46l594K355K175k659m47K553j696j471K709l11k721J765K480
1630C612l246j070L496j048k085K119k83k307J638J612k967p33L770r62k570K250
1646A226j62k336J824J702l557p38L644j070k527K303O77k470Q68J784k918l36
1662b086L419j884k745K974J487l192K99J756j419l80K408j805k732L216J573
$$ plain form
1677 889 -2619 -2280 126 -1796 -1964 449 -1425 -3760 -991 604 -2460 -2343 325 -1589 -2626 -83
1693 -83 -686 -2943 -479 235 -2900 -2070 1058 -745 -2706 -80 -189 -1690 -124 485 -2876 -1327 2042
1710 2042 -79 -2427 -111 291 -1189 563 1344 -1626 -869 2266 286 -1499 1194 1455 -595 629
1726 629 1757 -515 12 2354 1112 -735 1872 2318 -671 280 2316 665 453 2443 635 -897
1742 -897 2320 2824 -352 463 2738 1055 305 2455 576 -1072 2519 2915 -457 254 2475 322
1758 322 376 2638 1170 -912 1784 2082 -488 130 2116 64 -662 2060 1058 -1222 740 1415 -1101
1775 -1101 -39 2005 -935 -2058 1039 1063 -859 137 790 -1602 -512 1190 -910 -2355 536 103
1791 103 -1782 -291 721 -1971 -1241 675 -952 -2238 18 -631 -2734 -615 703 -1800 -2189 301
$$ packed form
1677H89l508L39K406j922j68K413j874k335K769J595l064J17K668j914j037K543
1693h3o03k257K464P14l135Q30L128j803j961K626j09j501J566O09l361J549L369
1710B042k121k348K316M02j480J752P81k970P57L135j980j785K693K61k050J224
1726F29J128k272N27K342j242j847K607M46k989R51K036j651k12J990j808j532
1742h97L217N04l176Q15K275j683p50K150j879j648L591L96l372P11K221k153
1758C22N4K262j468k082K696K98k570O18J986k052p26K722j002k280J962O75k516
1775a101J062K044k940j123L097K4j922R96O53k392J090J702k100j445K891m33
1791A03j885J491J012k692P30J916j627j286K256o49k103K119J318k503l89K490
$$ plain form
1807 301 -892 -1806 -48 -1148 -3349 -843 813 -1932 -2375 -132 -1049 -1965 224 -584 -3045 -1143
1823 -1143 647 -1863 -2221 156 -838 -2028 548 177 -2068 -901 754 -1425 -1619 1067 -172 -1765
1839 -1765 -276 674 -933 165 1033 -1501 -1167 1650 631 -1662 268 1301 -394 531 1713 -393
1855 -393 -717 1912 1088 -848 1101 1639 -243 711 2392 144 -74 1944 1440 -420 1219 2113 -239
1872 -239 677 2310 856 -226 1773 1142 -279 1409 2192 -199 368 2344 869 -216 1893 1160
1888 1160 -512 1547 1912 -197 125 1952 662 -476 1765 1149 -875 682 1715 -225 -233 1562
1904 1562 -134 -1168 997 900 -1438 301 1542 -852 -946 823 -339 -1758 506 494 -1275 -522 848
1921 848 -1274 -1113 664 -475 -2054 -740 -432 -1921 -534 570 -1953 -1804 220 -579 -2350 -873
$$ packed form
1807C01j193r14J758j100k201K506J656k745m43K243r17r16K189q08k461J902
1823a143J790k510l58K377r94j190K576l71k245J167J655k179j94K686j239j593
1839a765J489R50j607J098Q68k534L34K817j019k293J930J033j695R25J182k106
1855c93l24K629q24j936J949N38j882R54J681k248k18K018n04j860J639Q94k352
1872b39R16J633j454j082J999o31j421J688P83k391N67J976j475j085K109p33
1888A160j672K059L65k109L22J827j290j138K241o16k024J557J033j940qJ795
1904A562j696j034K165r7k338J739J241k394r4J769j162j419K264j2j769P53J370
1921H48k122J61J777j139j579J314L08j489J387J104k523J49K024p99j771J477
$$ plain form
1937 -873 -410 -2247 -1079 70 -1654 -1467 266 -774 -2527 -606 -53 -1895 -1402 -164 -1710 -1868
1953 -1868 117 -742 -2129 -305 598 -1754 -1418 -150 -1242 -1401 357 -598 -1824 350 851 -1435
1969 -1435 -816 1344 -288 -1194 386 -175 -1527 520 1230 -1091 -513 1592 206 -1132 623 625 -274
1986 -274 1157 1258 -809 -260 2298 917 -360 1261 1483 -263 907 1473 -412 471 2529 971
2002 971 -285 1423 1586 74 1022 1673 -87 355 2117 282 -508 1760 1892 85 559 1528 520
2019 520 384 1665 402 -435 1720 1607 -573 -186 1339 245 -231 1539 262 -1172 878 1186 -944
2036 -944 -86 1401 -48 -621 923 190 -1153 156 582 -1319 -266 1078 -537 -1500 378 -131 -1438
2053 -1438 -180 -9 -2054 -1032 681 -1187 -2141 -140 -12 -1364 -251 -387 -1855 -593 870 -1129
$$ packed form
1937h73M63j837J168J149j724J87J733j040j753J921N53j842M93J238j546j58
1953a868J985q59j387J824R03k352L36J268j092j59J758r55j226K174N01k286
1969a435O19K160j632r06J580n61j352K047P10k321N78K105j386j338J755Kq99
1986b74J431J01k067N49K558j381j277J621K22j746J170N66j885Q83K058j558
2002I71j256J708J63j512R48O51j760M42J762j835p90K268J32j807M74R69j008
2019E20j36J281j263q37K155j13k180L87J525j094m76J770j277j434K050L08k130
2036i44Q58J487j449n73J544p33j343J309M26j901J053J344j615r63J878n09j307
2053a438J258J71k045J022J713j868r54K001J28j352J113j36j468J262J463j999
$$ plain form
2069 -1129 -2231 -73 -407 -1904 -651 335 -1627 -1182 402 -885 -1530 239 -541 -1751 -579 734
2085 734 -1266 -942 75 -913 -1214 452 394 -1939 -649 1022 -405 -1030 517 -729 -595 732 453
2102 453 -1609 -161 1301 76 -271 967 -268 -840 933 937 -506 663 1588 -116 -564 1555 810
2119 810 -240 1198 1274 74 971 1387 -21 -125 2233 1448 -59 1165 1141 -174 988 1747 489
2136 489 52 1715 1418 -26 1024 1402 143 538 1648 421 233 1381 713 -165 1162 1349 -508
2153 -508 0 1481 417 90 1293 280 -873 715 1241 -432 -327 1111 573 -514 691 -98 -1009
2170 -1009 438 834 -937 -566 662 -171 -1126 388 181 -1172 -297 269 -1173 -659 432 -892 -1848
2187 -1848 205 150 -1406 -822 -343 -1418 -857 658 -699 -1733 26 47 -1245 -693 -116 -1266 -868
$$ packed form
2069a129j102K158l34j497J253R86j962M45J584j287o45J769p80j210J172J313
2085G34k000L24J017r88l01J666n8k333J290J671j427o25J547j246J34J327k79
2102D53k062J448J462j225l47J238j235n72J773Mj443J169R25j704m48K119p45
2119H10j050J438P6j200Q97M16j408j04K358p85j507J224k4j315J162P59j258
2136D89m37J663k97j444J050L78j259L95J110j227j88J148o68q78J327J87j857
2153e08N08J481j064l27J203j013j153J588N26j673J05J438n38j087J205p89r11
2170a009J447L96j771L71J228q33r55J514k07j353Q75N66j442N14J091j324r56
2187a848K053n5j556N84M79j075N61J515j357j034J759K1j292N52N77j150L98
$$ plain form
2204 -868 402 -581 -1800 289 -47 -1428 -658 321 -967 -1221 87 -628 -1243 291 423 -1551 -562
2221 -562 599 -841 -1346 226 -215 -942 347 293 -1570 -44 809 -313 -556 611 -91 -905 561
2238 561 456 -565 380 1104 -121 -343 1179 657 -523 307 1249 -141 265 1339 -24 52 1413 914
2256 914 -487 911 1314 312 306 1031 117 4 1408 951 -360 1109 1197 92 258 1420 407 43
2274 43 1269 1117 -220 648 1499 -227 36 1085 573 -255 640 652 -373 674 1291 -358 -313 1221
2292 1221 190 -469 396 384 -745 -260 1116 -1018 -585 943 159 -883 104 332 -1177 -218 362 -689
2310 -689 -640 234 -722 -1427 -333 45 -1404 -665 125 -861 -1219 252 -956 -1376 -271 -292 -1401 -871 383
2329 383 -946 -1146 -100 -496 -1016 -130 -100 -1352 -849 328 -915 -1498 45 -362 -1588 -274 297 -1072
$$ packed form
2204h68J270r83j219K089l36j381P70R79j288k54J308p15o15J534J32j974R89
2221e62J161j440n05J572m41p27J289n4j863J526Q53j122k43J167p02q14J466
2238E61j05j021R45P24j225k22J522n22j180Q30R42j390M06J074j363P6J361m99
2256I14j401J398M03j002oP25r14j13J404m57j311J469Q8j105J66J162j013l64
2274D3J226j52j337Q68Q51j726K63J049n12q28Q95J2j025J047O17j649M5J534
2292A221j031o59Q65j2j129M85J376k134M33J528p84j042R87K28j509R59N80j051
2310f89M9Q74r56p05J094L78j449P39P90r86l58J471j208m20J105k1j109N30J254
2329C83j329k00J046l96n20Q86L0j252N03J177j243n83J543m07j226J314N71j369
$$ plain form
2347 -1072 -843 575 -673 -1299 171 52 -866 -118 116 -706 -586 579 -350 -555 538 307 -708 88
2365 88 832 -50 -56 886 14 -224 823 489 -653 414 1037 9 193 1116 560 -212 1396 957 -353
2384 -353 592 1237 161 285 1022 601 248 1391 1121 -137 690 1426 245 81 1348 786 -313 1106
2402 1106 881 79 565 1459 227 188 1032 754 -348 686 703 64 468 1261 -209 -217 899 244 -226
2421 -226 502 818 -649 -117 790 -192 -200 1009 190 -610 227 618 -887 -451 571 -84 -770 719 -649
2440 -649 -1266 -39 435 -890 -854 35 -473 -878 458 -504 -1589 -260 391 -981 -936 224 -789 -1210
2458 -1210 -9 -120 -1341 -442 -367 -1078 -893 223 -790 -1539 -267 -114 -647 -627 -145 -1101 -922 279
2476 279 -317 -1182 -34 86 -697 -194 25 -833 -747 669 -71 -946 291 267 -446 -153 612 -219 -306 623
$$ packed form
2347a072K29J418j248o26J470j19r18P48K34q22J20J165r29k05J093k31j015P96
2365H8P44q82oR42q72k38J047l34j142J067O23j028J84R23n56p72J608m39j310
2384c53R45O45j076J24P37m21l53J143k70j258Q27P36j181j64J267n62j099J419
2402A106k25q02M86Q94j232l9Q44k78j102J034J7o39M04P93j470qJ116o55m70
2421b26P28L16j467N32R07r82qJ209q19q00Q37L91j505M36J022o55o86J489j368
2440f49o17J227M74j325L6Q89n08m05J336r62j085J329O51j372M5J160j013m21
2458a210J201j11j221Q99P5p11J85J116j013p49J272J53n33K0M82r56J79J201
2476B79n96q65J148J20p83N03K19q58Q6J416p40q75J237k4p13K93P65q31q7R29
$$ plain form
2496 623 -72 -710 503 580 -705 386 1005 223 -332 758 166 -100 916 799 -553 284 1102 394
2514 394 -194 859 716 164 1210 824 -208 382 1373 345 7 673 534 -282 704 833 -223 434
2532 434 1205 -134 -173 1113 732 -19 371 865 -17 593 1392 -176 -210 1061 659 -188 188 403 -105
2551 -105 549 680 -143 -452 963 429 -805 358 659 -590 -175 666 -205 -409 267 -162 -1050 -137 316
2570 316 -734 -633 135 -522 -655 437 -97 -913 -353 290 -871 -822 141 -125 -902 -108 -408 -1108 -368
2589 -368 497 -866 -1059 -97 -196 -863 -44 -19 -1040 -387 -2 -1120 -1130 236 -265 -1026 -6 -59 -897 -125
2609 -125 342 -708 -588 606 -262 -915 -110 202 -386 -287 654 -301 -438 377 134 -722 250 541 -427 16
2629 16 824 -13 -460 838 327 -317 121 799 -77 110 951 92 57 706 500 -235 671 1238 -61 388
$$ packed form
2496F23o95o38J213P7j285J091O19p82n55J090n92k66J016j17j352Q37Q18p08
2514C94n88J053j43n52J046l86j032N90R91j028l38O66j39q16R86J29j056O57
2532D34P71j339l9J286l81p51L90M94q82O10P99j568l4J271m02q47L76K15n08
2551a05O54J31q23l09J415n34j234J163L01j249M15Q41q71k04O76m29q88R13M53
2570C16j050J01P68o57j33J092n34q16N60O43j161M9R63k66p77P94l00p00P40
2589c68Q65j363j93R62r9o67Q19K5j021O53L85j118j0J366n01p61J020n3q38P72
2609a25M67j050J20J194q68o53Q05L12n88R9R41r55j37Q15k43q56R72K91r68M43
2629A6Q08q37m47J298n11o44M38O78q76J87Q41q59l5O49k06p35R06N67j299M49
$$ plain form
2649 388 1135 461 -6 1044 878 -276 603 1002 -5 124 1064 750 -49 919 343 86 734 917 182
2668 182 407 982 103 -163 660 651 -293 601 957 -365 77 1048 207 -326 850 484 -350 289 687 -74
2688 -74 -489 523 -54 -466 390 180 -555 -46 400 -751 -544 198 -302 -543 -20 283 -924 -818 213
2707 213 -615 -747 144 -494 -1257 173 -31 -1089 -642 -50 -644 -818 -80 -579 -881 -583 140 -971 -250
2726 -250 72 -589 -970 299 -281 -1285 -450 -76 -650 -531 -19 -450 -692 -49 -168 -904 80 146 -736 -339
2746 -339 463 -324 -703 255 29 -287 226 154 -614 -616 738 95 -378 350 366 -535 398 565 -264 191 599
2767 599 265 -350 597 628 -162 434 988 -147 -9 925 109 -347 768 1101 -395 287 918 237 -91
2786 -91 871 418 -76 502 811 -224 469 1062 222 221 897 525 -86 451 384 -318 -10 635 4 -244 1013
$$ packed form
2649C88P47o74m67J050j66j154Q79L99j007J29R40l14p99R68n76k57O48J83p35
2668A82K25N75q79k66Q23rr44Q94L56j322M42R71q41n33J176l66q34O39L98p61
2688g4m15J012n77m12Q56k10p35N09M46j151K07P42n00k41N23L03j207J06J031
2707B13q28j32Q91o38p63J430k04j058M47N92n94j74P38m99l02K98P23j111P21
2726b50L22o61l81J269n80j004Q35L74n74J19N12m31k42O43j19p36R84O6q82L97
2746c39Q02p87l79R58k26l16N13p2p68kJ354o43m73P28J6r01R33J67q29M55M08
2767E99l34o15R47L1p90N96N54j135J38R34q16m56J115L33j496O82O31o81l28
2786i1R62m53m94N78L09j035O93N93q40jO76l72o11N37o7p02L08O45o31k48J257
$$ plain form
2807 1013 188 -214 613 308 -333 97 568 -151 -604 715 286 -453 109 129 -713 272 771 -281 -778
2826 -778 72 62 -652 -11 211 -512 -220 396 -615 -1069 107 -365 -842 -4 168 -868 -754 482 -628
2845 -628 -1129 106 -15 -1089 -402 141 -694 -690 35 -720 -652 110 -71 -898 -351 367 -573 -711 136 -122
2865 -122 -748 77 -385 -1052 -13 444 -202 -856 473 -310 -810 164 300 -674 166 260 -644 -160 688 119
2885 119 -757 29 332 -170 364 674 -366 -218 815 489 -454 169 707 -191 -38 961 -156 181 915
2904 915 153 -506 752 495 -74 322 840 -100 21 369 555 87 666 773 -139 -5 1138 282 134
2923 134 851 192 -490 691 729 -205 -59 811 409 -71 901 277 -9 383 777 -254 -273 513 25 -276
2943 -276 756 402 -199 296 317 -377 -424 633 -111 -201 12 70 -338 -266 195 -212 -317 450 -273 -416 58
$$ packed form
2807A013q25m02Q27l05o41M30M71p19m53J319m29p39N62K0q42R85M99j052m97
2826g78Q50j0p14O41K22p23K92O16j011m54J176m72m77Q38J72j036J14J236j110
2845f28n01J235j21j074O87N43q35MP25p55O8P62j81q27N47P18r40j38Q47k58
2865a22o26Q25m62o67J039M57o46o54J329p83n00R74J36r74Q40R4r04M84Q48n69
2885A19q76P86L03n02N34L10j040J48J033l26r43O23N38q98J53R99j117L37P34
2904I15p62o59J258k57n69L96N18r40J21L48J86m68N79J07r12J34J143q56j48
2923A34P17o59o82J181L8r34J46Q70m02m80R72o24k86L92L94j031j9P86m88l01
2943b76J032l54o01M95K1o94m7J057p44r0K13N8m08P2M61m07j05P67p23j43M74
$$ plain form
2964 58 169 -724 -591 400 -594 -435 267 -258 -600 -11 200 -985 -171 230 -431 -807 46 -238 -846 106
2984 106 -160 -1056 -438 -22 -167 -682 275 -482 -1123 -58 -114 -832 -713 130 -466 -543 228 -101 -652 203
3004 203 76 -757 -334 406 -302 -184 181 192 -621 91 289 -304 -7 440 -68 -448 680 253 -286 110
3024 110 438 -471 28 694 239 -412 352 224 -193 378 744 -304 9 1012 135 -145 476 755 -221
3043 -221 761 547 -215 129 643 -147 59 755 328 -282 535 823 94 229 730 479 -192 488 180 -16
3063 -16 651 822 -52 -544 706 206 -213 434 839 -313 122 439 -476 -228 376 31 -304 456 205 -352
3083 -352 -186 424 -570 -221 191 -73 -652 236 55 -836 -439 33 -396 -507 236 -95 -683 -92 -83 -420 -358
3104 -358 246 -702 -779 283 -327 -681 -95 -29 -617 -250 -11 -231 -480 -23 -3 -785 -182 21 -743 -439 237
$$ packed form
2964E8J11q93J33R91r94J59P02n25l42N89K11j185Q14M01o61l76Q53k84o08R52
2984A06k66q96O18M16j45n15R57p57o41J065n6p18J19Q43n96p7P71l29n51Q55
3004B03j27q33M23P40p08J18L65J1q13P12J98n93K97M47n08l80J128m27n39L96
3024A10L28r09M99O66m55o51P64j28m17N71L66j048L13J003q77k80O21K79r76
3043b21R82k14p62L44N14p90K06O96m27o10Q17K88p29J35N01k51o71O80l08j96
3063a6O67J71q74m92J250n00m19O47M05j152M35L17r15K48O04l45l35P60k51n57
3083c52J66O10r94L49M12k64n79Q88j81q91L97M72m29j11P43l31n88N91Rl37O2
3104c58O04r48p7J062o10l54N86O6n88L67K39k20k49M57K0p82O03K03p64L04O76
$$ plain form
3125 237 -167 -384 427 -173 -672 77 364 -527 -517 367 -265 -517 552 -51 -584 -137 345 -271 -164 560
3145 560 -213 -463 233 413 -470 403 249 -149 -100 523 179 -270 724 620 -217 322 793 -13 224 577
3165 577 111 -176 557 634 114 185 751 74 167 593 468 -350 271 606 -424 402 524 -249 -189 479 117
3186 117 43 476 786 -317 236 699 -50 65 520 380 -348 423 687 -55 40 507 138 -196 388 6
3206 6 -628 370 474 -171 -37 307 -477 -256 358 97 -377 -117 343 -585 -289 297 -337 -776 47 7 -736
3227 -736 -182 75 -718 -386 105 -457 -606 17 -83 -1119 -44 -24 -597 -497 210 -271 -691 170 -23 -588
3247 -588 -400 -295 -773 -265 190 -124 -547 32 52 -679 -363 360 -515 -490 246 -59 -594 322 -3 -686 -332
3268 -332 49 -164 -598 443 -14 -261 227 232 -512 73 413 -336 -308 170 113 -82 537 444 -528 167 962
$$ packed form
3125B37m04k17Q11o00m99P49K87q91J0Q84o32k52J069o03n33M47M82o16J07P24
3145E60p73k50O96J80q83Q73j54l98M9O23l44m49R94j04q37N39M71q06K37L53
3165E77m66k87P33P7n20P1N66o77R3M26j25q18O21L35j030Q26J22p73O0O68l62
3186A17p4M33L10j103N53M63p49J15M55j40p28P71K64p42R5M67l69l34N84l82
3206Fo34R98J04o45J34L44p84K21O14k61m74K60M60r28K96N86o34m39Q23m0p43
3227g36N54K57p93L32M91n62j49O23j00j036J075K0n73J00P07m81m20Q61j93n65
3247e88J88J05m78N08M55l14m23N79K0p31L16P23q75K5P36l05n35R16l25o83L54
3268c32L81k13m34J041m57k47M88Np44N85L40p49K8M78n7j95O19r3r72O95P95
$$ plain form
3289 962 -49 -43 548 211 -272 445 611 -100 308 487 41 -291 414 472 58 239 491 30 246 801 37
3310 37 -96 399 458 -170 300 806 39 116 672 206 74 707 161 -266 362 657 -238 -130 417 -61 -345
3331 -345 368 386 -408 246 480 -343 -208 383 81 -110 284 -260 -522 315 14 -573 -383 159 -176 -402
3351 -402 22 274 -377 -137 237 -492 -514 22 -122 -724 124 -93 -542 -406 -66 -776 -333 -112 -165 -494 -147
3372 -147 22 -640 -376 72 -528 -446 10 -241 -600 -69 77 -385 -330 -14 -544 -459 356 -245 -442 -63 294
3393 294 -438 -277 565 -273 -162 392 -131 -432 289 296 -505 -55 238 -185 -293 131 357 -265 175 311 11
3414 11 200 555 -6 -108 243 144 -273 337 621 32 132 602 99 9 211 476 -177 329 707 87 185
3435 185 582 127 -407 367 218 85 19 250 106 133 602 205 -320 295 383 -145 102 249 37 -195 629
$$ packed form
3289I62j011ON91l37m83P17J66p11M08J79m46l32P05N8m14J81K52m61K16N55p64
3310C7j33M95N9o28M70N06p67P7N56m66j32O33n46m27O28K95q95J08N47m78k84
3331c45P13J8p94O54K34q23J35N91l02j91L94n44k62Q37l01n87J90N42l35k26
3351d02M24K52o51K40L74p29k2N36j44o02Q48k17m49J36L40p10M43K21n3l29L47
3372a47J69o62K64M48o00Q2M56k51l59N31J46m62N5L16n30Q5Q15o01j97L79L57
3393B94p32J61Q42q38J11N54n23l01P21Pq01M50K93m23j08M24K26o22M40J36l00
3414A1J89L55n61j02L51r9m17O10K84n89J00M70n03r0K02K65o53N06L78o20R8
3435A85L97m55n34P74j49j33o6K31j44K7M69l97n25O15Q8n28K47J47k12k32Q24
$$ plain form
3456 629 388 -136 212 497 -364 58 455 -114 -245 265 295 -226 290 193 -396 -75 570 -290 -331 240 199
3477 199 -404 333 -67 -311 -461 -336 -339 -232 -31 128 -540 -441 181 -433 -212 244 -552 -731 -89 157 -343
3498 -343 -18 270 -442 -270 70 -544 -529 58 -223 -515 -43 -165 -403 22 230 -217 -545 -125 -258 -797
3518 -797 -123 59 -440 -371 168 -320 -527 65 -102 -450 53 243 -280 -177 418 -137 -252 214 376 -307
3538 -307 -9 99 -236 -73 209 125 40 179 500 125 -1 421 92 -72 502 263 -199 445 450 47 148
3559 148 278 199 -8 166 252 174 446 364 238 424 583 -288 42 544 377 242 231 436 -87 139 857 233
3581 233 -35 588 104 -132 128 479 -36 345 508 85 -67 336 2 -325 -162 222 -72 -83 126 -408
3601 -408 -123 478 -203 -492 122 241 -378 -160 141 -141 -113 74 1 -326 62 147 -320 -457 34 -219 -506
$$ packed form
3456F29k41n24L48K85q61M22L97n69j31N10L0n21N16r7n89L21O45q60m1N71m1
3477A99o03P37m00k44j50J25lJ07K01J59o68R9O22o14K21M56p96j79O42K46n00
3498c43L25K88p12J72L40o14J5N87k81k92M72j22k38M25K08m47l28M20j33n39
3518g97O74J82m99O9N39m88k07N92j67l48N03J90n23J03N95n55j15M66J62o83
3538c07K98J08l35J63K82q4q5J39L21l75j26M22l29j64N74k39m62O44Nm03J01
3559A48J30p9k07J74Q6p8K72q2j26J86J59q71L30N02j67j35j1K05n23K26P18o24
3581B33k68O23m84k36K60L51n15L81J63m23j52M03l34l27J63L84k94j1K09n34
3601d08K85O01o81k89O14J19o19K18L01k82K8J87p3l27L88Q5m67j37M91k53k87
$$ plain form
3622 -506 77 -122 -663 -313 -80 -346 -364 -236 -19 -209 -465 -18 -329 -107 -205 -385 -376 276 -82 -439 -32
3643 -32 -125 -469 69 140 -114 -406 87 59 -378 7 42 -155 -36 336 -157 -334 327 102 -112 -13 169 18
3665 18 -75 457 -339 -20 -13 8 -153 218 327 -310 429 417 -312 -194 424 75 -158 354 403 24 -69 601 199
3688 199 -9 857 182 283 530 151 41 262 491 263 157 839 360 -238 573 466 -120 106 601 77
3708 77 -70 405 501 101 233 322 168 -153 518 -331 -328 380 374 40 -149 354 43 -149 296 46 -150 346
3730 346 -70 -116 -81 59 -273 -146 116 -270 -181 5 -22 -474 -103 104 -103 -362 94 -117 -321 152 155 -492
3752 -492 -296 391 -401 -346 -175 -117 -681 33 -124 -211 -119 224 -354 -407 12 187 -264 -114 -123 -458 -401 64 -175
3775 -175 -207 272 -358 -582 -52 249 -176 -177 -63 -262 -389 281 205 -117 57 176 41 99 240 -247 -111 270
$$ packed form
3622e06N83j99n41L50K33k66j8J28K17j90k56M47l11K22r8j80RO52l58l57M07
3643c2r3l44N38P1k54k92M93k8m37L85L5j97J19L72m93j77O61k25k14R9J82j51
3665A8r3N32p96L19PK1j61L71J09o37P39j2p29J18O18l49k33N12M9l79r3O70m02
3688A99k08Q66o75J01K47l79j10K21K29k28j06O82m79n98Q11j07n86K26M95n24
3708G7j47M75R6m00J32Q9j54l21O71q49LP08ol34j89N03l11j92M45k50j96M96
3730C46m16m6L5J40l32J27K62l86Q9J86k7m52L71K07k07k59M56k11k04M73Lo47
3752d92J96O87p92N5J71N8n64P14j57q7R2L43n78n3M19J75m51J50rl35N7M65k39
3775a75l2M79o30k24N30L01m25jJ14j99j27O70p6l22J74J19j35N8J41m87J36L81
$$ plain form
3797 270 388 -309 56 281 -64 -134 154 -78 192 -7 214 -256 149 254 -61 -212 155 391 260 300 -108
3818 -108 -305 291 421 160 107 410 372 -182 224 454 -34 192 464 -186 -54 653 -12 38 399 217 -41
3839 -41 365 222 -16 -28 327 324 -130 134 268 -201 133 205 -148 -51 295 73 -305 -166 141 -563 -82 73
3861 73 -33 130 92 39 -31 132 102 -122 -213 6 -176 -338 246 -147 18 114 60 -204 -142 172 -162 -310 -36
3884 -36 84 -377 60 -65 -187 -368 -1 51 -343 -135 151 -767 -242 -72 -557 -422 285 -238 -566 -218 -263
3905 -263 -282 -2 303 -194 -348 324 -289 -320 293 8 -324 336 356 -234 -56 127 31 -575 182 109 -294 -89
3927 -89 251 -194 -53 327 -198 -332 -17 216 -121 -64 173 -41 -42 448 119 68 680 95 12 -162 421 2
3949 2 -32 340 172 21 476 263 79 -49 354 -224 -216 402 0 -108 286 101 -133 113 570 319 -203 -37
$$ packed form
3797B70J18o97L65K25l45p0K88k32K70j99K21m70M05J05l15j51L67K36j31M0m08
3818a08j97N96J30k61n3L03l8n54M06K30m88K26K72o50J32P07o65N0L61j82k58
3839d1M06j43k38j2L55lm54K64J34m69L34P2l53R7L46k22l78J39L07p04M81J55
3861G3j06J63l8n3p0J63l0k24r1K19j82j62N84l93J65R6n4k64O2L14l34j48K74
3884c6J20m61M37j25j22j81L67N2l94K08K86r18N25J70m85J35P07n23l28L48m5
3905b63j9K80L05m97j54O72o13l1O13k85l32O60K0n90J78J83r6o06P57p3m03K05
3927h9L40m45J41L80n25j34L15K33l37N7K37k14jM90l29n1O12n85q3j74N83m19
3949Bl4L72j68j51M55k13j84j28M03n78QO18m02j08L94j85k34K46M57k51n22J66
$$ plain form
3971 -37 25 -382 35 265 -274 263 353 142 223 229 250 -733 187 471 -297 -145 373 -95 -148 -16 -196 -530 293
3994 293 123 47 -26 274 -59 -167 181 -112 -459 -179 -10 -277 -65 170 -229 -78 128 274 -182 -91 202
4015 202 -137 -354 53 -467 -350 129 99 -269 -128 42 -109 -308 41 -410 -464 -165 -95 -357 19 196 -333
4036 -333 -130 213 -168 -392 -16 -81 -372 -85 378 87 -198 70 -73 -295 80 55 -15 39 445 -392 67
4057 67 365 -250 -411 447 487 -107 -81 136 -32 -181 137 186 -129 236 485 -132 101 592 95 -100 371
4078 371 200 -377 56 444 28 488 348 41 -61 233 407 42 613 -55 57 206 366 36 68 282
4098 282 362 -164 160 21 -217 50 87 201 -206 238 -78 -146 354 221 -229 314 -29 55 -301 -62 139
4119 139 -35 -26 247 -281 -59 179 -272 -396 378 196 -382 -31 71 -217 -279 427 -137 -151 -58 -122 -444 -227
$$ packed form
3971c7O2m07M17K30n39N37R0k11Q1OK1r83R20K84p68J52N18m68n3J32j80l34Q23
3994B93j70p6p3L00l33j08L48k93l47K80J69k67K12K35l99J51K06J46m56R1K93
4015B02l39k17M07n20J17M79l0l68J41J70j51j99L49m51n4K99P0k62L76J77n29
4036c33K03L43l81k24L76o5k91K87M63k91k85K68j43k22L75k5p0N4M06q37M59
4057F7K98o15j61Q58M0n94K6K17j68j49L18M9l15L65K49o17K33M91m97j95M71
4078C71j71n77M33L88m16M60j40l07j02K94J74l65N71o68J12J49J60l30L2K14
4098B82Q0n26L24j39k38K67L7J14m07M44l16o8N00j33m50N43l43Q4l56K39K01
4119A39j74RK73n28K22K38m51j24P74j82n78L51J02k88o2P06n64j4R3o4l22K17
$$ plain form
4141 -227 -64 -68 -451 113 -31 -226 -26 114 -342 -475 33 -46 -91 165 -57 -363 -148 -293 -258 -183 -265 -126
4163 -126 -222 103 -189 -358 38 166 -519 -220 211 -18 -159 58 137 -117 99 226 -352 -141 63 -153 30
4184 30 -48 234 -156 84 186 -224 6 383 -217 -2 92 439 155 78 175 46 -72 437 -38 15 150 484
4206 484 -155 36 448 22 92 396 311 66 278 438 -385 231 464 -37 -96 233 154 -92 88 -101 -172 250
4228 250 208 110 63 140 116 -213 179 99 -177 267 222 197 -131 124 -45 33 116 -37 -95 -61 151 23 -378 248
4252 248 -104 -227 57 88 -454 -74 201 -251 -208 189 -76 -205 -107 3 -22 -179 126 -232 -369 -107 -63 -306
4274 -306 -316 -46 -61 -298 -95 -83 -181 -122 -65 -84 -551 116 -63 -227 -163 -226 -526 21 -97 -132 -49 42 -312 -84
4298 -84 130 64 -284 -31 -312 -124 -75 -190 64 -46 371 107 -112 -82 252 -297 317 344 -80 -167 388 87
$$ packed form
4141b27J63ml83N64j44j95K00J40m56j33N08p9m5K56k22l06K15j45L5P5q2J39
4163a26r6L25k92j69L96J28o85K99M31k29j41K17P9k54K16J27n78K11K04k16J83
4184C0p8K82l90K40J02m10K30L77o00K15R4L47k84p7R7j29j18N09m75N3J35L34
4206D84o39J91M12m26P0L04q5k45K12J60q23O16K33n01n9L29p9k46J80j89p1M22
4228B50m2r8m7P7k4l29L92q0k76M44m5k5l28K55j69P8Q3j53n8L4K12j28m01O26
4252B48l52j23K84L1n42L80K75m52M3L97k65j29R8J10k5j57L05l58j37K62M4k43
4274c06j0K70j5k37K03J2r8N9N7j9m67O67j79j64O4o3l00N47j18l5Q3R1l54K28
4298h4K14o6l48K53k81J88M9j15K54j10M17k64k19L0L34n49O14K7m24q7N55l01
$$ plain form
4320 87 -131 121 253 -193 162 495 -108 295 -10 -10 153 516 371 -198 185 303 -126 -135 447 246 -232 262
4342 262 -6 38 83 478 136 276 233 366 -42 189 510 -262 12 303 106 -83 228 191 -75 219 318 -119
4364 -119 -90 276 -190 132 374 78 -96 320 351 -364 -367 182 237 -299 167 -225 -199 -17 281 -61 11 109 -364
4387 -364 -174 124 61 -314 -38 183 -437 -289 151 -253 -399 -153 -136 -231 -268 20 -265 -164 69 -393 -494
4408 -494 -43 -320 -77 -10 107 -360 -277 -38 86 -415 46 268 -222 -351 242 -173 -383 243 -50 -402 156
4429 156 -48 -92 -43 394 38 -132 291 61 31 274 122 -274 -175 167 -323 -111 173 152 -322 256 139 -184
4451 -184 -155 118 -37 124 -33 336 -97 98 115 -175 115 288 -219 91 63 -262 192 138 182 -217 43 278
4473 278 259 -73 161 314 49 105 262 7 -6 487 334 -56 439 204 -144 314 119 56 160 118 -47 -173
$$ packed form
4320H7k18K52J32m46L55L33o03M03l05%J63L63j45n69L83J18m29rN82k01m78M94
4342B62k68M4M5L95l42J40m3J33m08K31L21p72K74K91j97j89L11l7k66K94R9m37
4364a19K9L66m66L22K42k96j74M16L1p15lN49N5n36M66l92K6J82K98l42P2R8m73
4387c64J90K98o3l75K76K21o20J48M40m04j46K46J7r5l7K88k85J01K33m62j01
4408d94M51k77K43O7J17m67Q3K39J24n01M61K22m90j29N93m15k10O26k93l52N58
4429A56k04m4M9M37l56j70M23k30l0K43j52l96R9L42m90K12K84k1m74N78j17l23
4451a84K9K73j55J61j57L69m33J95J7k90K90J73n07L10k8l25M54n4M4l99K60K35
4473B78j9l32K34J53k65N6J57k55j3M93j53l90M95k35l48M58j95o3J04m2j65j26
$$ plain form
4495 -173 699 259 -112 -143 -74 -250 11 -195 -40 -304 -134 57 -105 27 298 -161 -312 264 -424 -227 281
4516 281 382 -6 -339 68 -485 -258 99 -105 -490 127 -76 -200 -8 479 -308 -445 148 -256 -203 -86
4536 -86 -154 -532 -134 103 -258 -263 136 -268 -669 -107 134 -336 -77 -209 -468 -404 241 55 -369 59 -161 -104
4558 -104 -118 114 -223 -234 121 38 -331 -99 177 -169 -347 60 -72 -407 218 -101 -389 106 82 -325 -114
4579 -114 -56 -15 133 234 -178 -188 -184 446 -159 -310 488 -54 -99 225 56 -226 378 -53 114 102 73 203 -56
4602 -56 231 87 -89 299 636 338 -61 151 276 -56 256 -112 79 212 160 -57 -31 399 330 -353 87
4623 87 35 -160 212 251 40 -307 174 43 38 196 140 -105 -33 116 -157 26 332 206 -248 26 130 -428
4645 -428 91 329 -193 -255 22 -8 -154 8 -85 -109 9 105 -8 -32 249 14 -174 41 120 15 66 253 -326
$$ packed form
4495a73Q72m40l71l1O9j76K61k06J55k64J70J91j62J32K71m59j51N76o88J97N08
4516B81J01l88l33M07n53K27L57k04l85O17k03j24J92M87p87j37N93m04N3J17
4536h6o8l78L98K37l61nL99m04m01N62K41m70K59j32k59O4O45j86m24M28k20N7
4558a04j4K32l37j1L55q3l69K32K76l46j78M07j32l35O25l19k88M95k4m07K11
4579a14N8M1J48J01m12j0MO30o05j51P98n42m5L24j69k82O04m31J67j2k9J30k59
4602e6K87j44j76L88L37k98l99K12J25l32L12l68J91J33n2k17K6M30o9o83M40
4623H7n2j95L72L9k11l47M81j31nJ58n6k45P2J49k73J83L06j26m54K74J04n58
4645d28N19K38n22o2K77l0j46J62r3k4J18R6j13k4K81k35j88K15P9j05N1J87n79
$$ plain form
4668 -326 -195 23 -293 -232 -2 -112 -231 -281 122 -125 -309 88 -25 -188 -368 201 10 -8 161 8 -248
4689 -248 13 -63 -245 34 15 -259 -202 153 39 -148 185 165 -345 146 51 37 -126 177 149 -217 266 166
4711 166 -287 14 69 175 -280 212 55 -124 216 359 -346 -144 315 -320 185 -86 42 -288 183 272 -54
4732 -54 117 123 117 158 588 418 -207 -20 116 -71 -66 156 406 65 348 386 16 139 232 -158 133 172 30 9
4756 9 -23 144 95 -60 -15 -147 5 113 -74 -232 156 -33 -99 -441 63 32 -124 57 -238 -42 142 -322
4778 -322 -165 209 92 64 -201 -24 -163 -266 -55 10 -346 135 -116 -96 -12 -120 -445 -89 220 -116 -133 -417
4800 -417 250 -229 78 88 -128 -397 -299 298 -150 -186 233 -218 -212 -41 206 24 66 272 -53 -54 -107 -201 -236 -45
4824 -45 71 67 185 107 -95 -114 122 -205 -142 347 353 -56 146 165 68 17 144 -204 88 292 -17 118 185 138
$$ packed form
4668c26J31K18l16O1K30j10j19n0M03k47j84L97j13j63j80N69j91j8J69j53k56
4689b48K61p6j82K79j9k74N7L55j14j87L33k0n10M91r5j4j63L03k8l66M83j00
4711A66m53L01N5J06m55M92j57j79L40J43p05K02M59o35N05k71J28l30M71Q9l26
4732e4J71OoM1M30j70o25J87J36j87NK22K50l41K83L8l70J23R3l90K91L9j42k1
4756Il2J67m9j55M5j32J52J08j87j58L88j89o6l42N04l1j56J81k95J96J84m64
4778c22J57L74j17k8k65J77j39j03K11O5l56M81k51K0Q4j08l25L56L09l36j7k84
4800d17O67m79L07J0k16k69R8N97m48l6M19m51OJ71K47j82M2K06l25jn3r4l5J91
4824d5J16mJ18p8k02j9K36l27O3M89Om09K02J9r7n1J27l48K92K04l09J35O7m7
$$ plain form
4848 138 -63 -46 72 -60 14 117 5 -35 190 498 181 99 465 -137 136 239 27 43 278 377 5 23
4870 23 450 206 -164 335 249 79 64 438 -39 -108 11 232 -13 -84 159 68 225 341 -253 -178 161 104 93
4893 93 -27 215 -43 -306 341 -161 -248 460 -118 -247 -103 -54 -210 -461 87 -252 -271 -185 37 -269 112 -184
4915 -184 -109 -333 -137 -84 -247 -8 -362 -157 -240 29 -161 176 -146 -25 -377 -258 -176 -129 220 -7 -422 -164
4937 -164 218 15 -138 70 169 -68 3 84 310 -174 67 110 -256 66 13 -20 -142 39 117 123 94 -69 8 111
4961 111 224 -97 5 136 61 105 217 -248 -279 199 224 -96 -19 48 -21 64 -80 162 -23 -66 264 -176 97
4984 97 114 -59 45 302 337 255 85 -83 16 77 461 170 38 439 72 24 87 -145 -178 38 44 227 235 293 325
5009 325 -89 128 243 177 322 232 31 -113 68 -175 -338 197 144 -24 -36 364 145 -137 149 -227 -18
$$ packed form
4848A38k01J7J18j32P4J03j12m0K25L08l17q2L66o02K73J03k12J6K35R9l72J8
4870B3M27k44l70M99q6j70j5L74m77o9J19K21k45p1K43r1J57J16n94P5L39n7j1
4893I3j20K42k58k63O47n02q7P08n78j29J44M9j56k51N48l39j9Q6K22l06L81k96
4915a84P5k24J96N3j63K39l54K05q3K69j90L37l22J21l52J19Q2M7L49k27m15K58
4937a64L82k03j53K08R9k37P1Q1K26m84K41M3l66L22n3l3j22J81P8Ok9j63P7J03
4961A11J13l21J02J31p5M4J12m65l1M78K5l20P7O7o9Q5j44K42j85m3L30m40K73
4984I7J7j73J04K57L5q2j70j68R9O1L84k91j32M01l67m8O3k32l3K16OJ83QN8L2
5009C25m14K17J15o6J45r0k01j44J81k43j63N35n3j68j2M00k19k82K86l76K09
$$ plain form
5030 -18 31 -59 -37 34 180 -104 -195 134 -66 -277 -24 249 -364 -107 19 -20 -297 -162 87 -139 79 -307
5052 -307 -19 -123 35 -98 -82 -104 -53 -58 198 88 -222 -29 -53 66 -500 -345 -101 1 -363 -21 -40 -100 277
5075 277 62 -481 76 29 -293 146 -102 -58 123 126 -131 -322 360 -62 -229 153 -128 -246 -91 85 -143
5096 -143 -163 241 40 -34 182 107 119 136 246 2 -24 -198 288 165 -89 48 133 109 -232 196 -46 170 -113
5119 -113 61 17 442 -30 126 101 345 4 343 223 -48 133 360 -73 -90 184 -151 -187 573 6 -56 115
5141 115 20 131 -236 394 193 104 284 -151 183 119 47 -18 -182 152 -125 -161 162 -42 75 -204 -59 19
5163 19 10 -256 109 -284 76 -50 40 -79 75 -226 -201 114 -277 -622 52 3 -103 -233 -79 -111 -51 126 -243
5186 -243 -176 -213 227 -255 -186 -197 273 -166 -99 104 32 2 -1 -146 -52 329 123 -125 -70 -196 -335 43 45 -85
$$ packed form
5030a8M9r0K2P1J46k84r1L29k00k11K53K73o13K57J26l9k77J35K49k26K18l86
5052c07K88j04J58j33J6k2N1nK56j10l10J93k4J19n66J55K44J02l64L42j9o0L77
5075B77k15n43N57m7l22M39k48M4J81Lk57j91O82m22j67L82k81j18J55J76k28
5096a43k0M04k01p4K16p5J2J7J10k44k6j74M86j23k54J37Q5k4l41M28k42K16k83
5119a13J74m4M25m72J56k5K44l41L39j20k71J81K27m33j7K74l35l6P60n67o2J71
5141A15r5J11l67O30k01q9J80m35L34o4p2o5j64L34k77l6L23k04J17k79J45P8
5163A9rk66L65l93L60j26R0j19J54l01K5L15l91l45O74m9j06j30J54l2O0J77l69
5186b43O7l7M40m82O9j1M70m39O7K03p2l0lj45R4L81k06k48N5j26j39L78Kj30
$$ plain form
5210 -85 -227 274 -261 75 -147 227 184 -18 49 -397 -50 56 126 -116 -260 31 34 166 465 260 -50 171
5232 171 4 -76 46 338 -30 37 255 298 274 78 403 41 49 267 62 -55 -75 120 -197 204 -136 84
5254 84 309 109 -46 133 84 -166 36 226 412 140 -44 122 162 141 31 -29 123 210 321 -125 -62 61
5276 61 -49 -93 347 56 97 -253 -159 155 -25 91 -107 -68 132 -144 44 -18 94 -225 -130 290 -51 -6 16
$$ packed form
5210h5j42N01n35L36k22L74m3k02O7m46L47J06P0k42j44K91LJ32K99k05l10K21
5232A71j67q0J22K92l68O7K18M3k4j96L25l62QK18k05j17k0J95l17M01l40K20
5254H4K25k00j55J79m9k50K02J90J86k72j84J66M0k1j10o0J52Q7J11m46O3J23
5276F1j10m4M40k91M1l50R4L14j80J16j98L9K00k76J88o2J12l19R5M20l41M5K2
$$ [...]
8191e4
##END NTUPLES=NMR FID
##END=
