##TITLE=1H_TG-2292
 CDCl3, 8 sc, 
 10.7.2020
##JCAMPDX= 6.0         $$ Bruker NMR JCAMP-DX V2.0
##DATA TYPE= NMR FID
##DATA CLASS= NTUPLES
##ORIGIN= UXNMR, Bruker Analytische Messtechnik GmbH
##OWNER= root
$$ XWIN-NMR		Version 3.5
$$ Fri Jul 10 11:09:46 2020 Russian Standard Time (UT+4h)  she@DPX200
##.OBSERVE FREQUENCY= 200.1315
##.OBSERVE NUCLEUS= ^1H
##.DELAY= (6, 6)
##.ACQUISITION MODE= SIMULTANEOUS
##.ACQUISITION SCHEME= undefined
##.AVERAGES= 8
##.DIGITISER RES= 18
##SPECTROMETER/DATA SYSTEM= spect
##.PULSE SEQUENCE= zg30
##.SOLVENT NAME= CDCl3
##.SHIFT REFERENCE= (INTERNAL, CDCl3, 0, 15.7039)
##AUDIT TRAIL= $$ (NUMBER, WHEN, WHO, WHERE, WHAT)
$$ ##TITLE= Audit trail, XWIN-NMR		Version 3.5
$$ ##JCAMPDX= 5.01
$$ ##ORIGIN= Bruker BioSpin GmbH
$$ ##OWNER= she
$$ F:/spectra/data/she/nmr/H-F/1/audita.txt
$$ ##AUDIT TRAIL=  $$ (NUMBER, WHEN, WHO, WHERE, WHAT)
(   1,<2020-07-10 11:08:34.62 +0400>,<she>,<DPX200>,
      <created by zg, POWCHK disabled, PULCHK disabled
       configuration hash MD5:
       00 E9 B6 7A A2 85 ED C7 34 08 36 98 17 FE 4E 26
       data hash MD5: 16K
       9E AA 87 33 92 A7 CE 93 0C 3D 68 25 18 42 57 F4>)
$$ ##END=
$$ 
$$ hash MD5
$$ 73 A2 E8 17 79 31 C1 8C C9 C3 F3 0E 6C 40 DE 06
##$RELAX= 
##$RELAX= 
##$RELAX= 
##$RELAX= 
##$RELAX= 
##$RELAX= 
$$ Bruker specific parameters
$$ --------------------------
##$DU= <F:/spectra>
##$EXPNO= 1
##$NAME= <H-F>
##$PROCNO= 1
##$TYPE= <nmr>
##$USER= <she>
##$AMP= (0..31)
100 100 100 100 100 100 100 100 100 100 100 100 100 100 100 100 100 100 
100 100 100 100 100 100 100 100 100 100 100 100 100 100 
##$AQSEQ= 0
##$AQ_mod= 1
##$AUNM= <au_zg>
##$AUTOPOS= <>
##$BF1= 200.13
##$BF2= 200.13
##$BF3= 200.13
##$BF4= 200.13
##$BF5= 200.13
##$BF6= 200.13
##$BF7= 200.13
##$BF8= 200.13
##$BYTORDA= 1
##$CFDGTYP= 0
##$CFRGTYP= 5
##$CHEMSTR= <none>
##$CNST= (0..31)
1 1 145 1 1 1 1 1 1 1 1 1 1 1 1 1 1 1 1 1 1 1 1 1 1 1 1 1 1 1 1 1 
##$CPDPRG= <>
##$CPDPRG1= <>
##$CPDPRG2= <>
##$CPDPRG3= <>
##$CPDPRG4= <mlev>
##$CPDPRG5= <mlev>
##$CPDPRG6= <mlev>
##$CPDPRG7= <mlev>
##$CPDPRG8= <mlev>
##$CPDPRGB= <>
##$CPDPRGT= <>
##$D= (0..31)
0 1.2 0 0 0 0 0 0 0 0.06 0 0.03 0 0 0 0 0.0002 0 0 0 0 0 0 0 0 0 0 0 0 
0 0 0 
##$DATE= 1594364914
##$DBL= (0..7)
120 120 120 120 120 120 120 120 
##$DBP= (0..7)
150 150 150 150 150 150 150 150 
##$DBP07= 0
##$DBPNAM0= <>
##$DBPNAM1= <>
##$DBPNAM2= <>
##$DBPNAM3= <>
##$DBPNAM4= <>
##$DBPNAM5= <>
##$DBPNAM6= <>
##$DBPNAM7= <>
##$DBPOAL= (0..7)
0.5 0.5 0.5 0.5 0.5 0.5 0.5 0.5 
##$DBPOFFS= (0..7)
0 0 0 0 0 0 0 0 
##$DE= 6
##$DECBNUC= <off>
##$DECIM= 24
##$DECNUC= <off>
##$DECSTAT= 4
##$DIGMOD= 1
##$DIGTYP= 9
##$DL= (0..7)
0 120 120 120 120 120 120 120 
##$DP= (0..7)
150 150 150 150 150 150 150 150 
##$DP07= 0
##$DPNAME0= <>
##$DPNAME1= <>
##$DPNAME2= <>
##$DPNAME3= <>
##$DPNAME4= <>
##$DPNAME5= <>
##$DPNAME6= <>
##$DPNAME7= <>
##$DPOAL= (0..7)
0.5 0.5 0.5 0.5 0.5 0.5 0.5 0.5 
##$DPOFFS= (0..7)
0 0 0 0 0 0 0 0 
##$DQDMODE= 0
##$DR= 18
##$DS= 0
##$DSLIST= <SSSSSSSSSSSSSSS>
$$ [...]
##$SUBNAM2= <"">
##$SUBNAM3= <"">
##$SUBNAM4= <"">
##$SUBNAM5= <"">
##$SUBNAM6= <"">
##$SUBNAM7= <"">
##$SUBNAM8= <"">
##$SUBNAM9= <"">
##$SW= 24.9337058887773
##$SWIBOX= (0..15)
0 0 2 0 0 0 0 0 0 0 0 0 0 0 0 0 
##$SW_h= 4990.01996007984
##$TD= 16384
##$TD0= 1
##$TE= 0
##$TE2= 300
##$TE3= 300
##$TEG= 300
##$TL= (0..7)
0 120 120 120 120 120 120 120 
##$TP= (0..7)
150 150 150 150 150 150 150 150 
##$TP07= 0
##$TPNAME0= <>
##$TPNAME1= <>
##$TPNAME2= <>
##$TPNAME3= <>
##$TPNAME4= <>
##$TPNAME5= <>
##$TPNAME6= <>
##$TPNAME7= <>
##$TPOAL= (0..7)
0.5 0.5 0.5 0.5 0.5 0.5 0.5 0.5 
##$TPOFFS= (0..7)
0 0 0 0 0 0 0 0 
##$TUNHIN= 0
##$TUNHOUT= 0
##$TUNXOUT= 0
##$USERA1= <user>
##$USERA2= <user>
##$USERA3= <user>
##$USERA4= <user>
##$USERA5= <user>
##$V9= 5
##$VALIST= <valist>
##$VCLIST= <CCCCCCCCCCCCCCC>
##$VD= 0
##$VDLIST= <DDDDDDDDDDDDDDD>
##$VPLIST= <PPPPPPPPPPPPPPP>
##$VTLIST= <TTTTTTTTTTTTTTT>
##$WBST= 1024
##$WBSW= 4
##$XGAIN= (0..3)
0 0 0 0 
##$XL= 0
##$YL= 0
##$YMAX_a= 894556
##$YMIN_a= -550469
##$ZGOPTNS= <>
##$ZL1= 120
##$ZL2= 120
##$ZL3= 120
##$ZL4= 120
##$ABSF1= 10
##$ABSF2= 0
##$ABSG= 5
##$ABSL= 3
##$ALPHA= 0
##$AQORDER= 0
##$ASSFAC= 0
##$ASSFACI= 0
##$ASSFACX= 0
##$ASSWID= 0
##$AUNMP= <proc_1d>
##$AZFE= 0.1
##$AZFW= 0.1
##$BCFW= 1
##$BC_mod= 2
##$BYTORDP= 1
##$COROFFS= 0
##$CY= 11.3945322036743
##$DATMOD= 1
##$DC= 2
##$DFILT= <>
##$DTYPP= 0
##$F1P= 16.9975609425685
##$F2P= -3.02152046262296
##$FCOR= 0.5
##$FTSIZE= 0
##$FT_mod= 4
##$GAMMA= 1
##$GB= 0.15
##$INTBC= 1
##$INTSCL= 1
##$ISEN= 128
##$LB= 0.24
##$LEV0= 0
##$LPBIN= 0
##$MAXI= 10000
##$MC2= 0
##$MEAN= 0
##$ME_mod= 0
##$MI= 1.114404
##$NCOEF= 0
##$NC_proc= 0
##$NLEV= 6
##$NOISF1= 3.799351
##$NOISF2= 2.8
##$NSP= 1
##$NTH_PI= 0
##$NZP= 0
##$OFFSET= 15.70392
##$PC= 1
##$PHC0= -9794.173
##$PHC1= 17.40092
##$PH_mod= 1
##$PKNL= yes
##$PPARMOD= 0
##$PSCAL= 0
##$PSIGN= 0
##$REVERSE= no
##$SF= 200.130013532006
##$SI= 16384
##$SIGF1= 3
##$SIGF2= 2
##$SINO= 400
##$SIOLD= 16384
##$SREGLST= <1H.CDCl3>
##$SSB= 0
##$STSI= 0
##$STSR= 0
##$SW_p= 3612.71676300578
##$SYMM= 0
##$S_DEV= 0
##$TDeff= 0
##$TDoff= 0
##$TI= <>
##$TILT= no
##$TM1= 0
##$TM2= 0
##$TOPLEV= 0
##$USERP1= <user>
##$USERP2= <user>
##$USERP3= <user>
##$USERP4= <user>
##$USERP5= <user>
##$WDW= 1
##$XDIM= 8192
##$YMAX_p= 0
##$YMIN_p= 0
$$ End of Bruker specific parameters
$$ ---------------------------------
##NTUPLES= NMR FID
##VAR_NAME=  TIME,          FID/REAL,        FID/IMAG
##SYMBOL=    X,             R,               I
##VAR_TYPE=  INDEPENDENT,   DEPENDENT,       DEPENDENT
##VAR_FORM=  AFFN,          ASDF,            ASDF
##VAR_DIM=   8192,          8192,            8192
##UNITS=     SECONDS,       ARBITRARY UNITS, ARBITRARY UNITS
##FACTOR=    0.0002004,     1,               1
##FIRST=     0,             0,               0
##LAST=      1.6414764,     0,               0
##MIN=       0,             -550469,         0
##MAX=       1.6414764,     894556,          0
$$ Real data points
##PAGE= N=1
##DATA TABLE= (X++(R..R)), XYDATA
$$ [...]
2689B026R32Q28k839K91L228j737l782J635L253j573k420N73K181J908n97m664
2705g57k897N765N117m417n814J74L442K970M43m309l280L531L868k349k563k47
2721a323l88J130K221q70l223J69J949k37J582O54m070k879L144L200j99j626
2737g66l376j995N109N792l074o152j389L644M257L68n342n665M504Q474n08o329
2753b448l264J220M515M405k823p138o60M912K465l04q30k851j541L808L977j739
2769A704l428k609k36N699M629m719q375J727Q040M038k913p153m444O427Q640
2784G027j927q827k744M529N148K228l652o439N70P139K432l637l575k595K240
2799b083O085K789o191n838K473N811L184j346o533m182N404O788j207n678k525
$$ plain form
2689 2026 2958 3786 947 1238 4466 2729 -1053 582 3835 2262 -158 415 2596 4504 3907 -757
2705 -757 -3654 2111 7228 2811 -3003 -2829 613 3583 4026 -283 -3563 -32 3836 1487 -1076 -1323
2721 -1323 -1711 -581 1640 770 -2453 -2284 -335 -572 1010 1664 -2406 -5285 -2141 1059 860 -766
2737 -766 -4142 -6137 -1028 4764 1690 -4462 -5851 -2207 2050 2418 -2924 -8589 -4085 4389 3881 -2448
2753 -2448 -5712 -4492 23 4428 1605 -5533 -6193 -1281 1184 880 50 -2801 -4342 -534 3443 1704
2769 1704 -1724 -4333 -4569 1130 5759 1040 -7335 -5608 2432 6470 3557 -3596 -8040 -1613 7027
2784 7027 5100 -3727 -6471 -1942 3206 5434 1782 -4657 -4087 3052 5484 1847 -1728 -4323 -2083
2799 -2083 4002 6791 600 -5238 -2765 3046 6230 4884 -1649 -5831 -427 6361 5154 -524 -3049
2814c049O40N050M869l476p549q08N948M523n54n854o035K561R973K822p695o673
2830e307J388O333N356k748r326k798P715N481k117n002l031R99N444M156m207
2845B336o241n98L088L846K227l940p375J509P924L566m268o223k782M923Q348
2860F340j038r952m446O528O728P74n198o506K25Q537M578n593o318r30M113N376
2876C218J078o621n278M095O509P07l642m739j740M715O032k218o317j695L020
2891b876L848L158k371p386j625O677M808j574n408m530J902Q688L501p580p359
2906h127L176O882L283l467p188k119P158N954l269n844q17K233L655K969l040
2921A439n087K7L325K295J017k051m738o30O584M362l651n584j247L469O119K61
$$ plain form
2814 -3049 -2409 2641 7510 4034 -3515 -4323 1625 6148 5594 -260 -6295 -3734 6239 9061 1366 -5307
2830 -5307 -3919 2414 7770 5022 -4304 -7102 613 6094 3977 -1025 -4056 -3057 2387 6543 2336
2845 2336 -3905 -4503 -1415 2431 4658 718 -6657 -5148 2776 6342 2074 -4149 -6931 -2008 6340
2860 6340 5302 -4650 -9096 -2568 4160 4934 -264 -6770 -6545 1992 6570 977 -5341 -6271 -2158 3218
2876 3218 4296 -2325 -7603 -3508 3001 3708 66 -4673 -6413 -1698 4334 2116 -4201 -5896 -2876
2891 -2876 972 4130 1759 -5627 -7252 -575 4233 2659 -2749 -7279 -5377 3311 6812 -768 -8127
2906 -8127 -4951 1931 5214 1747 -5441 -7560 -402 5552 2283 -3561 -4378 -2145 1510 4479 1439
2921 1439 -3648 -3621 -296 1999 3016 965 -3773 -4403 2181 6543 2892 -2692 -3939 -470 5649 5910
2937E910p003m635M901O367p1m391l693K01N411L981m297n421O06L641K114O94
2953D315k964l737J730N027R0l197j314j493J487L429L59l736j908K395J814R89
2969C286j01l425k810L354M065j573l398j773N07M052L250l622n605J803M550
2984B560R72k435k801j261L086L296k174l612J021K457o18K6j19r85o87R39j04
3001d39K08J672j448l080J250M345o58l212j521M02K573K367k780m484J814M206
3017A215J92k111j353k81J186K102j249k764M87K244q04k2J278j063j138J332
3033g49O52q79Q18p10j769J66L103o1j599J37j87M68K429n39l701m05L371J313
3051A858j517q12j388Q45L061O99l467p69K258Q06j149J5n42n45J055J123q30
$$ plain form
2937 5910 -1093 -5728 -827 5540 5469 1078 -2615 -2414 2997 6978 2681 -2740 -2134 1507 3621 4315
2953 4315 1351 -2386 -656 4371 4461 1264 -50 -1543 -56 3373 3732 -4 -1912 483 2297 3286
2969 3286 3185 -240 -3050 304 4369 2796 -602 -2375 -1868 2184 5434 1812 -3793 -1990 2560
2984 2560 3532 1097 -1704 -2965 121 3417 1243 -2369 -1348 1109 491 517 398 -587 -1274 -335 -439
3001 -439 -231 1441 -7 -3087 -1837 2508 1850 -1362 -2883 -2481 92 2459 -321 -4805 -2991 1215
3017 1215 1407 -704 -2057 -2338 -1152 950 -299 -3063 -2576 -332 -1136 -1158 120 -943 -2081 -749
3033 -749 -97 -976 -158 -868 -2637 -2471 632 571 -1028 -891 -1078 -610 1819 1280 -2421 -2826 545 1858
3051 1858 341 -471 -1859 -1014 2047 2746 -721 -1490 768 1574 425 440 -102 -647 408 1531 701
3068G01Q82N63k893p64L672J289k581k343j16K280L254o03m910j490M783L327
3084E051k521l549j633J622M258Q55m139j982J921J977j07N30j459k721J077L329
3100B509k57k255j213p38J095M366K29n273j684K785K094J054j758m108l00M243
3116G89K673k578k851p59J806K770J504l883m115J809M413M58j966l065r38L470
3132d63M186k669m558n31K951K110L53j929l469M29L436R47r18n28j736p47K927
3149b09K493l029l187K11K676L066M09m912l687L806O295j006m452l156Q28M493
3165F39K686k807n223J350M615J470r88l022k306J336M840P14l828j759N03J742
3181c8K992N24m128k233K836K810J16j210k816j731L165M621j641l974j517K435
$$ plain form
3068 701 1583 2146 -747 -1511 2161 3450 869 -1474 -1590 690 3944 3341 -1569 -3059 1724 5051
3084 5051 2530 -1019 -2652 -1030 3228 4083 -56 -2038 -117 1860 1753 2283 824 -1897 -820 2509
3100 2509 2252 -3 -1216 -1954 -859 3507 3736 -1537 -3221 -436 1658 2712 954 -3154 -3454 789
3116 789 3462 884 -1967 -2726 -920 1850 3354 -529 -4644 -2835 1578 2036 70 -2995 -3933 -463
3132 -463 3723 1054 -3504 -4035 -1084 1026 1379 -550 -4019 -3590 -154 793 -125 -653 -2389 -3136 -209
3149 -209 2284 -745 -3932 -3721 -1045 2021 2430 -2482 -6169 -2363 3932 2926 -1526 -4682 -3854 639
3165 639 3325 518 -4705 -3355 1260 2730 1742 -1280 -3586 -2250 2590 3304 -524 -2283 -1780 -38
3181 -38 2954 3478 -650 -2883 -47 2763 2879 1669 -1147 -2878 287 4908 3267 -707 -2224 211
3197B11K918J978l023n838J801N718J752l969l690j95L722M682j815n774j046
3212b568M090J749p93j701j468Q6K869J259j887j365l32m47K133K574j901m824
3228b526j10L313L103n4l880l903K743O061o09n905k186K616L630J606l346m855
3244d302R88N759J228k731k849o40J025L033Q37l395k141J312J508J317O34k352
3260g69l218J465L745q7k168j638r05K180L210p25m322p69L020J905M11k471l167
3277d303J20M806J620l309k555Q92K268K066q94l597n98L114J785k092j425N47
3293a555m54J589J831j574j271K77P7L0J986L28l033q38K531J803j01j472k522
3310b368M60M224J027m149j977J787K220Q70n45k677r22K784K090j474j715K28
$$ plain form
3197 211 3129 5107 2084 -3754 -1953 3765 5517 1548 -2142 -2337 1385 6067 4252 -1522 -2568
3212 -2568 1522 3271 2478 777 -691 -605 2264 3523 1636 271 -61 -508 1625 4199 2298 -2526
3228 -2526 -2636 677 3780 3726 -154 -4057 -1314 4747 4138 -1767 -3953 -1337 2293 3899 553 -4302
3244 -4302 -3314 2445 3673 942 -1907 -2547 -1522 1511 2348 -1047 -3188 -1876 -368 949 1583 -769
3260 -769 -3987 -2522 1223 1136 -1032 -2670 -3575 -1395 1815 1090 -3232 -4001 -981 924 1335 -1136 -4303
3277 -4303 -4183 623 2243 -1066 -3621 -2729 -461 1605 711 -2886 -3484 -370 1415 -677 -2102 -1555
3293 -1555 -2009 -420 1411 -163 -1434 -1157 -1080 -1050 936 1264 -1769 -2607 -76 1727 1626 154 -2368
3310 -2368 -1908 2316 3343 -806 -2783 -996 1224 2094 1549 -1128 -2050 734 2824 1350 -365 -137
3326a37m35J015J968j127k180O07J277K04P64J66k936m06K764Q77j335r45n93
3343d52K22K246J059k654j896J596J672J7k03k147j002K229K046j594k215P69
3359c07P79P54M17j271k021J229J822j074n51J75Pm74J103K71r24j67J31j234
3377a335J315J440j455k171J015K236p9q22j660o35J847K547k414k437J137J030
3393d41l3K14kr64M83J037q67l11M43j51j486J424R74r96p05Q8L28Q73J563j792
3413c21k544J146K486n08r11m40m64J117K169j193k446N67J403J144J6q11k342
3430a932J26K981R26j857o76j61M17J758N14k355j446J760O47L54L20j213j259
3447a096R85K360l61j426p21p42J236K591n00l645n09K475J775r4j605k187N91
$$ plain form
3326 -137 -572 443 2411 1284 -896 -289 988 1192 1956 2122 -814 -1220 1544 2421 1086 141 -452
3343 -452 -230 2016 3075 421 -1475 121 1793 1810 1607 -540 -1542 687 2733 1139 -1076 -307
3359 -307 472 1226 1643 372 -1649 -420 1402 328 -223 -48 -41 -515 588 859 -65 -232 -101 -1335
3377 -1335 -20 1420 -35 -2206 -1191 1045 966 144 -1516 -2151 -304 2243 -171 -2608 -1471 -441
3393 -441 -474 -260 -262 -1226 -743 294 -573 -884 -441 -592 -2078 -654 320 -676 -1381 -1293 -965 -92 1471 -321
3413 -321 -2865 -1719 767 259 -652 -1092 -1556 -439 1730 537 -1909 -1342 61 1205 1221 410 -1932
3430 -1932 -1806 1175 2101 244 -432 -593 -176 1582 2096 -259 -1705 55 702 1056 1376 163 -1096
3447 -1096 -111 2249 1888 462 -259 -1001 235 2826 2326 -1319 -1828 647 2422 2328 723 -1464 -873
3464h73K986M89k652j315J578J107N38n40j822n74K706R91j417r68k93j087J447
3481C01K372r99k411j23J194P87J066j048k988L93L188Q18k025j674q08J136L182
3498B361R08l922k167J635K248N90q34k895j416L407K364j231k812l93J005J212
3514F0J081j527k174R58J172L3j01M90j627l98K176P95j323j627n58O73K994O49
3532A746l624k559K324L487m65j978j682M70L039J024l475k304K171K550K7o65
3548H6j850p57J434J815m09p19O2j088k33J843J219k483j203J406J498Q46o82
3565G85l182q27L173K819j774k577m38J165K221Q19k403k652K074K489m36p80
3581D76j614l73J529K341p75k109L02Q35L90jn6j745L55J803M50p40k19j148o19
$$ plain form
3464 -873 2113 2602 -50 -1365 213 1320 1858 1318 -504 -1078 1628 2619 1202 234 -59 -1146 301
3481 301 2673 1674 -737 -860 334 1121 2187 1139 -1849 -1456 1732 2550 525 -1149 -1957 -821 2361
3498 2361 3269 -653 -2820 -1185 1063 1653 819 -2076 -3492 -85 2279 1048 -1764 -2157 -1152 60
3514 60 1141 -386 -2560 -1602 -430 -397 -498 -8 -1635 -2033 143 938 -385 -2012 -2570 -1897 1097 1746
3532 1746 -1878 -4437 -2113 1374 909 -1069 -2751 -2281 758 1782 -1693 -3997 -1826 724 751 86
3548 86 -1764 -2521 -1087 728 319 -400 -338 -1426 -1659 184 1403 -1080 -2283 -877 621 1467 785
3565 785 -2397 -3224 -51 2768 994 -1583 -2021 -856 1365 2184 -219 -2871 -797 1692 1256 476
3581 476 -1138 -1511 18 2359 1584 -525 -223 612 1002 1001 945 -800 -445 1358 1808 1068 849 -299 -918
3600i18K480J800j753k162K1R01J592P68k292k254K807K464q72l274l78R92J953
3617A875J104k125k481L62K565l9j15q6j015m26J554j50j219j0l33l50J500J107
3635A718j609j739Q77J088O31j61j549j364J373K250j091j970K11R32J070J24
3651G91r00j798M1K163J85p92n60n36L81J613K38k061l83J338N76j40L63j552
3669a033j382J438J581m13j29p09j055M97K321m16j800m06P03R10R41n66k751
3686b269J21L356M77j785j127k17N29J848l5j687m89J851oq88M79N1q44O54N02
3705E21l79Mj95m54j00K034L86k167l58J479M15K14p15j488L35K055N65j984r57
3724g89J130O82N27M13j817q68J742J036r61o86k24k74J209R26r97j317M91K25
$$ plain form
3600 -918 1562 3362 1609 -553 -532 369 1961 2729 437 -1817 990 3454 2582 -692 -1070 -78 1875
3617 1875 2979 854 -1627 -1265 1300 1261 1146 1060 45 -381 1173 1023 -196 -206 -539 -889 611 1718
3635 1718 109 -1630 -753 335 966 805 -744 -2108 -735 1515 424 -1546 -1335 -403 667 791
3651 791 -109 -1907 -1866 297 482 -310 -870 -1406 -1025 588 826 -1235 -1618 -280 296 156 519 -1033
3669 -1033 -2415 -977 604 191 62 -647 -1702 -1205 1116 700 -1100 -1506 -803 107 1048 482 -2269
3686 -2269 -2148 1208 1685 -100 -1227 -1444 -915 933 898 -789 -1278 573 567 -321 158 209 -635 19 521
3705 521 142 146 -49 -503 -603 1431 1817 -350 -708 771 1186 1400 685 -803 -468 1587 2152 168 -789
3724 -789 341 1023 1550 1963 146 -722 1020 2056 1095 409 185 -89 1120 2046 1049 -268 223 448
3742D48K24Q29l06j665j3J374M77l87l73o21q61K002Q96j635j427M07R14J044
3760A327Q0j699j497K008J455j050j031m36M89R24K85j241j086J007P36m33j0
3777a72L83r51n62Q91P03n58o00k14n02J598Q48j306j884R84J557l0o02j270o96
3796b383J690J643r45j787L78L71R12R86j104j893Q81J170J49q38k08l41O78J317
3814F76j25j491j90Q02N6K10P28j422o85J066Q92j52K5o45j127J453K097j045
3832A123k303l3J110J774M40j931j799J285K898k56k421n11P05O45J126j033j406
3849e87N41J560l90k94J15l93r05N15J220k04n94k30p24N50J926q70k206K15J827
3868A072O01n89j258j337J090K823n84k739k12J597N38Pp29j378J46K065l62j149
$$ plain form
3742 448 672 1501 1195 -470 -483 891 1368 981 608 -13 -874 1128 2024 389 -1038 -631 283 1327
3760 1327 1407 -292 -1789 219 1674 624 -407 -843 -354 570 855 -386 -1472 -465 271 -162 -172
3777 -172 211 -740 -1302 -411 292 -266 -866 -1080 -1582 16 864 -442 -2326 -1342 215 185 -417 -1687 -2383
3796 -2383 -693 950 5 -1782 -1404 -1033 -121 865 -239 -2132 -1251 -81 68 -770 -978 -1319 -641 676
3814 676 551 -940 -1130 -328 -272 -62 666 -756 -1441 -375 517 365 390 -255 -1382 71 2168 1123
3832 1123 -1180 -1213 -103 1671 2111 180 -1619 -334 2564 2308 -113 -624 81 726 1852 819 -587
3849 -587 -46 1514 1124 830 945 552 -353 162 1382 1178 584 354 -370 180 2106 1236 -970 -755 1072
3868 1072 1673 1084 -174 -1511 -421 2402 1818 -921 -1133 464 1002 1009 280 -1098 -952 1113 751 -398
3886c98q2l0j2R05P44j053o66L36k86J13R70j00j871K04J734j24n01n35p21L88
3906i85J728L69k927j93J136R46L1n58j075L19J794j66j898k63J150K10j51N27
3924fo28m01L99M56n56O05N72j603n09J778K67j187K72n31K11J907K45k288q48
3943a845J969N57j30p19m73O7J127O84j291r09J064mO22qm02j472P63J376m0j97
3963G39l51o49K10J114m31r20J44O93J54M88k86j129o52J926M77o77k63l79o12
3982d04P93J218j229q13R05P56o6k49j092l16R64J648j378r88J88O55r4K37K54
4001I89j203M89M58k66m00O20p32o03R66P53l13r62Q6l42O50R46r83j342P70J071
4021F52l30o10l32r49J010J295m25j199j36O09k1J43K68j094m4R26R5r77M24k07
$$ plain form
3886 -398 -480 -510 -522 383 1127 74 -592 -256 -542 -429 541 441 -1430 -1226 508 384 -117 -652 -1373 -985
3906 -985 743 1112 -1815 -2008 -872 74 105 -453 -1528 -1209 585 419 -1479 -1742 -592 -382 -533 -6
3924 -6 -634 -1035 -636 -180 -736 -131 441 -1162 -1671 107 374 -813 -541 -1072 -861 1046 1291 -997 -1845
3943 -1845 124 681 551 -168 -641 -574 553 1237 -54 -963 101 97 719 711 309 -1163 -400 976 936 739
3963 739 388 -261 -51 1063 632 -288 -144 549 703 1191 905 -224 -876 1050 1527 850 587 208 -404
3982 -404 389 1607 378 -435 470 1226 1160 911 -181 -497 467 2115 737 -251 -63 592 498 735 989
4001 989 -214 275 733 467 67 687 -45 -648 318 1071 758 -204 -118 -460 190 1136 153 -1189 -419 652
4021 652 322 -288 -620 -1569 -559 736 311 -888 -1024 -415 -436 -293 -25 -1119 -1163 -237 -142 -1119 -695 -902
4041i02l8M80Q08j166o51M35k49K17Q80j82j083j23R93N50r06R0q51K96J666j66
4061I8k031n3J438O33K65o59j431O71J777j97j242l51R12o3L66L7o61k76N64K49
4081D6o0R61p66j357K59K042j61j068o8o6Q78R34n76k030O78J654J75q72m66l19
4101a82N5J114N11j376l44J293m6j77k67n87l66J343O50j044l82J9l1M53J021
4120A657p26j292L37P62j71K42j68q59l4J499L2j126m57L74j16J475J6j677q52
4139a084J686P00o87m19q22J05J408K77j356p57O45O12k86L20k41j57R0J90o20
4158c96J16O63q79l68J195K55r82l60j60L85R08K69j485r04J443O86p90n20m1
4177i65M66O41j6l92r27O55O84m12o0J7q57M09Q11Mn26m4o5R8P40L66j409m78
$$ plain form
4041 -902 -940 -460 348 -818 -1469 -1034 -1283 -1066 -186 -368 -1451 -1574 -581 -31 -937 -847 -1698 -1402 264 98
4061 98 -1933 -1986 -548 85 350 -309 -1740 -1069 708 511 -731 -1082 -170 -233 133 170 -491 -767 -203 46
4081 46 -14 947 181 -1176 -917 1125 964 -104 -172 -238 640 1574 998 -1032 -354 1300 1475 603 137 -182
4101 -182 -127 987 1498 122 -222 1071 1025 848 581 -6 -372 971 1621 577 195 214 183 636 1657
4120 1657 931 -361 -24 738 567 809 641 -218 -252 1247 1279 153 -304 70 -46 1429 1445 -232 -1084
4139 -1084 602 1302 615 196 -626 -521 887 1164 -192 -949 -304 308 22 342 101 -56 34 224 -396
4158 -396 -280 383 -496 -864 331 586 -396 -756 -916 -531 377 646 -839 -1743 -300 386 -404 -924 -965
4177 -965 -499 142 126 -266 -1193 -538 146 -266 -326 -309 -1166 -757 54 58 -468 -512 -577 -479 261 627 -782 -1260
4199a260J160K58l71K21l42q61J346P89j086o29L77K94L61K57p51j185J498J013
4217A089q79o43L09j0K53P30o27q49R17P25j026O3P39n39m70P74q7k73M31j66
4237D61n78M29J003p54r58M30R41q08L10J68j002J116L27o52p61J029p5k4K85
4256H87n18q8K01M78o49m00P98j96q32O59J88l26L49J69p57M07O81o84j208J046
4276B05N48o87M08l60n39L7R41m09q40P50j78m28Q18L13r88m45Q41L59o76R0j07
4297c47o09O23P23n77o72M61k06k80J064l5j001J18P60l94r4L78r55K0J180R8
4317B55j266R1J47L96M32K65j122k89R89J61m54K36J02o71N85M91l83o11L32Q
4337c06j35R23l50q72j71J159K51o30J48k71m95J688L19j602m82P09K58J33R07
$$ plain form
4199 -1260 -100 158 -213 8 -334 -1195 151 940 -146 -775 -398 -104 257 514 -237 -1422 76 1089
4217 1089 210 -433 -124 -134 119 849 222 -627 290 1015 -11 52 791 252 -218 556 469 196 627 461
4237 461 -117 312 1315 561 -397 33 974 166 476 644 -358 758 1085 433 -328 701 626 602 887
4256 887 369 281 482 960 311 -89 709 513 -319 340 528 202 551 720 -37 370 1051 367 -841 205
4276 205 753 66 474 114 -425 -388 553 144 -696 54 -124 -552 266 579 -409 -854 -13 346 -330 -240 -347
4297 -347 -956 -333 390 -187 -859 -398 -604 -884 180 145 -856 -738 22 -372 -466 -88 -1043 -1023 157 255
4317 255 -1011 -920 -773 -377 55 320 -802 -1091 -102 59 -395 -159 -57 -728 -143 348 -35 -646 -314 -306
4337 -306 -441 482 132 -740 -911 248 499 -131 17 -254 -749 939 1258 -344 -826 -117 141 274 1181
4356A181j138p48J049R55j054n56J75L52L13J025j473q53J017R13n95j36L01j228
4374e00K85J077J6m94j0k79n42J033O87j041q16Q19O33J34K1j536p46J735J363
4393A839j496j385P34O55J26K22r30r31J349P78o23m42K86l37l4P70q6r08j09
4412e22N21k45P61J07j230o29J004J092m02o27p24k64J531Q96j495r70M39Q77
4430A20P5k75o09n01R02J093o56j336k26P98O27M74l10j854P72J195Pr80l6j08
4450h28k0Q57K1j201M55O6L70L31K82q28j035R09R30J8o23l03m14R28J330o63
4470E82j812L3J752M57j127j20p54Q14J437p42q54j06P57J3L82J15r73k27R03
4489E30L06p65P74j94j234P34J235p35o25K81J54K00L72q12j013P83J188j59n53
$$ plain form
4356 1181 43 -705 344 1299 245 -311 -136 216 529 1554 81 -772 245 1158 563 427 728 -500
4374 -500 -215 862 878 384 374 95 -447 586 1273 232 -584 235 868 1002 1023 -513 -1259 476 1839
4393 1839 343 -1042 -308 347 473 695 -235 -1166 183 961 338 -104 182 -155 -189 581 495 -413 -522
4412 -522 -1 -246 515 622 -608 -1237 -233 859 457 -170 -894 -1158 373 1269 -226 -1196 -757 120
4430 120 195 -80 -689 -1190 -288 805 149 -1187 -1413 -615 12 486 176 -1678 -906 289 296 -684 -720 -828
4450 -828 -848 9 30 -1171 -716 -650 -280 51 333 -495 -1530 -621 309 327 -296 -599 -1013 -85 1245 582
4470 582 -1230 -1197 555 1012 -115 -235 -989 -175 1262 520 -334 -440 317 330 712 827 -146 -373 530
4489 530 836 71 845 651 -583 151 1386 651 26 307 461 661 1033 221 -792 -9 1179 1020 467
4508D67m37j40K46J189n41j438K18P59J83R1j91r75Q1J432K60j641J54N64j15
4527A66L08J34j135m7J091k9o53L37J83j123K34Q96J51r48o2k02L35J090n38j123
4547i35K09J230L6q90o62M09K96R12j87j368M7J123q6o32J64k77N7L71l77j48
4567g08J05O05n30n91R99m11m23L85N73r78N09M32o68j04P61lp65M22M14o78M96
4588a58L60p42n3P32Nm95O7L14k60J75N17r08j9P62M20p46J38ln1Q02J61j114
4610i6J4J208k16o21K6L23m61N09K41n03J75L94k04n19L87O23j191M53O40m21
4630G61j84O7l96k17J276m11p44pQ93m75J99r0p66j16J114P2j085L0L79J4Q1N56
4652I51j129m2O63q7m30k4J82j40N14m9m73p10R78K39p47r2J54J67R7N77p14l66
$$ plain form
4508 467 30 -110 136 1325 784 -654 -436 323 506 597 406 -569 -488 944 1204 -437 -283 281 166
4527 166 474 608 -527 -574 517 488 -165 172 355 -768 -534 362 513 -435 -497 -699 -364 726 188 -935
4547 -935 -726 504 540 -350 -1012 -603 -307 605 418 -950 -903 220 134 -498 -334 -611 -554 -183 -560 -708
4567 -708 -603 2 -528 -1119 -120 -531 -954 -569 4 -974 -465 -33 -701 -805 -44 -47 -812 -390 24 -654 -158
4588 -158 202 -540 -593 139 144 -351 -284 30 -230 -55 462 -446 -465 297 717 -29 109 106 55 857 1018 -96
4610 -96 -82 1126 910 289 315 638 177 686 927 424 599 993 789 270 657 1280 89 542 1182 761
4630 761 577 644 248 31 1307 896 152 145 1038 563 762 672 -94 -210 904 976 -109 -79 300 314 395 951
4652 951 -178 -220 443 356 -74 -98 84 -56 458 409 -64 -774 204 443 -304 -396 -242 -75 22 599 -115 -481
4674d81Q24n52k78L84K92q37j79O23M1L18n79j95m73J208N30j580m25J028N76
4693B45j20o38n63L2J495j92r23m97O47j20L10K57n74m36L57O39m49K90P0m41
4713f11j93J279j18r52j40L26P6J016l57j351k6J328O35j071k65l50M83J143K53
4732A105j474l22J034L06j05j24q85k71Q89J221r97n87J29K69L50O15m89j194
4750e30K87J199l82k50L0q82L20R99N89j199m09K71r7J050oj504m98J427R35o80
4770F70r20k22J05J272K67j033q67J102M01k92o1l55q00M10J090o05m94N74j15
4789A27j41N78K5j094L6P97L00m16j15p34j74J486K61j141j150J335L79l0J44
4808D73p91r96P83J120m66l70j11j91K17R47m26j192L31Q56k86J56o02p07Q81
$$ plain form
4674 -481 343 -209 -487 -103 189 -648 -827 -204 -163 155 -424 -619 -1092 116 646 -934 -1359 -331 245
4693 245 125 -513 -1076 -1044 451 259 -664 -1161 -514 -634 -324 -67 -641 -1077 -720 -81 -530 -240 -170 -611
4713 -611 -804 475 357 -595 -735 -409 -333 683 326 -1025 -1051 277 912 -159 -424 -774 -291 852 1105
4732 1105 -369 -691 343 649 544 420 -465 -736 153 1374 377 -210 -81 188 538 1153 664 -530
4750 -530 -243 956 574 324 354 -528 -208 791 1380 181 -228 43 -54 996 990 -514 -1012 415 1350 670
4770 670 -250 -472 -367 905 1172 139 -728 374 775 483 422 67 -733 -323 767 162 -332 242 127
4789 127 -14 564 589 -505 -469 328 628 212 97 -637 -811 675 936 -205 -1355 -20 359 329 473
4808 473 -318 -1314 -531 589 123 -247 -358 -549 -332 615 189 -1003 -672 184 -102 54 -548 -1255 -374
4827c74R66l08j212R8M97j58O16J41r24k07O83M88m85r2j65o84P98J260j207q48
4847a117M08K59P51K24j113p28J165J397j121q37P01m44K60Q19j82j394M32Q67
4865C47r8l02J2k39m48J170K36m56m62J77J8O07J66q72n46J238N69q33j97j83
4885i6L5O01O43q95n88O42K00l76M36k35n80K30R96m36q52M59l68O75L83j62j399
4906f87M20J306m65m00q0m0j69J009j43r00j31L84R0k38O63n13q46O81R23o38
4926B26k30K5l68K18Q25p00r45N57R66m33l46K26n29K25O10k90o72K59L32PM3
4947FJ62n69j52P69N0m83l25J77o03Q98R85j064m70L59N3j68L61n32l19R42N37
4968F14j020j35J74K52j49O31o88m21K58J074m99k21m4m28M05M71J55j040J04
$$ plain form
4827 -374 592 284 -928 -830 -333 -491 125 266 -658 -865 -182 306 -179 -271 -436 -1120 -322 938 -269 -1117
4847 -1117 -709 -450 301 525 -588 -1316 -151 1246 125 -712 -11 -455 -195 624 442 -952 -520 347
4865 347 249 -53 -41 -280 -728 442 678 222 -240 -63 -45 562 728 -144 -690 548 1117 284 87 -96
4885 -96 -61 540 1183 288 -300 342 542 166 602 367 -213 17 1013 577 -275 184 -184 491 874 712 -687
4906 -687 -267 1039 574 174 94 54 -115 894 751 -149 -280 104 194 -44 619 106 -740 -59 864 226
4926 226 -4 21 -347 -129 696 -4 -949 -392 574 141 -205 21 -508 -283 327 37 -635 -376 -44 -37 6
4947 6 168 -401 -553 216 266 -217 -542 -365 -968 -70 915 -149 -619 -260 -207 -375 -14 -546 -865 77 614
4968 614 -406 -541 -367 -115 -264 367 -321 -742 -484 590 91 -130 -174 -602 -197 274 429 -611 -507
4987e07O00M93l46N3o53n0Q33K05q38j76O35k27K40M68q23k33M58K92k80M08l27
5008B25o05K47J371n06j314J97P77L36m1m48r21Q42J115n25r37P7K44J60L47r3
5028E48o14o3Q50j46o80J73J97n89L54R08j129J91m5o6K38N59q18n67M48N94p4
5049B69n05p4m6K97R80l22j587P39L37M85j73m59q43M95J175p45p39R0N65j47
5069b08O73j85j033j34J217l94k01j9J47m93K14P92n35j48Q0mQ6L41j76q92L87
5090d85J101k05o85l23K10O85N18p97j025J92J339J6n52o55j7M42J218n61j253
5109h37K77N62lL94k67n37j10P47M94p81n54N29k13M95Q33q61p31L07P37J06j24
5130D63j47j017M91J022k28p29j69M72L35M29l95p20m53J299J76l45j42j43m08
$$ plain form
4987 -507 93 586 240 293 -360 -410 423 628 -210 -386 249 22 262 730 -93 -326 132 424 144 552 225
5008 225 -380 -133 1238 732 -582 -385 392 728 687 239 -682 160 1275 750 -187 -110 134 294 641 548
5028 548 -66 -129 721 575 -105 68 265 -324 30 938 -191 0 -45 -111 127 686 -132 -699 -251 343 269
5049 269 -236 -310 -356 -59 921 599 -988 -249 88 573 400 -59 -902 -407 768 23 -716 -626 -61 -208
5069 -208 465 280 -753 -887 330 -64 -265 -284 -137 -630 -416 376 -159 -307 -227 -231 -145 196 20 -872 -485
5090 -485 616 411 -274 -597 -387 298 816 19 -1006 -814 525 541 -11 -666 -683 -241 977 416 -837
5109 -837 -560 2 -1 393 126 -411 -521 226 720 -61 -615 -86 -299 196 1029 168 -563 -256 481 587 463
5130 463 316 -701 -210 812 584 -145 -314 158 493 922 527 -193 -646 653 829 484 342 199 -209
5149b09R59O61j755J2R77K28k16k07m75j43R12P2p32j15M06l23J29O34o62n59
5169d06L64K70NP2J16r96m7J263l36p68O8N1M09M24q6j128QJ067K03p60l24Rm9
5192e71P35J91p58n49Q00L10j73j4o46J72K25O84q14l53K21R4r5Q24l49q89J84
5213g71O55K8m34N95o22j17Q59O1r88j9M50K29L17j40r56l35J180O78q49m92n3
5234g24J73P25L2q81m59J273L87m97j56j34K0J11K48J36k67J86m39Q5O54K67j092
5255c52l66Q97M37m92k75k78R7R84J58o02n45O37L96j11j26m33m82J270L84p81
5275D17o41l66P52N45R8m99q54Q57M97k99n51P5j2K17Q01o14o20MO80k56N61k90
5297E02o74k6R12J3q19k46K19j22R03L13j694k96P23J036n93l13l86o68J418J007
$$ plain form
5149 -209 750 1411 -344 -332 645 873 657 450 -25 -168 744 816 84 -31 375 52 181 815 153 -406
5169 -406 -42 228 233 305 421 -575 -622 641 305 -463 -395 -344 65 489 403 -725 -717 350 553 -207 -531 -522 -571
5192 -571 164 355 -403 -952 -152 158 -15 -29 -675 -503 -278 406 -408 -761 -540 -446 -541 283 -66 -955 -771
5213 -771 -116 -88 -522 73 -549 -666 193 254 -734 -753 -303 -74 243 103 -853 -1188 -8 670 -179 -671 -724
5234 -724 -551 174 206 -675 -1134 139 526 29 -127 -261 -241 -130 118 254 -13 173 -266 -181 473 740 -352
5255 -352 -718 179 616 124 -151 -429 -332 652 810 208 -337 300 696 585 459 26 -456 814 1198 417
5275 417 -224 -590 162 707 805 306 -548 309 806 507 -44 31 19 236 1037 423 -197 -193 487 231 792 502
5297 502 -172 -198 714 727 -92 -338 -119 -241 662 975 -719 -1015 -292 744 151 -162 -548 -1216 202 1209
5317A209j185n91J8M88O16m46p34k11M88Q52n27m89J84k88Q5R84l14n67j57M01
5337a84L00k37L70p76l00O66Q31j065k82K61j0P72k8q72n65J025K31M4o75r7r9
5358f90P89R78q70j183L93N28l3L82k64j053O53J253m76r12%L82R7K79N8r26J13
5379e02L93M96J8L6m45o81J200M54o58j092L53K94Q17N34j002j234J001J039l15
5398G06q23J51k40Q69K58n95p24J22O90O0K30k07p61k01J079J13m33k29m3k01
5418a79P44J55q52m91J246M16m28k45m51m87J101M70p28o36J18J50M02K17j98
5437C24r30L04J148l57l38m53p1N39N92l05j116M01N63M8J41o60m65N1J098j29
5457C85m97m93K03J50L02N61p69o68M39O73j05k41m02k16M52Q91p55l77O3M65
$$ plain form
5317 1209 24 -567 -549 -61 555 109 -625 -836 -348 504 -23 -512 -328 -616 -531 453 139 -428 -585 -184
5337 -184 116 -121 249 -527 -827 -161 670 -395 -677 -416 -426 346 318 -554 -1119 -94 137 181 -494 -591 -690
5358 -690 99 1077 207 -976 -583 -55 -88 294 30 -1023 -370 883 407 -505 -505 -123 -26 253 311 -615 -502
5379 -502 -109 387 405 441 -4 -685 515 969 311 -781 -428 -134 683 1217 215 -1019 -18 1021 706
5398 706 -117 34 -206 663 921 326 -398 -276 414 474 704 497 -264 -465 614 727 294 65 22 -179
5418 -179 565 720 -132 -623 623 1039 611 366 -85 -572 529 999 271 -365 -247 -97 305 522 324
5437 324 -606 -302 846 489 151 -302 -373 166 758 453 -663 -262 301 349 490 -170 -635 -584 514 385
5457 385 -112 -605 -402 -252 50 611 -158 -826 -387 286 181 -60 -462 -678 -226 665 -90 -467 -404 61
5477F1J48P8k07r45M40R09j38n89j77K43L55L09l61o16k2Q03j18r9k00m43k7J049
5499D53L5o96o45N91N44l04L49p24j63Q65M46j072K6L03m81M58O45k45j058K29
5519d44R03j06l10j56l55M18O63K68j218N5M13J24L67k59r07J87R71Rn46k91J22
5540i2m8M20L04m29o34Q95K0j37J75k76l05K06R80o56m56m6p5M47N30n10j191
5561h78M54J443l62n50M6n50J65Q17j10q46o1N17K31j18L06r44l01J260L10o43
5581A86k23n67J61L00P87r83n24N53P46p1k84n22l58N99O36l93q36L58P8J97M89
5602C29l42q97K91Q95m4m16k11j76L12O77J7q89n07J004J90j55j82o19NJ097L72
5623G51r31o44M30j5M52K82m49q27M79R30j53m80j68m79N97R12k03j096k68P78
$$ plain form
5477 61 209 287 80 -865 -425 484 346 -243 -420 -177 178 487 126 -490 -512 291 173 74 -126 -569 -596 453
5499 453 488 -208 -853 -262 282 -22 327 -397 -560 305 751 -321 -295 8 -473 -15 630 385 -673 -444
5519 -444 459 353 43 -113 -468 -50 613 881 -337 -282 131 255 622 363 -544 -357 614 623 77 -214 -92
5540 -92 -140 280 584 155 -479 416 436 299 474 198 -107 99 1079 423 -33 -79 -154 293 823 313 -878
5561 -878 -424 1019 657 107 153 -397 -232 585 475 -371 -432 85 316 198 504 -440 -741 519 829 186
5581 186 -37 -604 -443 -143 644 -339 -863 -310 436 365 81 -441 -799 -200 436 43 -793 -435 -357 -160 329
5602 329 -13 -910 -619 276 232 -184 -395 -571 -259 418 435 -454 -961 43 233 78 -104 -723 -718 379 751
5623 751 -180 -824 -394 -409 43 325 -124 -951 -472 458 305 -175 -343 -822 -225 687 484 -612 -880 -102
5643a02P14l4m58p14K8J517K8q83l95N5J35O71K23q59r1J08M45K9J2m67q56R71
5665G7R01o19q00L96M5K98L27J5j464O74O87K72o42l38l00L83R99n3j287j84Q41
5686B28J90l0j51p77r5P23Q27r28o49N59Q0L36J15m50r72Q20P98q3k63l24o43
5707f89M42P51j89q16J27J16K72N93n41r46j75J656j50m56K9m16n6J199j33q27
5727b09o55R99K20m36Qp01R4P36K50p31O6O3MK15P22n20r07M79Q90l49k41m24
5749d27j53M71Q33k60j013o7L64J36L52q9q15L3J377m62l73L7l81K72N92L14j023
5770b82n72J184J50k81q6l15n42J301k2p66k9J13J81L44J44l69q52M85Q37k87
5790C36m51K8K6J9O75K0q80l16Q20K16k9n1r92o4J425j1p04l17Q5J27M21J40p13
$$ plain form
5643 -102 612 578 120 -594 -566 951 979 96 -299 -244 -109 562 785 -74 -165 -57 388 417 429 -38 -894 77
5665 77 978 359 -441 -45 0 298 625 640 -824 -150 537 809 167 -171 -471 -88 911 858 -429 -613 228
5686 228 418 388 237 -540 -635 88 915 -13 -662 -103 -23 313 428 -22 -994 -174 624 541 278 -46 -689
5707 -689 -247 504 315 -501 -374 -258 14 607 66 -880 -1055 601 451 -5 24 -392 -448 751 618 -209
5727 -209 -864 135 355 -81 -73 -774 -680 56 306 -425 -359 -296 -292 -77 645 125 -782 -303 587 238 -3 -427
5749 -427 -580 -109 724 464 -549 -616 -252 -116 236 147 -668 -635 742 280 -93 -56 -437 -165 427 741 -282
5770 -282 -854 330 480 199 113 -202 -744 557 535 -231 -260 -147 34 378 522 153 -699 -214 623 336
5790 336 -115 -87 -61 -42 633 653 -227 -543 277 493 464 413 -579 -643 782 771 67 -250 -165 -38 383 523 -190
5813a90j61L58Q00m81k62L04q17O50K85m66p76O77M47l3J13k78j002O44P32l67
5833A77m44p1N41m29L86O1p00R6M17K80l86K23m96n11J182M04q74o57L25L82M87
5854C93k74p84k88R75L34m28m32J03k2N59N03j200l82P09M36k39j51k78j19L66
5874b19J18K06q73M38M28j32R6J55q42J91P49J98j34p40K32P7M80L86j080q00
5894a066J060L02Q6k6o23k57O54Q27l74o84jK13J17M15l16p30K63Q70l04k98l3
5915I5l64L75O00j61q26M0N81k98M99O0q36m55J142N41q22j45n13M84O64L87j103
5936e5j094R28Q55j81j78n34n03P54J270r30j013j2N31M10L19k46j008J82J127
5955F22o1n95mj31%P21j53p78m0J92K76J88O5o15j74L88O52n69m23j15M55O4L31
$$ plain form
5813 -190 -351 7 807 326 64 368 -449 201 486 20 -756 -79 368 335 448 170 -832 -188 544 177
5833 177 -267 -338 203 -226 160 221 -479 -383 34 314 -72 151 -345 -856 326 730 -144 -801 -476 -94 393
5854 393 119 -665 -953 22 356 -72 -504 -401 -423 136 639 -561 -943 -234 202 -37 -188 -466 -585 -219
5874 -219 -101 105 -768 -330 98 -34 62 217 -625 -434 315 513 379 -361 -129 -52 428 814 -266 -1066
5894 -1066 -6 296 382 356 -267 -524 130 957 583 -101 -102 111 228 643 327 -403 -140 730 426 128 95
5915 95 -269 106 706 545 -281 -241 340 42 541 601 -235 -690 452 993 171 26 -487 -3 661 1048 -55
5936 -55 -1149 -221 634 453 275 -259 -762 -8 1262 332 -681 -693 -162 248 567 321 -687 -505 622
5955 622 561 -34 -38 -169 -169 552 399 -379 -419 -227 49 237 302 -313 -487 -99 553 -16 -439 -554 -99 -35 296
5978B96m82o74M73J018j97n35m28l09M81J120l48j484K94P12K65K30o27p46K25
5997g16J355J44p47r81N14m3Q31K40r36n51P21N07l54J13l39p28N72Q92k56r51
6017g13K3L54P07L14m32j123M22J184j36o74n51k34P39R44k88q24k95R99Rj28
6037B97j7r41J21Q32M59p39m5m46M19M31O03r33r56P42R13J66o45k65m49K94J094
6058I35j54r78j82L47K89M88j18j186j31J198M07n17n18k58M57R16m18q29m07
6077f59M70M53j54J26n06m57J049K97o15l59M0K16J96O76p17r59M20R09j35k04
6097H7m70m26L82R58L4j395O7M45K68K05m8r68O8J098O1k77p16L09q8N12M56j141
6119e79k56O07L69k59J29k08n50O21N81n73m55L41m8K60L77n95o10O25M05k10
$$ plain form
5978 296 -186 -860 -387 631 434 -101 -529 -838 -357 763 415 -1069 -775 -63 202 432 -195 -941 -716
5997 -716 639 783 36 -945 -431 -474 357 597 -339 -890 -169 338 -16 97 -242 -970 -398 494 238 -713
6017 -713 -690 -336 371 685 253 -870 -448 736 600 -74 -625 -859 -120 824 536 -288 -583 416 425 297
6037 297 280 -661 -540 292 751 12 -33 -479 -60 371 974 41 -915 -173 740 906 261 -4 -453 -159 935
6058 935 781 -197 -379 -32 257 745 627 -559 -690 508 915 398 -120 -378 79 995 577 -252 -659
6077 -659 -189 264 110 236 -270 -727 322 619 4 -355 -315 -99 97 773 56 -903 -483 426 291 87
6097 87 -383 -809 -427 531 565 -830 -763 -318 -50 155 107 -861 -793 305 366 89 -627 -318 -406 106 562 -579
6119 -579 -835 -228 141 -118 11 -197 -747 -126 455 -118 -573 -232 -280 -20 357 -238 -848 -223 182 -28
6139b8l53k57L29R3L16K46n64j24J49J65L16Np50j46Q20L75r61O2J39K33J7M41
6161E23p92k11M53N42k93l33qR7J84O58n92o42L88kJ48J22N0p06K06O56L47r60
6183a65J13l39N21J89K89n62n22R53K91m92n6l26o5M08N57j023j21M76K15lj56
6204A82k61m57Q90M91m59o24K52j50L39N66q29n69M62P13j76m05K33n41N0Q74
6224E81l17p35L6L27J84L27l67p24L85R40J83r78j46l36N54N01K80r93o10J104
6244A96P9j68j6m66l50P49N28q07m79K67K51M72P81j217o53M31Q35N1n04k66l23
6265f09L29J015k97j350L99O10L48k52k41m80j59R58P01r50m42J3L49N49M71j272
6285c10n03M46P38m4r0p86j23P20J080m90j119n4N48O68k39m85j031P42J120M
$$ plain form
6139 -28 -381 -638 -309 -216 100 346 -218 -342 -193 -28 288 293 -457 -603 217 592 -369 -307 -168 65 82 523
6161 523 -269 -480 -27 515 222 -111 -119 -22 162 820 228 -414 -26 -28 120 242 292 -414 -208 448 795 -165
6183 -165 -52 -391 130 319 608 46 -476 477 768 276 220 -106 -171 237 794 -229 -350 126 341 338 182
6204 182 -79 -536 354 845 386 -238 14 -136 203 769 -60 -629 -167 546 370 -35 198 -343 -293 581
6224 581 264 -471 -435 -108 76 403 36 -688 -303 637 820 -158 -304 -640 -86 415 695 -298 -908 196
6244 196 275 107 91 -375 -725 24 552 -255 -734 -467 -216 256 1037 -180 -833 -402 433 484 -20 -286 -609
6265 -609 -280 735 438 -912 -513 97 445 193 -48 -528 -687 271 972 22 -420 -407 -58 491 962 -310
6285 -310 -813 -367 371 327 237 -549 -672 48 1128 638 -481 -535 13 681 442 -43 -1074 -332 788 792
6305G92q03l86L3L98Q63r5j407J87J13J055m13nr76j72J091P16k12j226j43N79
6325a1N94M87j308o29N30Q67J39k96p92l08N86Q47j06j244NM00O56R2j84j038
6345g13n0J090M96q15l35l05O19L30L94j152n40O54P17L7k44m92r95J240R94o94
6365B36j013K22M0N75P58p41j127J54J235K58m98l36m42M49Q84J19j518p2P78
6384c9L07J03j1j027J88N29P78p38p37K30Q1P33M12j153n96M42Q74R8n36n21l85
6405i68Q35R06m10p86k67K01O24K86Jj225M34Q79m1j85o29r6O4J031K64j293l74
6426g49M72O37L43j32q66o08J138M14k79o26J87l64R24K50n91q32N11N06k0j32
6446A83j40l18J94J016k14j326K10P59j24M88k61j085Q0R15L41m61m24K33q1L46
$$ plain form
6305 792 -11 -397 -364 34 897 802 -605 -418 -305 750 337 332 -644 -816 275 991 779 -447 -590 -11
6325 -11 583 1070 -238 -867 -337 530 669 373 -419 -727 -141 706 600 -644 -639 -239 417 509 325 -713
6345 -713 -763 327 823 8 -327 -632 -13 317 711 -441 -981 -327 390 427 183 -309 -1304 -64 930 236
6365 236 -777 -555 -515 60 818 77 -1050 -896 339 597 99 -237 -679 -230 654 773 -745 -817 -39
6384 -39 268 371 360 -667 -479 50 828 90 -647 -417 -336 397 809 -344 -940 -498 376 474 -62 -583 -968
6405 -968 -133 773 363 -423 -690 -489 135 421 422 -803 -369 510 469 284 -345 -441 -377 654 918 -375 -749
6426 -749 -277 360 703 571 -295 -903 235 649 370 -256 -69 -433 491 741 150 -682 -171 335 315 183
6446 183 43 -275 -81 935 721 -605 -395 364 240 728 467 -618 -538 377 718 257 -167 66 -15 331
6466C31K84q45l58N30L36o2L22o88m89M06R27k36r54K70L15Q2L46m01p87O72M47
6487D48L5p62LM5M58K49k70o37j62P49k18p2N07o75l96O43M37q5l40J6l20K69
6509g8M81n63p39Q72L73n83P8q3m37M64O62k92o38j0N26M4J21j79r33M88J148
6530G22l93m75l97M38Q6M98n89k58J91%M36k95M8j10k53P07M23j007n9L54O1P6
6552B04J71j87o44O33N06l71n11j00j3L59P03o50n90J03Q51j87l73j01n1K16N99
6573E67J04j070K88J17J56Q1K38m09k87L69O39n55k55l1l40P36L25o84p78O93
6593i6O71j32k62m51k95P09K99r9p53K18J90L83K9l05o91K12O96j12k18r1o34
6614g32L19R91j32j074j07P28J60J77r5o79k75R57M73o27p65p3N29M44L00q38
$$ plain form
6466 331 615 -230 -588 -58 278 216 538 -150 -639 -233 694 458 -496 -226 89 171 517 116 -671 1 448
6487 448 483 -279 -276 -231 227 476 206 -431 -593 156 -62 -134 373 -302 -698 -55 382 297 -43 -27 -347 -78
6509 -78 403 -160 -899 -27 346 -237 -159 -242 -679 -215 447 155 -483 -493 33 77 198 19 -914 -426 722
6530 722 329 -146 -543 -105 -19 479 -110 -368 -177 -177 259 -36 12 -98 -351 356 779 -228 -287 67 128 204
6552 204 375 188 -456 177 683 312 -199 -299 -312 47 750 100 -490 -387 464 277 -96 -197 -248 -32 567
6573 567 671 -399 -111 6 162 243 481 72 -215 154 793 238 -17 -48 -388 348 673 -11 -789 -96
6593 -96 575 443 181 -270 -565 144 443 344 -409 -191 -1 382 411 106 -585 -373 323 211 -7 -98 -732
6614 -732 -413 578 446 -628 -735 -7 153 330 235 -444 -719 238 711 84 -681 -754 -225 219 519 -319
6634c19o83M71Q28L6k82m45n01P50N51J16j040NM52L73J64m51p69M0J067J20m30
6655E3o99O9J03J046J70j250k47M77P56k31J6j121R9Q36P69q16m36Q0Q8O45j03
6676C04n86p39P66N51N02r16j75k98K76J161j25r36l21K32N18M35k81p78n59J450
6696D81O47r47o04j86L43R79J56j209j59K16R11r4k91m38k03N41O10j56p48j0
6716a61K53L38L62n89j062N26O43N40n07n82l77L47J127l1j112n50M52P25L43
6735F85k17j370K44P61O09l72q15J74j19J011J72q65p27K88J041Q8n08l09p25
6754i54Q13P10k14n67n15N95J99O04m80p33k14J098L12p01Om04K1P13M05r29m50
6775f85M64L94J54l22n67k18O20P00k26o61L7J2M85K77n82n67N60M85J87k84m99
$$ plain form
6634 -319 -1002 -531 297 333 51 -394 -895 -145 406 522 -518 -513 -61 312 476 25 -744 -704 363 483 53
6655 53 -646 -577 -474 572 742 -508 -755 -278 478 247 263 -858 -759 77 846 30 -406 -326 -238 407 304
6676 304 -282 -1021 -255 296 798 -118 -293 -591 -315 846 721 -215 -536 -304 214 649 368 -410 -969 481
6696 481 1128 181 -423 -609 -266 713 869 -340 -499 -283 628 534 243 -195 -398 143 753 597 -151 -161
6716 -161 92 430 792 203 -859 -333 310 850 343 -239 -616 -269 858 827 -285 -835 -383 342 685
6735 685 468 -902 -658 103 712 340 -475 -301 -420 591 763 -102 -829 -541 500 588 80 -229 -954
6754 -954 -141 569 355 -212 -727 -132 67 671 191 -542 -756 342 654 -47 -41 -445 -424 289 694 -235 -685
6775 -685 -221 173 327 5 -562 -780 -160 540 314 -347 -310 -298 187 464 -118 -685 -125 360 547 263 -236
6796b36m61J40J005k62l91j08J7N40K29l24n96k99Q89O78p90j37j14j90N86L61
6816E37n20o76M23O25j75K29n92k79N04M71J0p18J23Q3M4M38l17m36N8P03n0l63
6838A22k05L0j27P39j94k60l08K70K58k58K07l34j32L70M10m37m97M39j41J83
6858A35K57j83n44J47O34n17L26j91k13K37M94o00n47L08J37K40K03n6p94L69
6878a58M17ll63j46K12k13Q15k38m63j72N10Pk89L16r51L11O68K41p93j52N35
6899I1k75J93J70k92j74L49L75n73q2N5m05N39L45l12n28J15O59k25p6%l01j04
6921d56Q68l63o38K29K78N60m64J07q10q6J145m4k60l92K76k22M24K57o45m57
6941f93P55R3J75n6k62o67M73Q87n13l00l04L27J45K55k23n85K77N66K04m45l08
$$ plain form
6796 -236 -697 -557 448 186 -205 -313 -296 244 473 149 -447 -746 143 821 31 -106 -220 -410 176 537
6816 537 17 -659 -236 389 214 443 -149 -428 76 547 557 -161 -38 45 89 527 210 -226 -168 535 485 122
6838 122 -83 -53 -180 559 365 105 -203 67 325 67 274 -60 -192 178 588 151 -346 93 -48 135
6858 135 392 209 -335 -188 446 -71 255 64 -149 88 582 -18 -565 -257 -120 120 323 267 -527 -158
6878 -158 259 256 -107 -253 -41 -254 561 323 -140 -312 198 205 -84 232 -719 -408 260 501 -292 -444 91
6899 91 -184 9 179 -113 -287 62 437 -136 -218 -163 -568 -29 316 4 -524 -409 250 25 -51 -51 -352 -456
6921 -456 412 49 -589 -360 -82 478 14 121 -689 -775 370 326 66 -326 -50 -272 152 409 -236 -693
6941 -693 62 155 330 274 12 -655 -182 705 192 -108 -412 -85 60 315 92 -493 -216 350 554 109 -199
6962a99j21L2J081r4j086p8N96M68k47r8p10J96P77kk81q31M22J79J10K76n32
6983a42n35M70M89l26K68l45m87K42J035l74o26pL26Q3M23l18r97rJ278J27o24
7004d9m84K26K38O64k84q96j09N70N34l13j0q27l0J079K74o53m98k63P50O36P5
7025F30p06j108O02J016L0m04q59m1M88Q28n3j050J7N04M89K43p54n43k74J189
7045B44L71k88q25QK55P44K67q24r20R50P72j35j66j070k15N83J062r35k89j3
7065d24N59M19O17j037r92L30Q45L32o37p9p66N09J018j48q31m18P37K58N34j49
7085F77r08m82R66N66m35m33k67J22O90M64r01p62N78O24n5j27n36o86Q94P67
7105G56m49p08mK61M63J41l42o17K28N02P4q0l91l69L58M90J12p20N2J34J34L70
$$ plain form
6962 -199 -320 -288 793 699 -387 -465 131 599 352 254 -456 -260 517 515 234 -597 -175 4 114 390 -142
6983 -142 -677 -207 282 -44 224 -121 -608 -366 669 295 -331 -338 -12 71 494 176 -821 -830 448 575 -49
7004 -49 -533 -307 -69 595 311 -585 -694 -124 410 97 87 -740 -770 309 583 -70 -568 -831 -81 555 630
7025 630 -76 -1184 -582 434 464 60 -799 -840 -352 476 423 -627 -610 -106 383 626 -128 -671 -945 244
7045 244 615 327 -498 -490 -235 509 776 -48 -968 -18 754 619 453 -617 -832 -249 813 -122 -411 -424
7065 -424 135 554 1171 134 -858 -528 317 649 12 -67 -833 -324 694 546 -285 -703 34 292 826 677
7085 677 -231 -713 253 819 384 -49 -316 -194 496 960 59 -703 -125 499 444 317 -219 -905 -11 756
7105 756 307 -401 -405 -144 319 460 118 -499 -271 231 305 225 -166 -535 -177 313 425 -295 -243 -109 25 395
7127C95p0m77p12P85Q72k90p96k65K78J59P67p48m79Q5N96L18m55q3m11M9Q17
7148C35K03r41J81L56J9r2K50q32R5Q48J5m42k67q1j33L33O06p13j93M02J99j53
7170eJ37m61m07L73N03l5m64K98l09M88O22m25q76M3N63L41J68m80l05k17O90
7191B42M76r50K73K00O1Q2Q7p83l02Q64N4m31M2K28l03L29K96k51l92N5N66r0
7213C53O2j62m95L44L68M9j004N40K34k86J39q7n97K52L05L52o00K80q9N7P74
7234G89n93l22l69R88l88j78kk08k7P57po19j59O34j09J9O6o02P7L20M86n57K6
7257B2k56K07J34K64m98k18J12M95j21l99O04r91K64P57n4n86N4J73J63K95l00
7278A21n08n7N69R2k88K24m35K1M95J22q76j95O41K33p8j78l61k12Q95M13n48
$$ plain form
7127 395 325 -152 -864 -79 793 503 -293 -558 -280 -121 646 -102 -581 -496 100 418 -37 -120 -531 -482 335
7148 335 538 -403 -222 134 153 61 311 -521 -426 422 437 -5 -272 -353 -486 -153 453 -260 -453 -51 148 -5
7170 -5 132 -329 -736 -363 140 105 -359 -61 -370 118 740 315 -561 -518 45 386 554 74 -231 -448 242
7191 242 718 -232 41 241 302 384 471 -312 -614 250 304 -127 -85 143 -160 169 465 214 -178 -123 443 353
7213 353 415 253 -242 102 470 519 -485 55 289 3 142 55 -542 -290 15 367 -233 47 -42 15 789
7234 789 196 -126 -495 493 105 -73 -75 -283 -310 447 440 -179 -338 296 187 206 272 -330 -253 67 553 -4 22
7257 22 -234 -27 107 371 -127 -345 -233 262 141 -258 346 -645 -381 376 322 -264 -210 -37 126 421 121
7278 121 -387 -444 125 217 -71 153 -282 -261 234 356 -520 -715 -74 159 81 -97 -458 -670 225 638 90
7299I0o61L38p8P51k9l69o78K32R04j20n54j78j94L11P73j85p37k52O36K18K19
7320D37n41l51q8O57O70l82q12m6J47O71K27p28m27L46M52O0l47l6o96Q28N93
7341F34j73p08j09L28J41M38l43j022O30M48J34m64l29j98M46O20O7p27l67O41
7361H7J87p1J22m45n91J098M56o08p00L28l2M97P57q35r26M05R99j95l62j51m68
7382d48N30O37k03j031K2K37M54L58m23p09J50P00K78o34j48j77J14O48L91q18
7402g2q70P33N17j3l37j82n94Q03O34m13q17o3Q2Q33K64l22j067K93J004J50k43
7423C20n36k43l06J156P33j492p96J058L55p3M91j397J53O26O45q36m62M52l18
7442d70Q76M1l58o31L60P23m24J82l77n32L70R65k19o73l31L78J92O98m51p04
$$ plain form
7299 90 -571 -233 -311 440 411 42 -636 -404 500 380 -174 -352 -546 -235 538 353 -384 -636 0 218 437
7320 437 -104 -455 -543 114 784 402 -410 -456 -309 362 589 -139 -566 -220 232 292 -55 -91 -787 41 634
7341 634 461 -247 -356 -28 113 551 208 -814 -184 264 398 -66 -395 -593 -147 473 540 -187 -554 87
7361 87 274 203 325 -120 -711 387 843 235 -465 -137 -169 328 1085 250 -676 -271 728 533 171 20 -448
7382 -448 82 719 516 -515 -493 -256 198 556 133 -576 -426 274 552 -82 -230 -407 -293 355 746 -72
7402 -72 -942 -209 308 295 -42 -224 -818 -15 619 206 -611 -674 -592 241 505 183 -884 -591 413 563 320
7423 320 -216 -459 -765 391 1124 -368 -1164 -106 249 176 667 -730 -577 49 694 -142 -604 -152 -470
7442 -470 406 447 89 -542 -182 541 117 299 -78 -610 -240 725 506 -167 -498 -120 72 770 319 -385
7462c85l23Q78J09j11l49n31N73N52N24j224o55N94L30K50j39l59l92OJ048q9
7482C07p17M5l46Q70M83lr30l0P21n40K56j72l13O9R24j82m80l58JJ77O39l5o88
7505c02k37O94L77j82q1n20P6K44M06q72o3M33J43j28J85j08l89N19L30o08p7
7526a60K15p1K39j4J53m90j55Q02j92k22N1m67J55O42J52q80j21K94m3O9J84m44
7548c03k25Q90L3m33JJ23m07M60M07m13n27N37J62l68P8rn21O25M04k01k24k09
7570a20J72Q3L23l09l51j55P20p6l40r9J78p4J79M61o96L7L39k09K1O6l82m54
7592f86Q29L85n81k69L48j16J94L53l75m71M20N2J56l35J84l07O0K49n8l43L18
7613Gjo3J90j5m36J19L85M5j25j63JL00r1K37o76k9N88j26l50L60l57n3L76J14
$$ plain form
7462 -385 -708 170 279 168 -181 -712 -139 413 937 -287 -942 -348 -18 232 93 -266 -658 -652 396 307
7482 307 -410 -365 -711 159 642 639 -291 -321 400 -140 116 -56 -369 -300 624 442 -38 -396 -395 -218 421 386 -302
7505 -302 -539 155 532 350 269 -251 -175 69 475 -397 -460 -27 116 -12 173 65 -324 195 525 -83 -160
7526 -160 55 -16 223 209 362 -128 -283 519 327 105 156 -311 -156 486 638 -242 -363 -69 -112 -43 141 -303
7548 -303 -528 362 395 -38 -37 86 -321 139 546 133 -394 143 305 -63 15 6 -515 110 514 313 89 -120
7570 -120 52 135 458 149 -202 -357 363 287 -53 -152 26 -48 131 592 -104 -67 272 63 84 150 -232 -686
7592 -686 143 528 -53 -322 26 -90 104 457 82 -389 31 83 239 -96 88 -219 -159 90 32 -311 7
7613 7 6 -57 133 118 -318 -199 186 231 106 -57 -56 244 153 390 -286 -315 273 147 -203 157 -200 -253 123 237
7637B37n28k44M64K20l73J26r1j85N56J50j01l78j10j23M19K88m08n01M44O20
7657D82n94J08p0k06L27n0K26o10k6O77j2j10j18m52m46Q87P64p03m86J47J45
7678a20L65L12o52r08O95O93k2m40l4m79M88R60p69o84M16R0J46L84l55p29K45
7699c98O73L9m28j24p9K3P99K61r37k13J87N99J13j27k67o33P15N13n28k28p2
7720a12k31N00N33m14p01jR40J09m36k56m91M58O98l07n34o6N50k34J21J99n79
7741b54oO24J70n92J3r0n1P37K67o88m87K01M64k62L30p13j22L52P93n53k15k31
7763c13K73K50K98o88l64l9J277J34n88k54l4J0M11k44m4l27O0N62R7m2q62l86
7785h13J066Q7k89j0p22K64N96J33k01q87L27O06O1J30q22k58M56Q99k67n34n11
$$ plain form
7637 237 -291 -535 -71 149 -224 -98 -189 -374 182 332 231 -147 -257 -380 39 327 -81 -582 -138 482
7657 482 -112 -4 -74 -280 47 -3 223 -387 -413 264 252 142 24 -428 -874 13 777 74 -412 -265 -120
7678 -120 245 557 -95 -1003 -308 385 363 -77 -111 -590 -102 858 89 -595 -179 -89 57 441 86 -643 -398
7699 -398 275 314 -114 -238 -317 -294 505 766 -171 -384 -197 402 515 388 121 -512 203 716 188 -40 -112
7720 -112 -343 157 690 276 -425 -426 514 623 187 -69 -560 -102 596 289 -245 -311 239 5 126 325 -254
7741 -254 -260 364 534 -58 -45 -135 -186 551 818 130 -357 -156 308 46 376 -337 -459 -107 686 133 -82 -313
7763 -313 -40 210 508 -180 -544 -583 694 828 240 -14 -48 -38 373 129 85 -242 -182 380 477 435 -427 -813
7785 -813 253 340 51 41 -681 -417 179 312 111 -776 -449 157 218 348 -474 -732 -276 623 356 -178 -689
7806f89J90L71M92k21o68n7P56M07m60l73j54l1N63o5n09K7L64l76N92K74k96
7827A37q64M62N02P4n30k64j27M91L03k11m15j17Q98j72J77n05k83K02O73l5n36
7848a40j89L80r7K67M81q84k15O06Q9k03rQj86J9M80j75n97L12J03J15j1K43n47
7871a50L02K30J65p47J49J50k16P77k43q45M59J41K0M6l27j2k35O41J21o37J00
7892a11N28l11j99K51l99j12M39J17l44P6J72k46K89Q8J33o30K32M40l47j97L20
7913A89l53j13M20J71m85K41k5j77K11N3l19J09N60m44K22l15k80L38L53J5n12
7934a41k19M94k47K68l5l94LK67K73o20P7L93n4n9K13l17L8r2L55n55ML24J60
7957A36l35J09K04m58K83L82n72L09k36pK25K50Q1q55M44k5ql30O08m20l84Q45
$$ plain form
7806 -689 -499 -128 364 143 -525 -582 174 581 121 -252 -406 -437 126 61 -448 -421 -57 -433 159 433 137
7827 137 -727 -265 237 311 -219 -483 -610 -119 184 -27 -442 -559 339 167 344 -161 -444 -242 431 396 -140
7848 -140 -329 51 -46 221 702 -182 -397 209 298 95 86 94 -92 -73 407 232 -365 -53 50 165 154 397 -150
7871 -150 152 382 547 -200 -51 99 -117 660 417 -428 31 172 192 238 -89 -101 -336 305 426 -211 -111
7892 -111 417 106 -93 158 -241 -353 86 203 -141 -65 107 -139 150 238 371 -259 -27 413 66 -131 189
7913 189 -164 -277 143 314 -171 70 45 -132 79 132 -187 -78 482 38 260 -55 -335 3 356 371 -141
7934 -141 -360 134 -113 155 120 -274 -271 -4 269 -351 -274 119 65 6 219 -98 -60 -152 203 -352 -348 -24 136
7957 136 -199 -90 114 -344 -61 321 -251 58 -178 -185 40 290 371 -484 -40 -65 -73 -403 205 -215 -599 246
7979B46N4m89j62K26J16M6L26m99P8k51N81n64M27L8m14K94M27m86l41O9N04L1
8001B57k57K53o75L13M60n59J62n0j24Q6O56k23m25JK80J31l47L23l50k98P19
8022C33K41o70k40L65J16K60j62l31l39P8P02m09o3k49%J52O78p8p74K18J05L3
8044c4M75k12q23M2O51K20k91j56m88M82Q97l71o23k14L48L17J16m37m73K16Q01
8065D43K2l75o73P30j45M47J32l73p19L87M49M6l38J06p03L58P55l55n74K84N86
8086D90m91J51j21n44j20J228j29k39n31J00Q9M29L70q60o40P22M78N5k82n63
8106d08r0P51N53m57o07o6M26M0J33J66q32L30O22l69p0l4k87k69Q09M4n70j99
8128c84K86k0O38l90q24q1O62O89l53n34l0m0L63N25n75n75N24N62l22M61j167
$$ plain form
7979 246 300 -189 -351 -125 -9 37 363 -136 -58 -309 272 -292 135 173 -241 53 480 -6 -347 -278 226 257
8001 257 0 253 -422 -109 351 -208 -46 -96 -220 -134 522 299 -126 -125 155 286 -61 262 -88 -386 333
8022 333 574 -96 -336 29 145 405 243 -88 -427 -349 353 -56 -119 -368 -368 -216 462 384 -390 -172 -67 -34
8044 -34 441 229 -594 -552 99 319 28 -128 -616 -134 763 392 -231 -445 -97 220 336 -101 -574 -358 443
8065 443 465 90 -583 147 2 449 581 208 -511 -124 325 371 33 139 -564 -206 549 194 -380 -96 490
8086 490 -1 150 29 -515 -635 593 464 225 -306 -206 -117 312 682 -178 -818 -96 382 437 155 -408
8106 -408 -498 253 806 349 -258 -324 102 142 275 441 -391 -61 561 192 122 88 -199 -468 341 385 -185 -384
8128 -384 -98 -118 520 130 -694 -775 -113 576 223 -311 -341 -381 -18 507 -68 -643 -119 443 121 582 -585
8149e85o3N82N09J30j279M07j04L76L45Q5p35O7L35J19k1j20l41j78N64O21r91
8170b77l95M05O96r7m66j28l05O52L03k58j45l34O3L58L48m9n91j01P02j41k75
$$ plain form
8149 -585 -648 -66 443 573 -706 -299 -403 -27 318 403 -332 -265 70 189 168 48 -293 -471 93 714 -277
8170 -277 -672 -267 429 332 -134 -262 -567 85 388 130 -15 -349 -286 72 420 371 -220 -321 381 240 -35
8191c5
$$ Imaginary data points
##PAGE= N=2
##DATA TABLE= (X++(I..I)), XYDATA
0@%%%qJ6j6K4m0M8n6P3q9J12j44J76k09K50k98L49m11M84n63O56p61Q73j003J147
27F10j301J476j674J887k120K381k665K973l317L695m102M553n051N594o193O858
43C604p592Q411r329J0358j1528J2870j4422J6244j8424K1080k4399K8693l4495
56a8929M2815n5843P9315j34800M96847M85151q65444l77232K56104N66920Q0705
67E55609l13390l69699O5715L04657J68197j97898k46401n2817K11617K01187
77C26777l6903k68071j71431L8523J74875J66255K8865k23304k27569Q5082K98439
88A91538R2657k09352k50756M948K66931K07170j65323l31656l3793L11752K50485
99C34601q1921l06883j90890J60703L28899N8100k88058k40394R5287K82343J30087
$$ plain form
0 0 0 0 0 -8 8 -8 16 -24 24 -32 41 -48 64 -80 96 -113 137 -161 188 -223 261 -302 354 -407 466 -537 610
27 610 -691 785 -889 998 -1122 1259 -1406 1567 -1750 1945 -2157 2396 -2655 2939 -3254 3604
43 3604 -3988 4423 -4906 5452 -6076 6794 -7628 8616 -9808 11272 -13127 15566 -18929
56 -18929 23886 -31957 47358 -87442 409405 894556 29112 -348120 -92016 474904 555609
67 555609 242219 -127480 -61765 242892 411089 213191 -33210 -86027 125590 326777
77 326777 289874 21803 -149628 -111105 63770 230025 258890 35586 -191983 -106901 191538
88 191538 284195 74843 -175913 -170965 95966 303136 137813 -193843 -227636 84116 334601
99 334601 252680 -54203 -245093 -84390 244509 302609 14551 -225843 -130556 151787 281874
110B81874j68780k51564r083K14676J22864r0223j54092r4662K5678J59452J20503
121A56643j01639j95079m4906J18270J44065M1650j42148k15096j9007K21279
131c5968J75935r1728k49406r9564K03719K64913m8373l00152j26352J89766K22236
142A05026M357j84981j67175N5743K31517J11244j29556j54631L656J13299J01938
153I0437p411j24856q7348P4809J31817L5657o4180r8170m3911R4184J41345j0052
165A32321j52822r4708N5198J24817N9399r0071j42961M750J48281Q4749o5570
176F3383j26526q0067N0961J60633N9856j50938j52415M8491J52242O1809p5383
187A2046j15299j0486J15785P5003p6327j03676J494P6366P1216N613p4139n5268
$$ plain form
110 281874 113094 -138470 -147553 67123 189987 99764 -54328 -148990 -123312 36140 156643
121 156643 55004 -140075 -184981 -66711 77354 119004 -23144 -238240 -257247 -35968
131 -35968 139967 48239 -201167 -300731 -97012 167901 119528 -180624 -306976 -117210 105026
142 105026 109383 -75598 -242773 -187030 44487 155731 26175 -128456 -124800 -11501 90437
153 90437 83026 -41830 -129178 -54369 77448 113105 48925 -49245 -93156 1028 142373 132321
165 132321 -20501 -115209 -60011 64806 124205 34134 -108827 -104077 44204 128953 63383
176 63383 -63143 -143210 -92249 68384 128240 -22698 -175113 -126622 25620 87429 12046
187 12046 -103253 -113739 2046 77049 722 -102954 -101460 -25094 46122 51735 -22404 -77672
199g7672M7638O5286j392j1752J209l5664k4584N2167N1760k7117n5539j2353
211b8013M9674P7327l974j10486n9667Q4856Q9728k9456q4294m2766L0660P5459
223D9048K1260p6280n3943M8288N1667k1179m2590k1165N334K8566J885l9516
235d8625K352N3690j871n7024m711M1071J5135q556k0003l2683N760N2599J8781
248A5915l2068j9123J0588K4923L4330j548n3245k3652L6377K5565J470P671j9005
261H198m1354J9000O6495J6291m0584m3791k0234L1663O2404r448q9387l6522
273g7269O6338P6100K877p8042q6735K9039J25381L0907j23265r8263M5740J02845
285A5653M0386n8831r0413M049J02336N0712o3220p3483j0770L6241O3912L1673
$$ plain form
199 -77672 -30034 35252 33860 22108 23317 -12347 -36931 15236 66996 39879 -15660 -28013
211 -28013 21661 98988 95014 -15472 -75139 9717 99445 69989 -14305 -57071 -26411 49048
223 49048 70308 -5972 -59915 -11627 40040 18861 -23729 -44894 -39560 -10994 -9109 -48625
235 -48625 -46273 7417 5546 -51478 -56189 -15118 17 -8539 -28542 -61225 -55465 -2866 15915
248 15915 -16153 -35276 -24688 235 34565 33017 -20228 -43880 -7503 18062 19532 27203 8198
261 8198 -33156 -14156 52339 68630 28046 -15745 -35979 -4316 58088 48640 -40747 -77269
273 -77269 -10931 65169 68046 -9996 -96731 -67692 57689 88596 -34669 -132932 -87192 15653
285 15653 56039 -2792 -93205 -89156 13180 63892 672 -72811 -83581 -47340 16572 48245
297D8245n8369p3682J7586P9624N7962J266p1036q5224K6065J23512M8817q8824
309B5942j05516K959J21871J16769m6621j64472n2738J24783J19511k1422j20026
320A040j00276L0618J44915P4537r8748j27111N788J07705Q0102l6704j32531
331e0665p5985Q2655J21752M035r3714q1516J480R8289R9678l5829j34786o1346
343a25952O6909J01566L7361p3975j23378o476J45170J13084n7081j46613o5224
354a34609R8272J66539J2479j87813j34760J08224J98262M3271j35481j46309
364a11925J2925J64856J09173q8727j56471l4363R2147J04032J7439r5515j05510
375i1939K6931J25312O5915n7385j22649q0806O4134J63445M6241j55046j56449
$$ plain form
297 48245 -10124 -83806 -66220 13404 71366 72632 1596 -83628 -57563 65949 114766 25942
309 25942 -79574 -76615 45256 162025 115404 -49068 -101806 22977 142488 121066 1040
320 1040 -99236 -68618 76297 150834 52086 -75025 -69237 38468 118570 81866 -50665
331 -50665 -126650 -43995 77757 81792 -11922 -93438 -91958 6331 106009 70180 -64606 -125952
343 -125952 -59043 42523 79884 5909 -117469 -123945 21225 134309 77228 -69385 -134609
354 -134609 -36337 130202 142681 -45132 -179892 -71668 126594 169865 34384 -111925
364 -111925 -99000 65856 175029 86302 -70169 -104532 -12385 91647 109086 13571 -91939
375 -91939 -65008 60304 126219 68834 -53815 -134621 -70487 92958 139199 -15847 -172296
386a72296M0000J79387J08316r5550j97709m3167J76789J48628p8234j86260o9201
397a89297J15648J76343L7179j57834j49837N4144J69662P4174q2046j37774m8377
408a38015J08407J40836n915j31222q3150N1503J31722Q3657p7043j70520m6201
419a35941J39467J40301j8133j39329j09350M8714J71357Q0064j25668j67276
429a15794N1J50456J21778n6000j89119r0410J38789J83788j0607j65849j08322
440a41239N5373J46111O7096j05173j47381J470J30722R0523l3744j10321p6642
451a23205N4762J37642N0465r2617j14237j8782R0113J18213K952j39689r6855
462a31238Q8510J55782K6428j21598j25981J9763J55666R4107r6346j52134j5475
$$ plain form
386 -172296 -132296 47091 155407 59857 -137852 -181019 -4230 144398 66164 -120096 -189297
397 -189297 -73649 102694 139873 -17961 -167798 -113654 56008 130182 48136 -89638 -138015
408 -138015 -29608 111228 105313 -25909 -109059 -57556 74166 157823 80780 -89740 -135941
419 -135941 3526 143827 125694 -13635 -122985 -74271 97086 177150 51482 -115794
429 -115794 -115743 34713 156491 100491 -88628 -179038 -40249 143539 132932 -32917 -141239
440 -141239 -85866 60245 127341 22168 -125213 -123743 6979 97502 63758 -46563 -123205
451 -123205 -68443 69199 119664 27047 -87190 -105972 -15859 102354 105306 -34383 -131238
462 -131238 -42728 113054 139482 17884 -108097 -88334 67332 161439 65093 -87041 -102516
473a02516J12824J02892q890j14433r0378N6715J27937K4642r6034r5601o980
484h9822Q6333R2832k1561j20220o1555O5589R5692K3353o9922r6531l665J01468
496A991O3301n8895q8415j6218N6956P9959K3147p6537q5423K0115R3068N0650
508F3699l7195q7305m1406P4841J05558j1514j05151m5450O2177Q7332K1815p4031
520A3370q9305J8193J00921L8781n8198n8298J500M6991M7191r198n7614k6423
532c2089K6156K7880J0439n060m1282l9310L0906O4456P455m7065m0888k84M6947
545H261M0301l6493p2828j504O6361M0896k0161n2139l1708L8081O9265L33o4048
558a5383k8148K8654K9065O957j3633k4368Q362M1831J1408k6375j3114O360J325
$$ plain form
473 -102516 10308 113200 104310 -10123 -100501 -43786 84151 108793 12759 -82842 -89822
484 -89822 -3489 89343 67782 -52438 -113993 -48404 47288 70641 719 -95812 -99477 1991
496 1991 65292 6397 -82018 -98236 -41280 38679 61826 -14711 -100134 -80019 13049 63699
508 63699 26504 -60801 -102207 -27366 78192 66678 -38473 -83923 -21746 65586 87401 13370
520 13370 -75935 -57742 43179 81960 23762 -34536 -33036 13955 61146 51948 -5666 -32089
532 -32089 -5933 21947 32386 27326 -13956 -53266 -22360 42096 49551 2486 -38402 -38686 8261
545 8261 48562 12069 -60759 -62263 4098 44994 24833 -27306 -59014 -20933 48332 48665 -15383
558 -15383 -43531 -14877 14188 21145 7512 -16856 -8494 33337 44745 18370 5256 11616 12941
571A2941P809P145r839l248R854r448r650K8562K3763k5037k9459O055J6559M384
585C0391j3581k7208k56L9701J4493l4745j8415K0621J0669j1310j2477p484P496
598b105J4935j8605l2664K1985N0623o451m8560j1951L4816L3372j3146n9646
610c7397k9471N7688O5584k4234o4738j0522M2318M1323L673m3408l9857K1284
622a7757M4021k573k9928j2191L834J9425L1007P24l7464k5094O054J9867K7387
635B7312N61n3684m1801L8341O5326P289m7191n1027j485O2340N0383m6990q8772
648g9398j2039P0955O6750o948q1144o1676N4314J06814Q324r5515o6778K9589
660f6752Q0352M4101m6336q1016j743P9779N2222k3136n2908l3678J6704N9555
$$ plain form
571 12941 20750 27895 18056 14808 24662 15214 5564 34126 57889 32852 3393 9448 26007 30391
585 30391 16810 -10398 -10654 29047 43540 8795 -9620 11001 21670 10360 -2117 -9601 -2105
598 -2105 12830 -5775 -38439 -16454 34169 27718 -20842 -32793 2023 35395 22249 -37397
610 -37397 -66868 -9180 56404 32170 -32568 -43090 -772 40551 44224 816 -39041 -17757
622 -17757 26264 23691 -6237 -18428 -14594 4831 35838 36562 -902 -25996 -19942 -75 27312
635 27312 27873 -25811 -67612 -29271 36055 43344 -3847 -54874 -56359 5981 56364 9374 -79398
648 -79398 -91437 -20482 46268 39320 -41824 -103500 -49186 57628 65952 -29563 -96341 -66752
660 -66752 13600 57701 11365 -69651 -71394 8385 60607 37471 -15437 -49115 -32411 27144
672B7144L0564l9243n4595j1140L7868O6122L0456o4978r0573J5534J05468N3813
684A06440o3544j08091k6834J01163J08722l7261j33757m4079R3179J01681p457
695I0162j05723q6240M1500J16727L4224q2311q0122P891P2618O4420j4484q5427
707b6765n1252M4798P5680K2278m6782p6350k2013Q2730R3689k1087j04525n4709
719h4308N1338J00406L9821q2804j15060P226J23886Q0138n3236j17570m6598
730i6761Q9034J25408p438j37986q3756O7232J17279L1470q4810j07336K289J14250
742B8875P4187n6403j00131l1225N2190P7902J8293p2742p9505J0503P8581N8629
754E9154j5467q5094o9805M7262J17925K9441j00477j01608J6025J15766Q4827
$$ plain form
672 27144 57708 18465 -36130 -47270 -9402 56720 87176 22198 -68375 -52841 52627 106440
684 106440 42896 -65195 -92029 9134 117856 80595 -53162 -97241 -4062 97619 90162
695 90162 -15561 -101801 -60301 56426 90650 8339 -71783 -63892 8726 73146 58662 -26765
707 -26765 -78017 -33219 42461 64739 17957 -58393 -80406 2324 96013 74926 -29599 -84308
719 -84308 -32970 67436 107257 24453 -90607 -83381 40505 120643 67407 -50163 -96761
730 -96761 -7727 117681 110243 -27743 -111499 -44267 73012 104482 19672 -87664 -85375 28875
742 28875 103062 46659 -53472 -84697 -32507 45395 63688 -9054 -88559 -78056 525 59154
754 59154 43687 -41407 -111212 -63950 53975 83416 -17061 -118669 -102644 13122 97949
765I7949n7477j36081k7890J17284J02625l2423j13209o2442N7835J15788K7748
776H9707r6515q7444K9553R4984N4401l6155r2056m2952O7094R2279Q30q2016
788h290o9780J3134Q9829O8669m7222j05407k3123P8211P3861q095q0393p1422
800i0028K8216J03568M2859p2158r0439n173Q2981Q6110j6329j12688o5988O6449
812d2620J04798J4635p9618q0463J4371J04397O3500o4775r8228p9Q2998O0657
824G9573k1789p9251m6868M8228Q1969J4648n0456m7838o680M1842N7468k73o7669
837B904m7423K7555O2379L0583l6085p2343j4151P6667O4587l6262q4334l2714
849e8637M7648P5044R026q0614o5097L9986Q2983J7924n1337n6610p238N1742
$$ plain form
765 97949 40472 -95609 -123499 -6215 96410 63987 -49222 -111664 -53829 61959 89707
776 89707 -6808 -94252 -64699 30285 84686 48531 -43525 -86477 -19383 72896 73726 -8290
788 -8290 -78070 -64936 24893 93562 46340 -59067 -82190 -3979 69882 61787 -18606 -90028
800 -90028 -61812 41756 84615 12457 -77982 -83155 -174 85936 69607 -43081 -109069 -42620
812 -42620 62178 76813 -2805 -83268 -68897 35500 99000 34225 -64003 -64082 18916 79573
824 79573 57784 -21467 -68335 -20107 61862 76510 26054 -21784 -28464 13378 70846 70573 2904
837 2904 -44519 -16964 45415 75998 39913 -32430 -46581 30086 94673 58411 -25923 -58637
849 -58637 -10989 64055 73081 -7533 -72630 -32644 50339 68263 16926 -39684 -46922 4820
861D820M7193k4973o2040j4960L7653L9250O951l2483l8727R923M6768J7471k5311
874A1535k9863j7892J0105M1830K7264k8383m2424k452L3400L6119J817m7591
886f535m1849K9865N7840p11n0889l1615K2756N5338K3166m8528n7798J6576N7515
899B5131J0592l7244k9495K101K5633J8246j3436j7173J1754R459j6135o868J4672
912b763J04j6162l912Q887J1916P248j3803k0411J5803L3553n719l4012j1476
925c0747J5925J8169L915j5401j1191J8355J9377j6993j8755J6034J8817p354
937A0151j5897j1424K263K1105J3684j8426j4660J6341J4871q341j4140q445M384
950h534K1222N831k9259k1234K0449K7313M731j3262k0926p958K1291J8190j6792
$$ plain form
861 4820 52013 27040 -35000 -49960 -12307 26943 33894 1411 -37316 -27393 19375 36846 11535
874 11535 -18328 -36220 -26115 15715 42979 14596 -27828 -30280 3120 39239 41056 -6535
886 -6535 -48384 -18519 39321 38610 -12279 -43894 -21138 34200 57366 8838 -48960 -32384 25131
899 25131 35723 -1521 -31016 -28915 -3282 14964 1528 -15645 -3891 5568 -10567 -17435 -2763
912 -2763 -2659 -18821 -22733 -13846 -1930 5318 -8485 -28896 -13093 20460 14741 -19271 -30747
925 -30747 -14822 3347 7262 -8139 -19330 -975 18402 1409 -17346 -1312 17505 10151
937 10151 -5746 -17170 -14907 6198 19882 1456 -13204 3137 18008 9667 -4473 -12918 -8534
950 -8534 12688 18519 -10740 -31974 -11525 15788 20519 7257 -13669 -21627 -336 17854 1062
963A062k2733N173J2582P380M562p886j3851N777J6773K674l550p100k0735o262
977b6134L4606K8800k0451l7833o956L3026M1155k514n5834l3764M1108N2768
989D7977q091m7530k8215J9661N2264K2329m4621n0168J2278M6040J9213j6814
1001B4323l6556k7109J9899M7493J3119l1276l5318q353K8689M2727k217n6293
1013b0872l4986L1764M8799J0703l5512m7298j24O0361M2909l5408o3696j4773
1025e8133M2341N4677O711n9957n4489K9990P3594K1591m6051n4827m678N6059
1037F828N2331k6303p2448k0271N0998N4420L933m9406n1562J1173O5290L5202
1049F0185l3627n4568k4386K7776O0341K2172n6427o1659J6429O9607L7687l5835
$$ plain form
963 1062 -21671 -16498 -3916 3464 8026 140 -13711 -7934 8839 11513 7963 863 -19872 -26134
977 -26134 8472 37272 16821 -21012 -27968 5058 46213 43699 -12135 -45899 -4791 47977
989 47977 39886 -7644 -35859 -16198 36066 58395 13774 -36394 -24116 21924 41137 24323
1001 24323 -12233 -39342 -19443 28050 41169 9893 -25425 -33778 -5089 37638 35421 -20872
1013 -20872 -55858 -24094 24705 35408 -104 -47402 -47526 12835 55744 20336 -43360 -58133
1025 -58133 -15792 38885 45596 -14361 -68850 -38860 34734 56325 10274 -44553 -49231 6828
1037 6828 59159 32856 -39592 -59863 -8865 45555 49488 82 -51480 -40307 24983 60185
1049 60185 26558 -28010 -52396 -24620 35721 57893 1466 -60193 -43764 25843 63530 27695
1061B7695p4810k5406O7643P5236k2900q7683l8675M9002P8172K1607o5212p3775
1073f9106J5550P9438L7423l9742o2064k1460M3515O6932N665o4276m7758K4679
1085c1204O2324L4376l1751p3413k5076O3684O8966j3253o9058m3016K8272P4266
1097D5117L5430n6588p6503K372O8964M7792k2497p0172m0158M6978Q0379P340
1109F8454o9663n5843J6410O6416M4445l7220q3666k0498O8670O4422j4654o5886
1121a8613m3504K9304P4072K4605n9322o3414O129N5701M4184j1912o1418m0007
1133f4195L9492P0194J2880n2667n5368k511N9806N6019k7069q1126k5683N9003
1145a1225O7352P36o4795n8619K5201Q0400K6110o0638o2732M113N6020M8261
$$ plain form
1061 27695 -47115 -72521 -4878 70358 47458 -40225 -78900 -29898 48274 69881 4669 -69106
1073 -69106 -53556 25882 63305 23563 -38501 -59961 -16446 50486 56151 -8125 -55883 -31204
1085 -31204 31120 65496 33745 -39668 -64744 -1060 67906 54653 -14405 -57421 -29149 45117
1097 45117 80547 23959 -52544 -50172 18792 66584 44087 -26085 -66243 -19265 61114 68454
1109 68454 -1209 -57052 -40642 25774 70219 32999 -50667 -71165 -2495 61927 47273 -18613
1121 -18613 -62117 -32813 41259 65864 6542 -56872 -50743 4958 49142 37230 -24188 -64195
1133 -64195 -24703 45491 58371 5704 -49664 -52175 7631 63650 36581 -44545 -70228 -11225
1145 -11225 56127 56863 -7932 -66551 -41350 39050 65160 4522 -58210 -54097 1923 50184
1157E0184j4351o4926l1774M2356N5607L561m3312m6299k696N1153M3634k4012
1169A9125n5366j5679L3845M5964J3106m1472n3322P320N8061K9989k9341m9108
1181c6878j7577L9737N8383J814o1417l8985L0656N4594J5667l9659n4087N79
1193d7173O1828L9272l2776m9707m585L5205L4973j886m1410l0020J9718L4273
1205A7712P992j4182k1385j4393J6683L5871N868l1643k8799J111K9631L1113
1217C5579j2795n2116j7142M7201M5242j2201m8707k7987K5222N2663O491n2149
1229a0699l3887K7450L9457N085k1950k3085J828K7348J6299j7179j9256j342
1241i931L653R994J6122k601k2171r190J4174J8733R065j3760l0379l979L2888
$$ plain form
1157 50184 35833 -29093 -60867 -18511 37096 40657 -2655 -48954 -51650 -497 43137 19125
1169 19125 -36241 -51920 -18075 27889 40995 -477 -53799 -46479 11582 41571 12230 -36878
1181 -36878 -54455 -14718 43665 45479 -15938 -54923 -24267 30327 45994 6335 -47752 -47173
1193 -47173 14655 53927 21151 -28556 -33141 2064 37037 35151 -6259 -36279 -16561 17712
1205 17712 25704 11522 -9863 -24256 -7573 28298 34166 2523 -26276 -25165 4466 35579
1217 35579 22784 -29332 -46474 727 45969 33768 -14939 -42926 -17704 34959 41450 -10699
1229 -10699 -44586 -17136 22321 27406 5456 -17629 -15801 11547 27846 10667 -8589 -9931
1241 -9931 -6278 3716 19838 17237 -4934 -14124 50 18783 27848 14088 -16291 -20270 12618
1254A2618J8751k2604k6089P77K1667K2571l584l1438j5335K2301K1204q734j8908
1267f803r608M400J9284Q903j7909j4315J2172J2157n279o168k254k488K284K056
1281c568n565K361J3351l657j5125K972J4351J360q053q636l360J1050J3413r953
1295I41j6894P410J6486o23o434j898k267J035K487m740j382J1139o77j5251J728
1310h940J8505L396j4184j0877Q37J4608J5193j3629k9874O1K9893J5357j1987
1323H359j9291r463J3789K4896l323k9085j0422J7247J6391L806r939j9601l625
1336b0261K4474J9218j1032j8966q391M346J8876J2778j5466k1914M915J9894
1348H471J2852n97j7874k1393P766L2016J0590k1939k5315m863K2431L3008j748
$$ plain form
1254 12618 31369 8765 -17324 -16547 5120 27691 24107 -7331 -22666 -365 20839 12105 -6803
1267 -6803 -16411 -12011 7273 16176 -1733 -16048 -3876 8281 3002 -3166 -5420 -7908 -5624 -3568
1281 -3568 -9133 -6772 6579 2922 -12203 -9231 5120 6480 -1573 -10209 -13569 -2519 10894 941
1295 941 -15953 -8543 7943 7320 886 -1012 -3279 -2244 243 -4497 -5879 5260 4583 -10668 -8940
1310 -8940 9565 12961 -1223 -12100 -11263 3345 18538 4909 -24965 -24904 4989 20346 8359
1323 8359 -10932 -20395 -6606 18290 14967 -14118 -24540 -7293 9098 12904 2965 -16636 -20261
1336 -20261 4213 23431 12399 -6567 -14958 -10612 8264 21042 5576 -16338 -11423 8471
1348 8471 21323 20726 2852 -18541 -10775 21241 31831 9892 -15423 -20286 2145 35153 33405
1361C3405m0956k0340K9789L4851k795l5029l0620J1820M6538J7775l6580l6352
1373b8494R937L2499J8789r944l0139j7433J8669K6344N97j6816j8407p199J9846
1386a751L3465j88l8140k4539J5447L4294J7320k4642m5209l306M9899L3363k5657
1399B0356m5996j1936L3635M4771o49n3837l5569K6636M7726J1686k9181l8440
1411c0798l510M2080L4587k2163m7214j1069K8607L3663N648l5395l8169J1238
1423c2495M5660K1658j9455l5012j9571J9436M2968Q730m0737l6878J1049M2697
1435H050L0652j7268n4144k1478M7118N2507j0639n5847l3826K5031N7266J9931
1447D7353m8056n0437J8071N6261K2351k9132m4502j3849L4887M1617n365l9746
$$ plain form
1361 33405 -7551 -27891 1898 36749 33954 -1075 -31695 -19875 26663 44438 7858 -28494
1373 -28494 -18557 13942 32731 22787 -7352 -24785 -6116 20228 20825 4009 -14398 -21597 -1751
1386 -1751 31714 31526 -6614 -31153 -15706 18588 35908 11266 -33943 -37249 12650 46013 20356
1399 20356 -25640 -37576 -3941 40830 40181 -13656 -49225 -22589 25137 36823 7642 -30798
1411 -30798 -34308 7772 42359 20196 -27018 -38087 -9480 24183 29831 -5564 -43733 -32495
1423 -32495 13165 34823 15368 -19644 -39215 -19779 23189 31919 -8818 -45696 -34647 8050
1435 8050 38702 21434 -32710 -54188 -7070 45437 34798 -21049 -54875 -29844 27422 47353
1447 47353 -703 -51140 -33069 23192 45543 16411 -28091 -41940 -7053 34564 29199 -10547
1459a0547k1264J3469L0277K2069j3401l9433j4088K9985L3219j452l3423l4424
1471c9013O727N1444L1465l3274n1181m467M1043L8222q007n1779l1663L3360
1483a7123N3111J845m4481l3677J2675M7720K9228l1044n4120n481M2806L2428
1495C3887q539l5770k5453J7911M2589J0995k9941k6857M69K0794K4407L59l1927
1508g076k5173J5455L4056J5526j5682l5346j5472L3834M2017j2202n0487k2452
1520d3002K8800M5385R356m2931m1339J9352N2486J1933l6603l3376K898L0435
1532C394K3530j4184l3594n649K4205J8113J43j1879j8666p739J8395K1235l643
1545A3661j9917j7090K544K7962K2655j8923l6389m39L1914K1523j2211l3502
$$ plain form
1459 -10547 -31811 -18342 11935 34004 20603 -18830 -32918 -2933 30286 28834 -4589 -39013
1471 -39013 -32286 19158 50623 17349 -33832 -38299 2744 40966 32959 -18820 -50483 -17123
1483 -17123 35988 37833 -6648 -40325 -27650 20070 49298 18254 -35866 -41347 1459 33887
1495 33887 25348 -10422 -35875 -17964 24625 35620 5679 -21178 -20709 85 24492 24851 -7076
1508 -7076 -32249 -16794 17262 32788 17106 -18240 -33712 122 42139 29937 -20550 -43002
1520 -43002 -14202 31183 40539 -2392 -43731 -24379 28107 40040 3437 -29939 -27041 3394
1532 3394 26924 12740 -20854 -26503 -2298 15815 15958 4079 -14587 -22326 -3931 17304 13661
1545 13661 -6256 -23346 -20802 7160 29815 10892 -25497 -25936 5978 27501 15290 -18212
1557a8212j7546K5441L8113l435l6197j6204J7902K6139P987j9742k7717K879
1569b0592K8475J0099j5706j5420j424J0543J6700J835j6955j1963O929R112L915
1582E548N06j0759j2315P391J8082L901r054j0796o506J1657J9977m694k6132
1595a3194p942J9107J7496j418j6830j4381J0310K5355J469k3093j0531J0172
1607c480J0527K422n259r238J259J1516R49o179K721K922p950k954O674K707k691
1622C946k749l347J320J0900J778j1954l500Q718K429n061k295k706m9O708J760
1637E898o583K45N473k268k905K861j453m427L028J583m058J762M673l995k803
1652b969N775K085k219N26n444q317O095J3431k013j1019m190L977J0521P433
$$ plain form
1557 -18212 -35758 -10317 27796 24361 -11836 -28040 -10138 16001 23988 4246 -23471 -20592
1569 -20592 7883 17982 2276 -13144 -14568 -4025 12675 14510 -2445 -14408 -7479 1633 5548
1582 5548 6054 -4705 -17020 -9629 8453 12354 3300 -7496 -14002 -2345 17632 12938 -13194
1595 -13194 -21136 -2029 15467 14049 -2781 -17162 -6852 18503 19972 -3121 -13652 -3480
1607 -3480 7047 9469 4210 -5028 -3769 7747 8696 2517 5238 8160 210 -2744 3930 6637 3946
1622 3946 1197 -2150 -830 10070 11848 -106 -3606 5112 7541 2480 185 -2521 -2570 4138 5898
1637 5898 -685 -440 5033 2765 -140 2721 1268 -3159 -131 1452 -2606 -844 3829 -166 -2969
1652 -2969 2806 4891 2672 3198 -2246 -10563 -4468 8963 6950 -4069 -8259 -4282 6239 13672
1666A3672j1634j7055O648J9230J148j5659j0520J442J3071J4071m910j7482m069
1679a2047Q650N109K438L01j0550r738P568J3077K127p338j1697l643J7330J7705
1693A9292j2055k8031m095K1193J8711k106k2905j7763J5524L0517K244k5165
1705d639j7270O020J9275J4714r816k5401n702K1682J7294l521j3939j2498K830
1718a0971K0767R945j7023j9541J212J5923J6606K527k0809k0742J0628K7471
1730A5993R306j5658k3168r076K0483K8162n813l2700j2843K3127K8700K841k8321
1743A033k9947Q911L8751J4339k6332k7427N41K2588K2116l379k6630j3232J6117
1756b551J8608L96j1663j6676o840J8065K3594l013k3219j5120P419K4862J5836
$$ plain form
1666 13672 2038 -15017 -8369 10861 12009 -3650 -14170 -12728 343 14414 9504 -7978 -12047
1679 -12047 -3397 1712 4150 4451 -6099 -15837 -8269 4808 6935 -403 -12100 -15743 1587 19292
1693 19292 7237 -20794 -24889 -3696 15015 12909 -9996 -27759 -12235 18282 20526 -4639
1705 -4639 -21909 -15889 3386 18100 8284 -17117 -22819 -1137 16157 12636 -1303 -13801 -10971
1718 -10971 9796 19741 2718 -16823 -15611 312 16918 19445 -1364 -22106 -11478 15993
1730 15993 25299 9641 -13527 -22603 -2120 26042 20229 -12471 -25314 -2187 26513 29354 1033
1743 1033 -28914 -20003 18748 33087 6755 -20672 -20131 2457 24573 21194 -5436 -18668 -2551
1756 -2551 16057 16453 4790 -11886 -18726 -661 22933 19920 -3299 -18419 -11000 13862 29698
1769B9698j9108l5968j600L4758K3137j4862l2629j3643K3802L6127L8l7303k1999
1782b9552J6295K6767Q280j8387k6269j146L0136K0709j4397k6075j0868J2988
1794a1519K6169J0786k2657l0108J273K5925J9019l832k2537j8032J3592K9784
1806A7863K993k6304k2316N680K7149K2305j3461l7681j2476L1942L2830l412
1818B5112l1693k6728J0785L7545J4272l0414l0393Q344L1523J7649j2941l0418
1830a7357j1481K3878K6306m793k3416j4867L527K0339J8697q199k6356r241J7063
1843e900K3038N502k0963l0213K284L6122K0622k0493l1168l896K6178K7636o194
1856B2555l6744j6912K5926L0044k276k6539k0207O318K9734J7531j6463k5356
$$ plain form
1769 29698 10590 -25378 -26978 7780 30917 16055 -16574 -30217 -6415 29712 29750 -7553 -29552
1782 -29552 -13257 13510 21790 3403 -22866 -24012 6124 26833 12436 -13639 -24507 -11519
1794 -11519 14650 25436 2779 -27329 -26056 -131 18888 15056 -7481 -25513 -11921 17863
1806 17863 20856 -5448 -27764 -22084 5065 27370 13909 -23772 -36248 -4306 28524 25112
1818 25112 -6581 -33309 -22524 15021 29293 -1121 -31514 -23170 8353 26002 13061 -17357
1830 -17357 -28838 -4960 21346 16553 -6863 -21730 -18203 2136 20833 12634 -13722 -22963 -5900
1843 -5900 17138 22640 1677 -28536 -26252 9870 30492 9999 -21169 -25065 1113 28749 22555
1856 22555 -14189 -31101 -5175 24869 22593 -3946 -24153 -17835 11899 29430 12967 -12389
1868a2389k492J5033J4311J390j5279j6654O431K2169P631j2721j5964n784J4095
1881b23K2638O55k6089j8011R842K1314J1690r878k4377o530K3940K0728j0380
1894A5319k4177q737J2504K1397M524k2594j9308J2499K2724L360j2853j3220
1906h562q58J3170J1163p642j4949j792P297O335O399j499j2828o217R258J0345
1920I620J194q564j2590j172J7391J0644j4450j6784M672J7028R579p035j8951
1933i418q319J5538J5162o258j3120k919M846O538M425n313q386J674O091M70
1947A011r81k137p676j057J0324O484m787n855l065J178P397M658q397q667L893
1962g677O877J483o88m914n103O136J0453j952r812l275K445N261M682m152q954
$$ plain form
1868 -12389 -14881 152 14463 15853 574 -16080 -9649 12520 20151 7430 -8534 -14318 -223
1881 -223 22415 23070 -3019 -21030 -11188 10126 21816 11938 -12439 -18969 4971 25699 15319
1894 15319 -8858 -17595 -5091 16306 20830 -1764 -21072 -8573 14151 17511 4658 -8562
1906 -8562 -9420 3750 14913 7271 -7678 -9470 -2173 4162 10561 9062 -3766 -9983 -725 9620
1920 9620 10814 2250 -10340 -11512 5879 16523 2073 -14711 -10039 6989 16568 9533 -9418
1933 -9418 -17737 -2199 12963 6705 -6415 -9334 -4488 2050 6475 1162 -7224 -5550 541 1011
1947 1011 30 -2107 -9783 -10840 -516 5968 1181 -4674 -7739 -6561 836 5494 -2903 -11570 -7677
1962 -7677 -800 683 -5 -4919 -10022 -3886 6567 4615 -5197 -8472 -6027 -766 3916 -236 -9190
1977i190K695J0491P49o017k120Q30J849L480k269n684K346N494l763l108N758
1992A541L348l351k390m94M88M527m70p549j837R034L699n152k956L12J317M460
2008D527J575o325k918L141O50j412L467J664n254r54L708K292J414j826p807
2023d058k878J0812O831q051r110L93Q190R826l03j4638r815J1276J4382l034
2037I823j2971q663M542J5744P799j3989j5118N986J4924L813p903j1458m231
2050a1702R641J2016l457j0674k171K785N065O391r52j2158p116O858J0465M651
2064I642p684j6043k427K0177J6728j2682k2908l670J7059J7591l160k4096j3015
2077b4488J7930K3365k972j9844j0633P509J6260P284j2466j5860J072J2367O897
$$ plain form
1977 -9190 -6495 3996 4745 -1272 -3392 -2562 -713 2767 498 -5186 -2840 2654 -1109 -4217 1541
1992 1541 4889 1538 -852 -1346 -858 3669 3199 -4350 -6187 2847 6546 1394 -1562 -1250 67 4527
2008 4527 6102 -223 -3141 0 650 -762 2705 4369 -885 -1839 1869 4161 5575 3749 -4058
2023 -4058 -6936 3876 10707 2656 -6454 -6061 2129 11955 11652 -2986 -12801 -1525 12857 9823
2037 9823 -3148 -11811 -7269 8475 16274 2285 -12833 -6847 8077 11890 3987 -7471 -11702
2050 -11702 -2061 9955 6498 -4176 -6347 -3562 1503 7894 6942 -5216 -12332 -5474 4991 9642
2064 9642 1958 -14085 -16512 3665 20393 7711 -15197 -18867 -1808 15783 12623 -11473 -24488
2077 -24488 -6558 16807 13835 -6009 -16642 -9133 7127 14411 1945 -13915 -12843 -476 6421
2090F421l84o414r843O06J3805Q112p208j2569p000O549J7582O343j7537j7098
2104a8635P249K0546Q696j0420j9345o036J9129J8680q967k2842o845J4610J9047
2117A4867M605j8409j9053O750K2529P143j2856j5527l825J2889J5886j926j7670
2130d597p902R576J2835N386p242j6486p004J4048J6369j346j4226j2591K520
2143a0660J9550J3799j4310k3452j300K1694J5145p361k4004j2104J8040K6402
2155B1439j374k4178j3313R467J8289P315j3268j9168L70J8036J1057o414j2043
2168c785q899M311J6884Q947j2219j7184k222J2093J3851J793j7411j4544J0424
2181g961K1480M128j6241j6656r08J9078J7277r790k4108o604J6953J7818Q87
$$ plain form
2090 6421 6037 -377 -10220 -9614 4191 12303 5095 -7474 -14474 -7925 9657 16000 -1537 -18635
2104 -18635 -11386 9160 17856 7436 -11909 -17945 1184 19864 10897 -11945 -18790 -4180 14867
2117 14867 19472 1063 -17990 -11240 11289 18432 5576 -9951 -13776 -887 14999 13073 -4597
2130 -4597 -12499 -2923 9912 15298 8056 -8430 -15434 -1386 14983 13637 -589 -13180 -10660
2143 -10660 8890 22689 8379 -15073 -16373 5321 20466 13105 -10899 -23003 -4963 21439
2155 21439 20065 -4113 -17426 -7959 10330 17645 4377 -14791 -14421 3615 14672 8258 -3785
2168 -3785 -12684 -8373 8511 17458 5239 -11945 -14167 -2074 11777 13570 -3841 -18385 -7961
2181 -7961 13519 17647 1406 -15250 -16158 2920 20197 10407 -13701 -20305 -3352 14466 15353
2194A5353j6793j6126O210K2155P032j7610j6858J717J6232J3949m575j9309q525
2207a7148J3543J5031j078j0710j0460o20J2710J0544o219j4558m464Q516J3960
2220I047O691j2909j9311J468J9954J1125r847j7220n608J3853J8768l282k1185
2233h456q287J4326J4818n13j2609j2496K183J5447P409p854q346j097K964P218
2247D707M584p227r921J531Q859N683k047r085p901P203J4619J325j1977q172
2261g819K382Q459O494m031j2205j839J0813P632k661p275o249J102J1309N794
2275A1906q448j0200J036O847N656k36p322n564O854Q566k920o878k923j11M034
2290B97O049j005p049k492K646L295M168j3q032m679P167O144l817o840k850M118
$$ plain form
2194 15353 -1440 -17566 -11356 10799 17831 221 -16637 -14920 1312 15261 10686 -8623 -17148
2207 -17148 -3605 11426 10348 -362 -10822 -11442 1268 11812 5593 -8965 -13429 -4913 9047
2220 9047 15738 2829 -16482 -15014 4940 16065 6218 -11002 -16610 -2757 16011 12729 -8456
2233 -8456 -16743 -2417 12401 11888 -721 -13217 -11034 4413 11822 3968 -4378 -5475 -2511 4707
2247 4707 9291 2064 -7857 -6326 2533 8216 6169 -2916 -10817 -3614 11005 12330 353 -7819
2261 -7819 -5437 3022 9516 5485 -6720 -8559 2254 9886 7225 -50 -6299 -5197 6112 11906
2275 11906 3458 -6742 -5706 1141 6797 6561 -761 -6325 529 9095 6175 -703 -3626 -3737 297
2290 297 6346 5341 -1708 -4200 -1554 1741 5909 5896 -2136 -6815 352 6496 2679 -4161 -7011 -2893
2306b893R271K202j0374q040O302P911k6n009m354r81M866M153l572l596J934
2321b206J797q06K087l26n053j055K874R55Q43R77l319k569M047L987k344k932
2337c043q74r14K775M465k876o317L82M668L081Q00k497n585R77O253r2n102M2
2354c857K084M21J098M32j794qJ143j047J27M986r84q904j696Q332N822j563o534
2371a942n130N284J0331j592j2382k310Q882O131k583o560m011M062Q751O51p268
2386C14k304K493J22J427K944k780m548N08L657L941J927n522q272K958J2071
2401H936J916j0101q446K056R603Q412m837j3876k108J2017Q510l901j0076p141
2415i036M424J2107L832j0338q230L127P606N175j920q806o040O385Q783j604
$$ plain form
2306 -2893 6378 8580 -1794 -9834 -3532 4379 4353 -656 -5010 -5991 -1125 3028 -544 -4140 -2206
2321 -2206 -409 -1215 872 546 -4507 -5562 -2688 -1733 -890 87 -3232 -5801 -1754 2233 -111 -3043
2337 -3043 -3917 -4831 -2056 2409 -467 -6784 -6402 -1734 1347 2147 -350 -5935 -4958 1295 1203 -3899 -3857
2354 -3857 -1773 -1352 -254 178 -1616 -1624 -481 -1528 -1401 3585 2601 -6303 -7999 333 6155 4592 -1942
2371 -1942 -7072 -1788 8543 6951 -5431 -7741 1141 7272 4689 -1871 -5882 -1820 6931 7582 314
2386 314 -1990 503 625 2052 4996 2216 -2332 -1824 1833 5774 7701 2179 -6093 -3135 8936
2401 8936 10852 751 -7695 -5639 3964 12376 7539 -6337 -8445 3572 12082 8181 -1895 -9036
2415 -9036 -4612 7495 11327 989 -7241 -4114 3492 8667 6747 -2059 -8099 -1714 7069 5465
2429E465n799m839q00P079Q234k825j0819m116O204P245K687o758j1273M65J3987
2444D137P441q964j1227q43R459J0824l069j5531o754J1519J1833k167r567p216
2458a0125K982J1628N462q588r289K92N823N560J560o372r158J592J1328N873
2472H568m578r439n986O338J3456J398j3972r353N843J2104N373o437j2838k473
2486a1996J3160J0042n971j1799m612N523J1116M884j0861j1066L451J1512O165
2499I548m653j1104n752Q344J2533j087j1967o135M799R056O121n081j2469k366
2513a0213J0806P831k081q328q358J913J3632P586r369j2820j84J0803J0370j819
2527I769j4888r210J0558J4495R9j2839p940L897J2013O799q390j3202Q39J0452
$$ plain form
2429 5465 -334 -5173 -5973 1106 9340 6515 -4304 -8420 -2216 5029 7716 958 -10315 -9850 4137
2444 4137 11578 2614 -8613 -9456 3 10827 7758 -7773 -14527 -3008 8825 6658 -2909 -10125
2458 -10125 -7143 4485 9947 1359 -7930 -7638 -1815 3745 5305 -1067 -10225 -8633 2695 8568
2472 8568 3990 -5449 -11435 -5097 8359 9757 -4215 -13568 -7725 4379 9752 3315 -9523 -11996
2486 -11996 1164 11206 5235 -6564 -11176 -5653 5463 10347 -514 -11580 -8129 3383 9548
2499 9548 4895 -6209 -11961 -3617 8916 7829 -4138 -10273 -5474 3582 9703 4622 -7847 -10213
2513 -10213 593 8424 6343 -1985 -10343 -8430 5202 12788 3419 -9401 -9585 1218 11588 9769
2527 9769 -5119 -14329 -3771 10724 10823 -2016 -9956 -6059 5954 12753 4363 -8839 -8000 2452
2541B452N942j955p357o800K400J0858M501o444p967j674M987Q964J026j0908
2555a975q674P209J1292K045p783r574j135J1604R625o778j2236k446P056P986
2569F216J974p915q910L605J0628K821o435o889k182O262Q702j513j0308m536
2583h480O678O245J813l487p599j900P350N615k628n473l359M80O392N723m055
2598C315q922q4O639N077j357p539n842N607J0500j129r751m303N387O436K935
2613F969m983p959O60P340K004l637k738l56O27M289J790m490l169J573K569K023
2629B512J142m868n671L559P192R29l746l605j737M173N857j784p016j346M255
2644a54L050L27k159m454P29O837J931m802l788R48J939K855J97m273k221M343
$$ plain form
2541 2452 8394 6439 -918 -7718 -5318 5540 10041 3597 -4370 -6044 -1057 7907 8933 -1975
2555 -1975 -10649 -3440 7852 9897 2114 -7460 -8595 3009 12634 5856 -6380 -8826 -1770 6216
2569 6216 8190 275 -8635 -5030 5598 8419 1984 -4905 -7087 -825 7877 6364 -3944 -8480
2583 -8480 -1802 4443 6256 2769 -4830 -6730 620 6235 3607 -1866 -5225 -4745 1647 7370 3315
2598 3315 -5607 -5691 948 6025 4668 -2871 -8713 -3106 7394 6265 -3486 -7789 -2402 4034 6969
2613 6969 1986 -5973 -5313 2027 4031 394 -2344 -2700 -2073 2216 4006 -484 -3653 -2080 489 2512
2629 2512 3654 -1214 -6885 -3326 3866 4795 1049 -2556 -4293 -120 5737 3953 -3063 -4409 -154
2644 -154 2896 3223 1064 -3390 -2661 4176 6107 1305 -2483 -1535 404 3259 3456 -817 -3038 1305
2660A305J974j380N1M1k191j32J725m67K68M03k370j449M273K645l861l731K491
2677d05L164R41j906n614j098O530L837m789l720J835J700Q71o66j717m46K403
2693I20o61l710J656L514j530k773J581K062L70j335l703j215N439M124n184n583
2709f028K068M782J809j098l826k669M252L776l280l353O74J091R39J527q06k669
2725b811L70K455l61O04jl246j645L713L482j879k695j519l08N053L878m654o392
2742e956J503N072K466j419m974k874N407P401k092q588j263L778M891J754m692
2757D14n682J063O567J598k335j548j802l07L799K916l149l958k84J865M381K248
2773E786n502o214L374Q964Q83n727o514o63P588O769m538r287l99P134M027o29
$$ plain form
2660 1305 3279 1899 1950 1991 -200 -332 1393 926 1194 1597 -773 -2222 2051 4696 835 -2896 -405
2677 -405 2759 3700 1794 -3820 -4918 1612 5449 660 -3060 -1225 475 1346 680 -1037 -1483 920
2693 920 259 -3451 -1795 1719 189 -2584 -1003 1059 1429 94 -3609 -4824 615 4739 -445 -6028
2709 -6028 -3960 822 2631 1533 -2293 -4962 -710 3066 -214 -3567 -2893 -1802 -863 664 -142 -2811
2725 -2811 -2441 14 -347 257 256 -2990 -4635 -922 2560 681 -2014 -3533 -3841 1212 5090 436 -5956
2742 -5956 -4453 619 3085 1666 -3308 -6182 -775 6626 4534 -4054 -5317 -1539 3352 5106 414
2757 414 -5268 -4205 2362 3960 1625 77 -1725 -2032 1767 4683 1534 -2424 -2708 -843 3538 5786
2773 5786 284 -5930 -2556 6408 7291 1564 -4950 -5613 1975 8744 4206 -5081 -5480 1654 5681 5052
2789E052m973m790K403O524J155n347l687Q66K815M903M63p005m319M561N865
2804D486M02l568n960j241O580N854l623o784o14L638M325K021m943p012J432
2819e007P634K864l866n220k795M157Q850J44r654n002M577P374J792m752p843
2834f747j87Q891N082n420n821n59L433M411J669n331n966J915N505K712p07m721
2850a841n256L179Q384J234o999n367R44O363N580l417r571j590Q905N618k497
2865C669o310m387K953P945K383p677n921L169N393L498j219o818l211N587O353
2880E407j456n755l045J324N007M690l776o165n16N380L188N26m148n256K81P363
2896C049L858m784n475j421M362P306K81q942n262N735P545N9n700n523N48P642
$$ plain form
2789 5052 79 -4711 -2308 4216 5371 24 -3663 -2797 18 4921 5384 -1621 -5940 -1379 4486
2804 4486 4888 1320 -4640 -5881 699 6553 2930 -3854 -4468 -830 3495 5516 573 -6439 -5007
2819 -5007 2627 5491 1625 -3595 -6390 -2233 6617 6761 -2893 -7895 -3318 4056 5848 1096 -6747
2834 -6747 -6934 1957 7039 1619 -4202 -4761 -1328 3083 4752 -579 -6545 -4630 875 3587 2880 -1841
2850 -1841 -7097 -3918 4466 5700 -1299 -6666 -5722 641 6221 2804 -6767 -8357 548 6166 3669
2865 3669 -2641 -7028 -4075 3870 6253 -1424 -7345 -4176 1217 4715 3496 -3322 -6533 -946 5407
2880 5407 3951 -1804 -4849 -3525 1482 6172 2396 -3769 -4285 1095 4283 4809 661 -4595 -4314 3049
2896 3049 6907 2123 -3352 -4773 -411 6895 7176 -1766 -7028 -1293 6252 6311 611 -4912 -4364 3278
2912C278M661n929n895J166M159K609J51l617m593J681M777J448j616j919l531
2927c170O08O499K720n995n310J313M889M065j747p218k469O802O116l058n765
2942a720j768J720M790K219n179m387K038N099M81r70k858k402K128M807r75l862
2958h39j940J541J304K473j19m244j043L455J471o38r83k813j311L864L093k555
2974G16l624k52K378K959J494m121m959K611N551n16l942j894O25L042K978k901
2990A45m000K094L016q98j491M28q18m50J823j19j76J262j076k222J637L720j192
3007A683m091l19J723K554Q55k721l487K380M663p51l449p37J093J259J338j565
3023D28k360P50K755n77r41O09l10j414J233J050j483N7O14j646M51K846k89k556
$$ plain form
2912 3278 7939 2010 -3885 -2719 1440 4049 4200 583 -4010 -2329 2448 3896 2280 361 -3170
2927 -3170 -2562 3937 6657 662 -4648 -3335 1554 5619 3872 -3346 -5815 987 7103 4045 -1720
2942 -1720 -3488 -1768 3022 5241 62 -4325 -2287 2812 3293 2323 -535 -2937 -809 3998 3023 -839
2958 -839 -2779 -1238 66 2539 2420 -1824 -2867 588 2059 1421 438 -2375 -3686 178 3271 716
2974 716 -2908 -3160 -782 2177 3671 -450 -5409 -2798 2753 2237 -1705 -3599 -2974 68 3046 145
2990 145 -3855 -1761 1255 357 -1134 -706 -1524 -1974 -151 -270 -446 816 -260 -2482 -845 2875 1683
3007 1683 -2408 -2727 -1004 1550 2405 -316 -3803 -1423 3240 2489 -960 -1697 -604 655 1993 428
3023 428 -1932 -1182 1573 996 55 664 354 -1060 173 1223 -260 -203 411 -1235 -784 2062 1773 -783
3041g83k03J330K40O64n10l110K2L767R72k546j096N8J232K115R0l843o68L194
3059I25N30j854j0K23q89J574R88j284k88P35j843q88L562J091l194k268J684
3076a206K003K294j732m168n63N313K418m447l589P84K710L118j02m434k182L346
3092d37K406j030r88j228j523J296L444r85k916k07M82J916K241p40n070r74M316
3109CK283r26k249k717R02M784J264l722k883J296K235J644J51l625k974K851
3125a683M762p30l073j664M79L246K860l392m673J070M083J379q65k242k353J396
3141a400L708Q44k979o15n03k29K783J827l337l196K030L293J589j821m145j824
3157c975M639N376k481n728j247K796L690J232l525m378K130N335ol039k484o78
$$ plain form
3041 -783 -986 344 584 1248 738 -2372 -2350 1417 2389 -157 -1253 -1195 37 2152 2242 -1601 -2269 925
3059 925 1455 -399 -409 -186 -1075 499 1487 203 -85 650 -1193 -2081 1481 2572 -622 -2890 -1206
3076 -1206 797 3091 1359 -2809 -3372 1941 4359 -88 -3677 -2893 -183 2935 2833 -1601 -3783 -437
3092 -437 1969 939 -49 -1277 -2800 -1504 1940 955 -1961 -2168 -1686 230 2471 1731 -3339 -4313 3
3109 3 2286 1360 -889 -3606 -2704 2080 3344 -378 -3261 -1965 270 1914 2065 -1560 -4534 -1683
3125 -1683 3079 2349 -724 -2388 -1909 1337 4197 805 -3868 -2798 1285 2664 1799 -443 -2796 -1400
3141 -1400 2308 3152 173 -442 -945 -1174 1609 3436 99 -3097 -1067 2226 3815 1994 -2151 -3975
3157 -3975 664 6040 3559 -2169 -3416 -620 3070 4302 777 -3601 -1471 3864 3858 819 -1665 -2343
3173b343K340L915l23m500j828K484K283J210q35l465j710L385K632p52k797j666
3189a970K6L564L117k876m371N5K980K860l90l831l896K671O317l6n602k505J330
3206b557M277K816l162n541K16M970J644k547j761n73R53K543P12k884j353R66
3222a281M62J170J508k355l860Q05M444K088k183l628k192L639N165j952o269
3237d439j132M732L191m81l706l345K302N324N65m972k010J271J866K392k42l515
3253b199j718K513K571r9m75k310k210K786L566j188k746q64N31J874K606j673
3269I65m070L34L507J542j462k068k160J448M883Q19m493k375K292K580P11j618
3285H35k950j80M092J177k765j431Q52J046P87J020j388j972N37P45n2J788k20
$$ plain form
3173 -2343 -3 3912 3589 -911 -2739 -255 2028 3238 2403 -1062 -2772 613 3245 2493 -304 -1970
3189 -1970 -1944 1620 4737 1861 -2510 -2455 525 3385 2995 -836 -4732 -2061 4256 4220 -1382 -3887 -2557
3206 -2557 1720 4536 1374 -4167 -3951 1019 2663 116 -1645 -2218 -1265 1278 1990 -894 -2247 -1281
3222 -1281 -819 351 1859 -496 -4356 -3551 893 2981 798 -2830 -5022 -1383 3782 1830 -4439
3237 -4439 -5571 -839 2352 1871 -1835 -5180 -2878 2446 3011 -1961 -3971 -2700 -834 1558 1316 -2199
3253 -2199 -3917 -1404 1167 1068 593 -1717 -3927 -1141 2425 1237 -1509 -2373 -1842 32 2638 965
3269 965 -3105 -2771 736 2278 816 -1252 -3412 -1964 2919 3738 -755 -3130 -838 1742 2453 835
3285 835 -2115 -2295 1797 2974 209 -1222 -370 676 1463 2483 1095 -877 -340 405 353 2141 1921
3302A921k830n20L468J284j463k366q83J352L541j98m222j907L313K829n20k048
3318G51j614k44L262J337k713k007N98Q27R53P90r20k268P91J740Q9l54m97j515
3336i94l14K903L58k213j059M73N27J873K86k722j797K156K052j115r94j134m54
3353b168K569J969k438k009J051J289J47j01j290j089J347J767j087j528Q85O95
3369Iq76J023L22j491J46K22m27O87J444j341k202J761K262n95j642n10k78J732
3387B46J977k108k447R93K246m92n12L03j018N10J254o70j450J374j7j231R73
3404f9J229j179r94O74N51O06P20j708j684J230K197l89j608k63K76J136J460
3421B185j473k473R92K141K33l92j251j048L43K787L44k248j451J074Q83Q72l9
$$ plain form
3302 1921 -909 -1429 2039 3323 1860 -506 -1389 -37 3504 3306 -916 -2823 490 3319 2799 751
3318 751 -863 -1107 2155 3492 779 -1228 -630 197 1150 1940 1020 -1248 -457 1283 1372 1018 521 -994
3336 -994 -1308 1595 1953 -260 -1319 -846 -319 1554 1840 -882 -2679 -523 1529 414 -580 -1714 -2168
3353 -2168 401 2370 -68 -2077 -1026 263 410 309 -981 -2070 -723 1044 -43 -1571 -686 9
3369 9 -867 156 478 -1013 -867 -645 -1072 -385 1059 -282 -2484 -723 1539 944 -698 -1208 -1486 246
3387 246 2223 115 -2332 -1339 907 415 -97 206 -812 -302 952 282 -1168 206 189 -1042 -69
3404 -69 1160 -19 -1013 -339 212 818 1538 -170 -1854 -624 1573 1184 -424 -687 -411 725 2185
3421 2185 712 -1761 -769 1372 1605 1213 -38 -1086 -743 2044 2388 140 -1311 -237 646 1518 1479
3438A479k096j121J894J609n84n10p63r65R09K029m73k298m42N93R08J680r47
3455I02l091K49L321J199k151j775j116J037L217Q5l358p81K077R21l78r66j095
3472a703l84K646R25k396r41OQ46P88J532j082k522L52J853N61M6j087k181J027
3490a714K929N84k908j273N93K038K063p70l556j520K904K444l13j864j948r1
3506b402L293K164k633k686N13J824J151Q2j672j918J313J715k4o43N6p92n53
3523a212K209P01j949j690N74J567J858n9l228k172L515K816j185k612j246J227
3539h86K684K03l355j536K924K771q35j874j128k94J781J919j396j069k83J74
3555b00m7J807O41k421j240J800J613m3j445k010j55L502K112k866l037J063J643
$$ plain form
3438 1479 -617 -1738 156 1765 1181 671 -92 -1057 -148 1881 1408 -890 -1332 -739 169 1849 902
3455 902 -2189 -1940 1381 2580 429 -1346 -2462 -1425 1792 1877 -1481 -2262 -185 736 358 -608 -1703
3472 -1703 -2087 559 1484 -912 -1853 -1847 -1001 -213 1319 237 -2285 -1933 -80 481 527 -560 -2741 -1714
3490 -1714 1215 1799 -1109 -2382 -1789 249 2312 1542 -2014 -3534 -630 1814 1501 -363 -2311 -2402
3506 -2402 891 3055 422 -2264 -1751 73 1224 1306 -366 -2284 -971 744 720 77 133 -659 -1212
3523 -1212 997 1698 -251 -1941 -1367 200 2058 1999 -1229 -3401 114 2930 1745 -867 -2113 -886
3539 -886 1798 2001 -1354 -2890 34 2805 1970 96 -1032 -1326 455 2374 978 -91 -374 -200
3555 -200 -247 1560 2201 -220 -1460 340 1953 1910 465 -1545 -1700 1802 3914 1048 -1989 -926 717
3572G17J652n5k823j856K384K287j127j667q12K78J768J685j466k408L51J997
3588I05p3n87l45j249P17J678M82j812k95l55P3J818J120k386k047J106J624O96
3606A070k34j619j676K632K749j948l118L38J420J778M36j879k340J139K814m73
3622A089j239R8l77m10J374Mj325k44J169j84P31Q57j755j904J456J816k4j030
3640A02j080r02J881J912j405k144N88J788K85M3j647j337R78K146Qj900r5L39
3658d40M66J377j82k208k72J810M53l81l58q93m54J763R86p12n45n60l17N87J536
3677A656m56j742n18J360R10M32j308j479M29K742O61k741j137Q65R63J089m46
3694A280j812l07J808J58q61M7q3l11j9Q73n89n52L23k37L01J115J98k336k46
$$ plain form
3572 717 2369 2314 -509 -2365 19 2306 1179 -488 -1300 -1022 746 2431 965 -1443 -1092 905
3588 905 832 245 -100 -1349 -632 1046 1528 -284 -579 -934 -861 957 2077 -309 -2356 -1250 374 1070
3606 1070 836 -783 -2459 173 2922 974 -2144 -1806 -386 1392 1828 -51 -2391 -1252 1562 1089
3622 1089 -150 -52 -429 -839 535 539 -786 -1030 139 -45 686 1543 -212 -2116 -660 1156 1132 102
3640 102 -978 -1880 1 1913 508 -1636 -1048 740 1025 1068 -579 -1916 -938 1208 1216 -684 -779 -440
3658 -440 26 1403 1221 -987 -1259 551 1004 623 265 -628 -1082 681 1667 955 410 -150 -467 120 1656
3677 1656 1200 -542 -1060 300 1210 1642 334 -1145 -716 2026 2687 -54 -1191 -326 637 1726 1280
3694 1280 -532 -839 969 1127 266 313 230 -81 -100 773 184 -368 -45 -282 19 1134 1332 -1004 -1250
3713a250J585O81j121M1j028L00K039K53k331p97J469Q22J90o84j357m77J935
3730B70Q28j392n21J95J56O40O94j164j646J018J253k39j9n59p89R2J630r3r49
3749e95k14l69m20J878O76k029j522J753J229L34l52j773j098K420J396j998j142
3766a826P54P60L83M10j181j076J278J267j187k76M89o08l84J101K84q97o3k15
3784i87K60J118Q41j974r36J158J305K7j423l54J2J329J457j459j964R38J284
3801F32N30l82o61j208R46J562m36j130P9N72k2J171l19j458k81J167M08j096
3819G4R58o39p28J113J229q30m30n79M3Q13J234j136k224M84J901O70j55j686
3837A12j523J105K874p67k690j53J768P29j35q36j412R49J187K82j607j13L28
$$ plain form
3713 -1250 335 1016 -105 -64 -1092 -792 1247 1500 -831 -1628 -159 663 853 169 -1188 -1665 270
3730 270 1098 -294 -815 -620 -464 176 870 -294 -1940 -922 331 92 73 -486 -1275 -1183 447 354 -595
3749 -595 -809 -1178 -1598 280 956 -1073 -2595 -842 387 721 369 -1404 -2502 -82 1314 -684 -1826
3766 -1826 -1072 -312 71 481 -700 -1776 -498 769 -418 -694 -205 -813 -1197 -96 188 -709 -772 -987
3784 -987 -727 391 1232 -742 -1678 -520 785 812 -611 -965 -953 376 1833 374 -1590 -652 632
3801 632 1162 780 119 -1089 -143 1419 983 -147 -68 504 482 1653 1334 -124 -405 762 1170 74
3819 74 1032 393 -335 778 2007 1177 747 168 211 1024 2258 1122 -1102 -618 1283 1953 1798 112
3837 112 -1411 -306 2568 1801 -889 -1042 726 1455 1320 484 -928 21 1208 1490 -117 -230 98
3854I8q38O43R66m03j145M54l98N90J087o67k248j7K621K98j379j316m02J773
3872b83J729q74k556Q2K081K10p04m74j045P44J569r1j755k15J046o4K83P51r58
3891e24q58Q61J81l64M76j16p13K81J264j83p23q33J51R37J296k40k379l21J808
3910AR91j004l92m95J55J471J82j930m57J608O37m62k57n53J54K24M26n74O59
3929C84L95j268m96J842J94j000n16M09L50J291l75k261k00J938J237j412o83
3946a71k63N68R69M40j430j009J541L17l83k13k17r75N66J711p15n75k4p1J17
3965A83Q01m59j076L84O92K05m12l3n65l01J455K42j118l22oJ66L66P81q74j410
3985a301J074R44l14p76j40n14J314Q72q40j492L60J069J6r6k95p52K43Q13l90
$$ plain form
3854 98 -740 -97 869 466 -679 -225 -623 -33 1054 387 -1861 -1878 743 1041 -338 -1654 -2056 -283
3872 -283 1446 572 -1984 -1902 179 389 -315 -789 -1834 -1090 479 388 -1367 -1582 -536 -600 -317 434 -524
3891 -524 -1382 -521 -340 -704 -228 -344 -1057 -776 488 305 -418 -1251 -1100 -163 1133 893 -1486 -1807 1
3910 1 992 -12 -404 -899 -744 727 909 -1021 -1478 130 767 305 48 -505 -351 -127 299 -275 384
3929 384 779 -489 -985 857 1051 51 -465 -56 294 1585 1210 -1051 -1251 687 1924 512 -171
3946 -171 -434 134 1103 1543 113 -896 645 962 579 366 149 -826 -260 1451 736 161 137 66 183
3965 183 984 525 -551 -167 525 730 318 285 -280 -581 874 1116 -2 -324 -330 -164 202 983 109 -1301
3985 -1301 -227 717 403 -373 -513 -1027 287 1159 319 -1173 -813 256 272 176 -119 -871 -628 185 -205
4004b05r13Q94j56q10R85M02m22q65M38L14M50O71j166j053P63J267n79o09K32
4023c62n55P40J425r42j787N42J093O6N1M2o97m72J002M28j225M94O2k40P62K70
4043F97r18o08P79K51J79L24r2j821P75J501l50r04K17p31O10J499p95j581J77
4062g91J856L32n54p94p19Q42J376l00j802Q3J209K67p40L74p09m44R54N14m35
4081E19k46J3r21L21J571J92j866N3O75J14O83m66j855M53J823N06j869k56M13
4100a43R4J013k16j464J75R50O19j018k03k40j6J114M56j182q68P55k08N98M45
4119F61p86o23L30J024m29m94J01m21k5J215J99j534j02O40J47O55j67j549J46
$$ plain form
4004 -205 -1118 -224 -380 -1190 -205 197 -225 -1090 -652 -338 112 783 -383 -1436 -673 594 15 -594 -362
4023 -362 -917 -177 1248 306 -1481 -939 154 220 271 313 -384 -856 146 574 -651 -157 -95 -335 427 697
4043 697 -221 -829 -50 201 380 704 612 -1209 -434 1067 717 -187 30 -701 -91 1408 613 -968 -791
4062 -791 1065 1397 843 49 -670 172 1548 1248 -554 -471 738 1005 265 639 -70 -514 440 954 519
4081 519 273 286 -635 -314 1257 1449 -417 -364 311 425 1108 642 -1213 -760 1063 1569 -300 -556 -143
4100 -143 -49 964 748 -716 -541 409 1028 10 -193 -433 -449 665 1121 -61 -929 -174 -382 216 661
4119 661 -125 -748 -418 606 177 -317 -216 -637 -662 553 752 -782 -884 -244 -97 558 391 -1158 -1012
$$ [...]
8191b9
##END NTUPLES=NMR FID
##END=
