##TITLE=1H_TG-2292-F
 CDCl3, 8 sc, 
 23.9.2020
##JCAMPDX= 6.0         $$ Bruker NMR JCAMP-DX V2.0
##DATA TYPE= NMR FID
##DATA CLASS= NTUPLES
##ORIGIN= UXNMR, Bruker Analytische Messtechnik GmbH
##OWNER= root
$$ XWIN-NMR		Version 3.5
$$ Wed Sep 23 10:00:22 2020 Russian Standard Time (UT+4h)  she@DPX200
##.OBSERVE FREQUENCY= 200.1315066352
##.OBSERVE NUCLEUS= ^1H
##.DELAY= (6, 6)
##.ACQUISITION MODE= SIMULTANEOUS
##.ACQUISITION SCHEME= undefined
##.AVERAGES= 8
##.DIGITISER RES= 18
##SPECTROMETER/DATA SYSTEM= spect
##.PULSE SEQUENCE= zg30
##.SOLVENT NAME= CDCl3
##.SHIFT REFERENCE= (INTERNAL, CDCl3, 0, 15.7039)
##AUDIT TRAIL= $$ (NUMBER, WHEN, WHO, WHERE, WHAT)
$$ ##TITLE= Audit trail, XWIN-NMR		Version 3.5
$$ ##JCAMPDX= 5.01
$$ ##ORIGIN= Bruker BioSpin GmbH
$$ ##OWNER= she
$$ F:/spectra/data/she/nmr/H-F/1/audita.txt
$$ ##AUDIT TRAIL=  $$ (NUMBER, WHEN, WHO, WHERE, WHAT)
(   1,<2020-09-23 09:59:28.37 +0400>,<she>,<DPX200>,
      <created by zg, POWCHK disabled, PULCHK disabled
       configuration hash MD5:
       00 E9 B6 7A A2 85 ED C7 34 08 36 98 17 FE 4E 26
       data hash MD5: 16K
       19 9F F5 07 96 7C D4 6B 33 CF 77 8B 92 51 9D 6A>)
$$ ##END=
$$ 
$$ hash MD5
$$ A6 33 1C 26 42 5B AE E9 97 82 62 89 4E D6 3C 72
##$RELAX= 
##$RELAX= 
##$RELAX= 
##$RELAX= 
##$RELAX= 
##$RELAX= 
$$ Bruker specific parameters
$$ --------------------------
##$DU= <F:/spectra>
##$EXPNO= 1
##$NAME= <H-F>
##$PROCNO= 1
##$TYPE= <nmr>
##$USER= <she>
##$AMP= (0..31)
100 100 100 100 100 100 100 100 100 100 100 100 100 100 100 100 100 100 
100 100 100 100 100 100 100 100 100 100 100 100 100 100 
##$AQSEQ= 0
##$AQ_mod= 1
##$AUNM= <au_zg>
##$AUTOPOS= <>
##$BF1= 200.13
##$BF2= 200.13
##$BF3= 200.13
##$BF4= 200.13
##$BF5= 200.13
##$BF6= 200.13
##$BF7= 200.13
##$BF8= 200.13
##$BYTORDA= 1
##$CFDGTYP= 0
##$CFRGTYP= 5
##$CHEMSTR= <none>
##$CNST= (0..31)
1 1 145 1 1 1 1 1 1 1 1 1 1 1 1 1 1 1 1 1 1 1 1 1 1 1 1 1 1 1 1 1 
##$CPDPRG= <>
##$CPDPRG1= <>
##$CPDPRG2= <>
##$CPDPRG3= <>
##$CPDPRG4= <mlev>
##$CPDPRG5= <mlev>
##$CPDPRG6= <mlev>
##$CPDPRG7= <mlev>
##$CPDPRG8= <mlev>
##$CPDPRGB= <>
##$CPDPRGT= <>
##$D= (0..31)
0 1.2 0 0 0 0 0 0 0 0.06 0 0.03 0 0 0 0 0.0002 0 0 0 0 0 0 0 0 0 0 0 0 
0 0 0 
##$DATE= 1600840767
##$DBL= (0..7)
120 120 120 120 120 120 120 120 
##$DBP= (0..7)
150 150 150 150 150 150 150 150 
##$DBP07= 0
##$DBPNAM0= <>
##$DBPNAM1= <>
##$DBPNAM2= <>
##$DBPNAM3= <>
##$DBPNAM4= <>
##$DBPNAM5= <>
##$DBPNAM6= <>
##$DBPNAM7= <>
##$DBPOAL= (0..7)
0.5 0.5 0.5 0.5 0.5 0.5 0.5 0.5 
##$DBPOFFS= (0..7)
0 0 0 0 0 0 0 0 
##$DE= 6
##$DECBNUC= <off>
##$DECIM= 32
##$DECNUC= <off>
##$DECSTAT= 4
##$DIGMOD= 1
##$DIGTYP= 9
##$DL= (0..7)
0 120 120 120 120 120 120 120 
##$DP= (0..7)
150 150 150 150 150 150 150 150 
##$DP07= 0
##$DPNAME0= <>
##$DPNAME1= <>
##$DPNAME2= <>
##$DPNAME3= <>
##$DPNAME4= <>
##$DPNAME5= <>
##$DPNAME6= <>
##$DPNAME7= <>
##$DPOAL= (0..7)
0.5 0.5 0.5 0.5 0.5 0.5 0.5 0.5 
##$DPOFFS= (0..7)
0 0 0 0 0 0 0 0 
##$DQDMODE= 0
##$DR= 18
##$DS= 0
##$DSLIST= <SSSSSSSSSSSSSSS>
$$ [...]
##$SUBNAM2= <"">
##$SUBNAM3= <"">
##$SUBNAM4= <"">
##$SUBNAM5= <"">
##$SUBNAM6= <"">
##$SUBNAM7= <"">
##$SUBNAM8= <"">
##$SUBNAM9= <"">
##$SW= 16.880792210976
##$SWIBOX= (0..15)
0 0 2 0 0 0 0 0 0 0 0 0 0 0 0 0 
##$SW_h= 3378.37837837838
##$TD= 16384
##$TD0= 1
##$TE= 0
##$TE2= 300
##$TE3= 300
##$TEG= 300
##$TL= (0..7)
0 120 120 120 120 120 120 120 
##$TP= (0..7)
150 150 150 150 150 150 150 150 
##$TP07= 0
##$TPNAME0= <>
##$TPNAME1= <>
##$TPNAME2= <>
##$TPNAME3= <>
##$TPNAME4= <>
##$TPNAME5= <>
##$TPNAME6= <>
##$TPNAME7= <>
##$TPOAL= (0..7)
0.5 0.5 0.5 0.5 0.5 0.5 0.5 0.5 
##$TPOFFS= (0..7)
0 0 0 0 0 0 0 0 
##$TUNHIN= 0
##$TUNHOUT= 0
##$TUNXOUT= 0
##$USERA1= <user>
##$USERA2= <user>
##$USERA3= <user>
##$USERA4= <user>
##$USERA5= <user>
##$V9= 5
##$VALIST= <valist>
##$VCLIST= <CCCCCCCCCCCCCCC>
##$VD= 0
##$VDLIST= <DDDDDDDDDDDDDDD>
##$VPLIST= <PPPPPPPPPPPPPPP>
##$VTLIST= <TTTTTTTTTTTTTTT>
##$WBST= 1024
##$WBSW= 4
##$XGAIN= (0..3)
0 0 0 0 
##$XL= 0
##$YL= 0
##$YMAX_a= 295656
##$YMIN_a= -236283
##$ZGOPTNS= <>
##$ZL1= 120
##$ZL2= 120
##$ZL3= 120
##$ZL4= 120
##$ABSF1= 10
##$ABSF2= 0
##$ABSG= 5
##$ABSL= 3
##$ALPHA= 0
##$AQORDER= 0
##$ASSFAC= 0
##$ASSFACI= 0
##$ASSFACX= 0
##$ASSWID= 0
##$AUNMP= <proc_1d>
##$AZFE= 0.1
##$AZFW= 0.1
##$BCFW= 1
##$BC_mod= 2
##$BYTORDP= 1
##$COROFFS= 0
##$CY= 11.3945322036743
##$DATMOD= 1
##$DC= 2
##$DFILT= <>
##$DTYPP= 0
##$F1P= 16.9975609425685
##$F2P= -3.02152046262296
##$FCOR= 0.5
##$FTSIZE= 0
##$FT_mod= 4
##$GAMMA= 1
##$GB= 0.15
##$INTBC= 1
##$INTSCL= 1
##$ISEN= 128
##$LB= 0.24
##$LEV0= 0
##$LPBIN= 0
##$MAXI= 10000
##$MC2= 0
##$MEAN= 0
##$ME_mod= 0
##$MI= 1.114404
##$NCOEF= 0
##$NC_proc= 0
##$NLEV= 6
##$NOISF1= 3.799351
##$NOISF2= 2.8
##$NSP= 1
##$NTH_PI= 0
##$NZP= 0
##$OFFSET= 15.70392
##$PC= 1
##$PHC0= -9969.04
##$PHC1= 9.200901
##$PH_mod= 1
##$PKNL= yes
##$PPARMOD= 0
##$PSCAL= 0
##$PSIGN= 0
##$REVERSE= no
##$SF= 200.130013532006
##$SI= 16384
##$SIGF1= 3
##$SIGF2= 2
##$SINO= 400
##$SIOLD= 16384
##$SREGLST= <1H.CDCl3>
##$SSB= 0
##$STSI= 0
##$STSR= 0
##$SW_p= 3612.71676300578
##$SYMM= 0
##$S_DEV= 0
##$TDeff= 0
##$TDoff= 0
##$TI= <>
##$TILT= no
##$TM1= 0
##$TM2= 0
##$TOPLEV= 0
##$USERP1= <user>
##$USERP2= <user>
##$USERP3= <user>
##$USERP4= <user>
##$USERP5= <user>
##$WDW= 1
##$XDIM= 8192
##$YMAX_p= 0
##$YMIN_p= 0
$$ End of Bruker specific parameters
$$ ---------------------------------
##NTUPLES= NMR FID
##VAR_NAME=  TIME,          FID/REAL,        FID/IMAG
##SYMBOL=    X,             R,               I
##VAR_TYPE=  INDEPENDENT,   DEPENDENT,       DEPENDENT
##VAR_FORM=  AFFN,          ASDF,            ASDF
##VAR_DIM=   8192,          8192,            8192
##UNITS=     SECONDS,       ARBITRARY UNITS, ARBITRARY UNITS
##FACTOR=    0.000296,      1,               1
##FIRST=     0,             0,               0
##LAST=      2.424536,      0,               0
##MIN=       0,             -236283,         0
##MAX=       2.424536,      295656,          0
$$ Real data points
##PAGE= N=1
##DATA TABLE= (X++(R..R)), XYDATA
0@%%%%%%%%%%%%Qj6J6j6J6k4L2m0M8n6O9q1R6j13J33j53J78k07K38k73L11l55
34a89M03m58N16n78O49p26Q11r07J010j119J241j376J523j683J855k044K255k484
52a301K732l010L320l664M051m488M985n560O232p029P993r188J0721j2771J5678
67H701k0209K8684p6944K36487j40044k72958J87216R6649j77090L7134J04483
78A2109j29233N0284P5268j054o3417P2039j29372K3707J48490p6752m3587P9353
90A7835L1446j10470Q8014l3367p6891J16475K8412j01540L0853J77669j97776
101b9340p9445J68232J6816j19831P7346P1470j38288Q8253K1729q2704j9909
112b5671Q3168l2475k0J38485j41415q8086J25761P6015j67640K5463J04989n8956
$$ plain form
0 0 0 0 0 0 0 0 0 0 0 0 0 0 8 -8 8 -8 8 -16 16 -24 24 -32 37 -44 52 -61 72 -81 97 -110 128 -145 166 -189
34 -189 214 -244 272 -306 343 -383 428 -479 531 -588 653 -723 800 -883 972 -1072 1183 -1301
52 -1301 1431 -1579 1741 -1923 2128 -2360 2625 -2935 3297 -3732 4261 -4927 5794 -6977 8701
67 8701 -11508 17176 -59768 176719 36675 -236283 -49067 47582 -129508 -92374 12109
78 12109 -117124 -66840 8428 7374 -56043 15996 -113376 -89669 58821 -17931 -61518 17835
90 17835 49281 -61189 26825 -6542 -83433 33042 61454 -40086 -9233 168436 -29340
101 -29340 -108785 59447 76263 -43568 33778 105248 -33040 55213 76942 -5762 -25671
112 -25671 57497 25022 25002 163487 22072 -66014 59747 135762 -31878 -6415 98574 39618
124C9618L7724P488n3012o0680J07480k6451l5348Q2978l2092m5799L2812N3931
136A08649j26660M0210N6551m4374K8973L8815n4713o1540J16598p5273n8312
147c1076J06926M5958j24704R31J37884j17008m3147N7200R373m8954P1578J5594
159H0555j01953L8621L230j6886j3585M6877n3696J6755P2512q0473j6355J3250
171a1148r076l0655J06539m6510r1664J09069K0991j20266j6472J46000r9167
182d2359l8026J21805j4191j01170L4623O0030j06313N7549L5134m5787J0889
193b7816O0039n6568n8405R7570m4780k5018N0014K9902n5309L0733R070q2917
205g3485P7577R212n9913K1067J05582q6967n4083J11138m9664o2743O3030O2746
$$ plain form
124 39618 77342 84830 31818 -28862 78618 52167 16819 99797 67705 21906 54718 108649
136 108649 -18011 22199 78750 34376 63349 102164 47451 -14089 102509 27236 -31076
147 -31076 75850 121808 -2896 -1965 135919 18911 -24236 32964 42337 -6617 64961 80555
159 80555 -21398 17223 20453 3567 -10018 36859 -16837 -82 72430 -8043 -24398 -11148
171 -11148 -20224 -50879 55660 9150 -82514 26555 47546 -72720 -89192 56808 -42359
182 -42359 -80385 41420 27229 -73941 -39318 20712 -85601 -28052 7082 -38705 -27816
193 -27816 32223 -24345 -82750 14820 -29960 -54978 -4964 24938 -30371 362 9432 -73485
205 -73485 4092 13304 -46609 -25542 80040 -6927 -61010 50128 464 -62279 751 63497
217F3497r8219M9819M2546q9903K4406M2738n3535k7259J32777o1812o5286Q4494
229D4263k323q7975K8516Q2325r4997L5619N3738m9637k5269M5048l4736m5179
241e0607J05780l6533m0862M1778K7280o9508Q583L7424p0163N7743L3918m7614
253b781j9899P3687o6719n0328J12304l4967o8491O0303Q0526j16817o249P3545
265C4114o0728j6324O2677R675p3115O8089p526n2827K5906J1217k9369P632O3659
278D3080n9043J3374J7210m1818j2508N2939n280n4713Q1391k0262m8268L0131
290c767L3471p8733k972R9439m4018j7779K3780K89n7659M9426J7115o4080M1593
303c895K5379j6452j7350M0878o4287j0554P0688j7277k4242K1224K5622o6076
$$ plain form
217 63497 -34722 15097 57643 -32260 -7854 34884 -18651 -45910 86867 25055 -40231 44263
229 44263 41940 -46035 -17519 64806 -30191 5428 59166 9529 -15740 29308 -5428 -50607
241 -50607 55173 18640 -22222 19556 46836 -22672 -14089 23335 -46828 10915 44833 -2781
253 -2781 -22680 51007 -15712 -66040 46264 11297 -57194 3109 83635 -33182 -39431 34114
265 34114 -26614 -42938 19739 29414 -43701 24388 16862 -35965 -10059 1158 -28211 -20579 43080
278 43080 -15963 -2589 14621 -27197 -39705 13234 7954 -46759 34632 14370 -33898 -3767
290 -3767 29704 -49029 -52001 47438 3420 -14359 9421 9710 -47949 1477 18592 -45488 -3895
303 -3895 21484 5032 -12318 28560 -35727 -46281 24407 7130 -17112 4112 29734 -36342
315c6342M2400J2239n8107J5082N1697j2922l4051O0707n1225k6513M3487Q902
327A5354m0170K7529M1322p1097L6576K5321n1783k8113P2097p429m1056O9744
339D8295l0286m4734K4412M2443o3848J3913N2031m7147J7579L2380l2620n9338
351d6920P2929m960l7907N3404k979m2524J1263M9321p3810J1908M2170l4032
363b137N279N0874k6620p4528P4457r919m5291M2223K8235n9800Q973P0449p9163
376a6968j2194M1039j1760k7061O3732m848p7948N3372O438m1241N891M4010n0608
389b8146J2266O0993o2001j7604L1205n225m3523O9698j888o1820M5025J6610
401A5590m9805q939O2567n6647K499O0518k6290l2448K5202M089n7161O1808R803
$$ plain form
315 -36342 6058 18297 -39810 -24728 26969 14047 -20004 40703 -10522 -37035 6452 15354
327 15354 -24816 2713 44035 -27062 9514 34835 -16948 -45061 27036 19607 -21449 48295
339 48295 18009 -26725 -2313 40130 -23718 -9805 42226 -4921 12658 45038 12418 -46920
351 -46920 26009 21049 -16858 36546 33567 -8957 2306 51627 -22183 -10275 31895 -2137
363 -2137 3142 54016 27396 -47132 27325 17406 -27885 14338 42573 -17227 -8254 62195 -16968
376 -16968 -29162 11877 117 -26944 36788 31940 -46008 7364 13802 -27439 -21548 22462 -28146
389 -28146 -15880 45113 -16888 -34492 -3287 -8512 -52035 17663 15775 -46045 -1020 15590
401 15590 -34215 -43154 19413 -37234 -34735 25783 -507 -32955 -7753 -3664 -60825 983 10786
414A0786m4328J7300L7673l7048k1431N1983n1902k91N1092K844m4615K4618J2054
427H735n1783M1246O092l1587M630N7924l6148k7068M4807l5901j4375L6086K1253
440B3911n3534L3106K3994m7670O300J8599j3774k0119N7396k2161j9309L1374
452A8113j3250l2436J5437L6419m5860K5956K0515k6934r051K7495j6098l7690
464c7384N4765n916j4186J5234R850m3542J0030L9770m9168R622L1849k098l2944
477a4118L4732j0249m5218L8729R978j8903p3L8370m2346m48L0218l7392p523
490b4243L5501J0556m5781M1626j398m1732J6185J8905k6337l217N4628m2492
502g799n705L0893k1165l2328L7590J7338n2093M4370J4461l7677o745L7229l1453
$$ plain form
414 10786 -33542 -16242 21431 -15617 -37048 14935 -36967 -37258 13834 16678 -27937 -3319 8735
427 8735 -43048 -1802 4290 -27297 -22667 35257 -891 -27959 16848 -19053 -33428 2658 23911
440 23911 -29623 3483 27477 -20193 -13893 4706 -9068 -29187 28209 6048 -13261 18113
452 18113 4863 -27573 -12136 24283 -21577 4379 24894 -2040 -11091 16404 306 -37384
464 -37384 17381 11465 -2721 12513 22363 -21179 -11149 28621 -20547 -10925 20924 18826 -14118
477 -14118 20614 10365 -34853 3876 13854 -5049 -5122 33248 -9098 -9546 20672 -16720 -24243
490 -24243 11258 21814 -23967 17659 16261 -25471 -9286 9619 -16718 -19935 34693 -7799
502 -7799 -13504 17389 -3776 -36104 1486 18824 -33269 11101 25562 -12115 -18860 18369 -13084
515a3084j5752N7568k5920j1768K7391L209m9511L1390J9136m4723L1949K4560
527C4445k3749j7793M3818l5310j6011M5342j7612j2884L3702J0841o1047L6739
539B0481J7221m6652J4630L9490k3022k3339N6692l6289k8472L2982L734k9146
551a690K6713K3497n6067K9094J7752m0613j3713M6686j3103k5910M6052k2954
563A5744k5723J5786J5766m1700J6408K7993l3178J7351Q076k7337j9976M4572
575A3782k0674k2048L9542o540k1026R472J5499n1631K4499L0342l3106j317L2156
588H950q746l9600L9289j4510k1942K7568K0330k9149m826L5245l3359J337J0818
601h595o751o344L3999j843l6967K6268m475j0621N494J8077k6351J3149L6934
$$ plain form
515 -13084 -28836 28732 2812 -8956 18435 21644 -27867 3523 22659 -22064 9885 34445
527 34445 10696 -7097 36721 1411 -14600 30742 13130 246 33948 44789 -16258 20481
539 20481 37702 -8950 5680 45170 22148 -1191 55501 19212 -9260 23722 27456 -1690
551 -1690 25023 48520 -7547 21547 39299 -1314 -15027 31659 18556 -7354 38698 15744
563 15744 -9979 5807 21573 -20127 -3719 24274 -8904 8447 16523 -10814 -30790 13782
575 13782 -6892 -28940 10602 4062 -16964 -7492 8007 -43624 -19125 11217 -21889 -23206 8950
588 8950 204 -39396 -107 -14617 -36559 -8991 11339 -17810 -22636 12609 -20750 -19413 -8595
601 -8595 -15346 -21690 12309 10466 -26501 -233 -4708 -15329 -9835 8242 -18109 -4960 31974
614C1974l7090j4841J8019J0009k7554L0089L341k6896K2711J0010k4881j9879
626b4988L9650j4285k780J9042j0595j2483J3877P698m2744K7116J4535j3685
638C58K735J3744k2196j2414M0940l0983j5405K9561J7995l3111P366J7108l9965
651b4267J7286J9490j5435j7989L8259o011k2810J8039j8368o949K2537J7044
663B0826m2958J9512K7371l4481k389J6305j1220j6349M9599j5810l0329K5643
675E720Q300k8196P79K9494l3324J8230K4407k3828j9667K4908o68k5767L1625
688A2013j3021o987K5227L554m4245J2385L4688m0838Q971K8466j4435k6168M2317
701B1927r432m6187L1595J4927j5041l877K4182k7613N815J8349l0662p50K4978
$$ plain form
614 31974 -5116 -19957 -1938 8071 -19483 10606 13947 -12949 9762 19772 -5109 -24988
626 -24988 14662 377 -2403 16639 6044 -6439 7438 15136 -27608 -492 14043 358
638 358 3093 16837 -5359 -17773 23167 -7816 -23221 6340 24335 -8776 -1410 15698 -24267
651 -24267 -6981 12509 -2926 -20915 17344 11333 -11477 6562 -11806 -18755 3782 20826
663 20826 -22132 -2620 24751 -9730 -12119 4186 -7034 -23383 26216 10406 -19923 5720
675 5720 14020 -14176 -13397 16097 -17227 1003 25410 1582 -18085 6823 6155 -19612 12013
688 12013 -1008 -7995 17232 20786 -23459 -11074 23614 -17224 -8253 20213 5778 -20390 21927
701 21927 12495 -33692 -2097 12830 -2211 -6088 18094 -9519 -3704 14645 -16017 -16767 8211
714H211K336k4211K9240j5150k1352K6888J002k9416R994M2468l7718k349K1770
727A1713j6636j9073K8180Q823l6161K7830Q594j4799p713J0030j3289M145K5147
740A6791k6196O903J4634p947k2228K4081k278k6974L4327Q132k4576o457L4709
753B2921k7679j4372K9758n367j1050J2332J6306l4631R656J1038j2413m02R974
766F071K999q113J7904k3827j352J4030n206j0980J6803J2311l2527J9352P957
779A5422k2227j0580L1043l684k2424K7205n662j4965P84J5844k2757M423K2560
792A4982j6144J481N404m400j8652K3071p599j2883K3956o64j6927K015K0845
805A4485l5236O248K6522j3985j2183K0982N500l4613K0827J312j3445O519J5490
$$ plain form
714 8211 10547 -13664 15576 426 -20926 5962 6964 -22452 -12458 30010 -7708 -10057 11713
727 11713 -4923 -23996 4184 13007 -23154 4676 13270 -1529 -9242 788 -12501 -8356 16791
740 16791 -9405 -2502 12132 4185 -18043 6038 3760 -23214 11113 19245 -5331 -11788 22921
753 22921 -4758 -19130 10628 5261 -5789 6543 22849 -11782 -2126 8912 -3501 -3903 6071
766 6071 9070 957 18861 -4966 -6318 7712 2506 -8474 8329 20640 -11887 7465 15422
779 15422 -6805 -17385 13658 9974 -12450 14755 9093 -5872 -5088 10756 -12001 -7578 14982
792 14982 -1162 319 5723 1323 -17329 5742 -1857 -14740 9216 8552 -8375 -6360 14485
805 14485 -20751 -14503 12019 -1966 -14149 6833 12333 -22280 -1453 -141 -13586 -7067 8423
818H423j2656l348K0493k7931L115J4571p142j2740K6858L67l0070K4924j420
831C444k1450N203K9167k6263k760L3947k3974j5407J8180Q968l1510K2801J4154
844A4500k2023O345Q550j1375j1280K3752j6498M893J7823j6156p496J7760j213
857G582l2844L1498N544k2468J2165K0963k7792j4467L8797k0363j1760K0274
869G129Q123k3584J2935J1734l0236J0533Q524l327l416J6860j5641m417K0294
882A5511k1337m450J6743N806k5370K2655R807l0503N215J4619q775j3091K9885
895A6715j1448j1709J3448j371j2710J920J2840j8466J7542N839j4724l376J1278
908E778q485j0877K7464j3801q513J4932R004k5104O78J8826k0009P023J3410
$$ plain form
818 8423 -4233 -7581 12912 -15019 -11904 2667 -4475 -17215 9643 10010 -20060 4864 3444
831 3444 -18006 -12803 16364 -9899 -12659 21288 -2686 -18093 87 9055 -22455 346 14500
844 14500 -7523 -1178 7372 -4003 -15283 8469 -8029 -3136 14687 -1469 -8965 8795 7582
857 7582 -25262 6236 11780 -10688 1477 22440 -5352 -19819 18978 -1385 -13145 7129
869 7129 15252 -8332 4603 16337 -13899 -3366 5158 1831 -1585 15275 -366 -4783 15511
882 15511 -5826 -10276 6467 12273 -13097 9558 19365 -11138 -5923 8696 -79 -13170 16715
895 16715 5267 -6442 7006 5635 -7075 -5155 7685 -10781 6761 12600 -2124 -5500 5778
908 5778 -2707 -13584 13880 79 -8434 6498 15502 -9602 -8924 9902 -10107 -3084 10326
921A0326q73j9040J4407J288j4267J0079k351Q9J817J3530j6872K195N651j4384
935h405O732J1725j725j7658K3607n218j6623J0759N391j5402O1L2079k0887r708
949e272J2285N29j6169J0073J2915k1490J2329N614n244q432Q098r720k329K1449
963A4636j3100j542O420P63j9440J6489M751k2734J4783J1184r825j0582K1864
976A3667j9587j1004K4683o29j4151N114J4365k3065J1156N285j7635K508J7023
989G730l316j1928J9522j8550p100J7699K218k0224J0098J8861k3698Q644N980
1002E936j3875o912K2481n247j3591K2103j0050j0345P180R390k1276R820J4510
1015A0124j8891R282Q769j2607j4739K5200q535j0999K1138l493j5798N587J8311
$$ plain form
921 10326 9453 -9587 4820 6108 -8159 1920 -431 -342 1475 15005 -1867 328 5979 -8405
935 -8405 -1673 10052 8327 -9331 14276 9058 -7565 3194 8585 -6817 -6756 25323 4436 -5272
949 -5272 7013 7542 -8627 1446 14361 -7129 5200 10814 5570 -2862 5236 -4484 -6813 14636
963 14636 1536 -6 6414 7177 -12263 4226 8977 -13757 1026 12210 2385 -8197 13667
976 13667 -5920 -16924 7759 7130 -7021 -1907 12458 -10607 549 5834 -11801 -9293 7730
989 7730 4414 -7514 12008 -6542 -13642 4057 6275 -13949 -3851 15010 -8688 -44 5936
1002 5936 -7939 -14851 7630 2383 -11208 10895 845 -9500 -2320 7070 -14206 -4386 10124
1015 10124 -8767 515 9284 -3323 -18062 7138 -1397 -12396 8742 5249 -10549 -4962 13349
1028A3349k6673L629J3329p438R45J1414o561j9613K1600n105p678P838M559r842
1042f247N175J3546k4076M098Q542l315l785J5217o542j5213K1188o467j2768
1055a0647M370J7023j6010J747J7046j4879m482N910L243j3384J6364R40j1457
1068d216Q523P94p083m648J4994j3456L527J1729n229p174K908L258j4189J6698
1082F436j591r540N342J1420j1199j1352J6942r363j644P225N891j2796M026O889
1096F686j5361P407J637l111k636J6741j0294j0438J3343n141o410L395J2352
1109H170j4982O857P356j2797n40O224j448r955K0802p189r573R292K429j2361
1123g715j22J5616j5049P584Q260q756p800J2534k533j5562J9712j812q099L940
$$ plain form
1028 13349 -13324 -9695 3634 -3804 -2859 8555 1994 -17619 3981 -1124 -8802 -964 3595 -6247
1042 -6247 -1072 12474 -11602 -7504 1038 -2277 -6062 9155 2613 -12600 8588 2121 -10647
1055 -10647 -6277 10746 -5264 -3517 13529 -1350 -5832 78 3321 -10063 6301 7241 -4216
1068 -4216 4307 5101 -1982 -6630 8364 -5092 -1565 10164 4935 -2239 669 3927 -10262 6436
1082 6436 4845 -4695 647 12067 868 -10484 6458 -2905 -4549 2676 8567 -4229 -203 6686
1096 6686 -8675 -1268 369 -2742 -5378 11363 1069 -9369 3974 -1167 -7577 -4182 8170
1109 8170 -6812 45 7401 -5396 -5936 288 -1160 -11115 9687 2498 -7075 2217 4646 -7715
1123 -7715 -7837 7779 -7270 314 8574 -182 -7982 4552 2019 -13543 6169 4357 -3742 198
1137A98J0586j5789j865J3213j2473N741P246l295j0892J6693o773j6711J8075
1150C954K593j1887Q37J9618j7533k531J0428j0428j250J1570J685j6814J7269
1163G511l188j2325Q790M658j3557k2K4267j5302m988N896k986n197J0929l98
1177D088j6054J8987R84j0462q63Q625j2369J394J8608j3872j715P746k3j2762
1191g688J2049n92j4145J6302M180j1173l509J7782j5628o842J5247r76m693K459
1205B773M761j3572J1215J46j0489K442P945l42m485J0284j5874j819J1039J922
1219E946r437J633O907q222J1079n481j1440L34J6114n193q851J2592p897l792
1233e708N031N785j6773M845J3094p910o02J521j79j0080J0933k326m832P932
$$ plain form
1137 198 10784 -5005 -6870 6343 -6130 -389 6857 3562 -7330 9363 2590 -14121 3954
1150 3954 6547 -5340 -4503 15115 -2418 -4949 5479 -4949 -6199 5371 7056 -9758 7511
1163 7511 4323 -8002 788 5446 -8111 -8133 16134 832 -4156 1740 -1246 -6443 4486 4088
1177 4088 -11966 7021 8005 -2457 -3320 5305 -7064 -5670 12938 -934 -2649 5097 5074 -7688
1191 -7688 4361 3769 -10376 5926 10106 -1067 -4576 13206 -2422 -9264 5983 5007 314 2773
1205 2773 7534 -6038 5177 5323 -5166 -2724 5221 4879 394 10678 -5196 -7015 4024 5946
1219 5946 -3491 -1858 5049 -3173 7906 2425 -9015 -8681 7433 2240 -6611 5981 -1916 -5708
1233 -5708 -677 5108 -11665 -6820 6274 -1636 -2238 -717 -896 -10976 -43 -2369 -7201 731
1247G31N29n249k679J0230j0657K501L002l399K871P738k970j6097J2645N07k517
1262b814K021L004p715L015J5167j6321m734O421N098n017R079j834j5381J3288
1276C277M946q963p189J4466n143j332J1071r511o154N148P072j1923Q128L018
1290F911p899N119J916o289l468J3052j1845K96J2620m585r193N835L540j5743
1304i733J5015M291j3230n05J5379o786j1451J2635q216k334J0312N202j6017
1317e438L389Q854j0627N253K97m838j279J5083p556q943Q735n368r31N524L696
1332E851j3155J0553L666j2108L976M578o627l942J7932j0343n485J0681l035
1345B542j1349O544J1514j6104O020O977o330m264Q593m045j0582J3961o8l878
$$ plain form
1247 731 1260 -3989 -6668 3562 -7095 -4594 -1592 -4991 -2120 5618 2648 -13449 -804 -297 -2814
1262 -2814 -793 2211 -5504 -2489 12678 -3643 -8377 -1956 3142 -1875 7204 5370 -10011 3277
1276 3277 8223 -740 -7929 6537 1394 62 11133 1622 -4532 616 7688 -4235 3893 6911
1290 6911 -988 4131 6047 -242 -3710 9342 -2503 -2207 10413 5828 -3365 2470 6010 -9733
1304 -9733 5282 9573 -3657 -4162 11217 4431 -7020 5615 -2601 -4935 5377 10579 -5438
1317 -5438 -2049 6805 -3822 1431 1728 -3110 -4389 10694 3138 -5805 2930 -2438 -3369 2155 5851
1332 5851 -7304 3249 6915 -5193 -1217 3361 -3266 -7208 10724 381 -5104 5577 2542
1345 2542 -8807 -2263 9251 -6853 -833 6144 -186 -4450 4143 98 -10484 3477 3409 -469
1359d69q35M377o925J252O076q793M624J276J139k591N064q659k889J2140n369
1374e82l984M737O992j3383N004O460j1121j83R468J185j1597J1510j200r011
1388e705K961O410n194m400J2664n530k658J445J361m629J615M228m890O307k818
1403A167k001l02L706o379j43R676o802J58L050J214r825O093K999p921N431L373
1419C494l273n022R976p554n168R454m27n082K478P462j2794M401L993n930j537
1434e529Q017n95q521J0619m546o206L613N892o411m4P757p868L896K39m278k347
1450f312R171l152m927J1581o855n695N541O548j4175M365J1328r597n2O996l134
1465A631j1738J3006N75q193N928L526n579j899Q551r361J141M202j617O13L364
$$ plain form
1359 -469 -1304 3073 -3852 -2600 3476 -5317 -693 583 1722 -869 4195 -4464 -7353 4787 -582
1374 -582 -4566 171 7163 -6220 -1216 5244 -5877 -6060 3408 4593 -7004 4506 3306 -5705
1388 -5705 -2744 3666 -1528 -5928 6736 1206 -1452 -7 1354 -3275 -1660 2568 -2322 3985 1167
1403 1167 -834 -1136 2570 -3809 -3952 5724 -1078 -920 2130 3344 -6481 -388 2611 -5310 121 3494
1419 3494 221 -4801 5175 -2379 -7547 1907 1480 -3602 -1124 6338 -6456 -2055 1938 -3992 -5529
1434 -5529 2488 1893 -6628 3991 -555 -6761 -3148 2744 -3667 -3711 4046 -3822 74 313 -3965 -6312
1450 -6312 2859 -293 -5220 6361 -494 -6189 -648 5900 -8275 -3910 7418 -2179 -2231 4765 1631
1465 1631 -10107 2899 3474 -4719 1209 4735 -844 -2743 5808 -3553 -2412 1790 173 786 4150
1480D150k877p016J0379n470l152P019J290r526N330J0216j6375J164Q602l251
1494D83o587J2405j095j3550Q991L775o603l318J0117n809q99P477n869j839J39
1509b182K886m303P273k505n190O248L52m195j797P019q171L689P092m918m093
1524b795L216J547o816Q257j426m384K981N143n218l390O852p598K312O494n22
1539D653q357N654L632r649M270L685l235m887J0818j326p947L084Q30j221j700
1554a696O213l977R23q1j285K006j569j574k101Q654m019j456K911k776m313M775
1570F35O016j1300L535O463l281n325N974p22r496R819L313m970l682O493k994
1585D78k218M547m811J200K518K353n515M105k172n126O756M49l612J10P641r076
$$ plain form
1480 4150 1273 -5743 4636 -834 -3986 3033 4323 -5203 127 10343 -6032 -4868 3734 483
1494 483 -6104 6301 5206 -8344 647 4422 -2181 -5499 4618 -1191 -2090 5387 -482 -2321 -2182
1509 -2182 704 -3599 3674 1169 -4021 2227 2579 -1616 -3413 3606 -4565 -876 6216 1298 -2795
1524 -2795 421 1968 -4848 3409 1983 -2401 580 5723 505 -2885 3967 -3631 -1319 5175 4653
1539 4653 -3704 1950 5582 -4067 203 3888 653 -4234 6584 5258 -2689 395 1225 4 -1696
1554 -1696 4517 540 1463 1382 97 2103 534 -1040 -3141 5513 1494 38 2949 173 -4140 635
1570 635 6651 -4649 -1114 5349 2068 -3257 2717 1995 -7501 2318 5631 661 -3021 3472 478
1585 478 -1740 2807 -2004 -804 1714 4067 -1448 2657 485 -4641 2115 2564 -1048 -938 6703 -2373
1601b373K01P136n857l586O283L343r493P563O80p574Q03N955k507l835P592o198
1617a867J443L910l216o472O011L823q233P210j86n686k41P467n771m143Q738
1632B787l353k96K825n13p958O483K337p004M746K290l154k171P022p516q25P653
1648C353m291k859N900K725j1473O253L248o528M42O684k064o260Q356l454k215
1663b183P86J242k267L223K574p217M422j12k106q94M608l603j113P302n742j928
1679c008K839J977p243N535M078p662K022M454j993p258O765M42l441K654J217
1694A378j710j590L838n040K390J738k060N51K513j05n906N852k093j277J604
1709H3K520k324j26L922o236J438K251L62l624M992R70n835L998k86j525j924
$$ plain form
1601 -2373 -2172 4964 -893 -4479 1804 5147 -4346 3217 3897 -3677 -2874 3081 574 -3261 4331 -1867
1617 -1867 -424 3486 270 -6202 -191 3632 -4601 2609 2423 -3263 -3504 3963 -1808 -5951 2787
1632 2787 -566 -862 1963 1450 -6508 -25 2312 -4692 54 2344 -810 -2981 4041 -3475 -4300 3353
1648 3353 -938 -3797 2103 4828 -6645 -392 2856 -3672 -3230 3454 1390 -4870 3486 32 -2183
1663 -2183 -1397 -155 -2422 801 3375 -3842 580 468 -1638 -2532 2076 -1527 -2640 4662 -1080 -3008
1679 -3008 -169 1808 -5435 100 4178 -3484 -1462 2992 999 -6259 506 948 -2493 161 1378
1694 1378 -332 -1922 1916 -3124 -734 1004 -1056 -505 2008 1903 -4003 1849 -244 -1521 83
1709 83 2603 279 153 4075 -2161 -723 1528 1890 -1734 3258 4228 -1607 2391 2105 580 -1344
1725a344N525l131j95L741l883j061J997J811o850N998K004m751N89K926k433
1740I43m205P396l973j850L820R08m491R26L125o642M757J302k807j526M932k328
1756B87m501N372l860j84L739J500p004L417L931p247K176K532k176k494P964
1771C452l860n030N211p61k627J401M371o408L847K894n641p8L890j000l992P386
1787C055l606j819M423q44n699K427O770p823K574L294k674k133M885k223n449
1802d842P723j003j600L39J716n057L168M042p492J858L925L8m490M209k397l094
1818b957N508j497k928J266N023o476J462K362m347P62L976m61n876O393j104
1833A106l213N83J084j271M90M463o332J630K437p64l480K115J418k908M990k057
$$ plain form
1725 -1344 4181 1050 855 4596 713 -348 1649 3460 -3390 2608 4612 -139 450 3376 943
1740 943 -3262 4134 161 -1689 2131 3039 -1452 -526 2599 -4043 714 2016 -791 -2317 2615 287
1756 287 -4214 1158 -2702 -2886 853 2353 -4651 -1234 2697 -4550 -2374 158 -2018 -4512 3452
1771 3452 -408 -5438 -227 -988 -3615 -2214 2157 -4251 -404 2490 -3151 -3229 661 -339 -4331 3055
1787 3055 -551 -2370 2053 1209 -4490 -2063 4707 -3116 -542 2752 78 -2055 2830 607 -4842
1802 -4842 2881 1878 278 617 2333 -2724 444 4486 -3006 -1148 2777 2815 -1675 2534 137 -2957
1818 -2957 2551 1054 -1874 -608 4415 -2061 -599 1763 -2584 -1822 2154 1693 -4183 2210 1106
1833 1106 -2107 -1524 -440 -1711 -1221 3242 -3090 -1460 977 213 -3267 -1152 266 -2642 2348 291
1849B91k148k54L766k773r16L378k938J998J636r13n677M857K038l769J639J129
1865A344j34k547M436l848j493L421N76j220j65K258m112L395j90l297O84M200
1881C308p20m426M970k755q50J088J459l668J301M590m782K98O73J30k451M177
1897B342j610l202N102p39k607j245M268m444J850K882m085N99K644k86n372N210
1913A307p91k932L837Q44m017l51O103o495M26L155n23j823K889j20n192N548
1929A865j446k513J744K868l478K28M401o241R49L463m30m570N267N05n462M552
1945A702p98k677j17N703m573l19M055l131p48J211R95m126N191o16l049K680
1961A383n0k839K05N398o360J067M857k199l747L112J773n909M501J95j535J44
$$ plain form
1849 291 -1857 -2111 1655 -1118 -2034 1344 -1594 404 2040 1127 -4550 307 2345 -1424 215 1344
1865 1344 1210 -1337 3099 -749 -2242 1179 1755 535 370 2628 -1484 1911 1721 -1576 -892 3308
1881 3308 2588 -1838 3132 377 -473 615 2074 -1594 -293 4297 -485 -187 486 616 -1835 2342
1897 2342 732 -2470 2632 1893 -714 -1959 2309 -2135 -285 2597 -1488 -889 1755 1469 -3903 1307
1913 1307 516 -2416 1421 2265 -1752 -2103 4000 -2495 -2069 1086 563 -1260 1629 1509 -3683 1865
1929 1865 419 -2094 -350 2518 -960 -732 3669 -2572 -1623 1840 1410 -3160 2107 2612 -2850 1702
1945 1702 904 -1773 -1890 3813 -760 -1079 2976 -155 -903 308 1303 -2823 2368 1752 -1297 1383
1961 1383 1333 -1506 -1301 4097 -2263 -1196 3661 1462 -2285 827 2600 -3309 1192 1387 -148 -4
1977dK550k477j875M453m160J420J437J07l320L253Q78m901L303L08j024j258
1993a310M301l267j192L282k339o17R51K081l989L076K98l004P41J193n38k049
2009b382M547k979k28J240J55k489N94K969m092K708N16p68k293K464j9l191M052
2026H04j124n28k80K196l297K38K984l097R72J033J183l762L122l44k417J768
2042e49O56o74r23L673l566N01J623j584o45K203J063m463M185K9k848K61K408
2059A350j964r65M682l613l34J423M54l033K908J023m250L821M16k142j266M061
2075B571l226j491N196k545j500J387J962m571K561J226l269K086J377j044k325
2090a605M425m078l85L731j724k033K071K130n041L518j86k534R19L294k450k239
$$ plain form
1977 -4 2546 69 -1806 2647 -1513 -93 1344 1451 -1869 1384 2262 -2639 664 972 -52 -1310
1993 -1310 2991 -276 -1468 1814 -525 -1142 -191 1890 -2099 977 1275 -1729 -988 205 -333 -2382
2009 -2382 2165 -814 -1042 198 353 -2136 -1542 1427 -2665 43 559 -209 -2502 -38 -57 -3248 804
2026 804 -320 -848 -1128 1068 -2229 -1991 993 -2104 -1132 -99 1084 -2678 444 100 -2317 -549
2042 -549 107 -567 -1490 2183 -1383 -882 741 -843 -1488 715 1778 -2685 1500 1529 -1319 -1058 1350
2059 1350 -614 -1579 3103 -510 -844 579 1033 -2000 908 1931 -2319 1502 1918 -224 -1490 2571
2075 2571 -655 -2146 3050 505 -995 392 2354 -2217 344 1570 -1699 387 1764 720 -1605
2090 -1605 2820 -1258 -1643 2088 364 -1669 402 2532 -2509 1009 823 -1711 -792 2502 52 -2187
2106b187M910l551j023K434P71l696K686K235m687K538N13j972j312M336k060
2121f5j583L847k329j134J116K162m221J819K091k526J529L79j270k094M390k392
2137b81o97K552j016j250J149K238n556K841J409j039o66J560n31k381L758j754
2153C36j279Q12K059k100L80J970l347J503m5O81j580J811m18j802K348j492j32
2170b95k78K347l564J778K459k835j047R36J946l223K806m22j678O30J198n56
2186B02k802L242j878R99Q17l62k209Q17K429l197J771n48R6l56K114j995j666
2203b526L612k076k10P95J878l413J244J599k486Q97O15J37j848L285j641j110
2219a248K182j668o81J717K509n299K271K113k482n92K496q91k985M851r45k303
$$ plain form
2106 -2187 2723 -828 -1851 583 1354 -2342 344 2579 -2108 430 943 -1029 -2341 1995 -65
2121 -65 -1648 2199 -130 -1264 -148 2014 -2207 -388 1703 -823 706 1085 -185 -2279 2111 -281
2137 -281 -978 1574 558 -692 457 2695 -2861 -20 1389 350 -316 1244 713 -1668 2090 336
2153 336 -943 -131 1928 -172 208 2178 -1169 334 289 970 -610 1201 783 -1019 1329 -163 -295
2170 -295 -573 1774 -1790 -12 2447 -388 -1435 -499 1447 -1776 1030 608 -1070 -440 758 202
2186 202 -2600 642 -1236 -237 580 218 -1991 -1174 1255 -1942 -171 -719 -623 -979 1135 -860 -2526
2203 -2526 1086 -990 -1200 -405 1473 -1940 -696 903 -1583 -686 -71 66 -1782 1503 -138 -1248
2219 -1248 934 -734 -1415 302 2811 -2488 -217 1896 -586 -1178 1318 427 -2558 2293 1348 -955
2235i55O52J819j879j5K551l350J651J029o69j616K420j820j117M199k632j077
2251h09J854J440m356J953K744m276R35K341m27l419L837r86l056K987J09j187
2267c16o03L354l694Q88J380j506m19J641J68k493L438k293q01J549P29k056L16
2284g18K920l698J597Q95j021j840K711j04k592L110j276q11N64J841l035N76
2300h81K926k297K89M73O37k633K345o07j439K055j9o75n10K566l063J83J699
2317A049k02q73k24J885j956J004j052J83N09L95o19n85K151l046O74J383q3k439
2335a846J884J717l165P16Q28l47j806K631q90j255J988n71j042o67K641k245
2351a429J00Q64j38K08l90%j468K404j381P9J327k68k067J488K667m425M10K470
$$ plain form
2235 -955 -303 1516 -363 -378 2173 -1177 474 1503 834 -782 1638 -182 -1299 2900 268 -809
2251 -809 1045 2485 -1871 82 2826 -1450 -515 1826 1399 -2020 1817 831 -2225 762 871 -316
2267 -316 -919 2435 -1259 -371 1009 -497 -916 725 893 -1600 1838 -455 -1256 293 1022 -1034 -718
2284 -718 2202 -1496 101 996 -25 -1865 846 742 -1850 1260 -16 -827 -263 1578 -1457 -881
2300 -881 2045 -252 37 510 1147 -1486 859 252 -1187 868 849 174 -336 2230 -833 -650 1049
2317 1049 847 -26 -250 1635 -321 683 -369 -186 323 718 99 -486 1665 -1381 -707 676 593 -1846
2335 -1846 38 1755 -1410 -694 134 -213 -2019 612 -278 -1533 455 -116 -1158 -1825 816 -1429
2351 -1429 -1329 -465 -603 -395 -785 -785 -2253 151 -1230 -1151 176 -92 -2159 -671 1996 -2429 -2019 451
2369D51J63j738J253N59l158L288l41j386J78K112j451k82J897k415K95J159J045
2386A629k456J549K0j321K130r00j408L46L265l565M88K503j695j429J229R88
2402A373k445K822j063j564J304J373k158j30K284l061J146K309j598k773K216
2417C5J498k655J885r43j054J034K407l227j344L272j736O74j32N08k278K182
2433A26J94j905J195l48l91P12K181l517M55K263j722q22J535J330k943J855m
2450A94q46P30M41j053r63L620j936n16M73M7o96J297Q77k644J653N3N15o51O7
2469F62j268N49K890k149r48M88J822j813J71N19j079J019K13L70j495J422j234
2486A39n30J705l60r09j17J916k051M77K41K6q66L44R35j254J501j668l59R82
$$ plain form
2369 451 614 -1124 129 688 -2470 818 477 -909 -731 1381 -70 -352 1545 -870 -575 584 1629
2386 1629 -827 722 742 -579 1551 651 -757 -411 2854 -711 -223 2280 585 -844 385 1373
2402 1373 -1072 1750 687 -877 427 1800 -358 -488 1796 -1265 -119 2190 592 -2181 35
2417 35 1533 -1122 763 -180 -1234 -200 2207 -1020 -2364 908 -828 -154 -286 222 -2056 126
2433 126 320 -1585 -390 -738 -1129 -417 1764 -1753 -1298 965 -757 -1579 -44 1286 -1657 198 194
2450 194 -652 78 519 -534 -1497 2123 187 -329 144 191 -505 792 1669 -975 678 731 1246 595 662
2469 662 -606 -57 2833 684 -264 224 2046 233 404 923 -156 863 1076 1446 -49 1373 139
2486 139 -391 1314 954 45 -72 1844 -207 270 511 537 -329 15 950 -304 1197 -471 -830 152
2504A52J150j675p12K543k023N96LJ72j737J308J047j575J064r10j33k85K569
2521A554k669r72K654k96q90j04R08j763J808q8j113Q13N56q27o49K794k676l33
2539a293K081q4j555R68J226k711J858J51j025L62J339j581p52L194k156r74J044
2556I2R72j927J493P52k402J512J54m97j054K040j315n86K320j540j028N98J830
2573A414k860J423R03j933Q17O26o88j335K577j766J16J189m38j157P73R05k487
2590a921J589N27j053k01J801j140j147K528j419n30Q22J001j873P10R45j724
2606a085J110n6N6n77J605j352m80J797j153j17N78R25k302J548Q55j776O3J035
2624F74k3j743K523r26q38O05Q82p29q43J362j250J191q35L84n75M43k08o29J205
$$ plain form
2504 152 1302 -373 -1085 1458 -565 31 34 206 -1531 -223 824 -751 313 -597 -730 -1015 1554
2521 1554 -1115 -2087 567 271 -619 -723 185 -1578 230 142 -971 -158 398 -429 -1078 1716 -960 -1293
2539 -1293 788 704 -851 117 1343 -1368 490 641 -384 -22 1317 -264 -1016 2178 22 -952 92
2556 92 1064 -863 630 1382 -1020 492 646 149 -905 1135 -180 -766 1554 14 -1014 -416 1414
2573 1414 -1446 -23 880 -1053 -236 390 -298 -1633 944 -822 -706 483 45 -1112 -339 566 -1921
2590 -1921 -332 195 -858 -1059 742 -398 -1545 983 -436 -966 -144 857 -1016 -306 639 -1085
2606 -1085 25 -31 25 -552 1053 -299 -779 1018 -135 -252 326 1251 -1051 497 1352 -424 -361 674
2624 674 651 -1092 1431 505 -333 272 1154 425 -418 944 -306 885 50 434 -141 302 94 -535 670
2643F70r91J86N3R98j495j88J216j343P73L54K18j594J143K28j302R48K37k22
2661a11r33K037r79j198R01J69r0j78J187j876R62M0n9k13M14j35j012K395j038
2680B83r54M04O51q03N85J004k059J366J48n0r75J031o76n12J964j076l92L9J382
2699A360k094J027J293k380P33J274m15j899K313r37j067J423M50j122m60J661
2715A160j658R36J61q53j82O05K30j091J589j543R1J096o2j857J027J602k556
2732a305J398N01j143j312K752k58k274J700j03m34k76J331j788L10J397j403
2748i07M65J83j25j154J563o27m28J006l68n78K23J647k245R60N84p56j33J250
2766E60k34k054K150k23l47l30P38l82J85P34j479N57L59K65q68J011k57j349
$$ plain form
2643 670 -321 -135 -82 916 -579 -767 449 -894 -121 233 451 -1143 0 228 -1074 -126 111 -111
2661 -111 -1044 993 14 -1184 -283 -114 -204 -382 805 -1071 -109 -69 -128 -341 73 -62 -1074 1321 283
2680 283 -671 -267 384 -419 166 1170 -889 477 625 575 -400 631 -45 -557 1407 331 -61 -22 1360
2699 1360 -734 293 1586 -794 -61 1213 798 -1101 1212 275 -792 631 1081 -41 -501 1160
2715 1160 -498 438 599 -254 -436 169 399 -692 897 -646 -555 541 479 -1378 -351 1251 -1305
2732 -1305 93 594 -549 -1861 891 633 -1641 59 -44 -478 -754 577 -1211 -901 496 -907
2748 -907 -442 -259 -384 -1538 25 -602 -1030 -24 -392 -970 -747 900 -1345 -385 199 -557 -690 560
2766 560 326 -1728 422 199 -148 -478 260 -122 63 797 -682 -125 234 499 -369 642 385 -964
2784i64J816m21k78p66J106k17j32N16n28M47n11L93o86R24m33l73N87p9j88n81
2804c68J541j525J3J280l24j057M08J105j591Q91M07n93j059J941j61j965J182
2821A25k33L99m95J030q45k49R03o07L9l87L49o92J504m93r59R07n7k17l47J143
2841H18j318M70P49j023j26J024qj648K082m80j048J79J328j449l82K283j790
2858c39M3N44L42j385J018K66j478J326k01l08k11J210j295oJ143j578O07N78
2876B76M16j491J362l83j233J353r6m51k13J540j632Q1J082r54m26R29Q76k091
2894a055J642k19n99M1R18p07o57J856j546O73K13m61o89R14M15j559J527l21
2912C86l6n64J193j490L78J239j706O17N33n6j287J161J44j199Q14J04j24p45
$$ plain form
2784 -964 852 431 153 -613 493 276 144 660 132 579 68 461 -225 699 266 -107 480 401 213 -368
2804 -368 1173 -352 -339 941 617 -440 -32 1073 -518 373 780 187 -872 1069 908 -1057 125
2821 125 -108 291 -204 826 -19 -268 635 28 67 -320 29 -663 841 348 -611 296 239 22 -325 818
2841 818 -500 -30 719 -304 -430 594 586 -1062 1020 540 -508 -329 999 -450 -832 1451 -339
2858 -339 -296 248 590 -795 223 489 -989 337 136 -172 -383 827 -468 -474 669 -909 -302 276
2876 276 692 -799 563 180 -1053 300 204 -247 -460 1080 -552 -471 611 -343 -769 160 1036 -1055
2894 -1055 587 368 -231 -190 728 21 -636 1220 -326 347 560 99 -590 324 739 -820 707 386
2912 386 350 -214 979 -511 -133 1106 -600 17 550 494 -793 368 512 -687 127 231 107 -638
2930f38J500j316J73K37k69J94k14M84j273J404m21m2p5K85O3o47R24j127N65
2949a93k37M39k45Q6K36r32J008l26L0j082J757n23r80J215n74L62p53J374j320
2968f58L89N76j88l4k14L69r33R07M2p06L59L99j59r79J316p08L62m58M61m19
2988b76M38L27j254J198m74J1K8P33j070nJ571j304j96J58J033j382R53M2j501
3007i70R95P26l09j179J757r72MO62p11k47L68Q48j438P94n5p04O51M65o02r45
3027h62K078j239k43L74L79q45M94M12j345J263l11k94l52R70o90l79J387j587
3045g90J91J039J75j797R02Q57j137O37k10J64j010J597o82m60O28m14J48J54
3063hN05j471J390o8p39n8M29J43r55J608j433L54N12n7p53M16M04r11O57J43
$$ plain form
2930 -638 862 -454 -281 -44 -313 -119 -333 151 -1122 282 -139 -181 -256 29 92 -555 369 -758 -193
2949 -193 -430 9 -236 -150 86 -846 162 -164 -134 -1216 541 18 -962 253 -321 41 -712 662 -658
2968 -658 -269 307 119 85 -129 240 -693 214 256 -450 -91 308 149 -830 486 -222 140 -318 143 -276
2988 -276 162 489 -765 433 -41 -30 -2 731 -339 -344 1227 -77 -273 -115 918 -464 489 531 -970
3007 -970 25 751 442 -737 1020 48 52 714 3 -244 124 972 -466 328 273 -431 220 685 83 -862
3027 -862 1216 -23 -266 108 487 -358 136 548 -797 466 155 -139 -491 479 -211 -590 797 -790
3045 -790 -599 440 615 -1182 -280 577 -560 77 -133 31 -979 618 -64 -524 104 -310 -162 -8
3063 -8 497 -974 416 348 -391 -449 -20 123 -832 776 -657 -303 209 152 -601 -185 219 -692 -35 108
3083A08k08k93P16j70p77R97p46O28n01L43q24P83M69r92L78J78k80n43R97n83
3103c20k54P94j89j77l91J124j090O57rm11l4L52N10j077R52n35J92n68P32R1
3123C49m60O40m55K57l42M38o64N26K73j004P30k05L36r29J337o44k69M03k95
3142B2J57m74J059j458R89O3m08K72p4l1p50J324r00P0L36L28p22j13J070j318
3162e58K98L28j05l46P55k17q99J275p70L4k74P67j097L78O60r48O78j7l05l42
3182g05J255o76n58R60n0o98L23Q18j524Q03O96r36K21L62l5r48J344p70m72J036
3202D46j37l89l06J508j624Q50o7j27l93R06j30q14J350j043j03K27N43j065O64
3221B96P40j128L02L6K74o78Q61k63o80J061p81Q6J55L42j015R07J49p64M99K6
$$ plain form
3083 108 -100 -393 323 153 -624 373 -373 255 -246 97 -727 56 525 -467 -89 89 -191 -734 263 -320
3103 -320 -574 220 31 -146 -537 587 -503 154 145 -266 -300 52 562 -515 437 -98 94 -474 258 349
3123 349 -111 529 74 331 -11 427 -237 289 562 -442 288 83 419 -510 827 183 -86 317 22
3142 22 179 -295 764 -694 295 358 -50 222 148 117 -633 691 -209 -139 197 525 -197 -310 760 -558
3162 -558 -260 68 -37 -383 372 155 -744 531 -239 -205 -479 288 -809 -431 229 -719 -41 -58 -363 -705
3182 -705 550 -126 -684 276 226 -472 -149 669 -855 -52 644 -292 -71 291 256 -692 652 -118 -590 446
3202 446 309 -80 -386 1122 -502 348 281 154 -239 667 537 -277 1073 30 -73 154 697 -368 296
3221 296 1036 -92 210 246 520 -158 703 440 -240 821 40 126 281 623 -392 515 664 -100 399 425
3241D25J41j033J036p04k45P83m08o9n16J048r40P55m46L78k64j12L88o53Q07
3260C71o99M12l51J42j53k35P38r56R69n18M52r23O12K65o22P07o47N47p84Q72
3280A99o05O3L89J4l65j63Q37p72N69M1k31j16P6M91p64N87l41N40l35J29l86
3301a43K00O76q32M18k89N01r20O81J88r29R41k00j70p72J486q66q9L69m45N15
3321C20k83J99r09J052n00lM17k68o13K23J261j692K49R39q3n14L47K57j396J334
3341C37k61q3m39O22k79j43R38j326O02l0K97q50P97P8r86J457p62m08N9J001
3361F21j166J13J145r29m2L57L98j119J081j87p13M86j58K23j80O17j130O74O33
3380G24r56K56M7L34j014J160o85m12N33N17q90l06J240j145M02Q2K55m51P6L90
$$ plain form
3241 425 566 -467 569 -135 -380 403 -5 -74 -590 458 -482 273 -173 205 -59 -171 217 -436 371
3260 371 -328 84 -267 -125 -278 -513 225 -731 238 -280 172 -751 -139 126 -496 211 -436 111 -673 199
3280 199 -406 -343 46 60 -305 -468 369 -403 166 207 -24 -140 -64 427 -337 250 -91 449 114 243 -143
3301 -143 57 733 -99 319 30 531 -389 292 480 -449 492 292 122 -650 836 -30 -119 250 -195 320
3321 320 37 236 -673 379 -121 -124 293 25 -588 -365 896 -796 -547 392 309 -205 142 399 -997 337
3341 337 76 -7 -446 176 -103 -246 692 -634 -32 -62 235 -615 182 260 -726 731 -31 -439 -380 621
3361 621 -545 -432 713 -216 -258 99 497 -622 459 272 -441 45 -113 110 -70 547 -583 91 724
3380 724 -232 24 71 405 -609 551 -134 -546 -13 504 -386 -692 548 -597 -195 -113 142 -309 -233 157
3400A57n79Q01q88M74J17M7p16O74M47r27L27J02K53r45J055l12m24L47Q7J67
3420B64r45J113m64K28r5j11L70n50P13o56N98o61M48j25k27m5j39P50o56J46
3440d4J80M58o02k69N52o95M79k27R41j280N80J03k24j67pK66o43O61m83K76R2
3461e3Q9m41J56O17j284J041j53l78L17L35n11m59J024p64M4L13M79j008L72N32
3481B68j083P18k7K76o07P50o41j50R82o72L1j06O38j071N61L42p99N15L12k26
3501A1p59J352o32n12R67j88n14K2P18r50R27l11j76M7p6K85j8M78j236O79L42
3522D56r1o44N00N44j302Q85k16ln69J160l36m89Q38p51J47j82L82p25M30L21
3542C55n25M64j38kj96M98o45O0P04p36R0J82O18j098M48o5j96K01R1J01l86M67
$$ plain form
3400 157 -422 379 -509 -35 82 129 -587 87 534 -393 -66 36 289 -656 399 87 -337 10 97 264
3420 264 -681 432 -32 196 101 -10 360 -190 523 -133 465 -196 252 127 -100 -145 -284 466 -190 -44
3440 -44 136 594 -8 -277 275 -420 59 -168 773 -507 73 176 -48 -215 -222 44 -599 62 -421 -145 -53
3461 -53 36 -405 -249 368 -916 125 -28 -406 -89 246 -265 -724 300 -464 -420 -107 372 -636 -264 268
3481 268 -815 -97 -124 152 -455 295 -346 -496 486 -186 -155 -261 377 -694 -133 209 -590 -75 237 11
3501 11 -748 604 -28 -540 427 239 -275 -253 465 -485 442 131 -45 2 -74 211 193 671 -565 114 456
3522 456 365 -279 221 765 -537 348 132 129 -440 720 384 -105 733 -18 129 -53 329 -396 34 355
3542 355 -170 294 156 154 -42 456 -189 -129 575 -161 -71 111 729 -369 79 14 -182 19 110 211 -175 292
3564B92q65R02l64J43j48K00K22q12O62k92J93r1k7K32m53N83n26M09o73N33p8
3585D2j24J95j67M77o96N74o84M26l34L24J1n00M20j06M19p63O43P4j89k23K85
3606A04K59m97M59J7n07k80Q19J72j063O84k13K84m61N72p24k4Q14q9k11n76O86
3627B25m07O93n54k22M86k24Rl23R54q59K55K76m39o2M95Q7p26N76j6j54kO7l32
3650a97j08Q75j359Q04Q5J95p58J071m67p75J051j52l86r7M51l05j06L14o06L18
3670a52K06J85p34P30m08l70J319q32j24k3M98p83M63M09p10J22L44J00q50P19
3690A09k11m09P98k98J6k66N79q79P73j92k53j01K40J69k55L65n98K39K8M98o92
3711c40K47L13n52O86m33J48m53O95k60j45K28l90N78m58N86o37J71J4j4L6j10
$$ plain form
3564 292 -573 329 -35 108 -40 160 382 -430 232 -60 133 42 15 247 -206 377 -149 260 -413 120 42
3585 42 -82 113 -54 423 -273 301 -383 43 -291 33 44 -456 -36 -142 277 -486 157 231 42 -181 104
3606 104 363 -134 325 342 -165 -445 374 546 -517 167 -46 238 -223 349 -375 -399 415 326 115 -461 225
3627 225 -182 511 -43 -265 221 -3 6 -317 637 -222 33 309 -130 -192 303 390 -336 240 224 70 68 135 -197
3650 -197 -305 570 -789 15 100 295 -463 608 141 -634 417 265 -121 -218 233 -72 -178 136 -470 -152
3670 -152 54 239 -495 235 -173 -543 776 -56 -180 -203 295 -488 -25 384 -326 -204 140 240 -610 109
3690 109 -102 -511 287 -11 5 -261 318 -561 212 20 -233 -334 -94 75 -180 185 -413 -174 -146 352 -340
3711 -340 -93 220 -332 354 -79 69 -384 311 51 -94 134 -256 322 -136 450 -187 -16 -2 -16 20 -90
3732i0L94n95M60k35L47k16k06M97n53N05l31M83p69M57o8k20K42m17M46l13J96
3753A4k93L87k25m8M44m33K60l91O04m36k8O3l5J3j96Q18q09K95n2n5j39K82j3
3776B7o75Q37m30Q7J85j2m49K56M46o78M06k01L32m23M10l97j89R65p14K54j04
3797f7L59n10J95M20p25O00m6k14m03P82n38M2L24l30Q1k06N28o44N21j23l49
3818c03M87J3k49k62Q25q09M82J23o8l84L92j28o08Q67n53J32j26N37m00l45P94
3839D17j037P26J3J03m88L02L78o60N96k36j69J47L59n69K03J73m72L16l32O82
3859D52p31O06l92Q5J56l63L23l42R51r41J77K88k28J68l95M68n55L89j97M22
3879C41m29J26j00Q3K40l60M23n96L28k4r6q3MN81p99P01l55J43l52K75j4l36
$$ plain form
3732 -90 304 -291 169 -66 281 65 -141 356 -197 308 -23 460 -309 148 80 -140 102 -315 131 -182 14
3753 14 -279 108 -117 -165 279 -154 106 -285 319 -117 -145 -82 -117 -104 -300 518 -291 4 -48 -103 -242 40 27
3776 27 -648 189 -241 -154 31 19 -430 -174 272 -406 0 -201 131 -292 118 -279 -468 497 -217 37 -67
3797 -67 292 -218 -23 397 -328 272 226 12 -391 391 -147 -105 219 -111 -30 -236 292 -352 169 46 -303
3818 -303 184 197 -52 -314 511 -298 184 307 239 -145 247 119 -489 378 -175 -43 -169 368 -32 -377 417
3839 417 -620 106 119 222 -266 36 414 -246 350 114 -55 92 451 -118 85 258 -214 102 -230 452
3859 452 -279 327 -65 20 176 -187 136 -206 745 -196 -19 269 41 209 -186 282 -273 116 -81 341
3879 341 -88 38 -62 21 261 -99 324 -272 56 32 -64 -147 -143 438 -361 340 -15 128 -224 51 37 -299
3901b99N03n44L16k85K84l14L06J19k98K33l23N91l51L70m70J57M02p23L50l57
3921c33N72m12L41k50K16L10o28O57n07K12m69M93j75k32N90k05j02l31N54l50
3941d9P8j4j33M32m74J95o65J014m39l0K61k17L07l33L70n98L59r3K81l71L16
3962A97p3n32P98l10r1m57N37j35j69K34k90M83k06J55o17N23k08j99N45o0j03
3983B2k18N10l08p4O6k24L11N2j12n51J122p90p3L47j38j75K1L30n46Q08m58L22
4005B44k43qk6l54Q24o65rJ85M90o91Q5K30l18N65l71R6l79O10l36j3N10o67J93
4028d8N1m2j51J36N6J50J40k98r2JM23n43K05J55k22K37m33M84l49R1k49N82j65
4051A19j45J0K74k09n19M89j28J20K8O0k02j53O40q44K09J41p3K32k76O23n81
$$ plain form
3901 -299 204 -340 -24 -309 -25 -339 -33 86 -212 21 -302 289 -62 308 -162 -5 397 -326 24 -333
3921 -333 239 -173 168 -82 134 444 -184 473 -34 178 -291 202 27 -205 385 180 78 -253 301 -49
3941 -49 29 15 -118 314 -160 35 -630 384 -55 -85 176 -41 266 -67 303 -295 64 -29 252 -119 197
3962 197 124 -408 390 80 -11 -468 69 -66 -235 -1 -291 192 -14 141 -476 47 -161 -360 185 125 22
3983 22 -196 314 6 -68 -2 -226 85 137 25 -526 596 -194 -267 80 -58 -233 -212 118 -428 380 -78 244
4005 244 1 -7 -33 -387 437 -228 -237 -52 438 -253 -168 62 -256 309 -62 34 -345 265 -71 -84 426 -241 -48
4028 -48 3 -39 -190 -54 2 152 292 -6 -98 -97 326 -217 -12 143 -79 158 -275 209 -140 -49 -298 284 119
4051 119 -26 -16 258 49 -470 19 -109 11 39 99 -103 -256 384 -460 -251 -110 -183 49 -227 396 -185
4072a85K96m22M21ml19J86N8J95m16N30p63L31K4l3R4m1K39n39N13l23Q7K2J45
4095I6j14k50O12n61L95j41K08n63M70j06m02L59m7L03p23Q78m04O7k32p0L44
4116A19l08J53j94N43n40j2N86k03j15j11M44o46M0L98j69J4k25M49n53O36k01
4137A05j32m7J31j2l93M52k55M43m32j42J83P6q9p7L25l70l2J06M70n97J09L90
4159B12n88M88m40L88l06K37O7j87M92p85L57j87K95j19Rk9k5L02l16K05l15M59
4181B14k42j24M46k41J33m86O44n16N81n26KL47j16o2p2M81o71%J55K74l09jL28
4204B39m57M55l38L88l48J13j59n5M48j17J21l56Q8j15M33n10l0N32n89L31j97
4225a23K39n23N24j61k7J90m16P72o22K37k69L57k91m04P55k13K8q5M12m64j4
$$ plain form
4072 -185 111 -311 110 106 -213 -27 31 226 -190 340 -423 -92 -68 -101 -7 -48 191 -348 165 -158 -71 -49 96
4095 96 -18 -268 344 -217 178 37 245 -318 152 46 -356 3 -44 259 -464 414 10 77 -155 -225 119
4116 119 -189 -36 -230 313 -227 -239 347 144 29 -82 362 -284 -244 154 -15 -1 -226 223 -330 306 105
4137 105 -27 -74 57 45 -348 104 -151 292 -140 -282 -99 -23 -112 -189 136 -234 -266 -160 310 -287 -178 212
4159 212 -376 112 -328 60 -246 -9 58 -129 363 -422 -65 -252 43 -76 -67 -96 -121 181 -135 70 -245 214
4181 214 -28 -152 294 53 186 -300 344 -172 409 -117 -115 232 116 54 -18 463 -208 -208 -53 221 -88 -89 239
4204 239 -218 237 -101 287 -61 52 -107 -162 286 169 290 -66 22 -93 340 -170 -200 332 -257 74 -123
4225 -123 116 -407 117 -44 -71 119 -297 475 -147 90 -179 178 -113 -517 238 25 53 -32 380 -84 -98
4246i8K33r1j05J74K97p35M90j25J18J66k25J1M3On43O45qk75J54P7J25n79N19
4269B74j67m7j58L09k19j65O50m33K33k98Q1j44J26j23JM52m65J55k73L52j35
4290FR2Qj85p5q7K15k16N52l66k34N12j92P8j22K41m69L16j14j4J87k18J66k73
4313a92O27p38K70M2M3r8m9K46m79N23l25K3O9rJ49j31K16k96N03l17Pj4J0k41
4337a61J51K21l30Q5l6L74m65R5O0j39J27r6J89l29r1L74k88J45j28L99j52j13
4359a08j52M12k91k72M04k49L18l54K83l07J91L15j92j34j70M45o42O41m78L63
4379B3j51j5L7j34M18n78N19l02M21l45K20m3m16N59m62L71k09K17k69K78N3l71
4401a79M18l24L15m91K75K0j6J65n8J06j17J46l48M01l73kL73l22J09k67K16j94
$$ plain form
4246 -98 135 44 -61 113 410 -325 165 40 158 324 99 110 153 159 -384 261 253 -22 132 209 334 -245 274
4269 274 107 60 -98 211 -8 -173 477 44 277 -21 60 -84 42 -81 -80 372 -93 62 -211 141 6
4290 6 98 106 -79 -154 -241 -26 -242 310 -56 -290 222 30 108 -14 227 -242 74 -40 -54 133 -85 81 -192
4313 -192 435 -303 -33 9 52 -46 -95 151 -328 195 -130 -107 -38 -47 102 -29 187 -109 394 77 84 70 80 -161
4337 -161 -10 211 -119 -34 -70 304 -161 -66 -6 -145 -18 -114 75 -254 -345 29 -259 -114 -242 157 5 -108
4359 -108 -260 152 -139 -411 -7 -256 62 -292 -9 -316 -125 190 -2 -136 -306 139 -503 138 -340 23
4379 23 -128 -143 -106 -240 178 -400 119 -183 238 -107 113 70 -346 213 -249 122 -87 130 -139 139 192 -179
4401 -179 239 -85 230 -261 14 34 18 183 125 231 114 260 -88 313 -60 -62 311 -11 98 -169 47 -147
4423a47N51k14O1k58k65L19l23N15m74J40L75m51M4j34N90m84K13K9j02L1l56
4444c40K91j0J05m71M32Rk16N1L54j61l43J99R4m5k40L25J14j91M6l00O33l07
4466B9N7l69M99j12k10L06k67M8Q7K96m00J86k6k99K85p6J26j46J53k86M1J32
4488E4j40L10j98p0j59M30l43k4K30j94Q1k03L18n33O44k25j39J71k5K86l88J16
4510al15K77j31J77j62L0J40o3K06l36P8j21J39L8j72L05M0j56Qj9j25K59j05
4533ik36L67k53L52l74K74l66L94J78m54J82j20N7j28J48k0j30K68k35L11l13
4554a07J65j82J11R6j87m6j27L67p8K35n33K02Q7R7j96J31K01n49M18M8P7j86
4576D4n5J26l44M90k83J79k55K42k88L71k93j37M77m73L75n17M23k09K29J59n76
$$ plain form
4423 -147 404 190 251 -7 -272 47 -276 239 -235 -95 280 -171 -127 -261 329 -155 58 87 -15 16 -340
4444 -340 -49 -59 46 -425 7 16 -200 -149 205 44 -299 -100 -6 -51 -291 34 148 -43 3 -297 336 29
4466 29 86 -283 216 104 -106 200 -67 -19 68 364 -36 150 124 -175 110 34 160 14 167 -119 -78 54
4488 54 -86 224 26 -44 -203 227 -116 -140 90 -104 -23 -226 92 -441 203 -22 -161 10 -15 271 -117 -1
4510 -1 -316 -39 -170 7 -155 -125 15 -48 158 -178 -100 -221 -82 -44 -216 89 129 -27 -19 -38 -163 96 -9
4533 -9 -245 122 -131 221 -153 121 -245 149 327 -127 55 -65 -8 -136 12 -8 -138 130 -105 206 -107
4554 -107 58 -124 -13 83 -104 -150 -277 90 12 247 -286 -84 3 100 -96 35 236 -313 105 153 230 44
4576 44 -11 115 -229 261 -22 157 -98 144 -144 227 -66 -203 274 -199 176 -341 82 -127 102 261 -315
4597c15M47m61M63l14J60J6k8J70m67L28rO3l25L13o8j69L40J27k15k61M00k60
4619f5L10j45j37j20K94K8k46K54l80j1K83M4J05m21N33m97K83l25L40j22k12
4640b07N71n26O03n91L15k00J62k2n7J05m09N48m36k1L92j52j8N3K22m60K8K6
4662g4Q5k13J99K24m35L63l45K27j66L78l77K02n1k32J98L10j85l20N38l23k28
4683b25K91L2J63j45J46n48K69j97QQ1K59J92n73N45k04r8M12m74J74j1K05o84
4705c82N63n8Q5l92L2o1J36M71n07K58J6K8k86J69J17l04J82j51L42n27M61j23
4727F9J81k59l4Q6p7J02k41L62k24J2K63m36J48KK63m48L5L07q6J48j0j32j95
4750a64L06m26M93k98M0J25J6K63k79J09r8j06L3l8J40m05M86l67K56j67J13p9
$$ plain form
4597 -315 132 -329 134 -180 -20 -4 -32 138 -329 -1 -10 53 -272 41 -27 -196 144 271 56 -205 195 -65
4619 -65 245 100 -37 -157 137 165 -81 173 -207 -218 65 109 214 -207 326 -171 112 -213 127 5 -207
4640 -207 364 -162 441 -150 165 -35 127 105 48 153 -256 292 -144 -165 227 75 57 110 332 -128 -100 -74
4662 -74 11 -202 -3 221 -214 149 -196 31 -135 243 -134 68 17 -215 -17 293 108 -212 326 3 -225
4683 -225 66 98 261 116 262 -286 -17 -214 -206 -125 134 326 -247 298 94 -4 408 -66 108 97 302 -382
4705 -382 181 123 208 -184 -152 -213 -77 394 -113 145 161 189 -97 72 189 -115 67 -84 258 -269 192 69
4727 69 250 -9 -43 43 -34 68 -173 189 -35 -23 240 -196 -48 -46 217 -231 -196 111 25 173 163 31 -164
4750 -164 142 -284 209 -89 -49 76 92 355 76 185 87 -19 14 -24 116 -289 197 -170 86 -81 32 -47
4772d7j64J28M3K00k61K46r8q3o8K30O2m66L32j60K00J7k73l1L80J32l97K0J71
4795A13k22P4N0m3p3J29R8k20o0L50l82K68k12K41r5j09K13o0J77n19L75q0n3
4818d0J40j20O7mL42l08k87J23K15k72N8O6J26j30lJ14j98K62j72o5J87q5J57
4841A73K0n0J69k79k1j90M23j20m2j14k7J41k64K69j28L47k11P5l69J92J36j23
4863GQ0p2J20k73K85l95M74k41k19J67K45j4j75O8j78J83j30k02K12oK90l45J05
4886a4R6j59J98nm53K70P7k79J49j36O9J89L4L14n16K35o8j3J6j21J45q2j05j0
4910a69J15K37j98l1N0M9r3L6j59L13k80J05l6M2N1j8J48j71rN4K21j98K89o4
4934B84l04J10j22J09l14M65k69n4Q5j8Qk4K27l67K53j54m9M9Q5J52l33M58m37
$$ plain form
4772 -47 -211 -83 -40 160 -101 145 47 -36 -104 126 188 -278 54 -106 94 111 -162 -193 187 319 -78 -58 113
4795 113 -109 -35 15 -28 -101 28 126 -94 -154 196 -186 82 -130 111 16 -93 120 60 237 -282 93 13 -40
4818 -40 100 -20 47 43 385 77 -210 -87 128 -144 -86 -20 106 -24 -27 87 -111 151 -21 -86 101 16 173
4841 173 193 143 312 33 12 -178 245 125 83 -31 -58 83 -181 88 -40 307 96 171 -198 -6 130 7
4863 7 87 15 135 -138 147 -248 226 -15 -234 -67 178 164 -11 57 -121 62 -68 -270 -58 -64 226 -119 -14
4886 -14 82 -77 121 116 -337 -67 10 -269 -120 -256 -187 2 36 350 -166 69 1 -12 4 -117 28 -54 -159 -169
4910 -169 -54 183 -15 -46 4 53 -40 -4 -163 150 -130 -25 -61 -19 32 14 162 -9 -18 36 257 59 348 284
4934 284 -20 90 -32 77 -237 228 -41 -95 -10 -28 -20 -44 183 -184 69 -85 -134 -85 0 152 -181 277 -160
4957a60K27j26K77l09R9K95k33J35l03J64k36J45m6l8L70m47j0L89j37r0M5J75
4979A86l21J53j76K10j73K45J51l17J14r1n7L24L9k65j32L23p3l21Q4L47k47K08
5001B11j32R2j42j47q3K64j47lJ25p6P0j22K55j33j13K39k50pkL12l48J39J52
5024A54k76K6k06J47L9K77P4k37q6k25K60L7j67k68M95k4j32J71p0Q7j57L44j38
5047A25J10l01j19L73k57J58J36J4l36L26k06p5J87k36J71j59K16j64J78n3J65
5068B53m44K29k6J44j15j07J39L7o2p1kJ62k63q1N81q1k53L9L18n28K74J51j45
5091A49K7l80L60j72r4J33J12j98R2j94N27n66j83K96K1J33j97K03m73L96K4j5
5113Aj01nO0j40K75l17J96O2l28K28J16n5j91K33k0p8j15J84K0p3K11k42o5j91
$$ plain form
4957 -160 67 -59 218 -91 8 303 70 205 -98 66 -170 -25 -71 -109 261 -186 -196 193 56 -34 11 186
4979 186 -135 18 -158 52 -121 124 275 -42 72 -19 -76 248 287 22 -110 213 140 -181 -97 250 3 211
5001 211 79 171 29 -118 -201 63 -84 -87 38 -38 32 -90 165 32 -81 158 -92 -99 -101 211 -137 2 154
5024 154 -122 -96 -302 -155 -116 161 235 -2 -88 -313 -53 -16 -183 -451 44 20 -112 59 -11 76 -81 263 125
5047 125 235 -66 -185 188 -69 89 225 239 -97 229 23 -52 135 -101 70 -89 127 -37 141 88 253
5068 253 -191 38 12 156 41 -66 73 110 48 -23 -25 137 -126 -207 374 293 40 79 397 -131 143 294 149
5091 149 176 -204 156 -16 -110 23 135 -63 29 -165 362 -204 -387 -91 -70 63 -134 69 -404 -8 16 1
5113 1 -100 -105 -45 -185 90 -227 -31 31 -297 -69 47 -8 -199 34 14 -64 -179 5 25 -48 163 -79 -144 -335
5137c35N09k16K27j59lp6M6P8M4n4k96K50L5k94K15Q2n3P3K9r8K1K67o3j49j36
5162e6nJ1J49J73o16L36Q9r2n3K07Q2n19K53L4M5J14j55n3rJ56qK3n2o9Lq0p8
5189a70J64j5n4O6K04j17j27J95j97q4Q1p5N2J0J21J05k95J00j3m4J32q8J06J26
5213A83k24K55q1k33J42K6O8q2q9j49j4J10J88j19P2j5r9K64m9J11l48rP1J20
5237I9L1j75K40r6mRJ37j80j3j66K10k5J6j40k3L07l02K9q4J72O1k44q6K36l3
5262b4J12j58Q2k3K87l85L17l62J28J50J08l70k4K78j7o8J18j18k19K97k8J05
5284A86j70j22L02l77J30j0q5M14j58j53p5Nk00L13j4N9J35k27k24K94J36j07
5306E2j05J67Q6k94J81J34k87%K76j93k09K73l31M52j34j00J56j79R9J5j76J63
$$ plain form
5137 -335 174 -42 185 26 23 -53 -7 71 115 61 -235 15 50 -244 -29 53 0 73 102 4 25 292 229 80 -56
5162 -56 -61 -50 99 272 -344 -8 81 -11 -64 143 225 -294 -41 -7 38 152 -3 -56 -65 91 83 106 54 -15 -12 -92 -170
5189 -170 -6 -21 -75 -9 195 78 -49 146 -51 -135 -54 -129 -77 -67 54 159 -136 -36 -49 -93 39 -49 57 183
5213 183 -41 214 133 -100 42 68 136 54 -35 -184 -198 -88 100 -19 53 38 -61 203 154 265 -83 -92 -21 99
5237 99 130 -45 195 99 95 104 241 61 48 -118 92 67 83 -57 -80 227 -75 -46 -130 42 103 -141 -227 9 -24
5262 -24 88 -70 12 -11 276 -109 208 -154 -26 124 232 -138 -162 116 99 31 149 31 -188 109 81 186
5284 186 16 -106 196 -181 -51 -61 -146 268 110 -43 -118 -113 -313 0 -14 45 180 -47 -271 23 159 52
5306 52 -53 114 200 -94 87 221 -66 -66 210 17 -192 81 -250 202 68 -32 124 -55 44 59 -117 46
5328D6L0R0k19j62K47J77l48o9L34j62K04k42N7R1p0J20j95K99l01K05Qj20m3
5351b3M9j07n4K53pp3l22K86Q0J59j73j17k85M62J20k48q5Q9k37J67J53jj0Jr2
5376a5o0k6O0J03o9o0p9K16J58j5l66J16p1j32N52l54L47k37j51N1n6J54N2k28
5400a10J7K73k85j0L4J81P3j55k4j0k7K43k51K38l16O8LK47m6qj14l9j80J29J42
5425G3j38k3K95m24p6L54Or1l5N1j23O7J73j61j55K30l5J27k83J94j25J9o6P3
5449g3K18j5j02l35K89R6Rl15K13p0L32J1j56J13m24K71j38J85Lr8J07j37J22
5472A06j39J95q0o7J20q5J30k51K3K4Rj11L13j74j17n9M4j2n4K65j82K24p9j67
5496a24J6J16J91k85K5O6P9M3k2L2r2r3K9Q7K1r9l8j02L60oj16j61M2L4J32k68
$$ plain form
5328 46 76 166 -53 -215 32 209 -139 -208 126 -36 168 -74 -17 74 4 124 -71 228 -73 132 140 20 -23
5351 -23 26 -81 -135 118 111 38 -284 2 82 241 68 -49 -334 128 248 0 -85 4 -233 -66 87 86 76 77 -15
5376 -15 -75 -101 -41 62 -7 -67 -146 70 228 213 -153 -37 -108 -240 312 -42 305 68 -83 -32 -88 66 118 -110
5400 -110 -93 180 -105 -115 -81 100 173 18 -6 -16 -43 200 -51 187 -129 -61 -58 189 143 135 21 -18 -198 -69 73
5425 73 -65 -88 207 -217 -293 61 67 -24 -59 -8 -131 -64 109 -52 -207 23 -12 115 -168 26 -99 -80 -146 -73
5449 -73 145 130 28 -307 -18 78 87 -228 -15 -85 247 258 102 215 -209 62 -76 109 112 14 121 -16 106
5472 106 -33 162 82 15 135 50 180 -71 -48 -24 -15 -126 187 13 -104 -163 -119 -131 -185 80 -102 122 43 -124
5496 -124 -108 8 199 -86 -61 5 84 127 105 137 45 -48 -19 68 89 -10 -48 -150 210 204 88 -73 -31 3 135 -133
5522a33KJ95J36k61K38k52L7P4L35l42j24P3L0m1L39m13J89qk09M3J4J07%nj48
5547a24L30j52j2O8j25n8k42L81k68N1L13k54J24p5j44M09k44k3J71j84K8j15
5569a45O3J57n9J2l2J96j03Q9j65j80L44k39j15R8J33n6K92l88n0P8J8J31k45
5592a66MJ21J23J5k20J31k36N71l88n5J19m7R3j68K80p6l29K02P4p6P0j3J24k78
5616a25q3R1p0J28L21k44J81n37L76j6m8K08k1k42Q6r1J59l6q6J16k0l50L35m9
5640a7R0j63K08j12J4l06L51Q1j50J63K4k26P6O8L9j15rJ00k5O7j87l5P4Q2q1
5665A1M4j77L76l85k9J82K36j63j23K0J8J06j53n7R0J45l71J87J20m2M2P1k96
5688a48J86k20J51J93j61j33J24l34K49j79L23j34o4R3J17L5k4P2r6j0j36M4K5
$$ plain form
5522 -133 -131 64 200 -61 177 -75 -38 36 371 29 -95 -22 8 -33 306 -107 82 74 -135 -92 -78 29 29 24 -124
5547 -124 206 54 42 110 -15 -73 -315 66 -202 -151 162 -92 32 -43 -187 222 -22 -45 126 -58 -30 -145
5569 -145 -82 75 16 28 -4 192 89 178 13 -167 177 -62 -177 -79 54 -2 290 -98 -148 -70 -52 79 -166
5592 -166 -162 -41 82 97 -123 8 -228 343 -45 -100 19 -28 65 -103 177 101 -228 -26 48 -28 42 29 153 -125
5616 -125 -208 -117 -187 -59 262 18 199 -338 38 22 -26 182 161 -81 5 -86 73 37 -49 67 47 -303 32 -17
5640 -17 73 -90 118 6 20 -286 65 146 -4 159 183 -43 33 101 140 25 16 116 91 158 -29 -64 10 92 11
5665 11 55 -122 254 -131 -160 22 258 95 -28 -8 10 116 -37 -94 -4 141 -230 -43 77 35 77 148 -148
5688 -148 38 -182 -31 162 1 -132 -8 -342 -93 -272 51 -83 -147 -54 63 98 74 146 50 40 -96 -52 -27
5711b7Q1j41K21m0N4p1N4J0k22K8K15m36K41K9k8j99L63J40m91L28k57j52M21
5734A21K59k51j47N9R0j88J83k02l9J08O1rK19l40J35LOk50M3L15k21j9qK06j85
5759e1k0N9J50j63L1J16q7J41k92N4k8K22j90m6J36j06M4J82j44k14K46L9o9L0
5783D0k05K82j59J6o2L77k07k30J34m1K1j10L84k86N7j37N5K34j75q6P3j79L22
5806A18q1N1j01l8p8o9M3K20n0j67J60j80L71k49o4J69j79J78J45k34J02Ro8j06
5830i8O5M4Q8o8J75l5N9l54J09rjR3k53K3L28k93J73J09q9K33m40P4K0M3J33r2
5856C7J04j2L02l40l42L34k59J72l03L17j27n3K35M0j37l71L58R4j50J4K36l90
5878b41L67j3J03K2k54q8K68o9j49pm4j02K81J11j45j35O1M1K13j85p7J78j09
$$ plain form
5711 -27 54 -87 134 94 148 77 131 141 -81 -53 162 -274 -33 -4 -32 -231 132 272 -219 109 -148 -300 121
5734 121 380 129 -18 41 131 -57 126 -76 -115 -7 54 45 264 -76 59 62 68 -182 -139 176 -45 -64 -72 134 -51
5759 -51 -71 -12 138 -25 6 122 35 176 -116 -62 -90 132 -58 -104 32 -74 -30 152 8 -206 40 79 10 40
5783 40 -165 117 -42 -26 -88 289 82 -148 -14 -55 -34 -144 240 -46 11 -126 -71 163 -12 -98 -25 -204 118
5806 118 37 88 -13 -51 -129 -198 -155 65 15 -152 8 -172 199 -50 -114 55 -124 54 199 -35 67 76 8 -98
5830 -98 -33 11 99 31 206 171 230 -124 -15 -24 -25 68 -185 -162 166 -127 46 155 66 299 -141 -67 -47 -4 129 37
5856 37 141 129 431 91 -251 83 -176 -4 -307 10 -117 -170 65 105 -32 -403 -45 49 -101 -87 149 -241
5878 -241 126 113 216 238 -16 -104 164 95 -54 -61 -105 -207 74 185 40 -95 -34 7 220 35 -42 136 27
5901B7K11k67J21n9kK5j8J6J13k24jQ3J71l58J66p5LJ49j45K51n2r0J90q4j39
5926A2kK6N0j84P5J01j90J05N6J04j02J17l39M04k87J35N2j29q3K30p3k57L15
5949A36j14j37P6K11l50Q2K61k15L0J62j50r7K26k48K21O1Q8k79J55r7J17j98
5971e9M5J80m34M90oj91m7P3N0J1j58L7l3P2J23l41K53j02JK20k20jJ32l44M19
5996A70k97J5L9n5R2J63n1k30J45J44P5j49j90J87R2k71K38p9k1%n6j37J79K4
6020B7j56J34J3J42l3K0k28K79j21j29J77j79kJ7K29j73k8P2R2k14k47K34J15
6043D1NK19j79k46N3J78j8%J1J18j82j24J57l8jOq4K82k84q1J43J27k34j22K82
6068B9n9J84j61J61j48q5J88K0j40J39j54j18J18K07l86K93q8Q6n0J7k05M6J69
$$ plain form
5901 27 238 -29 92 33 31 56 38 54 167 -57 -58 25 196 -162 4 -71 -68 81 -64 187 135 45 235 151 12
5926 12 10 36 86 -98 -23 78 -112 -7 49 153 51 168 -171 233 -54 81 133 4 -79 151 78 -179 136
5949 136 22 -115 -39 172 -178 -96 165 -50 -20 142 -8 -105 121 -127 94 155 243 -36 119 22 139 -59
5971 -59 -14 166 -268 222 216 25 -22 51 101 112 -46 -9 -42 30 153 -188 65 -37 -36 184 -36 -37 95 -249 170
5996 170 -127 -112 -73 -128 -36 127 76 -154 -9 135 210 61 -129 58 150 -121 117 38 17 17 -39 -176 3 27
6020 27 -129 5 18 160 127 147 -81 198 77 -52 125 -54 -56 -39 190 17 -11 61 153 -61 -308 -74 41
6043 41 46 265 86 -160 -107 71 53 53 64 182 0 -124 33 -5 -6 0 -84 198 -86 -167 -24 103 -131 -253 29
6068 29 -30 154 -7 154 6 -79 109 129 -11 128 -26 -144 -26 181 -205 88 0 86 36 53 -152 -106 63
6091F3L3m7k52L55j06o5q6K80j52J9p7J74j76p8R1q7M5j6L09k10J40k60L38l9
6115A96n3j84P7j19q5K04R4j67p8OJ44k01J74r4J7LQ1R6j3j50K10p4k27Q9m4J43
6141D5L6N5K53k41l41K22Qj01j42J74j14K18m8j01J76r4l8j51L23k15l4j8K35
6164A07j15J85k72J99j20n5K54k16Q8k7J86k30r2J16l4L0j28L7K3R8k7l8L3j23
6188a21M55l07O6j26O5k0q3J61K4j46J12J34j01j73J56m0M0r7L3m8J54j56j15
6211a33J88l9Q9k16Q2j16J22MJ45j23r6K72j03L2j05Q8j79j72N06l06N9j34J50
6234A5k7k56K76k3n4j96M33j53j65J51j04J3K4J2J32l0k49J51MJ95r4k01L98l49
6258i7J25j87K37J5r4o9k7K80k8M8l39Q3l9J92j5j25Q1q5J04j13J38J73j60n6
$$ plain form
6091 63 96 49 -203 152 46 -19 -105 175 23 42 -35 139 -37 -115 -24 -111 -66 -82 227 17 157 -103 235 196
6115 196 143 -41 36 -83 -168 36 130 -37 -115 -109 35 -166 8 -86 -69 -66 15 111 98 -52 158 84 -143 -54 -98 45
6141 45 81 136 389 148 -193 29 37 -64 -206 -32 -146 72 24 -77 99 5 -33 -184 139 -76 -110 -128 107
6164 107 -8 177 -95 104 -16 -71 183 -33 55 28 214 -16 -108 8 -26 4 -124 -87 -64 34 7 -31 2 -121
6188 -121 334 27 93 -33 32 12 -71 90 114 -32 80 214 113 -60 96 56 96 -1 32 -16 138 -18 -133
6211 -133 55 16 105 -111 -29 -145 -23 -19 126 3 -93 179 76 108 3 91 -88 -260 246 -60 -1 -135 15
6234 15 -12 -268 8 -15 -69 -265 168 15 -150 1 -103 -90 -66 -54 78 48 -201 -50 -46 149 55 -146 252 -97
6258 -97 28 -159 78 93 -1 -70 -97 183 155 203 -136 -53 -92 100 85 -40 41 -44 60 -53 85 258 98 42
6282D2K2Lrj7p4K91l94l7K32j04j0j77L50O5j16l9J85k48N6p7Q6m9L1j34J18J75
6308A71l44K17j14l5L11p6J54j37j36J15O9k19J76r7k82M88j52l21N79j48m51
6329b32J24J77J60l25j19M33k96q6J42Kr8J55J38n6j57R0O0k18j19M34j59l89
6351c39K39L61q8j01k98M98l31M7n4J85j27JK4j75J07J68j82J43n8Qj67L46j17
6374I0l57K95J40j27k11K90j89N2K6J58j86Q8r6J91j63k38J08K78j75K2l8J02
6396F0Jk89L71j54J05M9r9j15J54j99k4J22J47k58K21NO9L0j33j52P5lp2J34j51
6421a06J1J44q9J25Rj87J03P1l7n2q7j3O0Rm0k06L12o2K8P6j28K44k35L46n53
6446b57L79k30r3K43q4O6M5r4k1j01k8K47J64ol5j86J14o4k11J39J77k42J11o
$$ plain form
6282 42 64 67 58 41 -33 258 -136 -173 59 -45 -55 -232 118 183 67 28 213 -35 21 -56 30 -19 12 -122 -4 171
6308 171 -173 44 -70 -105 206 130 284 147 11 126 195 -24 152 55 -227 261 109 -212 367 219 -232
6329 -232 -108 69 229 -96 -215 218 -78 -164 -22 -20 -118 37 175 119 -38 52 112 -106 -225 209 50 -339
6351 -339 -100 261 173 72 -226 272 -59 -12 -66 119 -8 -7 17 -158 -51 117 -65 78 20 28 -139 207 90
6374 90 -267 28 168 41 -170 120 -69 -17 9 167 -19 69 -27 164 1 -237 -129 149 -26 -4 -42 60
6396 60 61 -228 143 -11 94 143 44 -71 83 -116 -140 -18 129 -129 92 97 166 196 63 -89 -14 -17 -89 45 -106
6421 -106 -95 49 -40 85 94 -93 10 81 44 -8 -95 -108 -48 -39 -79 -285 27 -35 -7 69 -59 185 -50 296 -257
6446 -257 122 -108 -201 42 -42 24 69 -25 -46 -147 -175 72 236 230 195 9 123 59 -152 -13 164 -78 33 27
6470B7J05j98L8J32L7JR9lm71M10o7j33J03J5Q2k57K44j1l76K14k5J29J28l29
6494a06k07N50J1j55m6J02j80J84k40K2mQ3o6k30L54j25R0Q6k31M5k2O4q9J45
6518C5k38j1K22K5R7k04j98L78k03J93J4l66J41j17J68L0J59rj29q5K38k30J49
6541E9o6k19K70k08J5L31k88K09k32K47j52L0R8q0O2j13K83k04m0J41q7n8K4J6
6565C8j57J66m8j02o3O2K61M2J9l64m4K92l40J10K75l9k13M43k75j57o7M6R9m10
6589d26M69k47J50J62P6j10l51J23K7J72qn0R2L7k17M6J59L8j1n5ll1j35K4K34
6614A65k18j42L00k81L40k47J81m8j54K63k01J91o8K28r0n0m08K01k2o3j96K14
6636a05J08l6J77j46L5J09k56J82j1J08m85N09k73PO9j10L56k97M4J75j65k6Q1
$$ plain form
6470 27 132 -66 -28 104 141 142 241 238 -233 177 110 -23 80 95 177 -80 164 153 -223 -9 -34 95 223 -106
6494 -106 -313 237 248 93 47 149 -31 153 -87 -65 -69 14 -52 -282 72 -53 37 123 -108 -63 -85 -21 -110 35
6518 35 -203 -214 8 33 130 -74 -272 106 -97 96 110 -256 -115 -232 -64 -34 125 116 -13 -98 140 -90 59
6541 59 -7 -226 44 -164 -149 182 -106 103 -129 118 -34 -4 94 14 76 -37 246 42 2 143 56 -2 22 38
6565 38 -119 47 -1 -103 -166 -104 157 199 218 -146 -190 102 -238 -128 147 108 -105 338 63 -94 -161 -115 -16 -426
6589 -426 43 -204 -54 108 184 74 -277 -154 -127 45 37 -13 79 116 -101 -55 104 142 131 76 73 42 -93 -69 165
6614 165 -53 -195 105 -176 164 -83 98 50 -104 159 -42 149 81 309 219 169 -239 -38 -60 -123 -319 -105
6636 -105 3 -33 144 -2 33 142 -114 68 57 165 -320 189 -84 -77 -8 -118 238 -59 -15 160 -5 -31 50
6659E0p5o0J61k18J45Q7J9l89L36M8r8q4J48q0k6Q4m9j03P7j78J38j17K47l9M8
6684G2j56j7L5oL1mkJ46j64j58K69l04M8L69k83K67k74k5K87r0J31j05R8j05M9
6709A09k7j91M97l71l65L65m2K3J7J07J4k62K11r5k39L9L90l21J63M6q4KM1q7
6733f0J17n2j37J08r8J97o1J55k30J86jk7n8r8K10j12k3l65R6L48k09q9K75q6
6757a4J23j88m8m6l2K16q9J33j62J38O1j8K06l97J1Q4p4O9j18J39j32K44k51%
6781a45J50L2J29Rn2l66L98j42j20P1j39o3J71O7k47M58j75n3j24R9N0M5j72K74
6805A55k04J19j61l3l1O3P4K03l20K51k09J90j55J70p2P5Q3o2n0m6q8Ol4j2L3
6830e5Q3K85m14QK55k10J1M6P6L7j87K23m29M8M99j06Kj92J34o6rK10l13J22m3
$$ plain form
6659 50 -25 -85 76 -142 3 90 109 -280 56 104 6 -78 70 -10 -36 48 -1 -104 -27 -205 -67 -184 63 24 72
6684 72 -84 -101 -66 -72 -41 -45 -47 99 -65 -223 46 -258 -210 159 -124 143 -131 -156 131 41 172 67 165 60 109
6709 109 82 -109 388 17 -348 17 -25 -2 15 122 136 -126 85 -10 -249 -210 180 -141 22 68 -16 -14 27 -60
6733 -60 57 5 -132 -24 -122 75 14 169 -61 125 124 97 39 -59 151 39 16 -349 -253 95 -114 -203 72 -14
6757 -14 109 -79 -127 -173 -205 11 -78 55 -107 31 92 74 280 -117 -106 -22 -96 -27 -145 -6 -138 106 -145 -145
6781 -145 5 37 166 175 123 -243 155 13 -107 -36 -175 -238 -67 0 -247 211 36 -17 -141 -42 8 53 -119 155
6805 155 -49 70 -91 -124 -155 -92 -18 185 -135 116 -93 97 -58 112 40 115 198 136 86 40 -48 -42 -76 -88 -55
6830 -55 28 313 -101 -93 162 -48 -37 9 85 122 -65 158 -271 -223 276 170 172 -20 114 48 39 249 -64 58 15
6855A5k71K62J3K3j0j20K09k15M5J19j57K61k08MJ83Nl04J29K18k26J85J67m30
6878a03M1R3o7J53j38j49K38n8L2M4o9q8o3q6K05J15k83K94j50R5M3j28J10q8
6902gO1p4P3k3j19R5O8%m42M42j89K13l11M74l97N2P6q5J01j69J1J62K2j88O7
6927h7J37r4J42j72p6Q6J9m5L3J37n1k2r1J08J21k70J91P0k94K01j13K29k80O7
6951e4j64R2j8J51p7J34j80M54k73j90m0J95j65R5l9p7j26L00p0K55Mk37P3J63
6975B06k08J03j23L27k14j21J80j15L03l53j11J20r3J15o0L1l7j66K11K43l36
6996i8J29k77n6N85m00L98k12K3o2q0K86l49N7K14k58M0K89l84J57N4J25l41K06
7019D6R6l30J68L01l56K66l02J12j56K57q7k52R7K5K3J20M0k40K70j80K1L29j86
$$ plain form
6855 15 -256 6 19 42 32 -88 121 -94 -49 70 -87 174 -34 -30 153 158 -146 -17 201 -25 160 327 -103
6878 -103 -62 31 -36 117 -21 -170 68 10 42 86 17 -71 -134 -220 -15 100 -183 111 -39 56 99 -29 81 -7
6902 -7 54 -20 53 30 -89 6 74 74 -368 74 -115 98 -213 261 -136 -84 -8 -93 8 -161 -150 12 34 -154 -87
6927 -87 50 -44 98 -74 -150 -64 -45 -90 -57 80 29 7 -84 24 145 -125 66 136 -158 43 -70 159 -121 -54
6951 -54 -218 -126 -144 7 -70 64 -116 338 65 -125 -165 30 -135 -40 -79 -156 -282 18 -52 203 207 -30 43 206
6975 206 -2 101 -22 305 91 -30 150 35 338 -15 -126 -6 -99 16 -44 -13 -50 -216 -5 238 -98
6996 -98 31 -246 -302 283 -117 281 69 92 30 -50 236 -113 -56 158 -100 -60 229 -155 2 56 181 -160 46
7019 46 142 -188 -20 281 -75 191 -111 1 -155 102 15 -237 -140 -115 -92 28 68 -172 98 -82 -61 268 82
7042H2P0k39K63J6j13l5q5r1J1J87K3j6K9j17j05Q8J03j51J96k46J24K10q4k77
7066a57m2j28J55L07j94J49k09K75l42J12R4o8n2j08K31l26L90j42K9O9Q5k5j35
7089c2L50n55J66RKp1O4N3k75J80K03j59O0o0%j6J49J56k73KJ51k18J86k4o5j0
7115b7k02K56O2j83J55p8L1j61K61q4j49K60J0r9k16q9J78j18J84K60m96L45J
7138A01j18O9O4j47o0J84j20L12k88j65L66m09K83j11R0j83l9L36j47O8M7Kok47
7162a18J23J00nj80J21Jk9j99N26m38J25ol12K86L5P8l77L94m4N0k36M12l73j47
7186b13K38Oj97K56k61J13K84p6j67L54m02pJ18J00Kj80K28k16N7m6j16K7K13
7209A15l9N5o3j05P6P0J9k4o4n7Q7l29K18j08K43j27o9P6l06L74o4l2Q8k24K69
$$ plain form
7042 82 152 -87 176 192 79 44 -41 -132 -121 66 89 73 102 -15 -120 -32 71 -80 116 -130 -6 204 120 -157
7066 -157 -199 -327 -172 135 -59 90 -119 156 -186 -74 20 -48 -100 -208 23 -303 87 -55 -26 43 128 103 -32
7089 -32 318 -237 -71 -62 -60 -131 -67 -14 -289 -109 94 -65 -5 -65 -65 -81 68 224 -49 -47 104 -114 72 48 -17 -27
7115 -27 -229 27 89 -94 61 -17 14 -147 114 30 -119 141 151 52 -164 -253 -75 -193 -9 251 -245 100 101
7138 101 -17 52 116 -31 -91 93 -27 285 -3 -168 198 -211 72 -39 51 -132 -171 165 18 86 133 135 129 -118
7162 -118 5 105 100 -80 41 42 13 -186 340 -98 27 21 -291 -5 30 108 -269 125 81 131 -105 307 -66 -213
7186 -213 25 31 -166 90 -171 -58 226 150 -17 337 -65 -72 46 146 148 -32 196 -20 37 -9 -125 -98 115
7209 115 76 131 68 -37 39 109 128 104 40 -17 70 -259 -41 -149 94 -33 -102 -26 -332 42 -22 -54 34 -190 79
7234G9J02j93J69j49J21j8j29K52l98p8M41j65J55j80K11j97J5j15j28L77j08
7255F4J25k55K57N2m36J76J23j52k1N9j59L13Nl13K44j06J46k93Q8L43l38Q9p9
7278f8J15k33K97N9n6j70m3n5K14J01j85n7J38L1k88J67P0l8M3o0J93l57K91r9
7302A0k09J66j20J44k0l4j96O9M09n42L93J90j82o9o3%N5J65j84j44J23K83l15
7325g1J91j89k21M65j38j21M9J77j21k04J50J93k51J16q7K22o4J4j17R1L0k16
7347a02j9K83k98Q4K4j84J77l0J94l97L16l14q6N33k04q2j42L41r2k69L28p7N4
7370C8nJ6k43N14n48J64K66k87J2j48M50l00J8J10Q9r4J3j47j8L8J76k51K26k0
7394F9N8q9J14k30K26j30k21p6M48%J0k42M5J6m4R6j90M07k54K46k77ok09K85
$$ plain form
7234 79 181 -12 157 8 129 111 -18 234 -164 -242 199 34 189 9 220 23 38 -77 -205 172 64
7255 64 189 -66 191 243 -193 -17 106 -46 -67 -8 -167 146 151 -162 82 -24 122 -171 -83 260 -78 11 -68
7278 -68 47 -186 111 170 114 -56 -99 -154 60 161 -24 -81 57 88 -200 -33 37 -1 42 -18 175 -182 109 10
7302 10 -199 -33 -153 -9 -29 -63 -259 -190 219 -323 70 260 78 9 -54 -54 1 166 -18 -162 -39 244 -71
7325 -71 120 -69 -290 175 37 -84 -35 142 21 -183 -33 160 -91 25 -62 160 96 110 -7 84 114 -102
7347 -102 -121 162 -136 -52 -28 -212 -35 -65 129 -268 48 -266 -352 181 -23 -105 -247 94 2 -267 61 -16 38
7370 38 33 49 -194 320 -228 -64 202 -85 -73 -221 229 -71 -53 57 146 52 65 -82 -100 -62 114 -137 89 69
7394 69 127 38 152 -78 148 18 -203 -279 169 169 179 -63 -18 -2 -46 50 -140 267 13 259 -18 -24 -233 52
7418E2q1k41L37p3k7p1P0J42k27J21j04J57j80K50l58M33n3k03J57l26M58k03
7440C0J16k93P5P0j27K16j69M6j28K64m26L51j02J22Q1l8j50R0r4j29j13N12k69
7463f5J89p9j11nj60J99j64J55L2K37n12L90q3J10k02M9m6K30k72j10J41j03P4
7486a06Q7J00j31J65kk81K38j72L09k63J37R2k34M0j57J76j68o0K85j95R2N8J49
7509A59k94K57j26K82j60k72R3k2K96m58P0J89J04j12j08J79o6j59Q6J17j79J25
7531AK27n22J92j65L93k07J26J1K22l23K78l07P3L9M3K3j01KM4K10k90J03q8n3
7555f9n0K57Jl06J13M51m19L18l78J37j59K44r8j58M6J83j79J06J62j70p7k25
7577b70Q0L44j83N5K54k55k57J81K03m76K63O9j00J00J64l28mK89m31M42j76J92
$$ plain form
7418 52 -29 -270 67 -6 -33 -104 -34 108 -119 2 -102 55 -125 125 -233 200 147 -56 101 -225 233 30
7440 30 146 -147 -72 -2 -129 87 -82 -36 -164 100 -326 25 -77 45 126 88 -62 28 -66 -195 -308 204 -65
7463 -65 124 45 -66 -71 -231 -32 -196 -41 -9 228 -284 106 23 133 -69 -20 -66 164 -108 -218 -77 -180 -106
7486 -106 -19 81 -50 115 113 -168 70 -102 207 -56 81 173 -61 -21 -178 -2 -170 -230 55 -140 -48 10 159
7509 159 -135 122 -4 278 118 -154 -61 -83 213 -245 -175 14 118 6 -102 77 11 -148 -62 55 -124 1
7531 1 228 -294 -102 -267 126 -81 45 56 278 -45 233 -74 -1 38 81 104 3 5 49 259 -31 72 -16 -69
7555 -69 -119 138 139 -167 -54 397 -22 296 -82 55 -104 140 42 -116 -70 113 -66 40 202 32 -45 -270
7577 -270 -190 154 -29 26 280 25 -232 -51 152 -324 -61 8 -92 8 172 -156 -160 129 -302 140 -36 156
7599A56l13L22K4j89r%j20K3M19j75M7o7j99R9o4j76O9L28k73J51P2n7j16k66
7623c14N94k03j0j98J26j90K50l2l9KJ99k75J16Q6O3j82J7j56M29l36J85l34K93
7646I1R1k23l3J51Jm39L84l70K12P3o2k7J82P0j09K01l28J73k67L56n4j49K66
7669A90j72P5j85K21j12P9n0o8K36j94l0m0j0k7J22o1k9J48k10L20k95J03P5j26
7693d0K71l68J13q0K57j15j87O5qJ55k31O0Q5j25J02K91j53r8l0L7N6j16J00j89
7717a48K66j58m8M11m04O7p1K47o7j82P8J26k54J25L7j60L64k53l8J37K7k26q3
7740b07K12j88lJ28K00k90K30n8j11r7j54N84l45L6J02J67j41j95J81P1q6Lj63
7763a24K8J02k00J2K68q6K32n06M04j54m4J59m6pJ9J60l12K33n0r2J10J72k65
$$ plain form
7599 156 -157 165 189 0 -9 -9 -129 -106 313 138 185 118 -81 18 -46 -222 -153 175 -98 53 125 68 -48 -314
7623 -314 280 77 67 -131 -5 -195 55 23 -16 -14 185 -90 26 112 175 -7 10 -146 283 -53 132 -202 91
7646 91 182 -41 -74 77 78 -361 23 -347 -135 -62 -124 -151 31 101 -8 193 -135 38 -229 127 73 -76 190
7669 190 18 93 -92 129 17 96 46 -22 214 20 -10 -50 -60 -87 35 -26 -55 93 -117 203 -92 11 86 -40
7693 -40 231 -137 -24 -104 153 38 -149 -84 -92 63 -168 -108 -23 -148 -46 245 92 -6 -36 1 57 -59 41 -148
7717 -148 118 -40 -88 323 -81 -14 -85 162 95 -87 -9 117 -137 -12 25 -135 229 -24 -62 75 102 -124 -207
7740 -207 5 -183 -186 -58 142 -148 82 24 -87 -184 -338 246 -99 -63 39 206 65 -130 51 122 36 39 -124
7763 -124 -96 6 -194 -182 86 0 232 -274 130 -24 -68 91 45 38 57 217 -95 138 88 -4 106 278 13
7786A3j91K98l6j58L15l46m0N6K05L6q7k46J15J02mK4j64J66k3j2J36k4l99J85
7810g9L7R8j93J13O5Rl59L11J4j95K81J8j71J29l27J10K8J6J26J42k19j97L11
7833F8p7k20J97k00K33O9O9j25m6k1m4R7k6J35k40K77k33O2J03l0m9p2L90n32
7857b15rK40r9L7P2L13l93R4R4j82J61q3P2%j48n8J60J88k25m9J34k06J34j16
7881h4J84k61K54j38k3J37k02K47k59J96q6OK03k96J99r5K95l76J26kJ94k1n27
7904c29J77M5K25N1k22j06J49L9j00MJ45k39J62j5l9j82L02J68k17M8J27P6j60
7927A09n7k53K2J48R6J84k75k19K6M02k44J02k87J78j71K06K83l39L14k82J15
7948E8m20O23l14K18j09j57J16o1q2J69k60N1K95q2J10l72K23J85j47j00Q7L4
$$ plain form
7786 13 -178 120 84 -74 241 -105 -145 -89 116 152 65 -181 -66 36 32 56 -108 58 35 23 159 135 -264 -79
7810 -79 -42 56 -137 -24 41 50 -309 2 16 -179 102 120 -51 78 -249 -139 -111 -95 31 173 -46 -243 68
7833 68 -9 -229 -32 -232 1 70 139 14 -32 -53 -97 0 -26 109 -131 146 -87 -25 78 48 -1 -73 317 -215
7857 -215 -224 16 -83 -46 26 339 -54 40 134 -48 113 30 102 102 -46 -104 56 244 19 -30 104 -102 32 -84
7881 -84 100 -161 93 -45 -68 69 -133 114 -145 51 -35 -29 174 -122 77 -18 277 -99 27 25 219 198 -329
7904 -329 -152 -107 118 169 -53 -159 -10 29 -71 -67 78 -161 1 -14 -53 -235 67 235 18 66 193 269 109
7927 109 52 -201 -179 -31 65 249 -26 -245 -219 183 -61 41 -246 -68 -239 -33 250 -89 225 -57 58
7948 58 -362 261 -53 165 56 -101 15 -46 -128 41 -219 -168 127 45 155 -217 6 191 44 -56 31 65
7970F5r1O5K23k83j15K40J17q3N6k92J05J35m17L17j06K57k55J10r6q1J37J5R9
7993A22o5o5J38k78K38nl73M45J67k60J15k47q6R1M3K26j75j27JL08l8l01K43
8016A17j5l2O7k2l21J36J80j49j44K35J46l82L46j78j05R3j06L07k18O7P6r3p1
8039f6k7J82k28L8k1N8m0P5o8L9K76k00R6l06L07j64r3m2K13J9p2k8P0K2p9J81
8065A42j66K19j14k8r8j35L56j5q8r7P3k75J93K41j39j68L9J98k73q8Q2J80pr8
8089f6J61j7j79K63k02L73n6k26k36L24j03K81l10n8n0J1J85j93K02j21j41k7
8111a85M18l35L43l77J06k41P0M51k53K17k71Q1j14qL0L9J35j84L18l24K06j40
8133a8l82M08l52M13j25N8N3j13J61j98Q7K82k96J28j18R8J09l47j17L65k42P8
$$ plain form
7970 65 -26 39 262 -21 -136 104 221 138 194 -98 7 142 -275 42 -64 193 -62 48 -48 -129 8 23 122
7993 122 57 -8 130 -148 90 85 -288 157 324 64 179 -68 -154 -63 -20 206 31 -96 -95 213 175 -126 117
8016 117 102 70 137 115 -206 -70 110 -39 -183 52 198 -184 162 -16 -121 -28 -134 173 -45 22 98 5 -66
8039 -66 -93 89 -139 -101 -122 -64 -104 -29 -97 -58 218 18 114 -192 115 -49 -142 -184 29 48 -24 -52 18 40 -39 142
8065 142 -24 195 81 53 -45 -180 176 161 73 -24 49 -226 -33 208 69 -99 -60 138 -135 -223 -141 39 32 -66
8089 -66 95 78 -101 162 -40 333 277 51 -185 139 36 317 7 -51 -101 -90 95 -98 104 -17 -158 -185
8111 -185 233 -102 241 -136 -30 -271 -201 250 -3 214 -57 24 -90 -98 -68 -29 106 -78 240 -84 122 -18
8133 -18 -400 8 -344 69 -56 2 55 -58 103 -95 -8 274 -22 106 -12 86 195 -152 -269 96 -146 -68
8155f8J57P9j32P6q1j19qK33l01j72N63m30K15n3J52J81k31j8%p6M2J77j03n5
8179B8L7p8k03K44J0L1j47K5l7K50oj13
$$ plain form
8155 -68 89 168 36 112 31 -88 -96 137 -164 -336 227 -203 12 -41 111 292 61 43 43 -33 9 186 83 28
8179 28 65 -13 -216 28 38 69 -78 -53 -90 160 154 41
8191D1
$$ Imaginary data points
##PAGE= N=2
##DATA TABLE= (X++(I..I)), XYDATA
0@%%%%%%%%%%qJ6j6K3l1L3m1N6p2Q6j02J20j38J63j94K26k62L03l49M04m63N28
32B82o00O80p70Q66r71J090j220J362j517J684j869K071k289K529k794L080l392
49a778L738m116M532m995N507o081O729p460Q295r265J0404j1759J3407j5465
63h307J8118k1677K6731l4528M8236p9334K74457P1960m23255K24183J31798j49566
75G8816o6897J87199j32602R195P9529j9148r7428L6492l4491m6614J69296p4020
87H9327r1955O5581L3390j09201J4359N6290j16508J03155L2096r6251k6200J46306
99A00389j26936j47497K05564L2854j30730J2637J14746j36538J4016Q3065j04637
110h3067k597P4205J9899o7150J06006q7295j17369J43070Q1592j35109l6618
$$ plain form
0 0 0 0 0 0 0 0 0 0 0 0 -8 8 -8 15 -16 17 -24 32 -40 46 -56 64 -74 89 -105 121 -141 162 -187 217 -246 282
32 282 -318 362 -408 458 -513 577 -643 719 -798 886 -983 1088 -1201 1328 -1466 1614 -1778
49 -1778 1960 -2156 2376 -2619 2888 -3193 3536 -3924 4371 -4894 5510 -6249 7158 -8307
63 -8307 9811 -11866 14865 -19663 28573 -50761 223696 295656 -127599 96584 228382 78816
75 78816 11919 199118 66516 75711 155240 136092 38664 75156 40665 -5949 163347 89327
87 89327 -2628 62953 96343 -12858 1501 57791 -58717 44438 76534 -19717 -45917 100389
99 100389 -26547 -174044 31520 64374 -66356 -53719 61027 -75511 -61495 21570 -83067
110 -83067 -85664 -11459 8440 -58710 47296 -39999 -157368 -14298 67294 -67815 -104433
121a04433J68390o6276j5065K3828m5676l1798Q2749M1899r0121Q2378j5851n4721
133b4697K4035N8783p9524j1316J19560o0539N837K6770l2254o6908R4823P01
145E5271r7478J12136L8109j03345m5120J47932p5179r2631R8926J7471m0565
156A5527J6897M5950j15659K2131M4791k8915m267K6505q815l7694Q1892p4182
168a5839m0864M1869O959k0180N1787O870j26278R1964M0415j09867k8448J42184
180D0572l6209j05666J29597r010j05423R826R5682q1772M385Q4010o6550N4L8518
193a986k2711p8528R4286M515o1439N9953J9580m5944j5805N0929p6069M8511
205b4708N0488o9758J2318P8178m4015j01543J18867q880p9018N9738O8906p9505
$$ plain form
121 -104433 63957 -2319 -17384 6444 -39232 -71030 11719 53618 -36503 45875 30024 -24697
133 -24697 -662 58121 -21403 -32719 86841 26302 32139 58909 26655 -40253 54570 55271
145 55271 -42207 69929 108038 4693 -40427 107505 32326 -60305 38621 56092 15527
156 15527 32424 78374 -37285 -15154 29637 722 -3545 22960 14145 -23549 58343 -15839
168 -15839 -56703 -14834 -7875 -28055 23732 30602 -95676 -3712 36703 -73164 -101612 40572
180 40572 4363 -101303 28294 19284 -86139 -76313 19369 -62403 -58018 25992 -40558 -40504 -1986
193 -1986 -24697 -103225 -8939 -4424 -65863 -5910 13670 -32274 -48079 2850 -73219 -24708
205 -24708 25780 -43978 -31660 46518 2503 -99040 19827 10947 -68071 -8333 60573 -18932
217a8932j7122Q7765r2314M692O2259k9652l8715J00471j1346j17621Q9150J6745
229C5380p6456P943J01661o7936k4630Q6152o0505l1501L6945R258n8006Q6661
241D4966K587q1008M6663K3016m9126k3714P2876n1888J9169N5187n9550k6440
253b7262N1875j2069q0614J09359O71q7085M7465P3486q8932n7940J11983m2265
265a328l1388N8621J9503p5796K7626L9269p7815L1736K2841j5953q649N6129
277D4796l8989l2733M6718m0872k767M0175J9144o6330N0866J6654p4835L2343
289e830L2131m2684k8590J07484l0768n7815L3118L439l6566J6428N4482p1707
301b6878K5902L9449k9013k5444K4670j7981l7262Q6318j3838l9356J0982K8266
$$ plain form
217 -18932 -36054 51711 -40603 -35911 26348 -3304 -42019 58452 47106 -70515 18635 35380
229 35380 -41076 -33133 68528 592 -24038 62114 1609 -29892 7053 16311 -41695 44966
241 44966 47553 -33455 13208 36224 -12902 -36616 36260 -15628 3541 58728 -822 -27262
253 -27262 24613 12544 -68070 41289 41960 -45125 2340 75826 -13106 -71046 40937 -1328
265 -1328 -32716 25905 45408 -30388 -2762 36507 -41308 -9572 13269 -2684 -11333 44796
277 44796 5807 -26926 19792 -21080 -23847 16328 35472 -30858 20008 36662 -38173 -5830
289 -5830 26301 -16383 -44973 62511 31743 -26072 7046 10485 -26081 -9653 44829 -26878
301 -26878 -976 38473 9460 -15984 8686 -9295 -46557 39761 25923 -13433 -2451 25815
313B5815m8722K616M9822o3034J4957M8500m800n5559M0550j1150n2425N9783
325F353J0024l1273j338N2567o1588j673N0268n1655j9279N7702K4524p1692M9633
338A2573l359o0348L0451M2038l7149k3921P5730m4011j0705L4932k5506m8009
350e7284N3042M0829o8374M3905P432m4095Q03N1384m3130k4035P3996l2982q560
363g069L4484r603p4090N6108L8860o7541L8336L0484m4163k1043P5620n3026
375b643m1981O8606l503k6585L0942K1602q7797L6790M0461m9647M489M1780k1580
388A0934k7945O8785n1554l7370M5915P881l5930L4796L1148q2345L2343L0845
400B7503m5831j7525O0896k1822l7709P0954k8244m2989J6705K5353m7857L2032
$$ plain form
313 25815 -22907 -20291 29531 -33503 -18546 29954 25154 -30405 10145 -1005 -53430 6353
325 6353 16377 -14896 -16234 36333 -25255 -26928 23340 -28315 -47594 10108 34632 -37060 12573
338 12573 9214 -51134 -20683 21355 -15794 -39715 36015 -7996 -18701 16231 -9275 -57284
350 -57284 -4242 36587 -31787 12118 19550 -24545 -23742 27642 -15488 -39523 34473 1491 -7069
363 -7069 27415 17812 -56278 -170 38690 -28851 9485 39969 -4194 -25237 50383 -2643
375 -2643 -44624 23982 20479 -6106 24836 46438 -41359 -4569 35892 -13755 -9266 32514 10934
388 10934 -17011 51774 220 -37150 8765 16646 -19284 15512 46660 -35685 -3342 27503
400 27503 -18328 -35853 25043 3221 -34488 36466 8222 -34767 -18062 7291 -40566 -8534
412h534M0042o3567J1384L1826k1851m1882N3763j8683k6779N9613m816m4625
424c4109N94L7983m9666K2406K9974l7161L443M1711j4233n6306N2033j2032k3746
437c9109L9020K0416m2629J55M8972n2707P44K9893l086j9767M0115M101m7572
450b1454L6900n754k3888J1074M4833l1745n008M0039l5286p484K0024O474l9520
463a0795M5278J7499l8154J5264N028k3846r112N4188l6452j0147M2075q721l1498
476A0607J0664J9114n1717L4924K4221k6964p083K7083k0661l0284M5626k8633
488F897j2077L3003J2854m5633J1645K5551n4185J6887K4138j5203j7468M6312
500C2721k3014l7749M1496j6059k6428K3622L5117n3075J6830L3458m8470p611
$$ plain form
412 -8534 31508 -32059 -20675 11151 -10700 -52582 1181 -17502 -44281 15332 10516 -34109
424 -34109 -33515 4468 -45198 -22792 7182 -29979 -26536 15175 942 -55364 -3331 -15363 -39109
437 -39109 -89 20327 -22302 -22147 26825 -25882 -25138 4755 1669 -18098 22017 26118 -21454
450 -21454 15446 9692 -14196 -3122 41711 9966 4958 44997 9711 2227 22251 28725 -10795
463 -10795 34483 51982 13828 29092 34120 10274 1162 55350 18898 8751 50826 42105 10607
476 10607 21271 40385 -11332 23592 47813 20849 13766 40849 20188 -10096 35530 6897
488 6897 -5180 27823 40677 -4956 6689 32240 -21945 -5058 19080 3877 -13591 32721
500 32721 9707 -28042 13454 -2605 -29033 -5411 29706 -23369 -6539 26919 -21551 -29162
512b9162L2544m245l5322N6236j0514l5434K7664M047l6984Q747M6338m6923J4999
525h009L2442k8309k3526L2667l907l8453N3224o847k4228K2408J4677n1482J0146
538a9197M7432n0727Q395M0008j3695l8999M3356p655m9122M2929J1585k4717
550a0407O005L4085m9802K665L9562m0641j0898M1161Q695m5900L6971l953l8307
563c0764K0918J8990k4086n566M5435l3655j314J7251k3535j4479L5723O463m1257
576b9876M0110P06k7805L588K0469l1009K148N0892l6724r233K7124J60m2652
589c2102K6525J5786l5163K9558J6140k3748k0447L8045j9353j6834K6485p024
601b132k555J5479Q339m5869J8998J3917j8798Q495J2342j0181j0242L9378l3418
$$ plain form
512 -29162 3382 -863 -36185 20051 9537 -25897 1767 5814 -31170 -22423 23915 -23008 -8009
525 -8009 24433 -3876 -27402 5265 1358 -37095 16129 9282 -14946 7462 22139 -29343 -19197
538 -19197 28235 -22492 -14097 25911 12216 -26783 16573 8918 -40204 2725 14310 -10407
550 -10407 -4402 29683 -20119 -17454 22108 -18533 -29431 11730 20425 -25475 11496 7543 -30764
563 -30764 -9846 9144 -14942 -20508 24927 -8728 -10042 7209 -16326 -30805 4918 11381 -29876
576 -29876 10234 10940 -16865 -13277 7192 -23817 -21669 29223 -7501 -16734 10390 10550 -32102
589 -32102 -5577 10209 -24954 4604 20744 -3004 -23451 14594 -4759 -21593 4892 -2132
601 -2132 -4687 10792 19131 -26738 -7740 6177 -12621 -4126 8216 -1965 -12207 27171 -6247
614f247k4300K6373J4528k1388P845K2478l7859J6189J2469k1810j7752L5965
626F491N575k5741K3831j1415j1614O228J5145l1534J1618L4562k5926p04P643
639D159p886k0607L8315j0404k8648L5521J3874k7851j3131L2641l1088M801L1425
652B1121j6678j6506K4290J1122l9958J8778k406r392K1252J4173l2129m127M2429
665C1969l5784j0326K2568Jj8823L2602L272m8229K6730J3301k3126p894L4870
678B1131j8962o379L3259k8606j8853J9056J6048l1597K2084O462k2782K2198
690A3059O78l2446k235M8440l1873j0127L5826j3634k7123K4373J3536n2747K8343
703e930K8432k1663j0047J9157j1293j5447L0183k5083l860K6243N339k7817J2309
$$ plain form
614 -6247 -30547 -4174 10354 -11034 -3189 19289 -18570 -2381 10088 -11722 -29474 6491
626 6491 12066 -13675 10156 -1259 -12873 -6645 8500 -23034 -11416 23146 -2780 -3484 4159
639 4159 -3727 -24334 13981 3577 -25071 10450 24324 -3527 -16658 15983 -15105 -10304 21121
652 21121 4443 -12063 12227 23349 -16609 2169 -237 -9629 11623 25796 -6333 -10460 31969
665 31969 -3815 -14141 8427 8428 -10395 22207 25479 -22750 3980 17281 -5845 -13739 21131
678 21131 2169 -4210 29049 443 -18410 646 16694 -14903 7181 13643 -9139 13059
690 13059 13737 -18709 -20944 27496 -4377 -14504 21322 7688 -19435 4938 18474 -34273 -5930
703 -5930 22502 839 -9208 9949 -1344 -16791 13392 -11691 -15551 10692 16031 -11786 523
716E23P597l3378K8329P200k3582J430M0529k6415k5967L3844j2675j5696J9466
729A205K0552l7353J2592K2713k5942n635Q980K237p984K7234j9616q589K0637
742A1031j0019j7008J2609J7461l2577K5254J5053k9592q836K8521p747l0327
754b6177L7255n17j5974N510J5283k5783n714K8048j6526R18P421O207j3943R287
768E295q926j2868K4217n250p600O588J7035k9664L937K1194k3878n175K3993
781H898R931l3384K0575M681k1825L987J4202p829r924L0060j6749p250Q216k782
795H07j2410J2916J1064k3959K2459J403j8250k514K0720j8713r970L7718j5164
808F107j4901J2507J2316l2715Q926K0157k0625P948J1254o185j5965K1020j6407
$$ plain form
716 523 8120 -25258 3071 10271 -13311 -11881 28648 2233 -23734 10110 -2565 -18261 1205
729 1205 21757 -15596 -3004 19709 -6233 -11868 -2888 -651 -8635 18599 -1017 -9606 11031
742 11031 1012 -15996 -3387 14074 -18503 6751 21804 -7788 -16624 11897 4150 -26177
754 -26177 11078 10561 -5413 97 15380 -10403 -16117 11931 -4595 -3677 3744 9951 -3992 5295
768 5295 -3631 -16499 7718 2468 -5132 1456 18491 -11173 -7236 13958 -9920 -15095 8898
781 8898 18829 -14555 6020 10701 -11124 -7137 7065 -764 -10688 19372 2623 -4627 3589 807
795 807 -11603 1313 12377 -11582 10877 12280 -5970 -8484 12236 -6477 -16447 21271 6107
808 6107 -8794 3713 16029 -16686 -7760 12397 -8228 -280 10974 4789 -11176 9844 -6563
821f563q423K4336p132j0314J2902J1729l6363J6142J2793k3846N221K5167j2341
834C308k2328L6093j6483k3104J9786J4220k4481N723K8579k9732O43J1433o868
847c211j2169K0394j051j2429K2873j6221r442J3045P483k8540J8457K3177l1237
860h871P403J7674j6549k3326L8887m357k5659K4197P710j9228k808K3096k7870
873i701L635K0096p194m506Q318k614j7691K4071j2650j0092J9224O579k0680
886c205N346K2126l3916K289J9979m069j5083K0501K477k6448J7037M55j0116
899b627j485J6858j2137K337J4981k1761j563Q867J590j5026K1959k109j9631
912i747J6412M827j7459r189K7811j4157l329J6697n902j5187M360J4092k0311
$$ plain form
821 -6563 -14986 9350 2218 -8096 4806 16535 -19828 -3686 9107 -14739 -9518 15649 3308
834 3308 -19020 17073 590 -22514 -2728 11492 -12989 -7266 21313 -8419 -7776 3657 -3211
847 -3211 -15380 5014 3963 -8466 14407 -1814 -11256 1789 9272 -19268 -811 22366 -8871
860 -8871 -1468 16206 -343 -23669 15218 10861 -14798 9399 17109 -2119 -4927 18169 -9701
873 -9701 -6066 14030 6836 2330 10648 8034 -9657 14414 1764 -8328 10896 17475 -3205
886 -3205 2141 24267 -9649 -7360 12619 8550 -6533 13968 16445 -10003 7034 7489 -2627
899 -2627 -4112 12746 609 2946 17927 -3834 -5397 3470 5060 -9966 11993 9884 -9747
912 -9747 6665 11492 -5967 -15156 12655 -1502 -4831 11866 5964 -9223 -4863 9229 -11082
925a1082R887L152k826J342O148r013j0552J6710j3034M879J0658j808j6762J1838
939d63Q555k5277J1907P673q863n575K7357j2273k3952J9534J090j0284J191K0014
953A0634j9596J648J3822j1670n417M080L825r286K1376q273j1140R496k3j1589
967a2113M939J8126k4649R508J5779j1860j2180J5350k575k0649K8827K073j6492
980e916p7J6527j6160k836J8343j8895L439J5019J057j9074J3291l628j6209K2279
994G160J901j5350M42K4560k1525m610J5757j3858l941J6582N479k3692J8164
1007G069j649j6778R321R248j2241l027K3766j9878J39J1853j1022j2434J9078
1020C445O147k2506K0372m61j6859J965J9024j6946r333K5485r515k697O160j606
$$ plain form
925 -11082 -1195 1957 -869 473 6621 -2392 -12944 3766 -9268 -4389 6269 4461 -12301 -463
939 -463 8092 -17185 -5278 2395 -6468 -12043 15314 3041 -20911 -1377 -287 -10571 -9380 10634
953 10634 -8962 -7314 6508 -5162 -10579 -6499 -2674 -11960 9416 1143 -9997 -501 -524 -12113
967 -12113 -7174 10952 -13697 -4189 11590 -270 -12450 2900 325 -20324 8503 10576 -5916
980 -5916 -5993 10534 -5626 -8462 9881 -9014 -5575 9444 10501 -8573 4718 1090 -15119 7160
994 7160 9061 -6289 -5847 18713 -2812 -7422 8335 -5523 -9464 7118 12597 -11095 7069
1007 7069 5420 -11358 -2037 7211 -5030 -8057 15709 -4169 -4030 7823 -3199 -15633 3445
1020 3445 9592 -12914 7458 6997 -9862 -7897 11127 -5819 -15152 10333 818 -1879 4281 2675
1034B675j9364J6541Q153j6876J0332L622n816m196J5516j8411m043J8762m795
1047B100l345O337K210k0666J7483K647j7077P281J4201p650j1619K0834j3359
1060f23q538R264N166r198N716J0581j9127P627K407n985m135J2486l402p834
1074e595J6403q654o976r3Q725j1042Q576P825j5469N963O903n556j5564J7845
1088C291n46q833J0397J669q022m896J3608j3916L609Q108m861r22Q108j105j8709
1103a3020J5965j03p560L804J0742q846n312J4899j4745r09P708K332r411J2045
1117G589K728j8909J1576K681q034m470J8008q725m539J4030j1682o063P550O608
1131H348j7795J4530O853j5363M048O817p794j0250J9169q388j958J0068n386
$$ plain form
1034 2675 -16689 -148 8005 -8871 1461 5083 -733 -4929 10587 -7824 -11867 6895 2100
1047 2100 -1245 5092 7302 -13364 4119 6766 -10311 -3030 11171 3521 -8098 12736 -623
1060 -623 -9161 103 5269 -3929 1787 12368 -6759 868 3275 -2710 -6845 5641 2239 -5595
1074 -5595 10808 2154 -4822 -4915 3810 -7232 1344 9169 -6300 -337 6566 1010 -14554 3291
1088 3291 2745 -6088 4309 5978 -2044 -6940 6668 -7248 -3639 4469 -392 -1314 6794 5689 -13020
1103 -13020 2945 2842 -4718 -914 9828 982 -4330 10569 -4176 -5085 2623 4955 -4456 7589
1117 7589 10317 -8592 2984 5665 -2369 -6839 11169 2444 -2095 11935 253 -5810 1740 8348
1131 8348 -9447 5083 11936 -3427 621 7438 -356 -10606 8563 175 -1783 8285 2899
1144B899r116Q077N013k1644J6841Q044j3757k120J6187q859j4850J7753p440
1157b972k573R387L906j6788P356Q803j8574R481N881q237m401K1728r587j5921
1171a2511J2767j843k671M511O370j6753J1875Q265j6657N33P716l121o343K0033
1185A2171j0091r647J0741m1r448M221R969j6933J2489P213j3004n120J4061m702
1199A879j5193K0285m4p633o22O421r251J922R560j4042M858O658J096q877O776
1214C793o749p665J6776o39p475k833J1393q215L046J248j3133N235J2769L34
1228G885j6197J1664j669q271P054L874r009k953J9263r946m730K828P01o311
1242e817N557O390j0651Q477n00m678l725R305m499m900J0064n281K541K441r83
$$ plain form
1144 2899 -6217 1860 6873 -14771 2070 10114 -3643 -5763 10424 1565 -13285 4468 -2972
1157 -2972 -5545 3842 7748 -9040 -1684 7119 -11455 -1974 3907 -4330 -8731 12997 3410 -12511
1171 -12511 256 -1587 -4258 253 6623 -10130 1745 10010 -6647 -6114 1602 -1519 -7862 12171
1185 12171 2080 -7567 3174 3133 -6315 -2094 7875 -9058 3431 10644 -2360 -7480 6581 1879
1199 1879 -13314 6971 6927 -706 -1328 5093 -4158 -2236 7324 -6718 -1860 4798 5894 -2983 3793
1214 3793 -2956 -10621 6155 5516 -1959 -4792 6601 -1614 1432 2680 -10453 -5218 7551 7885
1228 7885 -8312 3352 1683 -6588 466 4340 -4669 -7622 11641 1695 -3035 -207 494 -5817
1242 -5817 -260 6130 -4521 3956 3456 -1222 -4947 4358 -141 -5041 5023 -258 2283 4724 3741
1257C741j4439R026R408r131L143O63k759l046J4401j2480r803J2413M654m081
1271A710o01M607j6215R958R080j0837n687J1388K730j0721J1244p460p674O194
1285b284Q131q306j3R814j1566L493K583m042m642J1639l638p656J5101n674r219
1300f279K951Q726j2426P014J1538j6228l88J2233r71j6949J2954O75p529J1297
1314F618K596j2370l935J5750r812m0N255m389m66R040j540j5585J1173o67l413
1329a785N208L145r520J561J1072j5085K302O913m192n172J3274k606j4559J2745
1343C301j258r797L121J3849j2917k922J2981q353m619N255K340j1968J1231N033
1357E277r930O41K186j523m036R480p234Q10M909k173j181Oj045o935J3723k560
$$ plain form
1257 3741 -10698 -1672 7736 -1395 1748 2411 -348 -3394 11007 -1473 -11276 1137 5791 1710
1271 1710 1109 5716 -10499 -541 8539 -2298 -7985 3403 6133 -4588 6656 -804 -8478 -2284
1285 -2284 5847 -2459 -2472 7342 -4224 -731 1852 -2190 -6832 4807 1169 -6487 8614 2940 -6279
1300 -6279 -3328 5398 -7028 -14 11524 -4704 -5092 7141 6170 -10779 2175 2850 -4679 6618
1314 6618 9214 -3156 -7091 8659 -1153 -1193 4062 -327 -793 8247 6707 -8878 2295 1628 -1785
1329 -1785 3423 6568 -2952 -1391 9681 -5404 -3102 3811 -381 -5553 7721 5115 -9444 3301
1343 3301 2043 -7754 -4633 9216 -3701 -6623 6358 -1995 -6614 -1359 981 -10987 244 5277
1357 5277 -4653 -4012 -1826 -3349 -7385 2095 -5139 -4329 580 -1593 -2774 -2768 -3813 -10748 2975 415
1373D15p033M680N416q617k946J2899j0470j202R459K339j1798N478O128j2577
1387g829M458O097j377p527J1049j369q424M814J20r92j367P564n606K293P50
1402B654m974K248J383m98m461J1032m917m377M657M4o117J029R277r442L612
1417A150M264l653n520O443l93r264J1487K21n433o05P716q870k299J0249p219
1432a726j92N147K668j0573O592J177r506N970M556l027m846R533o515j303M300
1447B255n100J04N438K150r664R337k553q635O265O009q766k960J5870r718m264
1462d232P124j060r859P856Q431j3162N115M218m822m209Q106l852m835R190l150
1477H59L5O04l7p469P614J385p987Q212J008o794m67J2018j2366m202J3243k838
$$ plain form
1373 415 -6618 -1938 3478 -5139 -8085 4814 -5656 -6858 2601 4940 -6858 -1380 4748 -7829
1387 -7829 -3371 2726 1349 -6178 4871 3502 -4922 -108 12 -980 -2347 5217 -389 1904 2654
1402 2654 -2320 -72 1311 813 -3648 7384 2467 -1910 2747 2791 -3326 -2297 6980 -2462 1150
1417 1150 5414 1761 -3759 2684 2291 -6973 4514 4735 -698 -1303 6413 -2457 -4756 5493 -1726
1432 -1726 -1918 3229 5897 -4676 1916 3093 -6413 -443 4113 1086 -3760 5773 -742 -2045 2255
1447 2255 -2845 -2741 2697 4847 -4817 4520 1967 -6668 -403 5606 -3160 -6120 9750 32 -4232
1462 -4232 2892 1832 -8027 -171 8260 -4902 213 4431 -391 -4600 3506 -346 -5181 4009 859
1477 859 894 1498 1461 -6008 1606 2991 -4996 3216 4224 -2570 -3037 8981 -3385 -7587 5656 2818
1493B818n951O266M608j5963O896Q001p958k916Q309K04p474Q662m579l620K106
1508e91L496k262K022K290q711O407Q92l996k276O718k842k764R436o313m336
1523b830K250M674o474M350L147p761L550L313k624o608P990l105k083Q145k543
1538C391o476O52Q424r879J708O395l608l892O054L410j1947M097K907p70k049
1553a583M452r42m168L707l149K782j651m97q03N601m21o683N072k845k063K460
1569g31P128r179j158R761m717m870K999M214r550O751O449p720l579M938J361
1584B097o582O309k748q68L424L79m083j44L215o771O462J818m603o05O040m872
1600a532n367J0199n459l709N455M649q914J861N780r255J520N904l38o538O714
$$ plain form
1493 2818 -3133 3133 7741 -8222 -1326 6675 -1283 -4199 4110 4314 -3160 5502 923 -2697 -591
1508 -591 2905 643 2665 4955 -3756 2651 3543 -453 -2729 3989 1147 -1617 7819 1506 -2830
1523 -2830 -580 4094 -2380 1970 5117 -2644 906 4219 1595 -5013 2977 -128 -2211 5934 3391
1538 3391 -3085 -2433 5991 -3888 -2180 4215 607 -3285 2769 6179 -5768 -1671 1236 466 -1583
1553 -1583 2869 1927 -2241 1466 -1683 1099 -552 -1049 -1852 3749 3328 -3355 1717 -1128 -3191 -731
1569 -731 6397 -2782 -3940 5821 1104 -3766 -767 3447 -6103 648 7097 -623 -4202 736 2097
1584 2097 -4485 1824 -924 -1792 1632 2011 -2072 -2216 999 -5772 690 2508 -2095 -2700 3340 -1532
1600 -1532 -6899 3300 -2159 -5868 -413 4236 -4678 -2817 2963 -6292 -4772 1132 794 -5744 970
1615I70j640m071O108l372m269L791P160q989K842L882o794O1O476j522p796J0133
1631B970j226l815K816K85n430K372P640q707L014L984l526k802N272k258n115
1646d526R709l067l969M204L416r428J267Q767p679R7N804k5q217O327J018o265
1662b567L484O86j03j57L948p585J720L604m127J73L142j26m827P411m098m483
1678c905M183J810m382Q17P715q990K80N410j911o401M312N029o787L400N24j260
1694a56k566L624k350p96M565l404Q40P22P98n302L703K040l951K577R25o20l306
1711b657N162m222j122M676p78j764Q55M083p492K798J745j980p65L373J78m582
1727b492N460l549j529K288K329m669J650N775p316R59K228n94m430N407M81n344
$$ plain form
1615 970 -670 -4741 1367 -2005 -6274 -2483 4677 -4312 -1470 2412 -4382 -4321 2155 633 -7163 2970
1631 2970 1744 -2071 745 1030 -4400 -2028 5612 -3095 -81 3903 377 -2425 2847 589 -4526
1646 -4526 5183 2116 -1853 2351 5767 -3661 -2394 6373 -1306 -1209 4595 4570 -3647 2680 3698 -2567
1662 -2567 917 1603 1500 1343 5291 -2294 -574 3030 -1097 -924 2218 2092 -2735 4676 578 -3905
1678 -3905 278 2088 -2294 -1477 6238 -2752 -2472 2938 1027 -5374 -1062 3967 -2820 580 1104 -156
1694 -156 -2722 902 -1448 -2244 2321 -1083 -243 479 1277 -4025 -322 1718 -2233 344 1269 649 -2657
1711 -2657 2505 -1717 -2839 1837 1059 -705 150 4233 -3259 -461 1284 -696 -1461 1912 2090 -2492
1727 -2492 2968 -581 -2110 178 2507 -2162 -512 5263 -2053 -1094 1134 540 -3890 1517 1998 -3346
1743c346N146m05l007j495N041m307J077M592m831l95K954L22o088N445q06k527
1759b630M707J18m898n06P302p106P4M591j799k120M509l5q148O429P06l218M98
1776a526M527m315q43O116o778j55L724J119m647M472M88n708N213p33m114Q31
1792b329P579o029j813N975l575k128K653J306o354O181K314n131P55J024j735
1807a307o06N905o392k41N714j011m516J951K190n408N846l04l532J016M352l815
1823a58k737N842m169N12L496K45n682L329L352o040J691J404M59j400L903l965
1839H2j896M979k118j586J95M142m430K897J99l840R76K414nm023M676j930p8
1856F54J617j729l148J841N415n825P69J769o28j805K029l64m203N354m76j353
$$ plain form
1743 -3346 1800 1395 -1612 -3107 1934 -2373 -1296 3296 -1535 -1930 1024 1346 -4742 703 -103 -2630
1759 -2630 2077 2195 -2703 -3209 4093 -3013 -2939 1652 -147 -2267 2242 2207 -5941 488 1194 -2024 -1526
1776 -1526 3001 -1314 -2157 3959 -2819 -2974 750 1869 -2778 1694 2182 -3526 1687 954 -3160 -2329
1792 -2329 5250 -779 -2592 3383 -192 -2320 333 1639 -4715 1466 3780 -1351 -596 428 -1307
1807 -1307 -1913 3992 -2400 -2641 3073 2062 -2454 -503 1687 -3721 2125 1821 -1711 -695 3657 -158
1823 -158 -2895 2947 -1222 -710 2786 3031 -2651 678 4030 -2010 -319 1085 1544 144 4047 82
1839 82 -1814 3165 1047 -539 -344 3798 -632 2265 2464 -1376 -400 2014 2009 -2014 2662 732 654
1856 654 2271 542 -2606 -765 4650 -1175 -406 1363 735 -1070 959 595 -3608 1746 1270 -83
1872h3j329K609k799K11K987m386J786K372N70n632L513P14l469K807N68j224
1888g85j276N423m299j920K731k53o88J212J925n173M605M34l719k68L398p80
1904E67j994N188m365k29K593J66m518K934L290n316L907M46k963j468N573k969
1920H42l349N779j234j525J81J974n425L346K246m690K245K128j680l231N737
1935C344m816j591N485r35l598J716L933o988K958J652l134J41M168j667m518
1950c850N801l056j610J752J404l381K098K916n767L140N97k207j013N089k971
1965a058k586O386k778l361J670M102n482J655L774l437N36R23l3l418M784j923
1981b46j196L214j048k083P37L249n207J867K554j664q09J939P5m072M593j636
$$ plain form
1872 -83 -1412 1197 -1602 -1391 1596 -2790 -1004 1368 1938 -3694 -181 533 -2936 -129 439 -785
1888 -785 -2061 3362 -937 -2857 -126 -379 -1067 145 2070 -3103 1502 1936 -1783 -2051 1347 567
1904 567 -1427 3761 -604 -833 1760 1926 -2592 342 3632 -1684 2223 2669 -294 -1762 3811 842
1920 842 -2507 3272 2038 513 694 2668 -2757 589 2835 -1855 390 2518 838 -2393 3344
1935 3344 -1472 -3063 2422 1487 -2111 -395 3538 -3450 -492 1160 -1974 -1833 2335 668 -3850
1950 -3850 1951 -1105 -2715 -963 441 -2940 -842 2074 -3693 -553 44 -2163 -3176 1913 -1058
1965 -1058 -3644 2742 -36 -3397 -1727 2375 -3107 -1452 2322 -1115 -579 344 311 -3107 1677 -246
1981 -246 -1442 1772 724 -1359 -622 2627 -2580 -713 1841 177 -632 1307 1382 -2690 1903 267
1997B67r94J035J642k276N7K825m668J778J077N78k695K810j73l141K918j040
2013@o04p65L794l120K9K458k537o77R87J706l964L410M02k537Q83Q62j200k213
2031c086M900k897l10J906L4k657Q12K708m190K313R42o62j096K355j510k308
2047b746L757k099K9J151J744m092J970K179m024J315J687j36k647M586j906k858
2063b090L140m6j700O04L183m354K159J888l063p33K856k17l791N829j854k648
$$ plain form
1997 267 -727 308 1950 -326 -269 2556 -2112 -334 743 1321 -1374 1436 1263 -1878 1040 0
2013 0 -604 -1369 2425 -695 -666 1792 -745 -1422 -435 1271 -2693 717 1119 -1418 -535 327 -873 -3086
2031 -3086 1814 -1083 -1393 513 547 -2110 -1298 1410 -2780 -467 475 -187 -1283 1072 -438 -2746
2047 -2746 1011 -1088 -1059 92 1836 -2256 -286 1893 -2131 -816 871 735 -1912 2674 768 -2090
2063 -2090 1050 1004 -696 -92 3091 -1263 896 2784 -279 -1012 1844 1627 -2164 3665 1811 -837
$$ [...]
8191d1
##END NTUPLES=NMR FID
##END=
