##TITLE=1H_TG-2292-E5
 CDcl3, 8 sc, 
 26.10.2020
##JCAMPDX= 6.0         $$ Bruker NMR JCAMP-DX V2.0
##DATA TYPE= NMR FID
##DATA CLASS= NTUPLES
##ORIGIN= UXNMR, Bruker Analytische Messtechnik GmbH
##OWNER= root
$$ XWIN-NMR		Version 3.5
$$ Mon Oct 26 11:09:13 2020 Russian Standard Time (UT+4h)  she@DPX200
##.OBSERVE FREQUENCY= 200.1315066352
##.OBSERVE NUCLEUS= ^1H
##.DELAY= (6, 6)
##.ACQUISITION MODE= SIMULTANEOUS
##.ACQUISITION SCHEME= undefined
##.AVERAGES= 8
##.DIGITISER RES= 18
##SPECTROMETER/DATA SYSTEM= spect
##.PULSE SEQUENCE= zg30
##.SOLVENT NAME= CDCl3
##.SHIFT REFERENCE= (INTERNAL, CDCl3, 0, 15.7039)
##AUDIT TRAIL= $$ (NUMBER, WHEN, WHO, WHERE, WHAT)
$$ ##TITLE= Audit trail, XWIN-NMR		Version 3.5
$$ ##JCAMPDX= 5.01
$$ ##ORIGIN= Bruker BioSpin GmbH
$$ ##OWNER= she
$$ F:/spectra/data/she/nmr/H-F/1/audita.txt
$$ ##AUDIT TRAIL=  $$ (NUMBER, WHEN, WHO, WHERE, WHAT)
(   1,<2020-10-26 11:07:57.42 +0400>,<she>,<DPX200>,
      <created by zg, POWCHK disabled, PULCHK disabled
       configuration hash MD5:
       00 E9 B6 7A A2 85 ED C7 34 08 36 98 17 FE 4E 26
       data hash MD5: 16K
       C2 E8 5D 82 3F 69 C5 05 6C F6 91 46 E1 07 22 DD>)
$$ ##END=
$$ 
$$ hash MD5
$$ 5D 93 85 01 94 90 75 B7 C0 00 E4 2B A5 A4 B3 62
##$RELAX= 
##$RELAX= 
##$RELAX= 
##$RELAX= 
##$RELAX= 
##$RELAX= 
$$ Bruker specific parameters
$$ --------------------------
##$DU= <F:/spectra>
##$EXPNO= 1
##$NAME= <H-F>
##$PROCNO= 1
##$TYPE= <nmr>
##$USER= <she>
##$AMP= (0..31)
100 100 100 100 100 100 100 100 100 100 100 100 100 100 100 100 100 100 
100 100 100 100 100 100 100 100 100 100 100 100 100 100 
##$AQSEQ= 0
##$AQ_mod= 1
##$AUNM= <au_zg>
##$AUTOPOS= <>
##$BF1= 200.13
##$BF2= 200.13
##$BF3= 200.13
##$BF4= 200.13
##$BF5= 200.13
##$BF6= 200.13
##$BF7= 200.13
##$BF8= 200.13
##$BYTORDA= 1
##$CFDGTYP= 0
##$CFRGTYP= 5
##$CHEMSTR= <none>
##$CNST= (0..31)
1 1 145 1 1 1 1 1 1 1 1 1 1 1 1 1 1 1 1 1 1 1 1 1 1 1 1 1 1 1 1 1 
##$CPDPRG= <>
##$CPDPRG1= <>
##$CPDPRG2= <>
##$CPDPRG3= <>
##$CPDPRG4= <mlev>
##$CPDPRG5= <mlev>
##$CPDPRG6= <mlev>
##$CPDPRG7= <mlev>
##$CPDPRG8= <mlev>
##$CPDPRGB= <>
##$CPDPRGT= <>
##$D= (0..31)
0 1.2 0 0 0 0 0 0 0 0.06 0 0.03 0 0 0 0 0.0002 0 0 0 0 0 0 0 0 0 0 0 0 
0 0 0 
##$DATE= 1603696076
##$DBL= (0..7)
120 120 120 120 120 120 120 120 
##$DBP= (0..7)
150 150 150 150 150 150 150 150 
##$DBP07= 0
##$DBPNAM0= <>
##$DBPNAM1= <>
##$DBPNAM2= <>
##$DBPNAM3= <>
##$DBPNAM4= <>
##$DBPNAM5= <>
##$DBPNAM6= <>
##$DBPNAM7= <>
##$DBPOAL= (0..7)
0.5 0.5 0.5 0.5 0.5 0.5 0.5 0.5 
##$DBPOFFS= (0..7)
0 0 0 0 0 0 0 0 
##$DE= 6
##$DECBNUC= <off>
##$DECIM= 32
##$DECNUC= <off>
##$DECSTAT= 4
##$DIGMOD= 1
##$DIGTYP= 9
##$DL= (0..7)
0 120 120 120 120 120 120 120 
##$DP= (0..7)
150 150 150 150 150 150 150 150 
##$DP07= 0
##$DPNAME0= <>
##$DPNAME1= <>
##$DPNAME2= <>
##$DPNAME3= <>
##$DPNAME4= <>
##$DPNAME5= <>
##$DPNAME6= <>
##$DPNAME7= <>
##$DPOAL= (0..7)
0.5 0.5 0.5 0.5 0.5 0.5 0.5 0.5 
##$DPOFFS= (0..7)
0 0 0 0 0 0 0 0 
##$DQDMODE= 0
##$DR= 18
##$DS= 0
##$DSLIST= <SSSSSSSSSSSSSSS>
$$ [...]
##$SUBNAM2= <"">
##$SUBNAM3= <"">
##$SUBNAM4= <"">
##$SUBNAM5= <"">
##$SUBNAM6= <"">
##$SUBNAM7= <"">
##$SUBNAM8= <"">
##$SUBNAM9= <"">
##$SW= 16.880792210976
##$SWIBOX= (0..15)
0 0 2 0 0 0 0 0 0 0 0 0 0 0 0 0 
##$SW_h= 3378.37837837838
##$TD= 16384
##$TD0= 1
##$TE= 0
##$TE2= 300
##$TE3= 300
##$TEG= 300
##$TL= (0..7)
0 120 120 120 120 120 120 120 
##$TP= (0..7)
150 150 150 150 150 150 150 150 
##$TP07= 0
##$TPNAME0= <>
##$TPNAME1= <>
##$TPNAME2= <>
##$TPNAME3= <>
##$TPNAME4= <>
##$TPNAME5= <>
##$TPNAME6= <>
##$TPNAME7= <>
##$TPOAL= (0..7)
0.5 0.5 0.5 0.5 0.5 0.5 0.5 0.5 
##$TPOFFS= (0..7)
0 0 0 0 0 0 0 0 
##$TUNHIN= 0
##$TUNHOUT= 0
##$TUNXOUT= 0
##$USERA1= <user>
##$USERA2= <user>
##$USERA3= <user>
##$USERA4= <user>
##$USERA5= <user>
##$V9= 5
##$VALIST= <valist>
##$VCLIST= <CCCCCCCCCCCCCCC>
##$VD= 0
##$VDLIST= <DDDDDDDDDDDDDDD>
##$VPLIST= <PPPPPPPPPPPPPPP>
##$VTLIST= <TTTTTTTTTTTTTTT>
##$WBST= 1024
##$WBSW= 4
##$XGAIN= (0..3)
0 0 0 0 
##$XL= 0
##$YL= 0
##$YMAX_a= 253017
##$YMIN_a= -175005
##$ZGOPTNS= <>
##$ZL1= 120
##$ZL2= 120
##$ZL3= 120
##$ZL4= 120
##$ABSF1= 10
##$ABSF2= 0
##$ABSG= 5
##$ABSL= 3
##$ALPHA= 0
##$AQORDER= 0
##$ASSFAC= 0
##$ASSFACI= 0
##$ASSFACX= 0
##$ASSWID= 0
##$AUNMP= <proc_1d>
##$AZFE= 0.1
##$AZFW= 0.1
##$BCFW= 1
##$BC_mod= 2
##$BYTORDP= 1
##$COROFFS= 0
##$CY= 11.3945322036743
##$DATMOD= 1
##$DC= 2
##$DFILT= <>
##$DTYPP= 0
##$F1P= 16.9975609425685
##$F2P= -3.02152046262296
##$FCOR= 0.5
##$FTSIZE= 0
##$FT_mod= 4
##$GAMMA= 1
##$GB= 0.15
##$INTBC= 1
##$INTSCL= 1
##$ISEN= 128
##$LB= 0.24
##$LEV0= 0
##$LPBIN= 0
##$MAXI= 10000
##$MC2= 0
##$MEAN= 0
##$ME_mod= 0
##$MI= 1.114404
##$NCOEF= 0
##$NC_proc= 0
##$NLEV= 6
##$NOISF1= 3.799351
##$NOISF2= 2.8
##$NSP= 1
##$NTH_PI= 0
##$NZP= 0
##$OFFSET= 15.70392
##$PC= 1
##$PHC0= -10689.04
##$PHC1= 11.00088
##$PH_mod= 1
##$PKNL= yes
##$PPARMOD= 0
##$PSCAL= 0
##$PSIGN= 0
##$REVERSE= no
##$SF= 200.130013532006
##$SI= 16384
##$SIGF1= 3
##$SIGF2= 2
##$SINO= 400
##$SIOLD= 16384
##$SREGLST= <1H.CDCl3>
##$SSB= 0
##$STSI= 0
##$STSR= 0
##$SW_p= 3612.71676300578
##$SYMM= 0
##$S_DEV= 0
##$TDeff= 0
##$TDoff= 0
##$TI= <>
##$TILT= no
##$TM1= 0
##$TM2= 0
##$TOPLEV= 0
##$USERP1= <user>
##$USERP2= <user>
##$USERP3= <user>
##$USERP4= <user>
##$USERP5= <user>
##$WDW= 1
##$XDIM= 8192
##$YMAX_p= 0
##$YMIN_p= 0
$$ End of Bruker specific parameters
$$ ---------------------------------
##NTUPLES= NMR FID
##VAR_NAME=  TIME,          FID/REAL,        FID/IMAG
##SYMBOL=    X,             R,               I
##VAR_TYPE=  INDEPENDENT,   DEPENDENT,       DEPENDENT
##VAR_FORM=  AFFN,          ASDF,            ASDF
##VAR_DIM=   8192,          8192,            8192
##UNITS=     SECONDS,       ARBITRARY UNITS, ARBITRARY UNITS
##FACTOR=    0.000296,      1,               1
##FIRST=     0,             0,               0
##LAST=      2.424536,      0,               0
##MIN=       0,             -175005,         0
##MAX=       2.424536,      253017,          0
$$ Real data points
##PAGE= N=1
##DATA TABLE= (X++(R..R)), XYDATA
0 0 0 0 0 0 0 0 0 0 0 0 0 0 0 -8 8 -8 8 -15 16 -17 24 -25 32 -40 48 -56 64 -73 87 -99 113 -130 151 -169 193
35 193 -218 247 -277 311 -347 386 -432 480 -533 590 -653 722 -797 881 -970 1069 -1177 1296
53 1296 -1429 1574 -1741 1925 -2134 2376 -2652 2978 -3369 3844 -4443 5219 -6276 7826 -10353
68 -10353 15556 -55753 128835 10196 -175005 -40085 -1819 -115810 -60864 -2659 -124774
79 -124774 -58602 10516 9335 -62130 8190 -94169 -82858 33192 -13727 -37147 -1456 39550
91 39550 -44859 22965 -6561 -77064 20922 63153 -20373 -32223 156222 9295 -112879 30036
103 30036 97383 -30815 9435 113144 -22133 41340 83906 9176 -38465 51562 45082 12515
115 12515 146951 41801 -55801 39287 130352 -10810 -9824 81048 36524 83884 83622 29104
127 29104 -34866 74804 60457 1806 82629 76112 27504 30169 106366 -2407 2933 65901
139 65901 32348 52223 95017 47604 -32415 99946 39212 -58436 53388 132471 -5510
150 -5510 -33925 137128 27122 -41854 25651 38741 -17040 49227 79542 -22648 17451 15730
162 15730 -3539 -10455 33888 -15163 -11566 69272 2237 -12895 -13504 -20651 -45379 50557 20972
175 20972 -77096 26234 56497 -50026 -87184 55650 -22024 -81361 41265 45922 -52980
186 -52980 -41289 36255 -64811 -27907 13696 -28354 -14542 34964 -3942 -65654 21543 -21887
198 -21887 -45364 3300 25998 -17559 5283 30359 -59556 -659 18717 -27770 -28457 62582
210 62582 23928 -48585 35857 12620 -39626 -18880 53116 -10331 2098 57341 -14033 -10939
222 -10939 24660 577 -55438 57306 45626 -36534 25440 46855 -25694 -40734 55405 -16016
234 -16016 -16621 49156 20839 -15778 13182 12490 -56239 24955 24323 -15823 2665 36541 -2347
247 -2347 -24928 22001 -41795 -14375 35641 15606 -30613 26736 21544 -68450 7495 28423
259 28423 -35000 -39127 68071 14238 -51828 18075 -6339 -43032 -6669 40920 -36401 1411
271 1411 35624 -26975 -18057 3283 -17604 -40735 38159 1809 -15351 20612 -9922 -42196
283 -42196 -5579 25509 -50884 9771 35541 -22546 -21423 30833 -14717 -73648 25275 19395
295 19395 -15574 1175 24101 -36139 -23350 34708 -37509 -26245 18966 17909 -21124 27078
307 27078 -1411 -60999 6793 16316 -12042 -9506 36770 -22068 -7058 33662 -30503 -33924 16027
320 16027 24596 -23988 39294 16101 -38020 706 20034 -12843 -13799 47440 -10083 695 41561
333 41561 3542 -38823 7455 32358 -24844 38874 39245 -14836 -11451 41377 1005 -28725 38866
346 38866 6196 3857 39951 37525 -33988 826 31529 -18844 23586 34852 3404 -7617
358 -7617 49168 -792 -26310 24629 -342 -7015 32088 47744 -34402 224 24523 -24137
370 -24137 -7033 27812 2486 -29282 44852 9080 -32661 -6647 287 -27464 -117 44722
382 44722 -29346 -15317 13374 -13116 -33784 6062 -8770 -40769 32776 10402 -30074 -18524
394 -18524 5180 -42505 -17738 31663 -27863 -16493 17559 -555 -45924 6958 -5554 -44679
406 -44679 14309 22100 -11044 -16131 22664 -33564 -23212 24781 -4224 -17251 16202 27320
418 27320 -25443 16106 3367 -33447 1840 37377 5383 -10893 38653 -11839 -12160 22628
430 22628 6124 -28628 20528 45234 -16797 16725 13922 -21964 -14135 35584 -2791 -19980
442 -19980 38839 4490 -16475 1034 7958 -39867 283 25105 -21130 401 11968 -17028
454 -17028 -41283 10306 -19592 -33125 12232 -2069 -28886 -13110 8536 -55603 -27996 1096
466 1096 -26178 -20996 8442 -16913 -55053 4897 -22235 -48870 -15612 3205 -30018 -17067
478 -17067 14949 -48855 -34491 -4666 -17363 -35510 7950 -1096 -36889 8462 -11374 -37986
490 -37986 -22496 15020 -21262 -9208 24393 -19386 -17717 3778 -3984 -36920 18025 15803 -18970
503 -18970 15394 17320 -19202 -20097 30229 -15112 -8846 34086 13143 -10944 13628 18989 -31958
516 -31958 14521 22952 -3424 10478 35603 2326 -13278 30994 -7276 -6470 24838 27088 -3788
529 -3788 22234 28677 -21144 12039 19953 -1564 1419 47075 12029 -9476 32968 5761 -11608
542 -11608 12805 33558 -9854 22572 41416 -7209 93 20973 5193 -12690 41898 14452
554 14452 -7032 30353 23141 -14615 -4368 29022 -11537 15446 33665 1758 -8024 23069
566 23069 8956 -27315 19224 7599 -2274 18509 23708 -19182 -10480 22478 -18671 -4616 15369
579 15369 5671 -12629 25056 2282 -40189 7884 11351 -16097 -9218 31614 -11268 -13548 17143
592 17143 -17489 -24077 8165 18755 -22417 11481 11791 -16143 -952 3094 -18666 -12507 35411
605 35411 -3228 -6232 12879 -4234 -14839 11077 9177 -31163 22072 32190 -6434 -12514 17067
618 17067 -6437 -16440 30498 458 -8983 17773 27916 -16441 -6123 11552 -13772 12940
630 12940 18948 -241 -9291 29793 -1728 -23965 10692 532 -5114 14137 22999 -26693 2384
643 2384 20429 -20659 -18493 11448 8651 -14835 23662 -4058 -26805 477 7503 -18336 -12163
656 -12163 17593 -11876 6606 6191 -23712 -25531 14649 3047 -30071 14375 6267 -13872 -3649
669 -3649 8179 -32772 -16993 28811 -7365 -12961 6547 7403 -22394 3095 -2628 -25487 9956
682 9956 16863 -2807 -11339 12332 -16405 -6129 12778 -16210 -8653 24496 17570 -29156 7067
695 7067 7332 -20167 -674 20148 -5981 -13401 34134 -1886 -20724 -1056 6262 -8930 7725
708 7725 16836 -16111 10976 10972 -11723 -15741 11882 -2333 -3982 27213 -7812 -13731 10976 11662
722 11662 -31574 -587 25049 -10343 2884 16691 -3891 -26300 17031 3672 -18299 7386
734 7386 12759 2075 -763 8347 -23655 617 13376 -7752 -1334 16710 4132 -16789 19490
747 19490 -7683 -22985 10820 22271 -12042 -3535 28593 -15613 -11234 9960 1052 -17684 16743
760 16743 19584 -15066 6117 2906 -7131 -7533 10140 -8158 4259 23262 -11062 -6704 7634
773 7634 -1054 -23130 16525 10560 -17360 10810 15755 -13442 -21385 17768 -8753 -10968 16138
786 16138 5013 -11457 1266 9428 -24800 -813 4058 -5614 2447 12111 -7858 -14787 14494
799 14494 -16841 -13936 11409 7776 -16327 9392 16890 -27950 -5840 9969 -4748 -14723 19510
812 19510 6067 -13496 10031 -2883 -10788 -3095 12080 -8486 10298 14597 -11950 1869 8227
825 8227 -6223 -13689 25399 3168 -8885 19767 9784 -18192 -3610 25340 -15359 -882 24323
838 24323 6934 -10701 9362 9223 -18963 8849 7204 1368 5539 12415 -5565 -3255 9559
851 9559 -18042 2070 14164 -394 -11670 18056 3024 -27054 6306 3091 -15054 -4426
863 -4426 25403 -12595 -17708 11943 -8566 -19177 -3095 7526 -19150 6117 6561 -16778 -11061
876 -11061 -5130 -11338 -12103 12527 -15282 -9079 9372 -7695 -23613 -3662 3731 -26087 5752
889 5752 10558 -12536 -14474 6689 -10432 -22016 10873 -5104 -9003 3165 8000 -16012 -4504
902 -4504 2997 -20492 2778 10799 -1916 -10009 14500 -8308 -17391 13347 -1561 -14410 4222
915 4222 24489 -13464 -4222 9771 -11659 -8971 11092 9854 -12914 12962 3758 -5278 2390
928 2390 -224 -9680 1484 20208 -7805 6115 9281 -9130 -9669 14972 3568 -17435 19645
941 19645 10042 -7872 1662 15368 -16484 -11435 24659 2778 -2696 7779 9883 -12577 6886
954 6886 7151 -11434 6284 9856 5752 2247 13379 -13780 -4984 15283 -1391 -2312 12655 10973
968 10973 -14639 13967 7317 -16223 -1060 15794 1083 -4861 23352 -5516 -12163 6049 7299
981 7299 -8929 3513 13902 -10126 9896 7707 -8549 -11984 9531 -478 -4137 19936 -3260
994 -3260 -10898 3095 11407 -16080 -3067 10567 -6926 7078 11404 -3931 -18328 10562 -323
1007 -323 -8753 10514 3971 -4814 1973 13518 -16611 -2331 7921 -5881 1392 16231 3272
1020 3272 -16599 14010 -480 -12857 5142 14391 -6344 -2728 21049 -6704 -4966 2729 -406
1033 -406 -6243 15261 10736 -11879 8136 2731 -4942 -2141 9966 -9143 610 20957 -3043
1046 -3043 -5410 1489 417 -13420 14344 7295 -14067 7466 12850 -6210 -13905 11817 -7929
1059 -7929 -6020 12966 4140 -7357 1149 6120 -17128 3948 4264 -7476 542 12432 -3003
1072 -3003 -12239 10127 -8691 -9020 4970 7228 -7084 5157 7710 -18125 1899 5502 -7672
1085 -7672 -9681 16652 2544 -10899 9270 -3405 -10753 -1654 11206 -9483 3355 10802 -8383
1098 -8383 -1848 4327 -4669 -15108 14614 4204 -7246 5805 3579 -8508 -5651 9194 -13231
1111 -13231 1875 11182 -2404 -5952 7003 -1592 -19132 9918 3342 -7778 539 11525 -6353
1124 -6353 -7439 7110 -13593 -3250 8664 3517 -10048 8517 3493 -15996 3636 1735 -7189
1137 -7189 -4080 16026 -3426 -4968 6692 -9221 -6028 5690 5521 -13349 11346 9336 -10808
1150 -10808 -1376 5063 -5205 -9158 15645 -1633 -1834 8583 -105 -10764 1853 8794 -12747
1163 -12747 7360 9282 -3692 -2917 10742 -4550 -15343 10302 1785 1188 5070 2814 -12041
1176 -12041 4090 9670 -15577 -2354 7192 3434 -4114 10747 -7847 -15504 8063 1936 -6343
1189 -6343 -1409 8916 -10622 3705 7410 -16380 -10723 8708 5279 -12989 9422 662 -10542
1202 -10542 -1223 2076 -8748 -4761 12151 -8174 -314 6165 -3108 -11321 1228 929 -8939 13686
1216 13686 3411 -7808 -3110 8163 -6036 -3116 8786 -10387 3176 17182 5103 -19165
1228 -19165 2964 8411 -6221 7714 6314 -4464 -1812 19722 -2889 -10625 4030 1656 2923
1241 2923 10144 9328 -12734 5839 8324 -4529 -1575 5693 1939 -134 15421 -4892 -4089 5364
1255 5364 -139 -8684 7186 13847 -9497 4244 4374 -5739 -4778 10587 -4580 -11683 14372 5495
1269 5495 -4846 -3236 1154 -13720 3215 13844 -10045 -6668 5454 5869 -9608 1363 -8374
1282 -8374 -9761 9838 5884 -5461 -7133 3907 -9722 861 2042 -10926 -4212 9499 2547
1295 2547 -12712 4970 -6448 -11638 2676 5994 -9039 -3168 12073 -12739 -7871 4142 -1709
1308 -1709 -13339 3883 6383 -9806 4462 -1022 -11576 -9466 8898 -2959 -6148 4456 -5706
1321 -5706 -2140 1667 -1648 -16765 1643 5108 -3636 4096 -1423 -9207 -5514 11420 -9503 -7443
1335 -7443 7906 1512 -3192 4758 2672 -18001 4342 8177 -5554 -1286 11303 -312 -9287
1348 -9287 12052 -2544 -7605 3932 10015 -3215 3213 11730 -6705 -418 3640 2817 -1082 10798
1362 10798 3172 -2235 10422 160 -2402 1602 6403 -4040 10581 11576 -8243 840 8666 -396
1376 -396 -8719 14136 2699 -6857 10250 9031 -8861 -6662 12225 -6065 -1554 8435 1848 -5739
1390 -5739 3482 3704 -11621 2718 686 -1584 1570 5094 -5105 -4091 4601 -9883 -1310 4135
1404 4135 -370 -5823 8742 965 -14154 3740 1922 -6057 -2840 12359 -4625 -4639 9019 -4089
1418 -4089 -7309 2647 7197 -7799 7950 7538 -6511 -132 6111 -893 -6318 12746 1314 -204
1432 -204 8059 4081 -4704 944 8488 -4940 7545 7977 969 369 7059 -516 -4093 10095 -1710
1447 -1710 1526 9565 6207 -7381 3871 6599 -10430 5078 10475 -1818 -7106 13967 1496
1460 1496 -12445 3806 2348 -5280 -376 13197 -6268 -5778 4144 -2056 -4385 -816 1844 -5435
1474 -5435 6648 -297 -4449 -935 -3988 -6029 1883 7866 -10622 1277 6344 -5963 -8138 6417
1488 6417 -246 -13621 10457 7580 -6477 -4136 7520 -6818 -6769 10833 -1127 -3622 3507 7130
1502 7130 -5349 1996 670 -7274 5345 6019 995 -2058 7183 -5702 -1798 7809 -2633 -4180
1516 -4180 5328 8577 -6827 4823 1248 -9020 -324 7816 -246 -5647 8522 -4170 -4189 3551
1530 3551 -666 -9430 1040 8349 -7453 3160 2023 -9166 -8102 7977 -964 -11492 5881
1543 5881 620 -5304 -2228 3707 -11616 -6241 5292 -2181 -911 -1833 -2789 -6955 3516 -4899 -7314
1558 -7314 3882 -1714 -3455 1944 4241 -14120 -1984 5511 -6420 -3225 8385 472 -13548
1571 -13548 7771 3026 -9947 -3400 7292 -1655 -3923 9915 -4101 -6427 -1370 3039 -2241
1584 -2241 1655 468 -4935 7374 -39 -5677 -4087 3978 -4598 1398 9661 -7249 -4897 4072
1598 4072 2075 -11074 3348 3744 -7481 3618 5866 -4827 -9975 6741 -3244 -4750 4385 1182
1612 1182 -3351 -287 2734 -9621 2273 1230 -5936 -253 7813 -986 -8110 5598 -4537 -4916
1626 -4916 3319 4504 -5813 729 6780 -5792 314 246 -2940 -2173 9918 1269 -5523 5981 -783
1641 -783 -2230 1696 4796 -6759 5169 10645 -4784 -850 5526 520 -7657 10495 4586 -5364
1655 -5364 4680 7373 -2119 -4492 7494 -2235 1627 5512 2137 933 4611 1503 -6572 7224
1669 7224 1300 -1104 4399 6539 -3345 -141 8892 -7069 -1122 7368 3842 -5166 7306 4928
1683 4928 -9553 2897 4953 -2331 -4603 9347 713 -2821 3978 -2803 -2873 706 3396 -5934 4769
1698 4769 2782 -5913 366 1311 -4611 -6305 7997 -3139 -3304 3725 -1360 -7378 -437 3250 -10508
1713 -10508 1441 4098 -3543 -5075 2749 -3697 -9198 4295 -2797 -3795 471 2466 -7022 -1593
1727 -1593 1899 -10454 -816 3851 -1141 -7138 5058 -948 -8464 1921 -880 -4414 -698 7042
1741 7042 -5436 -1391 3490 -4637 -2798 2713 1942 -5169 7829 1314 -4542 1493 2428 -3041 -592
1756 -592 8294 -4260 2554 7565 -702 -6128 4757 5615 -5243 6253 3745 -1050 1092 6990
1770 6990 -3486 -3947 7459 -216 1932 3686 2176 -5344 5228 3419 -7114 2232 3955 1358
1784 1358 -813 6110 -5730 -3615 6202 -1480 -4441 1946 5972 -6447 1987 1370 -6542 -1425 4667
1799 4667 -409 -5730 7066 -1707 -3354 339 -1136 -4912 2256 6402 -7146 1096 3338 -1019
1813 -1019 -4579 2603 -1548 -3026 9837 -71 -4050 398 5766 -4515 683 5478 -4034 3698
1827 3698 7377 1929 -7118 5585 2751 -1933 5321 2609 76 2573 9111 -5290 -560 5892
1841 5892 1386 1372 5154 3416 -4037 8299 1216 -4825 1471 6401 -337 -645 7439 -4826 -408
1856 -408 4050 -534 -6727 3850 6065 -5238 2197 -1240 -3840 -2266 4444 -5022 -4888 6102 -1620
1871 -1620 -2650 -1910 -1449 -7935 3481 1791 -7598 225 2467 -2312 -6175 3173 -6056 -3730 5259
1886 5259 -47 -5376 -398 4712 -6952 -190 275 -2853 599 5144 -889 -6059 5995 -1697 -2525
1901 -2525 1461 2700 -2344 3333 6844 -6561 665 3927 928 -2762 6328 1995 -2529 7352 447
1916 447 -3321 -675 7080 -2249 1494 5359 -2340 1359 2498 -268 -5951 6308 1358 -2857 3602
1931 3602 1046 -3611 -2018 5288 -7426 -1449 4814 -402 -3987 894 329 -8373 2797 -639 -4469
1946 -4469 -1571 3446 -3334 -5028 2205 -6511 -1911 736 -797 -5615 2024 641 -8230 951 -1222
1961 -1222 -4065 -3049 5832 -4359 -4558 4395 -3188 -4324 -627 2958 -6040 2859 2449 -4526 -622
1976 -622 1113 -1635 -4332 5918 -2265 -999 3734 -139 -4012 489 4156 -6396 3435 3731 -1790
1991 -1790 -1506 4639 -1273 -6237 5861 -288 -1374 1744 4358 -4038 -196 4082 -5187 461 2457
2006 2457 943 -2943 5149 -945 -5223 3456 -423 -2545 -119 5965 -4548 92 3869 -4562 -2975
2021 -2975 2366 2111 -5672 5204 691 -4143 589 1147 -3556 -2672 6135 -3630 -40 2302 -1560
2036 -1560 -3902 1988 1320 -6446 4425 1618 -1926 -1030 3514 -4358 -3284 5681 -2483 -323 2382
2051 2382 2685 -4828 2120 1999 -4968 2743 2596 438 -1828 5963 -2623 -2713 4116 -68 -814 2619
2067 2619 5160 -4982 3764 3573 -3032 -106 4405 1853 -1920 7619 -569 -1194 2896 2846 -1501 1820
2083 1820 5712 -2952 4228 3431 -876 -2228 4332 1463 -2333 6981 19 -942 1884 4403 -4169
2098 -4169 480 4831 -3254 1755 3972 901 -5846 3813 390 -3620 3179 977 -1791 -911 5126
2113 5126 -5344 -1922 1726 -2064 -1052 2579 1265 -6873 2987 -647 -3551 -954 1036 -2812 -1839
2128 -1839 4898 -5238 -1874 3 -1698 -4266 2683 1634 -6106 2912 -74 -3434 -2893 3686 -4477
2143 -4477 -3175 5671 -1408 -2724 -539 1570 -5626 2084 2729 -4190 200 2051 587 -3549 2577
2158 2577 -3984 -1344 4315 416 -1976 -108 2577 -5507 2923 1281 -3739 -447 5098 51 -4869
2173 -4869 4729 -2385 -2772 1880 3325 -3211 58 4779 -4665 609 1507 -681 -3580 3702 969
2188 969 -2544 3913 -1747 -2895 -693 4531 -3690 222 3211 -2896 737 2131 -429 -6318 4109
2203 4109 1722 -1476 2050 -34 -2316 -1085 5349 -4443 -520 2626 371 -461 2171 240 -6069
2218 -6069 4732 1589 -2311 307 4392 -1575 -2576 5474 -2655 -1495 1797 3131 -2598 2699 3264
2233 3264 -3711 1800 352 929 -387 4359 -1600 -93 4605 -1962 -773 1216 2085 -3496 5769
2248 5769 2866 -4695 851 4074 -427 -4339 5667 -979 -1478 3598 2087 -3399 -1890 4574 -3023
2263 -3023 1552 1229 -511 -1123 2233 -243 -4290 3030 -1969 -195 1371 1570 -4039 266 2296 -5849
2279 -5849 388 1842 -683 -3949 4202 -719 -5535 1678 -399 -2253 -1525 3807 -3702 -614 1548
2294 1548 -3533 -1411 1045 530 -4728 4242 -61 -3436 428 1015 -2248 -1847 5150 -2687 -14 2254
2310 2254 -73 -2982 1273 1771 -4167 3507 1350 -696 -1139 2248 -1640 -1244 3434 -3150 780 2456
2326 2456 857 -4530 2533 1286 -5349 2371 2745 -1775 -4216 5297 -971 -3561 840 -1192 -1549
2341 -1549 36 2608 -5364 73 526 -2318 -1725 -797 -1223 -2933 3380 -3389 -2307 -443 -2044 -3147
2357 -3147 945 1827 -7056 1651 2195 -3221 -5027 2766 62 -5205 2903 26 -910 -1909 1388 -3650
2373 -3650 -74 3394 -2587 194 1081 1334 -2666 3004 -1090 -2962 2926 2251 992 -601 2722 -3048
2389 -3048 2903 4429 -2601 -1616 4382 5170 -2871 2942 173 -565 2002 3676 332 -746 4533 -1259
2405 -1259 2379 2429 -622 -2267 4637 4315 -3743 2813 2010 47 -1367 3485 -630 -234 4070 -1826
2421 -1826 240 1944 2388 -4762 813 2585 -880 1711 217 -978 -2362 3723 -1530 -1229 855
2436 855 -1628 -28 2812 1704 -8203 756 3575 -652 -2567 887 -60 -2869 4087 -2351 -2655 -415
2452 -415 2006 -1286 508 2059 -4780 420 1348 101 -3029 2359 600 -1463 3133 -1363 -973 284
2468 284 2119 -3493 2688 5085 -2522 -1321 1955 2782 -2622 3289 358 -940 3419 2976 -287 -1521
2484 -1521 3488 -1646 3051 4060 -614 -1877 3249 4539 -2749 1743 -332 1191 2880 2647 -1567
2499 -1567 -909 4491 -2309 128 2090 1118 -3208 2859 2906 -3550 365 -64 -306 -1340 3071 -1917
2515 -1917 -1634 2074 -2651 -1935 394 1762 -5011 210 1499 -1933 -975 -1422 -1946 -2479 3510 -2781
2531 -2781 -2310 811 -851 -2881 -182 1633 -5704 207 1878 -217 -2681 437 -840 -2866 2688
2546 2688 -2244 -1679 450 2070 -2708 -442 1793 -3664 338 1258 1054 -2492 2142 -528 -2300 2658
2562 2658 -947 -1608 -87 3653 -3082 -170 2369 -2283 -1527 724 1648 -2883 2249 -891 -1753 648
2578 648 66 -1952 -1535 3329 -3349 28 1304 -907 -2887 625 1110 -3970 1357 -237 -945 -922 1718
2595 1718 -2313 -2292 2978 -1524 -273 372 1484 -2367 1196 513 -2471 2081 203 73 -209 3412
2611 3412 -2948 -874 3494 -831 -1588 1416 3744 -3414 1832 1995 -1720 -331 2569 1175 -2310
2626 -2310 3765 -154 -341 793 905 -1132 4 3088 -1570 2153 -36 -766 -322 2113 -742 -2220
2642 -2220 3890 -1242 -1047 809 1929 -3973 -148 3229 -2197 -4 1192 303 -3709 2291 -241
2657 -241 -2827 658 257 54 -1048 2185 -3446 -718 840 -1127 -480 323 448 -3137 3105 -692
2673 -692 -2089 -608 1214 -1061 -956 3297 -2972 -496 564 624 -1762 1136 975 -2835 2826 163
2689 163 -912 -1598 2240 -1419 -370 3845 -1804 -1120 1085 2495 -2970 1534 1803 -1792 1492 2392
2705 2392 824 -3022 2169 24 503 1308 -133 240 952 2469 -2277 1876 -175 -1054 1410 2373
2721 2373 -840 -1994 3265 -1967 -1073 1719 1050 -3226 239 3792 -3102 -475 586 -839 -3405
2736 -3405 2037 917 -3206 -764 -1390 -41 -1784 -162 -3589 -682 717 -2520 -841 -2284 -1938
2751 -1938 -3339 2147 -2251 -3767 -157 -865 -2211 -1938 674 -5235 -881 1678 -1251 -2908 -333
2766 -333 661 -3632 1199 -674 -1195 -862 1345 -670 -1131 2550 -2462 -176 871 1575 -1310 1843
2782 1843 1557 -2091 2452 1372 893 -707 2761 768 1470 3243 -1300 315 2011 3332 -1094 2518
2798 2518 1434 -519 3206 2169 -518 -1331 5085 259 226 2601 1087 -1345 1127 4183 -2983 477
2814 477 1998 814 -1078 1238 855 -2170 2070 -707 689 -29 1037 -1494 55 1130 -2469 1232
2830 1232 -103 -646 -1799 2994 -932 -2963 1945 -720 -1102 119 2844 -3590 -235 2668 -1207
2845 -1207 -1466 -228 1488 -2537 2270 172 -1359 60 700 201 -1297 2353 -1478 1181 945 177
2861 177 -912 708 1430 -2040 2465 -93 -81 391 2130 -1377 -283 3371 -1245 593 1187 1687 -1835
2878 -1835 1999 1034 -2220 1905 1170 469 -1512 3547 -520 -895 2128 171 -527 78 2983 -1932
2894 -1932 1342 877 -508 304 881 650 -1164 2874 -1193 193 830 286 -764 751 2152 -2661
2910 -2661 1697 720 -840 -1446 1718 -352 -2538 3046 -629 -1162 -809 1876 -2078 -603 1776 -2325
2926 -2325 -35 403 868 -2732 1079 -699 -1528 1294 -596 -804 -1365 2106 -2199 -273 23 -1269
2942 -1269 25 473 356 -2852 2211 -777 -1265 -38 497 -1037 -584 3033 -2633 -452 932 237
2958 237 -2196 853 1521 -2618 1772 64 -732 -1767 2325 -831 -1661 1373 -649 347 -903 502
2974 502 -2808 955 796 -1474 367 -504 -31 -707 2245 -2718 -944 2158 -78 -1102 -174 1596
2990 1596 -3351 1936 774 -1724 -962 1920 972 -2597 1921 -947 186 223 1331 -1090 220 2485
3006 2485 -1622 1331 39 714 -330 2236 86 -1068 3526 73 595 -284 2520 -760 1589 2369
3022 2369 -1234 955 1780 1828 -2231 2013 714 410 1821 117 -292 -497 3282 -1722 212 731 48
3039 48 -173 898 549 -3427 1841 -7 -592 -1500 804 -919 -1571 1209 -2699 -358 -512 460 -2388
3056 -2388 -197 -408 -2412 587 -1870 -1473 -1636 1533 -2358 -1917 984 -2127 -882 -804 447 -3403
3072 -3403 972 1019 -1954 -1089 -306 199 -2199 1650 -1299 -565 768 170 -700 -823 1404 -1610 2007
3089 2007 84 -606 233 1951 247 -1611 2699 -655 457 719 1476 -1392 556 2804 -1565 541
3105 541 413 1395 -1014 2187 245 -1426 1867 -165 -11 -815 1812 -1222 922 924 -1426 -7 545
3122 545 802 -2570 1712 -343 -1097 -23 16 -712 -1523 1913 -2048 -614 -362 -353 -1594 -322 262 -2966
3140 -2966 1210 -1258 -1073 -1321 386 -1582 -1770 1087 -2636 -427 -363 405 -2894 214 165 -2772 254
3157 254 -652 -325 -2004 1547 -1414 -1289 814 -1048 -120 -758 1293 -2195 1216 377 -1139 231 398
3174 398 694 -1215 2348 -893 112 845 795 -606 284 2522 -1663 1632 1001 587 -446 1754 724
3191 724 -990 2620 -176 830 371 1946 -736 579 2056 -868 1263 609 1176 -1134 2061 -30
3207 -30 -722 1593 59 240 -599 2505 -1676 238 1101 -432 -110 350 1219 -1951 1531 -292 -415
3224 -415 -347 466 -378 -980 1921 -1698 516 -145 -64 -1151 523 637 -2060 1527 -488 -88 -695 1587
3242 1587 -735 -365 1969 -859 136 116 1337 -1694 1158 823 -905 690 405 637 -1150 2101 -1109
3259 -1109 -76 1285 16 91 -247 1315 -1782 1483 532 -721 16 1109 437 -1518 2052 -1077
3275 -1077 78 119 1117 -969 -520 1751 -1448 874 -30 438 -1122 1248 267 -766 1402 -761 232
3292 232 -140 1630 -1293 599 1457 -968 502 584 1186 -1766 2201 551 -361 1250 529 283 -834
3309 -834 2675 -762 569 526 1003 575 782 865 -1631 2180 130 428 419 1070 -437 26 2375 -1682
3327 -1682 154 461 1215 -1124 743 913 -1566 756 125 182 -1775 1297 -414 -603 734 -1281 20
3344 20 -1089 438 -2054 1060 -189 -1820 78 -123 -379 -1544 1578 -2029 -879 657 85 -1337
3360 -1337 -1616 1020 -1846 686 -412 -165 -1056 492 626 -1419 802 -1493 772 325 302 -1577 211
3377 211 1381 -1840 830 343 434 -1171 1994 196 -1370 1417 353 402 -780 1934 -467 391 884
3394 884 3 727 133 1224 -758 1665 -167 630 1088 -171 -83 253 2774 -1525 427 1147 514 -694
3412 -694 892 1017 -1746 1430 754 574 -722 721 365 -322 1255 -1209 433 -78 940 -688 401
3429 401 35 -822 1265 -533 -136 -953 1852 -1337 -629 978 -751 -881 -479 1465 -2120 334 39
3446 39 -696 -927 -164 380 -1671 734 -1574 -39 -57 -547 -979 -419 762 -2022 801 -334 -570 -1020
3464 -1020 666 -58 -1985 1092 -635 -328 -685 975 -1211 -526 992 -654 304 -682 578 -655
3480 -655 709 -844 -536 1304 -634 -80 -152 1476 -1786 340 1348 -442 -853 367 1497 -1989
3496 -1989 801 11 -253 -467 556 267 -1096 1271 -877 500 -748 0 -548 20 199 -1130 1071
3513 1071 -1173 -609 -450 929 -1584 -907 1511 -1395 -641 -717 626 -2052 -118 135 -1124 -267 -761
3530 -761 84 -1921 596 -1113 -439 93 -1153 -201 -542 486 -2082 288 -347 -366 -134 -395 -643 -1292
3548 -1292 1961 -989 -675 -651 671 -207 -248 860 -1479 550 -280 579 -736 343 -98 -282 1800
3565 1800 -854 -255 -320 1499 -915 -24 985 -687 200 16 1119 -1346 1059 312 -254 252 227 554
3583 554 -773 1153 -754 753 367 245 143 136 1068 -483 1599 -1045 -381 1138 1064 -668 -1042 1811
3601 1811 -615 475 88 697 -980 801 1863 -930 405 21 1270 -313 1133 -306 -397 998
3617 998 -209 684 -844 1033 -578 1113 294 -647 692 95 171 -912 1489 -722 -299 471 114
3634 114 80 283 1459 -1660 249 444 475 -538 -90 167 -873 2096 -674 -434 -696 978 -174 -89
3652 -89 476 -1433 706 -175 446 -935 309 94 -427 1023 -773 -136 -407 1416 -833 -8 180 -649
3670 -649 379 94 547 -1183 1187 -383 -451 646 400 -21 -688 1546 -560 471 366 355 -603 370
3688 370 1500 -798 909 -301 728 367 1076 -174 -328 1665 -467 1230 -304 546 -373 1237
3704 1237 1014 -284 875 40 724 -139 1693 -392 119 1340 59 -25 -187 1295 -971 674 399
3721 399 -264 38 144 717 -1001 1372 -487 143 -123 348 -74 -172 796 -1051 529 -316 281 -443 -38
3740 -38 -288 -675 1171 -834 -129 -682 873 -874 2 642 -956 355 -35 447 -1364 814 -54 -249
3758 -249 540 -137 -61 -660 1331 -972 322 449 -51 257 -191 768 -1227 1060 -464 249 286 268 -115
3777 -115 -601 1209 -1033 414 126 414 -610 334 715 -1216 869 -145 311 -474 839 -319 -620
3794 -620 1101 -472 267 -369 552 -1154 254 369 -858 502 -556 168 -1128 993 -934 -2 105
3811 105 -458 28 -745 1077 -1184 380 -472 -210 -293 70 64 -1345 790 -927 324 -203 180 -729 -331
3830 -331 773 -1262 445 -727 256 -850 516 12 -1032 400 -563 176 -861 763 -880 -270
3846 -270 431 -565 139 -811 407 -1157 790 -596 -549 130 -541 -26 -500 714 -1489 -60 -56 -219 -367
3865 -367 -324 642 -1084 925 -574 -60 -789 239 16 -841 463 -912 263 -475 585 -794 206
3882 206 364 -751 774 -339 227 -531 745 -239 -18 600 -687 631 -205 958 -943 444 47
3899 47 -326 574 109 710 -1220 1127 -339 430 132 -351 -33 -142 1322 -950 618 -306 206 -184
3917 -184 235 236 -997 1011 -358 582 -456 339 -393 233 993 -920 263 -464 663 -962 544 162
3935 162 -574 102 -584 542 -758 634 -1184 305 547 -375 63 -648 391 -1254 981 -273 -120
3952 -120 -152 -88 861 -434 772 -1233 605 428 179 -456 -268 946 -766 828 -435 515 -385 559
3970 559 166 -254 352 -729 906 110 723 -975 468 591 -316 653 -242 765 -854 704 -206 70
3988 70 545 -703 69 -348 1067 -849 364 -352 26 375 -280 282 -742 660 -839 730 -5 -218
4006 -218 -361 -81 1078 -1466 210 -86 721 -526 -70 213 -778 707 -769 607 -636 407 -338
4023 -338 155 441 -927 614 -483 636 -752 392 -273 -28 480 -594 34 -310 1132 -1514 142
4040 142 488 29 -529 -481 1156 -1026 611 -267 563 -299 -254 327 -371 568 -1083 769 245 660 -321
4059 -321 58 520 -596 1092 -656 437 74 736 -375 -147 1302 -301 414 -334 1156 -860 205
4076 205 700 -34 404 -575 845 -185 831 -654 208 563 -262 171 -379 1213 -923 478 62 146
4094 146 -188 19 643 -503 751 -577 402 -149 373 -277 -429 608 -818 544 -751 142 -263 202
4112 202 -347 -495 960 -973 -177 -323 757 -1007 -172 609 -574 -179 -470 1125 -949 11 -157 211
4130 211 34 -472 462 -531 719 -610 740 -282 -260 403 -105 292 -650 1253 -416 230 279 308 -710
4149 -710 -146 1758 -239 154 -192 1270 -136 -181 564 -165 945 -373 1148 -207 713 -54 196 722
4167 722 -433 872 -258 777 -725 664 290 -437 651 -168 490 -358 1034 -671 -213 -143 135
4184 135 423 -736 627 -477 803 -943 -418 -354 -49 122 -489 750 -1390 -50 -93 306 -784 -718
4202 -718 786 -692 420 -694 647 -851 139 114 -657 16 -458 738 -779 156 -516 483 -154 -893
4220 -893 487 -321 132 -642 1139 -524 -204 494 277 -252 -996 1444 -399 -81 -340 361 -246 -542
4238 -542 733 -1007 391 -654 615 -644 -416 -10 -38 540 -1153 449 -751 -107 -744 246 29
4255 29 -825 732 -478 -48 -1054 739 -804 -468 -74 -639 263 -995 489 -912 151 -214 -324
4272 -324 169 -941 273 -601 696 -1072 51 -9 -7 -153 -533 456 -724 584 -260 319 -582 -102 375
4291 375 -826 402 -579 665 -669 139 -394 152 177 -414 805 -723 140 -494 590 -433 -453 900
4309 900 -106 300 -715 968 -783 -39 75 103 -3 -582 929 -543 235 -366 502 -122 -251 320
4327 320 -90 683 -719 489 -284 221 89 296 342 -749 946 -430 359 -379 1013 107 -401 697
4345 697 95 676 -446 996 -189 142 349 72 832 -223 890 -243 686 -70 794 268 -298 563
4363 563 -69 973 -325 933 -33 323 153 145 785 -382 712 -193 705 -81 456 354 -280 664 -435
4382 -435 791 -603 484 -142 477 -152 -409 708 -445 160 -646 653 -753 -261 -140 -573 143 -925
4400 -925 236 -869 -39 -528 -204 -114 -684 298 -934 231 -894 208 -596 -318 -93 -321 247 -978
4418 -978 212 -595 60 -332 120 36 -682 487 -534 385 -730 410 -218 16 133 -490 491 -640
4436 -640 746 -390 509 -318 119 136 -177 592 -415 808 -526 353 104 292 376 -52 345 -532 548
4455 548 -490 406 -134 -4 706 -608 470 -588 416 -533 434 -4 -81 422 -569 240 -797 486
4473 486 -548 198 -319 -147 189 -479 840 -881 471 -493 174 -169 -310 212 -545 688 -746 377
4491 377 -636 265 192 -268 408 -559 319 -342 480 -364 21 -92 47 583 -591 777 -410 354 -372
4510 -372 210 358 26 455 -341 1029 -235 761 -131 185 179 -318 736 -563 521 -339 694 -185 348
4529 348 290 -317 734 -458 651 -678 452 202 153 248 -290 455 -531 719 -495 435 -123 239 277
4548 277 -362 579 -602 423 -403 385 -285 243 237 -347 204 -499 501 -210 57 -242 84 450 -333 369
4568 369 -610 693 -396 340 -162 180 608 -148 733 -624 479 -510 396 326 -110 259 -72 953 -321
4587 -321 419 -224 411 191 -68 521 -122 635 -243 746 -353 517 244 165 396 -240 416 -293 450 -403
4607 -403 359 28 -229 288 -495 205 -587 249 -716 -232 87 -185 41 -645 384 -488 341 -611 -84 -85
4627 -85 -491 169 -493 379 -823 138 -381 -114 -12 -410 249 -668 307 -552 346 -360 -155 126 -617 280
4647 280 -691 326 -362 410 -186 185 -119 -271 347 -487 566 -422 498 -104 321 137 -115 237 -329
4666 -329 922 -122 426 -109 168 234 -57 437 -436 611 -129 471 -257 213 177 -511 502 -563 473
4685 473 -458 158 -232 -115 267 -211 361 -748 236 -401 -47 -512 -345 -88 -550 -173 -752 185 -785 -102
4705 -102 -649 -495 -181 -559 20 -1152 1 -619 -149 -568 -363 -4 -754 188 -958 281 -746 -77
4723 -77 -215 -187 29 -575 578 -386 294 -436 397 -185 -198 342 -598 324 -280 609 -355 421 351 -117 611
4744 611 -176 705 -328 603 -369 457 266 179 439 -179 713 -374 897 242 90 120 434 731 -77 659
4764 659 -230 546 173 422 37 23 722 -126 814 -213 569 -227 386 195 -24 431 -366 463 -331 338
4784 338 -575 329 268 -452 238 -260 481 -813 320 38 37 -151 -80 400 -617 308 -633 143 -513 -67
4804 -67 120 -270 101 -569 626 -426 209 -157 -434 -112 58 646 -1010 23 -11 563 -812 72 457
4823 457 -416 375 -396 687 -522 126 -34 62 190 -377 615 -380 270 -465 761 66 99 181 -265 429
4843 429 -509 709 -474 77 30 9 -86 -401 580 -464 457 -110 349 28 -229 413 -435 159 -874 555
4863 555 -262 -149 -425 7 263 -814 -8 -272 41 -686 163 -43 -234 -115 -606 265 -770 196 -381
4882 -381 -137 -154 -279 354 -438 176 -484 341 -259 87 292 -24 -171 -51 914 -707 509 421 320 -253
4902 -253 -129 769 -493 326 169 809 -220 -29 282 38 129 -513 624 -202 572 -123 574 64 -414
4921 -414 682 -218 163 -242 1019 -287 -123 526 -342 48 -348 828 -574 123 -118 -22 -41 -217 156
4940 156 -303 337 -761 314 -276 -154 -197 -235 410 -761 394 -265 -84 -179 232 222 -531 399 -177 442
4960 442 -501 555 -124 -96 345 -307 517 -348 524 -88 507 -32 102 384 -126 401 34 1104 -352
4979 -352 462 862 195 8 125 1032 -650 446 -132 451 -108 19 460 65 590 -426 861 -149
4997 -149 -11 169 64 -4 -423 756 -206 93 -217 579 -699 -347 662 -284 14 -766 389 -457 -142
5016 -142 -62 -487 -145 -747 324 -879 14 -644 -11 -217 -802 221 -338 -147 -1048 390 -339 -337 -115 122
5036 122 -119 -836 390 -335 209 -361 -190 -327 -215 462 -275 405 -433 416 -73 54 108 -299 598 -174
5056 -174 709 -266 552 -196 392 785 -144 515 444 797 -209 478 528 276 496 -53 551 19 374 -396
5076 -396 392 221 -7 333 108 378 -584 564 -378 -29 -94 116 -103 -358 481 -773 -57 -20 111 -590
5096 -590 -185 319 -389 -76 -751 156 -794 -66 -595 -383 15 -678 153 -251 2 -1231 93 -235 -425
5115 -425 -144 -412 84 -1086 441 -703 -306 -299 -318 55 -549 321 -887 305 -300 165 3 91 10 -329
5135 -329 302 -800 367 -212 -13 -210 133 670 -417 361 -268 541 -372 344 98 -328 190 -317 374
5154 374 21 396 -426 572 171 -294 130 41 452 -598 316 -386 365 172 -70 148 -156 411 -579 380
5174 380 -46 187 -279 51 490 -437 278 -381 434 -168 207 228 85 463 -497 349 46 171 -394 217
5194 217 136 -451 229 -271 211 -535 575 -347 -62 160 -415 221 -273 804 -727 209 45 10 211 -303
5214 -303 244 -586 312 -539 244 -228 288 17 -287 308 -430 167 -142 50 -420 103 -16 -529 199 -483
5234 -483 311 -341 251 -386 -124 371 -289 280 -236 440 -296 432 -229 -99 267 -255 281 -308 554 -438
5254 -438 260 13 -126 94 -77 651 -412 460 -72 58 89 169 137 -101 623 -447 351 -15 345 -80
5274 -80 -145 548 -213 362 -236 269 -387 411 -5 -65 537 -374 296 -230 205 -308 169 -122 -259 383 -23
5295 -23 329 -192 797 -289 348 238 -275 -11 -230 702 -339 406 -26 -162 -13 83 288 -413 687 -327
5315 -327 95 -121 275 -108 -108 480 -382 120 -268 249 -325 360 -187 -177 431 -644 49 -232 239 -347 -226
5336 -226 68 -474 142 -264 300 -737 388 -289 -162 167 -115 54 -437 555 -503 155 6 -6 -300
5355 -300 -60 294 -359 486 -471 223 188 389 153 -186 722 -172 693 -113 301 -33 603 532 -30 574 -183
5376 -183 323 -130 740 118 292 423 -76 441 -136 482 -510 352 -216 -101 151 -173 358 -506 534 -387
5396 -387 295 -296 -64 -144 -303 421 -864 18 -117 -107 -384 -117 -246 -793 177 -739 205 -352 -170 -513
5416 -513 -260 86 -850 150 -371 -84 -789 171 -119 -505 154 -489 -6 -432 212 -523 -195 18 -253 200
5436 200 -291 386 -460 558 -217 -179 163 36 152 -352 718 -488 298 207 172 -33 194 533 -140 727
5456 727 61 673 -77 502 160 123 826 -515 396 334 639 -28 433 293 62 480 121 517 -218 1034
5476 1034 110 147 492 -107 430 -81 709 -143 365 62 90 230 142 129 -428 854 -284 134 -81 66
5496 66 -111 -166 449 -431 393 -350 84 -377 85 -189 -613 486 -621 -73 -270 217 -599 17 -212 -902
5516 -902 284 -469 -73 -707 412 -437 -529 198 -514 -209 -363 398 -807 -374 110 -366 -220 -271 113 -746
5536 -746 71 -326 -170 -166 -55 208 -201 696 -611 42 79 -51 -69 304 346 -473 534 24 140 -212 621
5557 621 -156 -144 482 -46 225 -151 414 -286 200 286 -106 433 -71 526 -93 391 -55 202 287 -341 161
5578 161 87 606 -860 364 112 -373 -227 -108 194 -350 463 -277 143 -147 -5 -292 54 75 -603 78
5598 78 -557 -115 -352 365 -117 -335 215 -532 -53 -39 201 -521 -117 74 -589 -45 -93 80 -641 297 -143
5619 -143 -253 141 -249 34 -377 250 -625 -1 -91 -154 -248 -5 118 -541 660 -116 -115 286 477 162 -299
5640 -299 556 -271 178 -485 375 -308 79 559 -333 464 -173 360 139 341 -90 32 442 -409 243 40
5660 40 311 -173 366 193 -117 469 15 353 -383 740 -3 75 260 51 247 -129 529 -501 496 -154
5680 -154 110 96 -74 90 -536 674 -483 -117 -43 469 -255 120 499 -588 82 -329 435 -200 230 259
5700 259 -40 475 -101 -117 -319 348 -256 177 156 -518 151 -4 299 -471 686 -133 -107 291 -54 138 -25
5721 -25 297 -471 43 9 189 163 -394 108 -298 441 -68 64 159 84 -240 -152 440 -645 36 19 256 -428
5743 -428 358 178 -774 32 -389 41 -477 488 113 -386 164 -362 5 -459 13 -321 324 -153 -405 3
5763 3 -273 133 -585 560 -331 264 72 -102 -466 -201 681 -448 476 145 260 -420 350 -45 -600 432
5783 432 -427 149 -135 382 -173 104 139 -535 347 144 18 -483 558 -221 -253 244 -329 -110 -426 364
5803 364 -253 -204 -90 -493 -307 -390 306 -758 64 -706 -40 -260 -325 -407 -610 345 -702 220 -111 -182 -663
5824 -663 3 -17 -752 170 -262 -281 -538 19 -176 -436 407 -309 13 -88 40 -617 80 14 -192 189 -338
5845 -338 202 -479 539 -175 42 459 -203 73 -91 448 -417 605 289 64 10 384 595 -68 660 -172
5865 -172 274 29 348 74 253 524 -188 486 309 372 -150 621 272 -85 832 -47 547 124 730 26
5885 26 171 589 -80 268 105 465 -222 649 138 4 242 -279 365 -190 765 -384 230 134 -62 141
5905 141 361 424 -429 503 -232 -258 -285 123 -44 -391 218 -568 -39 -381 185 -455 -144 210 -560 198 -332
5926 -332 -92 -361 285 -258 -265 484 -298 -25 -457 200 -610 336 372 -197 395 140 288 -428 556 -101 316
5947 316 516 -121 -79 -173 566 -415 430 115 -131 92 192 236 -347 512 -382 167 173 286 -197 -185 217 -463
5969 -463 299 -328 -113 -401 567 250 -384 337 -48 -2 -592 291 -503 -153 125 -414 -267 -328 95 -414 476
5990 476 -301 -225 -285 -134 -140 -585 384 -390 -281 -41 -261 -163 -255 118 -760 26 -261 -42 -352 164 -350 -317
6012 -317 452 -688 225 -78 64 -357 194 328 -459 376 30 77 -122 350 -220 -121 369 -335 -111 -218
6032 -218 586 -599 227 218 -457 232 -47 192 -301 548 -20 62 367 89 9 33 377 -656 461 109 -13
6053 -13 -103 290 -74 -354 495 -232 246 -72 331 -308 21 265 -565 185 -129 273 -180 555 62 -180 343
6074 343 -144 -153 -280 365 -441 457 208 -205 -6 -69 351 -441 554 -122 -261 30 253 12 -200 308 -393
6095 -393 80 174 -65 -112 -38 113 -635 492 -125 200 -378 220 -142 -194 701 -237 137 -193 359 -275 205
6116 205 209 -308 212 -131 549 -264 766 -179 -581 197 -253 273 -204 523 -652 332 50 -37 -135 -58 195
6137 195 -387 501 -182 -183 86 101 -163 14 374 -346 392 -102 74 -148 213 -172 -387 523 -227 387 3
6158 3 302 -325 171 312 5 125 -6 425 -520 319 -81 -106 115 202 47 -278 713 -510 290 500 18
6179 18 211 179 591 -481 503 -64 128 -107 294 285 -128 308 -312 55 -60 -59 -350 97 438 -640 233
6200 233 74 376 -228 167 -230 -172 582 -476 -110 28 113 -623 18 168 -261 -30 -178 -50 -526 367
6220 367 -260 -51 33 -145 -42 43 187 -705 152 -66 -249 -127 -162 -191 -657 523 -402 30 -202 -25 -367
6241 -367 -185 193 -641 207 -80 15 -256 320 178 -404 372 -164 111 31 361 -590 330 311 -163 311 -2
6262 -2 372 -579 521 88 -62 350 160 200 -297 653 -397 221 272 -40 -2 88 289 -529 595 7 92
6283 92 173 522 -32 -150 613 -438 432 23 435 -69 344 294 -419 379 -130 359 -204 596 178 -22 318
6304 318 -228 7 213 457 -239 269 -3 -426 227 -162 64 -349 606 -81 -459 89 -68 -60 -103 421 -370
6325 -370 447 -98 159 -207 160 10 -197 379 -112 319 46 531 -261 -18 365 -306 319 33 270 -219
6345 -219 291 39 -376 177 -182 254 -72 498 -263 129 279 -291 -138 -114 243 -598 283 -176 53 20 -207
6366 -207 -107 -278 719 -356 149 94 171 -467 113 175 -436 412 132 28 -244 273 -315 -109 341 -531 1
6387 1 -295 315 -388 31 79 -297 209 3 102 -490 218 -235 -246 -9 -38 1 -171 581 -150 265 127 -170
6409 -170 -9 102 326 -521 259 -320 45 -36 -171 -284 -21 423 -732 230 -114 -9 -463 345 -178 -293
6429 -293 670 -191 -21 -162 358 -527 -259 178 -305 52 -346 383 -410 185 -247 -311 110 -195 -9 6 441
6450 441 -518 4 267 -73 -191 -6 212 -501 414 2 19 89 329 298 -122 678 -223 229 80 197 -185
6471 -185 171 119 -315 496 -275 190 75 532 -186 -136 553 -232 209 183 221 -217 73 251 199 394 149 -79
6493 -79 40 339 -160 -61 98 -81 -42 -197 595 -392 201 96 -192 -265 167 -179 -617 339 -461 19 -90
6514 -90 229 -328 -17 66 -427 -33 -239 186 -356 197 -171 -227 656 -323 -171 -58 394 -436 87 152 -238
6535 -238 17 -260 162 -291 491 -193 -336 136 212 -23 -404 621 -431 55 -13 267 48 -2 279 -290
6555 -290 264 -13 -82 185 292 64 -426 687 -239 57 288 476 -4 92 9 -282 233 64 -95 1 408
6576 408 -186 -218 309 -240 -116 -195 253 -229 99 -65 -164 328 -77 -107 -352 472 -200 -125 182 -62 -241 -140
6598 -140 525 -564 263 -10 70 -226 211 117 -499 403 188 267 -70 279 -3 -76 440 -438 101 -26 108
6619 108 -176 569 -19 -146 234 152 -61 -135 504 -343 -116 308 47 216 40 138 -204 381 -230 -306 31
6640 31 129 -4 -400 622 -325 -65 169 -6 -422 -74 97 -615 331 -134 -90 -88 223 -278 -125 145 -428
6661 -428 148 -151 34 -403 82 170 -304 178 7 -104 -86 105 -381 -217 228 -271 -34 122 402 -432 360
6682 360 -141 -164 -164 -33 55 -427 429 -305 91 51 15 -171 -9 614 -245 171 89 -151 -300 383 155 -203
6704 -203 411 -28 15 176 317 -121 151 376 -218 151 142 -26 -388 242 102 -257 269 -35 116 -133 341
6725 341 -287 -296 1 -50 -59 112 307 -535 287 45 9 -25 229 7 -340 491 -445 -239 -137 -118 -250 67 158
6748 158 -263 504 37 165 -298 273 -79 -94 488 -263 85 -10 354 -321 412 96 -169 321 57 347 -156
6769 -156 387 -327 -125 362 139 -18 -20 462 -328 187 71 -32 72 320 211 -62 309 -171 110 42 384
6790 384 -169 -57 202 -243 299 -88 -178 -360 330 57 -193 26 -279 8 -329 395 -385 21 186 -443
6810 -443 158 -75 57 -185 241 118 -189 6 -50 -251 -314 474 -503 -77 73 -64 -274 -185 -20 -573 306
6831 306 -49 -63 -3 255 -109 -110 146 -515 228 -9 124 -255 283 240 -496 43 -11 94 -288 254 -338 -16
6853 -16 264 -97 -103 -240 510 -201 308 140 -170 237 246 91 -307 373 -179 -63 224 -50 113 -230 324 -521
6875 -521 273 184 46 100 382 112 -312 442 -145 -137 -21 388 -193 -153 6 -671 116 121 74 -388 309 104 -480
6898 -480 239 -130 46 -128 322 -252 150 490 -50 -8 26 160 -248 368 38 -124 -108 108 -190 -292 408
6919 408 -290 0 250 134 -125 38 178 -592 256 159 -221 -290 209 -318 -469 307 -58 131 104 195 -243
6940 -243 77 130 -165 173 -95 112 -215 455 -207 -302 307 -47 118 -92 435 -399 152 56 -140 -136 104 85
6962 85 -439 175 -204 77 -89 40 -358 -127 484 -409 214 -7 -142 -178 121 14 -320 388 -160 -37 84
6983 84 51 0 -171 256 -238 127 117 205 -616 223 64 -167 563 101 -37 -92 327 -487 -57 249 -14 -105
7005 -105 297 437 -383 408 -3 -84 -107 88 65 -327 590 -201 126 189 321 -282 275 334 -411 454 -144 58
7027 58 -365 565 -162 -113 412 130 32 -43 375 -281 171 65 -398 148 119 127 -396 290 16 -28 106 -23 63
7050 63 57 127 -614 286 93 -138 -21 43 34 -546 201 -85 -271 -185 98 -350 198 114 -399 201 -32 115 -187
7073 -187 309 -118 -267 212 -134 -62 -427 430 -267 -163 344 -235 182 -183 175 -232 298 -304 -192 4
7093 4 -113 120 -190 495 -199 28 68 69 -43 -84 270 -600 232 -118 -129 18 156 -32 -294 504 -385 20
7115 20 -157 213 -423 197 111 -293 255 -191 110 -242 429 71 -148 366 -110 -106 -97 359 -483 46 386 -377
7137 -377 70 140 5 -452 471 -105 29 128 134 -66 -71 253 -316 300 -138 173 -30 -34 181 -378 268 17 86
7160 86 183 71 -189 28 167 -159 217 -67 30 3 237 -62 -89 172 -100 -96 -62 351 -137 106 235 -284 74
7183 74 158 234 -481 338 -154 -82 219 109 95 -290 539 -240 122 67 186 -354 84 432 -117 296 -6 -47
7205 -47 -14 225 -36 -62 389 -206 -3 148 203 -277 210 273 -445 -31 1 155 -87 296 -414 -228 61 -39
7227 -39 -117 -272 382 -278 226 120 -284 -28 -160 215 7 333 -179 -286 -105 -11 -95 13 194 -272 -25
7248 -25 185 -41 -341 88 143 -190 419 -99 -190 49 221 -229 -67 200 -256 45 72 24 -155 240 -151 -205
7270 -205 134 -20 -102 -113 399 -262 -125 70 27 -239 71 185 -479 187 -43 37 -116 87 -137 76 422
7291 422 -401 -45 -43 -386 -226 27 6 -185 297 189 113 -383 285 -260 61 234 -247 12 -193 32 -530
7312 -530 130 -35 -259 77 -243 -33 -434 197 -264 -279 236 -65 -1 -69 197 -444 10 14 -86 -184 -88 149
7334 149 -535 216 -295 -49 -127 434 -98 -133 134 -417 362 -202 98 -275 111 -9 -180 377 -250 164 -79
7355 -79 221 -155 216 564 -91 82 -437 64 -420 243 -187 -396 143 -1 72 -224 268 -226 -7 44 32
7376 32 -30 -64 188 -351 484 1 -44 91 189 112 -84 320 -186 -233 99 24 -272 48 217 -125 172 -59 -220
7399 -220 -247 426 -247 -43 415 -115 -208 -55 41 -394 31 139 -199 129 153 151 65 505 -67 151 22 24 -90
7422 -90 19 570 -94 182 231 -139 67 266 122 -298 500 -292 299 340 104 -131 34 522 -263 217 -310
7443 -310 24 -57 216 69 -296 224 -175 -49 -219 163 -158 174 522 -126 -274 -194 210 -210 186 -7 -209
7464 -209 -209 1 -197 -149 245 -585 -29 180 -153 -80 -92 189 -677 52 -134 -234 -221 390 -317 -181 344 -457
7486 -457 -169 63 326 -179 -221 55 -196 176 133 -149 -86 359 -141 -247 279 -61 6 -216 258 -348 12
7507 12 126 -122 84 -29 -39 -282 396 -94 -21 153 -181 -84 -23 582 -332 170 -173 183 -103 175 3 -271
7529 -271 486 -193 47 -320 504 -316 -31 234 -155 -98 285 99 -384 241 -98 -366 216 -204 124 -29
7549 -29 319 -200 110 124 -87 15 230 275 -384 247 -142 -209 87 289 -126 -234 251 -10 -67 247 77 -429
7571 -429 -23 91 -84 262 39 -59 -162 231 -42 -212 148 -288 437 17 212 -223 215 310 -86 168 -12
7592 -12 -151 -219 283 -200 -53 271 166 -15 -31 333 -125 -93 183 -21 264 133 12 39 244 166 -75 179
7614 179 88 -52 311 347 -260 23 113 66 -128 286 292 -191 334 93 9 -210 52 -182 117 256 -138 123
7636 123 -201 56 -193 124 22 -181 147 -111 -422 -205 283 -268 121 83 -27 -37 -132 55 -270 138 -408
7657 -408 2 204 133 -69 -81 528 -357 264 -32 -112 -516 159 315 -482 325 -64 -8 -329 343 -19 -239
7678 -239 68 -478 -13 -213 32 -175 44 42 -104 299 -196 -32 -122 284 -199 16 116 -6 -161 -231 208
7699 208 -468 132 92 17 -7 147 -3 -300 -27 -296 -110 -56 32 -257 110 31 -142 -45 -188 188 -110 268
7721 268 100 -215 -104 -32 -71 -110 111 -247 90 119 -238 -211 5 148 -180 220 -52 9 -10 -20 -316 -229 460
7744 460 -73 98 -68 -164 -125 16 198 -317 326 -5 -214 -9 600 -121 -150 228 229 123 95 275 -133 111
7766 111 111 -420 189 196 -45 -196 328 -201 -146 113 -219 -67 -188 253 -116 260 -183 -23 -239 -78 -77 -131 109
7789 109 -121 -133 28 64 -203 -571 395 -16 151 35 -46 -201 138 74 -182 65 32 -19 -188 125 -46 -235
7811 -235 26 62 108 52 63 -344 403 207 -356 168 108 27 -53 284 -227 288 389 127 154 -159 264 -51 71
7834 71 391 233 148 293 348 132 500 -116 165 203 48 -176 270 180 -419 224 201 43 80 350 -52 -94 337
7857 337 -60 -164 -3 113 -86 46 234 -418 129 -24 14 -465 38 -153 -21 -18 45 -104 1 -23 -233 182
7879 182 92 -274 110 -61 37 -287 298 -417 -145 37 -110 -3 -225 241 -276 267 -234 22 -12 182 -107
7900 -107 -235 108 -130 -118 84 273 0 64 -70 -41 101 37 280 -284 244 14 -246 119 320 65 112 207
7922 207 -246 114 287 -30 226 -91 166 -482 394 44 -155 -222 86 -66 -107 175 -107 90 -307 73 -150
7943 -150 51 -97 -445 360 -103 -310 -303 7 6 -164 567 -127 -220 49 345 -418 46 315 -195 -61 -98 -101 -211
7966 -211 297 96 40 306 -203 -272 178 299 -534 103 132 -253 -62 282 111 -512 146 -149 159 134 96 -126
7988 -126 -68 249 -341 56 65 175 -324 314 34 -153 360 85 96 -119 266 -287 37 148 -102 39 -9 193
8010 193 -293 216 48 -91 105 53 106 -195 467 -438 20 62 75 -105 -56 100 -501 315 56 229 88 32
8032 32 -109 -217 369 -143 103 167 198 -195 6 158 -281 64 62 83 148 276 86 -228 50 19 -97 170 81
8055 81 -113 -24 72 -222 43 -86 -17 -36 96 -37 -4 -132 32 -255 -59 327 -134 315 -158 -292 -214 34
8077 34 24 -73 424 -178 87 43 327 -304 -183 327 -305 63 81 33 -386 75 -46 -115 47 -52 -54 -216 137
8100 137 -266 -281 27 -375 -160 -125 53 -152 168 83 -342 163 65 -7 -96 295 -119 -37 -62 -15 -145 -6 -58
8123 -58 -425 92 56 -161 8 282 -47 8 621 82 50 216 145 -290 67 263 -126 41 366 125 -165 176
8145 176 -183 -187 -65 -102 -10 -47 168 -362 22 198 74 97 95 289 -92 355 -250 -222 52 156 -91 43 170
8168 170 -257 165 8 -51 -195 -20 10 -331 117 -246 140 44 264 46 -154 280 -312 -257 86 25 -215 93
8190 93 23
8191B3
$$ Imaginary data points
##PAGE= N=2
##DATA TABLE= (X++(I..I)), XYDATA
0 0 0 0 0 0 0 0 0 0 0 0 -8 8 -8 8 -16 16 -24 24 -32 40 -48 56 -65 80 -89 105 -121 143 -163 187 -215 244
32 244 -277 314 -354 398 -446 501 -558 623 -693 769 -852 943 -1043 1151 -1268 1399 -1542
49 -1542 1698 -1869 2059 -2269 2503 -2767 3063 -3400 3788 -4239 4772 -5413 6201 -7194 8492
64 8492 -10267 12853 -16976 24613 -43548 189291 253017 -76244 105267 164518 72816 47369
76 47369 173411 41489 78941 151811 125145 30181 62923 48078 -3371 135268 81180 19926
88 19926 45980 74692 5033 698 46372 -53789 36685 72304 -2859 -56331 83331 8847
100 8847 -167632 -1520 81419 -40889 -74313 63961 -50707 -68681 26869 -62153 -89018
111 -89018 -16909 32510 -54327 34992 -14045 -137073 -26558 66156 -38875 -97154 51217
122 51217 6171 1553 15310 -37623 -65140 16247 67607 -35791 38623 48629 -6351 -10162
134 -10162 58858 7209 -37827 77720 41473 37685 62365 38852 -39265 55503 77697 -51934
146 -51934 56113 131908 19211 -57752 112424 58629 -69985 34325 64033 15288 27971
157 27971 85121 -27274 -14134 30243 -5657 -475 22230 14613 -28584 54694 -4293 -52415
169 -52415 -21661 -19938 -25296 16379 31835 -91982 -13081 37393 -66189 -106564 20990 11068
181 11068 -106272 14640 27112 -78253 -88679 11020 -52383 -73408 17408 -40318 -39178 -7043
193 -7043 -23399 -96262 -20983 -9775 -69921 -6351 6541 -28598 -45259 5553 -66364 -41001
205 -41001 22472 -34622 -32238 27772 23150 -79523 -2405 14886 -49919 -21073 42791 10259
217 10259 -34721 43366 -18468 -35232 15737 8865 -35686 32825 69147 -49195 2627 41236
229 41236 -18617 -43749 51811 26010 -30809 54382 22543 -21297 -4512 25617 -33178 16027
241 16027 57447 -15403 5389 28436 8617 -36362 21420 -4956 -13396 52464 19754 -22947
253 -22947 463 35623 -56138 -3060 51825 -18594 -26908 53323 36101 -71904 5766 15276
265 15276 -30712 216 46662 -10846 -25416 43678 -26256 -26820 8408 1296 -24329 30856 28416
278 28416 -34697 13495 -7368 -31714 -5508 39923 -22708 -8314 51702 -23294 -26228 17797
290 17797 5951 -60534 26002 52068 -20855 -4162 14174 -16379 -35082 41710 -12096 -28662
302 -28662 33288 23167 -17799 -3375 12406 -58053 7299 36839 -7740 -13008 22624 -6063
314 -6063 -34903 29951 -24065 -35572 19131 31761 -22617 1701 19608 -55179 -9589 18866
326 18866 -6765 -23785 31252 -31 -33171 25240 -11862 -44240 -9019 39946 -21145 3580
338 3580 32707 -36081 -27438 19274 8776 -44347 25822 18580 -16038 20382 14256 -36256 -25972
351 -25972 42985 -11717 6295 33816 -4749 -16448 24964 12074 -42049 26019 18107 -2671
363 -2671 25349 38276 -26861 -23674 42087 -11502 -2001 33367 19424 -22308 30195 27932 -41138
376 -41138 796 17372 1518 3241 48756 -11886 -30353 25641 -3517 -20923 5662 20355
388 20355 -28395 25588 24254 -39794 -20176 7161 -14663 -23405 39139 -15758 -31183 12818
400 12818 -5484 -45576 -14673 12828 -45194 4157 18722 -26454 -38789 -2628 -26646 -47341
412 -47341 18859 -11382 -33747 -10108 7218 -44039 -29768 -2870 -50497 -13713 16478 -9831
424 -9831 -46942 569 -20542 -48655 3119 -10377 -36546 -10153 31543 -36426 -27477 2554
436 2554 -35636 -22589 18666 5372 -38764 22326 4709 -33394 -5636 8614 -18553 -5620
448 -5620 45065 -10322 -3700 19787 -3473 -22158 20559 26070 -14438 36265 26282 -4456 4284
461 4284 33893 -8165 -6129 51939 15963 12422 33015 23098 -20328 28202 35358 -12702 26921
474 26921 43429 16070 2325 42655 -5244 -12106 39044 21672 2898 24444 36403 -17608
486 -17608 17008 19074 -17855 2984 33680 11915 -10859 33175 -7693 -20226 9561 6884
498 6884 -20312 9448 32187 -25567 663 10348 -21741 -27492 21560 886 -26377 27615 3430
511 3430 -25237 -9498 12557 -30282 -5654 30645 -12499 -2087 16324 -1335 -30582 18115
523 18115 4355 -15853 26191 22441 -3824 287 28366 -19502 1864 32587 5319 6683 37884
536 37884 24199 -21017 28498 18492 -7156 19702 41820 9061 8982 47889 -4933 -3841 26734
549 26734 20311 -2354 35671 33403 -15239 25200 22532 -10764 -7702 35527 6325 1627 35071
562 35071 -4784 -14828 9161 13798 -28805 8706 20288 -12902 6712 6287 -22353 -30065 17685
575 17685 -14343 -20333 11342 -3790 -22262 -5618 -1382 -52264 -7012 12490 -22759 -21417 11797
588 11797 -11935 -42459 4195 -20898 -32229 -322 12811 -26484 -16814 8945 -32067 -15589
600 -15589 -4874 -16108 -18684 22904 -1488 -32402 3414 -11445 -19101 -2008 11367 -27006
612 -27006 4537 31917 -21036 -25162 4292 3306 -23115 22437 8240 -19933 10357 15640 -17418
625 -17418 -23201 18451 -7146 4889 19038 -5131 -13750 13074 6465 -32826 10999 11601 -3961
638 -3961 8366 16325 -20491 -14293 27083 -16590 -16050 16015 18880 -13319 8674 6393 -31232
651 -31232 4934 14542 -6015 -11638 23694 211 -6677 10475 -19844 -14485 17049 20449 -24226
664 -24226 9793 19397 -16110 -4520 7900 -12059 -15594 38036 4588 -18504 7758 9035 -14565
677 -14565 -5112 14584 -17216 12515 22582 -4145 -15347 6981 -1811 -13703 19900 -6815
689 -6815 -6356 20154 15668 -29556 -8296 20087 -17842 -213 18971 1613 -19806 21644 3751
702 3751 -32617 1096 10063 -1359 -2163 17255 -16378 -4799 11656 -16942 -14588 8287 10137
715 10137 -12391 17505 -6075 -24359 5996 8570 -22343 -10528 32714 -9525 -10557 9767
727 9767 -6525 -25893 7040 16581 -22646 6032 13165 -2242 -10989 1959 -13895 -7552 22851
740 22851 -6442 -3493 10389 5477 -20439 7059 5583 -23235 14268 23219 -5966 -14801 24767
753 24767 -7770 -20131 16138 7042 -8302 9227 26618 -17856 -3063 9818 -5777 -1926
765 -1926 11806 6418 -2855 23832 -8523 -12914 10188 5389 -12045 10869 25146 -17473 5839
778 5839 16203 -10306 -20103 17899 10307 -14869 18804 6921 -11187 -4977 12154 -15247 -5832
791 -5832 18061 -3930 2401 6253 -3883 -19419 11028 -3847 -16957 15670 8558 -13297 -5260
804 -5260 17110 -26456 -14243 16583 -2696 -13217 8529 10845 -24920 756 -1891 -14815 -3949
817 -3949 9413 -3855 -6840 11712 -19670 -9705 3636 -6828 -15224 13394 8971 -23548 7937
830 7937 2247 -22136 -13015 21015 -8294 -16152 21186 -1303 -18764 -5398 9315 -20064 -500
843 -500 13626 -5956 479 1862 -5745 -13937 8984 -10362 -3470 18085 -1467 -11851 6664
856 6664 10063 -27844 3867 15097 -8810 -1639 21782 -1292 -25219 15988 2151 -12732 3640
869 3640 17858 -5302 374 17859 -14305 -5864 5004 4231 -2220 16849 2382 -11337 16680
882 16680 -1190 -13746 672 18967 -10230 4035 22741 -10443 -10642 7210 5303 -16913 15104
895 15104 9907 -9119 6354 7388 -9135 -10852 12756 -10980 2470 16899 -2137 -10766 5277
908 5277 1891 -21198 12904 5925 -12300 2554 20485 -9515 -19233 13241 -8150 -7135 10744
921 10744 12784 -12820 2277 9839 -12742 1750 687 -2153 1078 20578 -2868 -5957 11786
934 11786 -8546 -5482 12958 13784 -14545 14899 18531 -11368 471 13361 -2788 -11600 30311
947 30311 11529 -6939 7808 10469 -4915 1248 18349 -6899 8758 16202 6128 -32 7905
960 7905 -3308 -8172 22727 4322 -1758 10067 12040 -11793 2705 15147 -16343 1008 17418
973 17418 6296 -10825 13595 -611 -20292 7639 8269 -4532 -3922 14734 -9744 -3024 7459
986 7459 -13699 -10959 5712 7852 -11271 11387 -3683 -19031 -131 7425 -11353 -12235 15287
999 15287 -6796 -2076 5401 -8992 -19292 3245 8802 -14672 7368 2524 -8565 -5270 7238
1012 7238 -12956 -12615 13434 -5376 -2382 7898 835 -21369 3135 6722 -16812 4323 11543
1025 11543 -4060 -12363 14962 -5633 -16037 4610 98 -2809 5794 11581 -18114 -1026 5096
1038 5096 -8870 -3082 5963 -1191 -7681 18388 -5256 -14078 49 1950 -7925 5695 13789 -17536
1052 -17536 2153 11032 -7394 -16069 8794 4152 -10685 14486 3527 -8998 -4678 7845 -11109
1065 -11109 -1603 13818 -6757 1101 8671 437 -15959 7732 1263 -10110 9947 8296 -3129
1078 -3129 -3464 10275 -14433 -2242 12539 -4653 -5403 12368 9659 -17284 5450 1162 -10188
1091 -10188 815 11861 -2094 -5648 13286 -9769 -6198 3857 -1181 -10701 10092 11692 -14141
1104 -14141 2171 1608 -7768 -8047 9079 -4959 -5128 13876 -5515 -8924 -32 2129 -17627 5771
1118 5771 10933 -11070 -918 6144 -3837 -14992 7296 -6650 -6035 11271 1765 -9592 -1391
1131 -1391 7516 -17816 240 7025 -5947 -2950 11148 919 -14729 6156 -6118 -6078 6731
1144 6731 6982 -9252 1935 13508 -15137 -4343 5376 -254 -8077 12654 5586 -10329 7118
1157 7118 -1779 -8350 -609 12888 -7594 804 13687 -6476 -4763 5261 1524 -15236 10992
1170 10992 9862 -3414 3596 465 -6717 -1454 14756 -11047 -3325 13628 5174 -3656 3079 479
1184 479 -15308 11860 9319 -3835 2 10265 -2606 -3212 12613 -11778 -5682 13733 12539
1197 12539 -9733 3840 9159 -11649 2052 5892 -418 -3253 14263 -436 -5854 9502 -2998
1210 -2998 -6886 1024 9880 -5594 8816 6912 -11904 -2914 6302 107 -8722 10402 -4960 -2061
1224 -2061 13201 -771 -20021 -4838 15211 -8202 843 4415 -7279 -6916 9524 -1995 -20976
1237 -20976 3550 2377 -691 1151 1668 -15282 -6052 9269 -10347 -5483 1608 1858 -6650 5374
1251 5374 -5427 -14425 4268 -1689 -6458 796 12616 -11393 -5891 5945 -7712 -4638 6529
1264 6529 2490 -13356 12624 8205 -9841 -4400 2302 -3274 558 18798 -7048 -7214 8655 8221
1278 8221 -6660 -2020 4027 -5461 14656 9394 -4477 -6433 6676 442 -1213 10243 -5728
1291 -5728 1230 10792 6131 -11815 2028 4649 -9265 8123 8986 -3001 -6332 12357 -6600
1304 -6600 -11026 9140 1586 -7792 1383 12099 -10095 -1157 2046 -10763 -5605 8529 4034 -11176
1318 -11176 4721 -3423 -4906 973 -2066 -10658 -874 12684 -6116 -76 -1650 -8230 -4531 9665
1332 9665 -1675 -11450 11139 3046 -4265 103 3785 -12490 1532 16494 -4597 -1288 8993
1345 8993 3636 -10878 9204 5278 -7796 7659 11680 1213 -2288 12710 -4259 -2531 9254
1358 9254 5138 2412 6953 7945 -5594 9332 3287 -3094 4405 8344 2183 4195 13739 -8842
1372 -8842 -1991 9718 2353 -6471 9825 10147 -10336 7488 7888 -7729 -8367 12988 1936 -6247
1386 -6247 10296 522 -5744 -1061 5975 -9801 -28 7008 -2736 1556 1567 -2580 -8102 5563 -4975
1401 -4975 -3507 7219 -1094 -4991 1931 3700 -15504 1042 6716 -5594 -2692 8356 -781 -12206
1415 -12206 7379 -2986 -8834 1948 7502 -5588 -1246 8582 -10578 -4141 4117 -15 -7654
1428 -7654 7413 4220 -8492 3929 -390 -6499 -4396 7572 -4305 -298 6981 -5533 -3765
1441 -3765 223 -52 -8514 6264 327 -5118 5983 511 -8552 -4740 7997 -9575 -24 10092
1455 10092 -4016 -9045 5909 4886 -16815 2028 6148 -3865 -1750 9066 -3600 -12075 6375
1468 6375 -833 -3132 -187 4405 -2620 2571 3007 -8045 852 -1475 -1049 2053 8855 -6384 -4138
1483 -4138 9759 -5567 -6835 4625 5990 -11369 7041 10874 -9304 -5762 5066 -558 -9371
1496 -9371 11087 1589 -7303 1580 4191 -5308 -5484 3779 -7521 3215 5494 -2889 -6273 929
1510 929 -2859 -8277 7237 -3292 -6269 1793 5652 -8717 -4844 2805 -11041 -1334 5614 97
1524 97 -9700 2782 -1736 -10066 3123 -1737 -7289 -1911 9667 -6891 -4202 3091 -9081 -6124
1538 -6124 6392 4382 -12498 4248 4445 -6927 -2475 2839 -4962 -7056 10615 549 -2263 -911
1552 -911 -1843 -3272 2107 2382 -7276 6707 2026 -2699 634 4168 -8314 -4634 12141 -3138 -2775
1567 -2775 6807 3200 -12238 3852 8911 -10096 -1556 8375 2894 -6453 7340 -771 -8722 2305
1581 2305 4642 1361 -1077 4171 -4248 4910 2743 -6513 -1155 5080 2278 -1214 10513 -4733
1595 -4733 -6112 6395 4825 -6055 1355 11233 -5257 2910 7582 -2321 -7200 7717 6016 -4845
1609 -4845 7880 4050 -1056 39 5849 -3449 1733 8814 -2788 3403 8348 2943 -7711 5823
1623 5823 3349 -3750 7080 6187 -1639 -2323 9459 -3318 -2263 3930 -1125 849 7178 4251 -9418
1638 -9418 3663 1618 -4037 1274 3628 -3466 -1145 10341 -7212 -6150 3257 162 -7721 4420
1652 4420 6630 -10639 674 3871 -4166 -8859 4464 -183 -4404 4655 -2354 -2708 -1569 187
1666 187 -8166 2878 3887 -5471 1653 2318 -3624 -6169 6832 -5304 -5118 8015 2051 -5506 384
1681 384 6544 -10806 -143 7439 -2002 -4037 6380 4297 -7750 3610 -1032 -2423 2195 4895
1695 4895 -2165 622 6628 -6765 380 2692 -1345 -4275 7735 2402 -6729 4919 -354 -4998
1709 -4998 -1250 7006 -5570 -483 8114 -3730 -4507 952 1249 -8250 4856 2499 -5094 1428 1456
1724 1456 -4138 -4952 4743 -6782 -1285 6670 -1080 -6214 1523 3103 -9875 1895 1885 -2834 -631
1739 -631 5540 -2504 -6055 5283 -4050 -2210 3260 3668 -4312 3532 4398 -7807 1484 2890 -263
1754 -263 -1619 8057 -707 -2343 7693 -1780 -4605 2879 8928 -4482 2985 6451 -2713 540 4529
1769 4529 413 -5375 9241 3389 -326 3811 1102 -3007 1992 7364 -6396 2608 6673 1663
1783 1663 -1237 3458 -719 -5321 8708 881 -3013 2421 6887 -3995 -2005 5367 -5443 377
1797 377 5274 2246 -5750 4973 2037 -6464 1770 -236 -1247 575 7247 -5759 -2849 5187 -3024
1812 -3024 -3947 308 2349 -4665 6881 539 -8034 -622 3579 -2613 -4690 6211 -4177 -902
1826 -902 4562 -1848 -8616 57 5104 -6342 2153 563 -2860 -1556 3812 -5626 -7141 6318 -1059
1841 -1059 -1482 110 1370 -6599 1263 2037 -8604 739 4160 -43 -5265 4175 -3601 -5116 4282
1856 4282 -1321 -5082 911 7635 -6153 -1530 1187 -3898 -419 3518 -35 -6196 7530 384
1870 384 -4263 -560 755 -2795 1714 7117 -6842 522 4303 -657 -5380 2941 1189 -4325 7156
1885 7156 893 -4270 -1548 5576 -4287 -3166 4714 -2254 1160 2608 -148 -7717 3473 1302 -5595
1900 -5595 1748 1527 -1667 -1892 4534 -7786 -4133 4502 -1171 -3702 1019 2664 -7425 2352 -737
1915 -737 -6441 -1804 4008 -1189 -4998 4106 -4377 -2338 128 -1711 -5222 2366 4177 -6210 1820
1930 1820 408 -3299 -3114 5067 -2731 -3685 7779 -331 -3305 -414 3359 -5288 2461 4884 -3373
1945 -3373 1383 4114 1279 -5211 4661 -651 -938 5304 1506 -1576 1360 5398 -6178 1840 3772
1960 3772 -1776 337 5646 886 -6262 5879 -740 -3755 1057 4302 -2543 -728 5508 -6082
1974 -6082 -1326 1203 -432 -4267 3515 1188 -5476 3118 -2031 -4493 -1842 4003 -5061 -1434 4791
1989 4791 -4429 -2961 629 389 -7940 3839 2049 -4462 1235 2024 -2537 -4273 5278 -3568 -743
2004 -743 4243 735 -1705 1986 2937 -6166 4824 2800 -940 1450 6197 -80 -2425 7667 -1677
2019 -1677 -146 5203 5465 -1960 4101 6266 -3716 3335 3549 1610 -338 8229 1904 -1181 6188
2034 6188 97 -306 2272 5925 -3398 3999 5647 -2334 487 3050 605 -4170 6990 542 -2146
2049 -2146 3128 1526 -3298 -1398 4584 -5406 996 3059 -1209 -3240 1747 -893 -7118 3768 -797
2064 -797 -2682 -355 2430 -5409 -2806 3430 -6408 -2219 1380 721 -5301 2183 -631 -6856 1298
2079 1298 -474 -2402 -2730 4300 -3846 -1619 2345 -4101 -2887 1294 2590 -4933 3793 419 -4302
2094 -4302 724 2253 -2219 -2750 6606 -2600 -196 3857 -154 -4576 1332 4794 -4219 3542 2108
2109 2108 -1221 -1031 4497 -1548 -4292 5066 -811 441 2249 2467 -5059 947 3640 -4308 1271
2124 1271 1345 108 -2844 4874 -2626 -4163 2696 -1310 -2013 521 3743 -6745 273 1624 -4418
2139 -4418 -2082 1806 -704 -5470 5455 -1296 -4969 -1477 581 -3481 -1695 4592 -5820 -1324
2153 -1324 972 -690 -4300 -112 -661 -3709 5139 -578 -3106 -1806 2336 -3408 -192 3968 -4393
2168 -4393 327 3684 1385 -5939 3173 1387 -3754 3745 3338 -571 -1754 6457 -2485 -1080 4259
2183 4259 348 -641 2719 5238 -3228 4140 1093 -2059 2104 5322 857 -1843 6071 -1485 693
2198 693 3043 939 -3314 3140 6415 -2892 2023 669 -1159 -746 4622 -1296 -3120 5217 -141
2213 -141 -672 177 1070 -5687 2610 4151 -4406 -76 2443 -405 -5462 3925 -1477 -3880 2392 1353
2229 1353 -1853 -2292 3411 -5118 -748 812 -793 -556 872 -225 -4138 3789 -2528 -2612 638 1406
2245 1406 -2174 1061 3779 -7343 -577 3193 -114 -4865 3461 1738 -4570 3095 550 -3189 -3029
2260 -3029 4715 -997 -1164 2792 -1768 -463 227 1170 -4594 2428 1069 -1799 2052 -73 -2135 -2099
2276 -2099 3980 -4513 -501 3880 -1133 -2914 1336 2069 -6757 1555 1436 -2205 -1277 2543 -1103 -3640
2292 -3640 2872 -3530 -1415 1202 980 -4009 1016 2447 -5728 187 429 -1237 -3115 3715 -1195
2307 -1195 -3400 2238 -1982 -2352 -737 2943 -4198 1177 2477 -2815 -1078 286 314 -3168 3485 -1699
2323 -1699 -955 3341 -139 -3336 44 4343 -4702 1871 4076 -900 -3189 3777 2844 -5050 2922
2338 2922 1210 788 1041 3567 -1941 -1243 4752 -1126 900 1060 2680 -597 4152 993 -2568 3183
2354 3183 413 539 1510 4652 -3771 927 5874 -1989 -2347 2966 4380 -4315 2978 3080 -1580 -389
2370 -389 1031 -427 -1614 4863 -2048 -1152 1614 368 -2331 -56 1123 -4526 2784 1844 -790 -2694
2386 -2694 176 -1860 -1186 4069 -4214 -2502 2338 3737 -4461 -1354 1529 -2847 1587 1390 -99
2401 -99 -3187 3341 -697 -1433 2634 -1562 -977 2533 5055 -4338 738 3343 -744 -659 2198 2737 -1638
2418 -1638 4730 49 -418 2841 2514 -1835 14 6223 -389 2259 1157 -31 -628 3966 2154 -2034
2434 -2034 3370 169 1518 2534 2284 -5254 53 7141 -719 -1930 260 2182 -2758 2571 -213
2449 -213 -4370 1251 1376 0 -2027 2232 -4388 -1524 2259 -1783 -2730 -795 1672 -4405 792 -2137
2465 -2137 -2922 -353 -78 -2795 -2294 4117 -5147 -4067 461 1019 -3802 -1339 1104 -4449 1280 73
2481 73 -2217 -4329 1110 -764 -1295 2972 -3540 -2767 472 3208 -4385 -1910 840 -848 2112 -151
2497 -151 -1744 -3351 3797 -954 -2102 2404 187 -1772 202 4103 -3760 -322 1938 353 123
2512 123 1865 987 -2650 3450 -848 -938 1524 2590 -1924 -572 4603 -2036 -366 -8 391 -711
2528 -711 3318 609 -3418 2851 -1 -1146 -634 2864 -3224 -564 4308 -1190 -2232 -1013 1246
2543 1246 -2676 2162 -571 -2937 963 698 -1666 -2975 2447 -3400 -1193 1218 -707 -2226 -899
2558 -899 500 -4208 1604 -1028 -2592 -631 1433 -2089 -3289 2790 -2724 -1932 209 1493 -2622
2573 -2622 -263 896 -3213 1254 -180 -1000 -1604 3788 -874 -1893 2903 -1054 -1000 325 3441 -2405
2589 -2405 1527 2676 -846 620 1519 686 -2150 4558 719 -534 2011 1749 -133 -511 3274 -2041
2605 -2041 2464 1893 119 195 2447 142 -2324 4714 -151 -1013 1499 3425 -2048 -795 3533 -2671
2621 -2671 -57 1836 1816 -3198 1557 1429 -2270 1180 -191 -66 -1440 2762 -1285 -283 985 -2176
2637 -2176 126 776 695 -2951 2964 33 -2521 1182 1247 -2066 -1996 4555 -1702 -1015 1397 298 -2656
2654 -2656 637 2722 -3417 1098 1303 345 -561 1439 -1074 -1966 2964 -926 407 256 965 -2501
2670 -2501 1220 1615 -3544 461 873 425 -1801 2237 -1951 -2429 1901 -334 -1209 -888 1817 -3541
2686 -3541 886 474 -2741 -1488 603 272 -2732 2493 -2374 -2954 676 1085 -2730 -1758 2638 -3273
2702 -3273 -285 858 -607 -3635 54 1562 -2041 1275 -1691 -282 -439 1436 -1971 -730 1268
2717 1268 -2344 1906 1157 -242 -2892 2831 193 -2227 2859 1015 -1579 -1060 4704 -1908 -1437 2455
2733 2455 800 -562 1338 3734 -2817 724 1319 1088 544 719 184 14 4103 -846 812 89 333
2750 333 24 2899 2008 -3170 2653 1407 195 -466 2622 -1263 -650 4604 -498 -1452 -115 2527
2766 2527 -2292 950 2015 -1491 697 876 926 -2136 2171 -1403 -1712 1615 370 -939 -1263 1858
2782 1858 -3029 554 769 -789 -1562 339 824 -2233 1762 -2664 -1527 817 1278 -1874 -1108 1668
2798 1668 -2451 1303 515 -1086 -2473 2973 1350 -2710 2108 -290 -1154 -352 4024 -1776 -1099 3909
2814 3909 502 -161 38 2680 -1584 2244 1809 557 2016 1145 1126 128 3685 -503 2019 2468 677
2831 677 802 2746 2126 -2635 3324 1658 45 1197 2930 -438 -1487 4905 -729 -1161 400 2528
2847 2528 -1009 482 1726 -2812 601 34 498 -2282 1167 -998 -1288 1108 -1963 -1481 -1609 735
2863 735 -3407 -253 -368 -2954 -710 -997 -1450 -3547 1772 -2453 -2191 -19 -1092 -2704 -1981 1377
2879 1377 -4192 -356 109 -1401 -2287 256 -142 -3642 1578 -728 -1183 -1250 1175 -1483 -1557 1468 -1827
2896 -1827 493 -317 801 -1617 1456 325 -1670 1572 -651 219 274 2964 -1688 334 2698 -1145
2912 -1145 -60 1201 1750 -2596 2822 1142 -1503 339 1511 361 -1649 3304 -1398 156 1340
2927 1340 884 -1298 -137 1991 -1732 2117 -1 -74 -837 1630 -271 -1571 1943 -1420 531 198
2943 198 630 -2782 676 1143 -2727 459 -253 -95 -1762 2018 -1801 -2176 1723 -882 -1301 -730 2199
2960 2199 -2999 316 707 -1650 -1096 416 594 -3079 1592 -313 -456 -527 -378 -869 -590 2335 -2359
2977 -2359 286 -188 -62 -598 790 -681 -2264 3217 -404 -604 -756 1768 -1538 -78 2448 -2285
2993 -2285 -135 1379 2020 -2741 1104 870 -1080 1466 158 407 -1113 2839 -1547 -260 1138 102
3009 102 455 428 1379 -2222 2341 147 -1072 -90 1340 235 -1281 2308 -2134 170 754 266 -2242
3026 -2242 -125 2002 -1758 1483 -1090 -999 -1036 2063 -1083 -1882 1419 -994 159 -750 653 -3130
3042 -3130 521 1677 -1774 -321 -251 795 -2260 1240 -1349 -1037 1060 -27 -283 -1237 1803 -1884
3058 -1884 1206 -121 -1070 341 1247 398 -2505 2203 -1000 -406 268 778 -1420 -403 2970 -2403
3074 -2403 -506 358 1039 -1561 623 662 -2157 1540 -626 -363 -1614 1247 -1094 -69 878 -2205
3090 -2205 -79 -120 322 -3234 978 -295 -1553 643 -393 -1037 -2077 1900 -2312 -1161 698 23
3106 23 -956 -717 835 -2866 1206 2 -539 -584 1138 -66 -1136 2151 -1706 362 811 955 -1454
3123 -1454 764 2108 -1409 1581 444 584 -488 2776 282 -537 2615 450 848 266 2317 -963
3139 -963 1916 1908 -375 1341 886 1355 -881 3115 -6 654 1846 862 125 -151 2891 -1544 1563
3156 1563 1140 654 -354 1315 1177 -1705 1892 -74 121 -83 1154 -918 -451 1749 -1619 438
3172 438 -386 234 -1694 956 -54 -2147 649 -671 -666 -1695 1743 -2015 -914 688 -1488 -765 -710
3189 -710 1087 -2562 1032 -256 -1338 10 -320 -409 -1733 1773 -1617 25 274 102 -983 -160 1314
3206 1314 -1878 1480 304 472 -406 1658 -116 -919 2493 -385 709 680 2242 -802 1106 2273
3222 2273 -832 1910 1120 1538 -477 2499 130 188 1767 315 1164 691 2553 -1046 1683 1427 -228
3239 -228 930 1117 1024 -1094 2979 -405 -171 742 694 -618 -657 2225 -1899 540 -130 126 -1306 242
3257 242 -286 -1952 990 -1457 -647 -1079 261 -1823 -1040 592 -2482 -562 -400 198 -2787 373 -661
3274 -661 -2080 341 -497 -598 -1956 1122 -1863 -702 -11 -992 -248 -559 1084 -2184 1142 -388 -218
3291 -218 375 565 -129 -810 2258 -1543 545 370 698 -1102 458 2122 -1504 1205 227 659 -797
3308 -797 1762 601 -940 1521 1 1018 -214 1087 -1290 1059 1139 -1007 986 13 618 -884
3324 -884 2031 -1150 -1215 1357 375 -401 -844 1691 -2027 70 248 -406 -915 -93 983 -2043 1217
3341 1217 -1065 -348 -500 -25 -1068 -397 756 -2381 269 32 -17 -1204 753 -163 -1863 1629 -240
3358 -240 -391 -1839 1637 -342 -344 789 -1166 474 -443 1149 -1755 516 -533 -415 1039 -726 -518
3375 -518 -1069 2093 -1423 326 743 -478 -409 248 1479 -2336 792 366 -24 -875 638 404 -1489
3392 -1489 1063 -971 549 -668 390 -882 185 624 -1111 1304 -1030 -217 -462 2009 -1289 -1583
3408 -1583 1610 -661 -184 -610 1357 -1967 376 1247 -599 -724 -208 1179 -972 880 -961 -250
3424 -250 493 -137 136 -947 1086 -1554 1342 16 -521 -49 691 -42 -1773 1922 -671 -402 -194
3441 -194 1349 -1082 -939 1175 -1184 104 -473 1025 -824 149 -332 -830 1106 -983 -193 -751 1200
3458 1200 -1098 -345 709 -1401 -141 -40 863 -2198 824 -39 -934 -424 -494 -283 -1640 1101 -890
3475 -890 -476 -586 94 -407 -559 339 -1641 1252 -896 -736 -352 384 -1257 -1158 1741 -1496 -699 -256
3493 -256 1175 -1662 -484 672 -1225 24 -323 685 -1505 783 -225 -421 308 -391 629 -715
3509 -715 1022 -981 995 -217 -742 995 759 83 -1176 2404 -439 -304 460 1288 -106 -478 2124
3526 2124 -344 979 549 1079 -98 644 1098 -582 1378 -54 771 164 1382 -444 323 1747 -242
3543 -242 1222 92 343 -566 1811 132 -1217 853 486 777 -770 1493 -908 -269 531 117 -13
3560 -13 -749 858 -1058 1479 -618 -859 213 500 -186 -1373 1405 -1118 -22 -167 468 -807 -351
3577 -351 879 -1531 523 -382 405 -875 249 62 -423 986 -1177 665 -81 900 -497 688 90
3594 90 -806 1750 578 -190 -1315 2018 264 -272 919 212 86 166 2397 -989 548 502 673 411
3612 411 348 976 -834 1749 191 534 -182 568 493 180 1208 -1193 1167 328 -33 -355 1194 469
3630 469 -1360 1128 -124 500 -467 1155 -901 -163 1309 -335 -305 -949 613 -1090 1338 -207 -1147
3647 -1147 179 233 538 -1267 731 -946 383 492 -153 -711 -730 943 -1207 620 -982 -480 -344
3664 -344 405 -36 -974 857 -1012 537 -84 435 -929 64 833 -1457 843 -33 -134 -1194 1153
3681 1153 174 -557 949 -552 -215 -479 1667 -825 -48 240 21 697 -193 600 -1338 1433 -18
3698 -18 -65 195 -456 248 -36 1367 -1358 483 137 137 -220 295 -1 -1121 1605 -361 7 -324 612
3717 612 -516 -535 1468 -1160 312 -384 536 -778 252 294 -1096 582 -415 533 -881 789 -824
3734 -824 114 402 -577 359 -740 542 -947 1028 -356 -636 329 269 26 -573 1366 -1107 81 342
3752 342 -4 -658 -304 1085 -1364 1060 -463 -111 -491 575 -103 -1079 429 -958 327 -660 465
3769 465 -785 -159 16 -850 249 -584 75 -1031 720 -956 -679 333 -806 -325 -874 482 -1719
3786 -1719 67 162 -804 -220 -524 149 -1651 716 -924 -669 -189 38 -286 -719 642 -1173 173 -376
3804 -376 -190 -536 361 465 -1126 1023 -393 163 -357 606 -125 -47 634 -550 803 -214 796 -732
3822 -732 682 208 -227 796 -172 406 -773 1440 -696 16 273 -183 244 -428 1103 -1109 696
3839 696 156 246 -78 152 67 -858 1086 -701 160 -424 245 -131 -110 525 -1038 754 -464 375 -615
3858 -615 330 -593 -648 1203 -610 168 -995 766 -815 134 366 -973 63 -304 850 -1187 539
3875 539 -564 53 445 224 183 -633 811 -851 786 74 -219 -200 293 766 -612 1267 -544 374
3893 374 364 775 146 -213 1052 -684 896 63 914 -468 439 699 -384 781 -633 974 52 1244
3911 1244 -338 -10 786 -343 779 -226 449 -822 796 372 -80 688 -340 517 -417 1310 -922
3928 -922 -29 447 292 -110 -311 922 -1040 445 -264 53 -206 -276 233 -811 1154 -902 188 -619
3946 -619 270 -473 -35 520 -1062 266 -541 843 -591 219 -600 -246 1159 -510 -336 -941 1082 -921
3964 -921 -92 -129 -458 278 -369 598 -1062 655 -652 236 -23 51 -340 -760 1426 -1094 621 -238 431
3983 431 -146 -18 611 -574 1055 -780 147 -95 792 -155 -376 778 -688 766 -129 595 -486 557
4001 557 214 -425 811 -623 327 141 1244 -954 -333 797 311 329 -762 857 -799 727 102
4018 102 284 -31 -306 592 -504 774 -960 453 -119 -32 -67 -261 612 -866 602 -832 -186 -35
4036 -35 309 -462 -1064 1183 -566 -54 -844 1058 -686 -656 594 -494 391 -793 967 -558 200 -621
4054 -621 109 567 -620 190 -449 909 -532 521 -308 -242 632 -139 310 -792 1340 -425 63 391
4072 391 831 311 -569 1149 -230 755 -511 836 29 261 152 -513 1338 -571 278 -389 667 -486
4090 -486 -348 723 -634 551 -530 791 -459 408 -33 -275 317 -515 582 -975 441 -683 26
4107 26 -95 -334 495 -599 143 -1157 1374 -949 -638 140 272 -455 -1257 1372 -626 -126 -654 916
4125 916 -82 -815 569 -636 654 -841 564 -399 179 97 -318 363 -1068 916 -521 516 -833
4142 -833 668 220 -731 875 -359 -85 -875 1185 -122 -870 -10 499 737 -1040 771 -360 569
4159 569 -103 100 113 -430 279 -637 615 -776 323 -267 -98 -358 -375 452 -1072 533 -337 184 -610
4178 -610 195 39 -1026 531 -109 391 -1199 472 -209 100 -150 -797 472 -698 632 -564 711
4195 711 -376 -686 811 -27 152 -934 1294 -471 -56 -547 133 114 -616 703 -868 264 -570 560
4213 560 -312 -478 269 -177 434 -1010 597 -461 -212 -613 179 44 -1101 823 -440 -109 -971 696
4231 696 -171 -1089 13 -234 357 -1088 503 -706 -337 -229 -212 -253 -1364 418 -538 407 -1363 -73
4249 -73 47 -299 -50 -376 456 -1077 717 73 -128 -255 557 556 -978 638 -541 429 -469 731 233
4268 233 -119 959 -365 1202 -534 1143 287 918 284 -217 1181 104 777 -433 1103 -39 312
4285 312 953 208 701 91 1282 -509 462 -87 978 606 -259 630 -354 961 -496 799 281 -59
4303 -59 371 -62 486 -1035 827 -180 132 -216 442 316 -673 1048 -721 537 -860 443 31 -241
4321 -241 35 -374 650 -840 520 -456 273 -236 70 147 -616 416 -492 509 -796 428 503 -208
4339 -208 444 68 500 -910 687 110 402 -163 202 322 -657 507 -589 668 -409 264 -33 -43
4357 -43 473 -259 558 -629 425 -333 504 -248 -30 624 -651 653 -539 720 -898 318 12 -540
4375 -540 149 -601 563 -782 304 -214 383 -21 -293 123 -770 459 -840 385 -471 -282 -228 -344
4393 -344 158 -956 540 -573 489 -535 -114 -32 -679 551 -796 404 -820 47 -409 -136 3
4410 3 -475 645 -640 472 -750 527 -420 -73 31 -671 419 -456 403 -624 662 -150 24 -76
4428 -76 -394 855 -820 293 -416 161 -345 -343 75 -353 733 -600 489 -335 368 -218 -99 128 -333
4447 -333 563 -563 459 -376 275 -257 76 189 -752 504 -316 723 -457 277 -156 -223 142 -391 435
4466 435 -439 676 -128 482 -100 315 128 -360 580 -411 843 -80 162 -375 -40 572 -386 683 -475
4485 -475 940 -407 788 251 -106 565 -297 852 -139 664 -98 531 120 163 518 -180 812 -342 552
4504 552 -179 487 177 -34 416 -599 563 -279 852 -540 293 -45 -346 364 -484 318 -486 846
4522 846 -511 -55 -180 -413 138 -956 353 -363 419 -678 -74 -325 -462 193 -787 266 -899 74
4540 74 -341 12 -270 -639 427 -562 193 -780 246 -407 73 -68 -440 435 -422 537 -842 137 -262
4559 -262 160 40 -592 527 -383 746 -413 462 -366 247 383 -106 340 -496 728 -218 402 -246 97
4578 97 181 -28 721 -516 603 -374 532 283 -28 -17 8 373 -628 563 -358 69 111 43 401 -283 764
4599 764 -549 566 -344 381 -226 -316 197 -384 708 -649 233 -682 231 -136 -109 11 -808 274 -386
4618 -386 431 -558 -60 30 -171 304 -697 -20 -548 385 -611 207 -633 -281 325 -852 398 -890 198
4637 198 -422 -28 -140 -391 303 -632 548 -744 440 -373 123 -150 -140 238 -463 447 -573 272 -308
4656 -308 46 5 -192 250 -750 613 -714 411 -318 121 33 -333 281 -409 498 -434 197 -325 230
4675 230 270 -203 190 -355 785 -465 532 -237 77 62 -105 425 -428 807 -287 421 -338 237 227 -34
4695 -34 714 -296 832 -264 582 107 269 250 -158 689 -213 500 2 583 -238 126 435 -276 272 -450
4715 -450 759 -507 349 -16 333 194 -448 678 -237 468 -301 442 -137 -68 271 -166 235 -553 447
4734 447 -342 386 182 -35 -121 -457 581 -691 176 -633 233 -163 -54 311 -235 325 -756 385 -442
4753 -442 -115 -109 -279 349 -452 312 -281 578 -551 308 -164 93 315 -465 489 -605 586 -326 92 -153
4773 -153 -14 402 -196 521 -293 562 -367 280 174 -450 47 -133 907 -604 155 176 499 -103 -250 591
4793 591 -315 331 -301 381 -223 153 182 -13 174 -594 581 -430 216 -453 404 151 -285 595 -275 59
4813 59 -204 466 -740 -451 385 22 -124 -658 532 -523 133 -277 120 -79 -756 440 -580 -3 -727
4832 -727 144 -167 -275 -391 -357 228 -500 246 -570 185 -746 -49 -10 -666 606 -372 -111 -851 494 -262
4852 -262 -160 -13 -320 354 -596 625 -299 155 -319 201 714 -455 154 -264 821 -505 160 193 -67
4871 -67 73 -112 921 -328 730 -228 632 286 281 732 -121 682 -552 535 -108 329 316 203 298 -175
4891 -175 947 -177 148 -108 817 118 -81 639 234 206 -388 919 -440 334 324 186 109 -542 877
4910 877 -506 303 -628 555 21 -443 280 -358 161 -771 488 -377 -204 -225 195 -24 -780 452 -315
4929 -315 -175 -517 355 -138 -629 594 -382 110 -684 308 -130 72 -32 -210 505 -638 313 -323 425
4948 425 -536 355 424 -309 342 14 657 -802 518 40 -215 12 -98 459 -509 640 -268 209 -380
4967 -380 -40 129 -105 -4 -600 631 -558 -212 -115 204 -214 -610 618 -606 389 -486 457 -310 -196
4986 -196 174 -226 98 -347 589 -521 44 -255 -165 -37 -454 136 -412 -24 -855 423 -167 -323 141 -241
5006 -241 357 -776 770 -558 31 -213 219 -198 -590 534 -282 425 -378 410 -118 -188 382 -252 505
5025 505 -839 576 9 360 -434 206 425 -649 323 -91 633 -651 332 -35 -477 -190 -300 412 -460
5044 -460 611 -294 87 -70 -2 350 -640 302 -534 453 -768 -261 -120 -314 8 -561 535 -798 -66
5063 -66 -35 -25 -267 -311 320 -706 156 -446 454 -327 -167 -242 -287 383 -946 506 -370 270 -520 522 161
5084 161 -471 306 -105 163 -697 407 -248 -93 107 151 252 -252 571 -614 407 -63 287 313 185 525
5104 525 -203 586 -339 686 182 0 50 164 836 -494 317 -113 466 -234 477 210 -422 625 -180
5123 -180 382 -364 580 -411 -112 415 -123 290 -468 425 -513 -189 -297 -354 195 -551 40 -801 473 -884
5143 -884 -78 -228 -158 -137 -685 315 -659 91 -592 -267 -266 -174 -3 -390 463 -705 37 -183 -8 -572 -198
5164 -198 432 -529 471 -414 394 -261 711 -151 -105 656 11 477 -76 650 -127 400 507 386 339 -178
5184 -178 700 -29 786 -70 396 495 105 526 -123 782 -348 527 236 254 244 95 572 -174 756 -296
5204 -296 252 -46 281 -112 -159 682 -539 92 -553 265 -406 -36 -188 -407 108 -424 -195 -539 280 -566
5224 -566 -189 -399 -577 16 -417 60 -846 -82 -410 -149 42 -309 -148 -833 546 -609 -20 -322 -112
5243 -112 -243 -434 130 -533 420 -389 -120 -125 394 -97 -437 362 -535 266 -360 659 -182 113 533 -330
5263 -330 512 133 225 -324 443 -105 212 458 -208 453 -111 582 -340 673 124 141 258 210 406 -501 873
5284 873 -239 139 107 230 286 -123 436 -485 426 191 237 -37 31 456 -518 477 -286 115 -121 536 -176
5305 -176 -105 596 -453 493 -259 398 -248 241 -54 -253 364 -265 323 -400 446 -476 9 137 -173 44
5325 44 -275 158 -555 407 -445 -4 -400 -91 -111 -485 578 -336 90 -262 2 -165 -299 405 -619 392
5345 392 -503 355 -300 191 -174 -482 563 -508 47 -259 331 -499 248 185 -407 44 -272 9 -624 344
5365 344 -375 40 262 -338 178 -129 345 -764 173 -52 -195 45 -211 317 -646 491 -128 35 -205
5384 -205 334 -217 -415 345 -682 482 -286 -11 -133 52 206 -366 565 -303 231 -32 397 -32 -54 503
5404 503 -170 681 280 379 -469 843 394 -263 451 -85 398 20 789 -26 264 368 121 338 212 771
5424 771 -343 542 -156 193 168 260 167 -125 585 -360 351 64 -41 -77 280 133 -618 134 -190 -47 -368
5445 -368 268 -425 -322 344 -505 -133 -746 102 -532 -300 -66 -540 -52 -781 67 -680 283 -472 -17 -232
5465 -232 -192 -169 -459 566 -960 -31 33 -230 -22 176 71 -614 459 -284 -17 13 594 93 -38 619
5485 619 -466 433 -41 266 -195 275 231 -244 575 -117 386 -153 806 -205 295 242 -81 -20 -215 431
5505 431 -444 408 7 -5 231 -189 94 -363 237 -562 -80 208 -113 -224 -135 419 -654 444 -210 -119
5525 -119 -623 94 -228 -684 346 -385 -12 -264 48 -484 -82 213 -746 88 -813 75 -778 125 -521 -489
5545 -489 10 -470 -15 -437 258 -919 116 68 -392 -364 -207 55 -712 506 -150 273 -59 131 30 -399
5565 -399 498 -470 593 -151 240 42 176 316 -211 686 55 449 -92 472 157 180 787 -478 301 251
5585 251 654 -208 596 547 72 326 -271 410 -171 728 -405 317 384 166 90 -48 379 -609 739 -12
5605 -12 -241 78 225 -39 -531 602 -307 -18 -257 228 -315 10 439 -597 301 -480 -15 -344 159 -80
5625 -80 -278 276 -531 -81 -116 35 -449 -101 214 -684 231 -25 295 -517 340 -202 -194 106 -41 229 -528
5646 -528 701 -319 28 -473 -32 -34 -137 118 -281 767 -540 -106 -151 158 -155 -155 725 -680 330 -108
5666 -108 87 -340 245 210 -143 304 11 330 -8 591 -241 85 127 -191 402 10 239 -453 533 -88 -273
5687 -273 419 192 227 -378 813 -193 -36 255 86 -93 -3 690 -290 585 -24 2 166 74 244 -161 431
5708 431 -392 309 109 254 56 319 75 -506 381 65 126 -571 323 42 -283 671 -202 128 -475 243
5728 243 -136 221 61 -270 229 -136 68 -325 431 -561 -78 128 -236 -328 -451 340 -779 37 6 -234
5748 -234 -412 70 186 -581 486 -84 -250 -432 -130 -237 -455 116 -600 286 -207 46 -443 117 18 -511
5768 -511 493 -436 -238 -209 215 -259 219 310 -265 -40 -302 499 -609 325 -79 -232 65 -140 343 -554
5788 -554 249 -567 85 100 36 -16 160 89 -506 608 191 44 -109 361 -61 -527 534 -283 234 31 529
5809 529 -174 273 362 -362 467 -77 249 -131 808 -258 210 571 -296 -59 112 534 -382 397 272 -142
5829 -142 75 -3 316 -325 479 -104 156 69 37 -106 -129 235 -558 278 261 57 -88 107 128 -307 588 -155
5851 -155 119 28 331 -94 190 415 -447 201 -157 416 -538 139 -147 -231 196 -292 273 -308 546 -352 135
5872 135 123 -456 -59 273 399 -468 547 70 143 208 168 315 -551 688 -201 266 156 360 -60 55 547
5893 547 -446 591 74 185 -87 324 154 -178 563 -333 55 -63 284 -651 73 377 -414 430 -20 210
5913 210 -599 382 -196 -112 162 -136 141 -160 231 -699 188 -235 -328 -298 -335 115 -867 223 -558 -302 -135
5934 -135 -172 -445 -617 362 -707 -303 -282 -347 -429 -143 77 -699 82 -332 0 -357 80 -703 -178 -121 -489
5955 -489 -335 -396 122 -543 84 -65 -283 137 -6 105 -621 492 -406 -6 284 -111 -206 169 234 -688 515
5976 515 -192 -266 86 346 -49 -292 407 -417 291 189 285 219 88 530 -352 507 -23 352 -68 742 170
5997 170 -332 902 -92 147 -308 583 -402 120 242 -101 263 123 51 -440 372 -320 -307 306 -96 226
6017 226 -186 318 -644 234 -80 -76 -196 -201 96 -634 310 -150 22 -26 173 -238 -35 362 -619 -64 -100 132
6039 132 -416 514 99 -654 143 -302 164 -481 536 -402 -102 559 -477 244 -343 94 -601 313 -57
6058 -57 -402 189 320 -56 -418 542 -289 106 -39 33 182 191 241 -503 708 135 134 -187 251 140 -127 590
6080 590 -480 445 377 355 -56 0 270 -471 318 8 -191 -206 615 -169 -128 359 -105 -85 -276 410 -349 358
6102 358 293 80 -18 18 105 -580 635 32 19 129 -34 186 -101 270 -659 191 59 -236 -116 9 319
6123 319 -535 556 -275 128 85 390 -163 -56 432 -480 -162 -115 293 -223 11 -117 -508 540 -66 219
6143 219 -616 461 -511 68 128 -222 312 -37 392 -288 532 -20 -213 49 -14 -63 -388 361 -358 14 120
6164 120 -99 -79 150 421 -653 424 -145 -94 -278 87 -247 -430 428 -274 123 64 86 -588 -171 100 -476
6185 -476 138 184 316 -565 416 -157 -241 151 -245 -272 -242 338 -527 236 -21 -91 -257 -176 149 -263 668 -196
6207 -196 135 -119 -35 -80 65 602 -451 225 -78 25 -313 218 224 -348 558 -23 119 -188 271 71 184
6228 184 632 -670 340 -143 279 -465 198 47 -282 230 167 115 -423 578 -428 118 431 -2 51 61
6248 61 541 -519 395 206 27 244 40 78 -185 525 -288 -282 -140 240 -287 42 503 -356 306 -93 158
6269 158 -424 218 -136 -218 393 -283 -13 -155 476 -379 380 400 -349 96 109 300 -321 527 -153 -60 475
6290 475 196 93 -14 615 -456 49 195 125 161 152 107 -240 517 -226 341 207 39 -11 -32 607 -504 223
6312 223 118 164 -279 264 23 -439 238 -144 272 -299 465 -179 -216 170 143 132 -248 147 -370 132 -248
6333 -248 -292 351 -175 -203 -449 319 -689 184 -46 -315 -294 -394 64 -691 68 -241 75 -257 -59 -488 -777
6354 -777 303 -434 -253 -339 -136 -397 -176 139 -392 -52 -226 58 -346 405 -194 -172 352 -234 -128 -246
6374 -246 816 -414 59 167 -71 215 -330 235 -236 503 -53 187 142 134 -61 -290 335 -276 363 205
6394 205 154 -62 482 -86 -93 603 -82 101 -103 563 -237 -171 335 -11 297 -89 40 41 470 -74 -83 244 56
6417 56 97 -329 491 -378 106 465 -295 9 -23 530 -482 103 -91 -211 14 -189 80 -272 499 -357 -214
6438 -214 -60 288 -293 -141 119 -221 515 -209 -190 -57 466 -15 -239 674 -211 69 -249 571 -465 -144
6458 -144 266 -235 330 -177 87 -336 232 -226 -47 173 -152 -84 -92 435 -458 264 31 -165 121 -4 230
6479 230 -220 585 -198 -396 -150 283 -191 -418 355 -253 340 81 16 69 314 -48 -669 366 -229 -78
6499 -78 -346 217 -339 -191 313 -495 227 -293 -175 -628 87 -122 -565 166 44 -132 -455 668 -230 28
6519 28 54 21 -23 -79 345 -352 397 -177 -367 265 171 153 -41 471 38 -225 -68 297 -207 1 409 -367
6541 -367 109 -93 293 -605 200 256 -260 226 -92 247 -159 254 -101 112 124 -187 354 128 164 -488 436
6562 436 -67 -322 340 -48 47 -53 398 -347 54 157 -182 -227 249 2 -439 579 -199 117 -61 153
6582 153 -178 -183 371 -337 197 179 12 -90 635 241 -153 397 -274 -160 -388 546 -135 74 290 -54 78
6603 78 -166 388 -312 479 -61 -359 206 78 -182 -332 385 -404 -56 10 -133 -98 43 415 -504 152 -352
6624 -352 -2 -137 70 70 -611 267 -444 34 -52 -84 -183 98 135 -517 283 -107 -187 -485 359 109 -356 378
6646 378 -223 171 -244 388 -313 109 216 -464 -188 -54 -146 -250 357 10 -76 17 -169 -201 -92 321 -303
6667 -303 481 263 43 130 159 -31 -298 392 59 33 96 506 53 -57 470 -82 44 108 229 -288 370 123
6689 123 -181 198 -8 143 -57 394 -361 30 264 -236 -76 -169 607 -253 484 -10 -208 184 0 249
6709 249 -266 564 -174 50 -115 -157 -278 24 85 -500 104 243 -66 -124 214 -173 -282 374 -246 49 130
6730 130 250 -454 254 135 -374 307 141 -49 -339 346 -210 -187 284 -62 -38 -87 453 -503 -19 -81 -334
6751 -334 65 82 73 -501 407 -157 -69 195 21 -131 -237 617 -563 -154 -56 -106 -337 -66 73 -503 397 -438
6773 -438 7 -250 79 -563 -132 302 -123 -88 -68 97 -474 -10 86 -458 173 -143 -8 -54 507 -390 -118
6794 -118 -96 -129 -78 -92 414 -699 186 120 -206 -142 188 152 -188 276 -343 101 -132 11 224 85 272 -169
6816 -169 496 52 180 -210 295 -170 -71 129 -254 143 -74 289 -93 360 398 -231 222 115 144 -228 395
6837 395 -62 -13 106 -311 115 -38 341 -547 105 234 -216 14 41 286 -499 241 108 -223 -194 -36 -211
6858 -211 -184 170 -325 -97 -65 212 -284 212 138 -303 467 71 -147 -129 377 -322 -2 234 -154 -72 -83 124
6880 124 -351 178 110 -68 129 -113 42 -345 160 -460 -33 122 -41 -162 -125 36 -461 271 -1 67 24
6901 24 431 -307 -202 249 -391 213 -28 136 -94 77 296 -402 110 154 114 -102 455 -119 -118 261 50 -62
6923 -62 -295 152 -280 -9 492 -293 51 -97 156 -256 347 -75 -95 -16 -112 -205 -149 284 -290 200 45 -257
6945 -257 -354 -101 198 -429 161 -41 -177 -44 138 -162 -106 427 -434 32 -63 174 -120 256 157 -315 324
6966 324 70 68 -43 592 -214 -59 305 -159 231 33 360 -304 389 -54 -249 -124 20 111 -162 761 3
6987 3 10 211 147 -257 -35 169 -292 393 11 -13 -34 357 9 -244 621 -259 52 268 276 -187 -14 156 -721
7010 -721 201 112 264 -237 336 -49 -143 304 -84 -73 -65 164 -400 186 130 -88 -10 202 116 -391 416 -266 -310
7033 -310 -146 -41 -179 -393 305 -280 24 28 -16 -99 -44 -13 -317 325 -151 13 98 119 -528 -133 442 -220 112
7056 112 98 101 -238 10 168 -454 232 98 281 -272 333 -430 -129 38 47 -126 216 168 -598 219 37 -141
7078 -141 132 138 211 -305 556 -240 -133 19 195 -77 4 532 -252 295 -95 -261 -118 24 -253 -208 -17 -299
7100 -299 43 -254 74 -251 23 297 -365 102 160 55 -296 439 217 -344 291 -49 250 -147 233 -353
7120 -353 83 -71 40 -117 25 394 -299 435 -350 15 111 515 90 101 557 -326 173 -83 -63 -235 295
7141 295 239 -178 189 -188 -2 -54 674 17 -166 187 -212 -38 51 416 -268 313 64 -153 134 -32 -52
7162 -52 -242 428 -268 25 180 -22 -41 -340 264 -464 256 101 -104 -5 21 -348 -439 326 -1 -237 -103 -7
7184 -7 -370 144 207 -437 165 52 49 -195 262 -63 -159 208 -358 56 -155 276 -207 247 115 -135 -184 -100 -72
7207 -72 -338 216 -13 -230 -28 32 -57 -264 242 -358 193 -41 19 -392 -100 196 -233 633 -21 -221 -245 418
7229 418 -319 -60 206 -282 54 80 175 -297 103 281 -329 83 59 -240 -467 759 -192 102 101 -117 55
7250 55 -35 -143 -352 257 -43 -216 -167 -206 -195 -442 344 -121 348 16 20 -187 -169 -8 -321 272 -171 75 -235
7273 -235 101 -165 -349 334 -78 186 121 144 -172 81 368 -282 66 -117 81 -185 279 -152 -93 57 -167
7294 -167 96 112 459 -513 71 189 -195 32 -18 -1 -482 456 -58 -78 -86 139 -37 -285 305 -305 -79 -266
7316 -266 230 -469 -141 18 -403 408 -99 -77 -364 58 78 -8 194 -6 118 -56 31 -368 238 -225 -293 92
7338 92 20 72 -104 396 -162 2 157 -115 125 -159 366 -290 458 -132 -95 163 192 249 -5 339 -220 176
7360 176 -74 200 85 44 375 -202 320 -141 -8 -387 369 179 -172 564 -220 59 163 -83 -162 191 456
7381 456 -390 127 -79 265 -198 233 118 -126 135 99 172 -25 293 -403 31 199 -241 -249 65 197 -346
7402 -346 271 -324 -148 -84 60 41 -228 346 -341 293 35 -227 -430 169 172 -90 168 -321 -203 -300 18 125
7424 125 18 208 -59 46 9 82 -254 447 263 -41 79 41 61 -266 569 -263 82 -141 215 139 -83 175
7446 175 -484 243 -58 -203 136 403 -68 -279 330 -206 166 -104 -23 68 177 259 -333 234 -64 196 -326
7467 -326 367 -34 -235 310 -204 -131 -136 320 -279 172 371 -183 -39 -136 61 -346 389 -390 -283 275 -23
7488 -23 -178 -288 401 -316 132 122 12 -184 -186 -23 -276 244 -105 -202 24 160 -90 -161 452 -1 128 143
7510 143 43 -132 137 85 -210 262 -77 -197 -333 287 -171 150 150 -156 -172 -62 -3 -15 515 321 -143 155
7532 155 104 -116 -49 488 -119 199 -51 162 -40 -48 426 -326 341 182 6 204 389 160 -179 595 106
7553 106 73 180 267 -179 67 359 -258 244 53 114 -230 278 -191 -434 242 -104 16 -65 340 -201 146
7574 146 148 -132 -86 140 346 -365 448 -172 -306 -74 -76 -388 -36 364 -390 74 -2 8 -190 -53 162 -325
7596 -325 260 -139 -189 -217 -51 -247 -6 451 -327 -146 89 -8 -271 57 35 -330 49 -52 59 -113 275
7617 275 27 -216 50 -93 102 -210 77 -200 247 86 -32 133 19 195 -492 313 -110 -25 18 -43 95
7638 95 353 264 -412 184 -167 -107 -35 377 27 -25 163 24 152 143 258 -65 -208 173 -111 259 565 254
7660 254 -319 185 45 -302 -2 32 57 -148 60 -186 7 169 45 -259 -2 57 -442 -105 -71 -155 136 188
7682 188 19 -355 -56 -384 4 -109 -82 -461 -44 204 -233 340 -125 -48 -264 457 -110 -163 151 -178 -18
7703 -18 73 280 -390 283 13 -194 188 27 -161 -163 245 -237 257 -59 -203 -416 -74 219 -451 187 79
7724 79 135 89 111 56 -133 280 95 111 107 4 205 273 265 -407 235 173 56 -122 238 -91 -222 -58 -82 33
7748 33 58 442 -90 303 63 51 -179 44 171 -336 -110 138 -101 -135 169 -210 -13 242 -246 172 -50
7769 -50 2 62 -41 129 -161 180 -289 160 41 294 -119 -99 186 -321 117 -17 105 -23 304 -103 -147 271
7791 271 80 8 -52 137 -227 -28 -79 -33 68 -29 163 -368 224 54 -292 -60 -208 148 -276 156 37 81
7813 81 69 -45 181 158 62 -183 77 129 -84 -63 288 -127 -279 130 -182 34 121 85 33 -3 -87 -223 -12 24
7837 24 -90 -179 -23 -2 -330 138 99 -106 -66 274 -206 -42 -24 -496 38 -59 245 -312 207 -62 -127 -21 103
7860 103 -26 -282 257 -52 354 -97 -47 -82 62 -11 -122 111 -87 -142 -38 68 -114 -221 101 38 -276 -36
7882 -36 221 -413 194 126 -308 211 104 -1 -254 309 -137 -9 152 72 17 56 380 -206 395 -76 -93 -57
7904 -57 44 -116 -313 -2 -216 -128 -106 10 -261 -172 265 -247 130 -25 -251 -57 275 213 -329 161 19 77
7926 77 -187 203 -97 -36 92 34 143 77 152 -312 113 -80 -64 198 178 154 -128 200 43 166 239 -45 389
7949 389 211 427 -422 403 5 135 -144 -4 91 -80 566 -126 228 194 202 -261 82 257 -108 213 25
7970 25 -103 -21 62 -256 -171 462 78 100 -289 239 -136 35 -8 -250 17 6 9 -254 366 -279 -180 164 -102
7993 -102 -47 -275 -20 -223 68 -21 -30 -32 238 -26 -140 351 -415 -120 -124 124 -78 -31 92 -156 -79 141 124 -190
8017 -190 214 143 -327 0 -127 -110 -62 47 -37 -79 240 -26 187 195 128 -272 147 -97 -131 -28 -234 62 -328
8040 -328 193 -127 -6 61 -16 8 -74 72 -294 20 -159 -112 132 -80 -198 -38 202 -259 152 -182 217 -255
8062 -255 -44 122 -158 -184 -69 44 -140 171 159 -188 60 -160 165 46 -59 -309 -24 91 -93 164 -146
8083 -146 94 -366 151 0 -145 47 -23 -292 -262 279 -176 112 90 57 -114 78 -199 217 -26 -107 44 15
8105 15 251 -12 17 290 -214 155 -121 -118 -135 75 -12 -135 168 -93 -389 -100 288 -310 24 125 -65 286
8127 286 -14 345 -179 406 -197 -194 183 -95 -134 -414 326 -208 -169 -32 56 -140 75 139 -11 179 147 -165
8149 -165 50 270 -80 -11 262 -253 128 -189 51 -448 276 90 -230 187 61 202 23 5 -161 -241 228
8170 228 -90 47 -195 405 -338 328 263 -141 231 -20 209 -220 247 -27 45 -56 -151 -269 -99 356 164
8191A64
##END NTUPLES=NMR FID
##END=
