##TITLE=1H_TG-2292-E4
 CDCl3, 8 sc, 
 23.10.2020
##JCAMPDX= 6.0         $$ Bruker NMR JCAMP-DX V2.0
##DATA TYPE= NMR FID
##DATA CLASS= NTUPLES
##ORIGIN= UXNMR, Bruker Analytische Messtechnik GmbH
##OWNER= root
$$ XWIN-NMR		Version 3.5
$$ Fri Oct 23 11:56:38 2020 Russian Standard Time (UT+4h)  she@DPX200
##.OBSERVE FREQUENCY= 200.1315066352
##.OBSERVE NUCLEUS= ^1H
##.DELAY= (6, 6)
##.ACQUISITION MODE= SIMULTANEOUS
##.ACQUISITION SCHEME= undefined
##.AVERAGES= 8
##.DIGITISER RES= 18
##SPECTROMETER/DATA SYSTEM= spect
##.PULSE SEQUENCE= zg30
##.SOLVENT NAME= D2O
##.SHIFT REFERENCE= (INTERNAL, D2O, 0, 15.7039)
##AUDIT TRAIL= $$ (NUMBER, WHEN, WHO, WHERE, WHAT)
$$ ##TITLE= Audit trail, XWIN-NMR		Version 3.5
$$ ##JCAMPDX= 5.01
$$ ##ORIGIN= Bruker BioSpin GmbH
$$ ##OWNER= she
$$ F:/spectra/data/she/nmr/H-F/1/audita.txt
$$ ##AUDIT TRAIL=  $$ (NUMBER, WHEN, WHO, WHERE, WHAT)
(   1,<2020-10-23 11:55:11.10 +0400>,<she>,<DPX200>,
      <created by zg, POWCHK disabled, PULCHK disabled
       configuration hash MD5:
       00 E9 B6 7A A2 85 ED C7 34 08 36 98 17 FE 4E 26
       data hash MD5: 16K
       95 8D 5E 2C 2E 95 B8 CE D9 6B FE CA E0 A7 12 11>)
$$ ##END=
$$ 
$$ hash MD5
$$ 32 82 1F DD 2A 79 93 F1 36 95 8D 81 F9 95 CC 61
##$RELAX= 
##$RELAX= 
##$RELAX= 
##$RELAX= 
##$RELAX= 
##$RELAX= 
$$ Bruker specific parameters
$$ --------------------------
##$DU= <F:/spectra>
##$EXPNO= 1
##$NAME= <H-F>
##$PROCNO= 1
##$TYPE= <nmr>
##$USER= <she>
##$AMP= (0..31)
100 100 100 100 100 100 100 100 100 100 100 100 100 100 100 100 100 100 
100 100 100 100 100 100 100 100 100 100 100 100 100 100 
##$AQSEQ= 0
##$AQ_mod= 1
##$AUNM= <au_zg>
##$AUTOPOS= <>
##$BF1= 200.13
##$BF2= 200.13
##$BF3= 200.13
##$BF4= 200.13
##$BF5= 200.13
##$BF6= 200.13
##$BF7= 200.13
##$BF8= 200.13
##$BYTORDA= 1
##$CFDGTYP= 0
##$CFRGTYP= 5
##$CHEMSTR= <none>
##$CNST= (0..31)
1 1 145 1 1 1 1 1 1 1 1 1 1 1 1 1 1 1 1 1 1 1 1 1 1 1 1 1 1 1 1 1 
##$CPDPRG= <>
##$CPDPRG1= <>
##$CPDPRG2= <>
##$CPDPRG3= <>
##$CPDPRG4= <mlev>
##$CPDPRG5= <mlev>
##$CPDPRG6= <mlev>
##$CPDPRG7= <mlev>
##$CPDPRG8= <mlev>
##$CPDPRGB= <>
##$CPDPRGT= <>
##$D= (0..31)
0 1.2 0 0 0 0 0 0 0 0.06 0 0.03 0 0 0 0 0.0002 0 0 0 0 0 0 0 0 0 0 0 0 
0 0 0 
##$DATE= 1603439710
##$DBL= (0..7)
120 120 120 120 120 120 120 120 
##$DBP= (0..7)
150 150 150 150 150 150 150 150 
##$DBP07= 0
##$DBPNAM0= <>
##$DBPNAM1= <>
##$DBPNAM2= <>
##$DBPNAM3= <>
##$DBPNAM4= <>
##$DBPNAM5= <>
##$DBPNAM6= <>
##$DBPNAM7= <>
##$DBPOAL= (0..7)
0.5 0.5 0.5 0.5 0.5 0.5 0.5 0.5 
##$DBPOFFS= (0..7)
0 0 0 0 0 0 0 0 
##$DE= 6
##$DECBNUC= <off>
##$DECIM= 32
##$DECNUC= <off>
##$DECSTAT= 4
##$DIGMOD= 1
##$DIGTYP= 9
##$DL= (0..7)
0 120 120 120 120 120 120 120 
##$DP= (0..7)
150 150 150 150 150 150 150 150 
##$DP07= 0
##$DPNAME0= <>
##$DPNAME1= <>
##$DPNAME2= <>
##$DPNAME3= <>
##$DPNAME4= <>
##$DPNAME5= <>
##$DPNAME6= <>
##$DPNAME7= <>
##$DPOAL= (0..7)
0.5 0.5 0.5 0.5 0.5 0.5 0.5 0.5 
##$DPOFFS= (0..7)
0 0 0 0 0 0 0 0 
##$DQDMODE= 0
##$DR= 18
##$DS= 0
##$DSLIST= <SSSSSSSSSSSSSSS>
$$ [...]
##$SUBNAM2= <"">
##$SUBNAM3= <"">
##$SUBNAM4= <"">
##$SUBNAM5= <"">
##$SUBNAM6= <"">
##$SUBNAM7= <"">
##$SUBNAM8= <"">
##$SUBNAM9= <"">
##$SW= 16.880792210976
##$SWIBOX= (0..15)
0 0 2 0 0 0 0 0 0 0 0 0 0 0 0 0 
##$SW_h= 3378.37837837838
##$TD= 16384
##$TD0= 1
##$TE= 0
##$TE2= 300
##$TE3= 300
##$TEG= 300
##$TL= (0..7)
0 120 120 120 120 120 120 120 
##$TP= (0..7)
150 150 150 150 150 150 150 150 
##$TP07= 0
##$TPNAME0= <>
##$TPNAME1= <>
##$TPNAME2= <>
##$TPNAME3= <>
##$TPNAME4= <>
##$TPNAME5= <>
##$TPNAME6= <>
##$TPNAME7= <>
##$TPOAL= (0..7)
0.5 0.5 0.5 0.5 0.5 0.5 0.5 0.5 
##$TPOFFS= (0..7)
0 0 0 0 0 0 0 0 
##$TUNHIN= 0
##$TUNHOUT= 0
##$TUNXOUT= 0
##$USERA1= <user>
##$USERA2= <user>
##$USERA3= <user>
##$USERA4= <user>
##$USERA5= <user>
##$V9= 5
##$VALIST= <valist>
##$VCLIST= <CCCCCCCCCCCCCCC>
##$VD= 0
##$VDLIST= <DDDDDDDDDDDDDDD>
##$VPLIST= <PPPPPPPPPPPPPPP>
##$VTLIST= <TTTTTTTTTTTTTTT>
##$WBST= 1024
##$WBSW= 4
##$XGAIN= (0..3)
0 0 0 0 
##$XL= 0
##$YL= 0
##$YMAX_a= 458238
##$YMIN_a= -414581
##$ZGOPTNS= <>
##$ZL1= 120
##$ZL2= 120
##$ZL3= 120
##$ZL4= 120
##$ABSF1= 10
##$ABSF2= 0
##$ABSG= 5
##$ABSL= 3
##$ALPHA= 0
##$AQORDER= 0
##$ASSFAC= 0
##$ASSFACI= 0
##$ASSFACX= 0
##$ASSWID= 0
##$AUNMP= <proc_1d>
##$AZFE= 0.1
##$AZFW= 0.1
##$BCFW= 1
##$BC_mod= 2
##$BYTORDP= 1
##$COROFFS= 0
##$CY= 11.3945322036743
##$DATMOD= 1
##$DC= 2
##$DFILT= <>
##$DTYPP= 0
##$F1P= 16.9975609425685
##$F2P= -3.02152046262296
##$FCOR= 0.5
##$FTSIZE= 0
##$FT_mod= 4
##$GAMMA= 1
##$GB= 0.15
##$INTBC= 1
##$INTSCL= 1
##$ISEN= 128
##$LB= 0.24
##$LEV0= 0
##$LPBIN= 0
##$MAXI= 10000
##$MC2= 0
##$MEAN= 0
##$ME_mod= 0
##$MI= 1.114404
##$NCOEF= 0
##$NC_proc= 0
##$NLEV= 6
##$NOISF1= 3.799351
##$NOISF2= 2.8
##$NSP= 1
##$NTH_PI= 0
##$NZP= 0
##$OFFSET= 15.70392
##$PC= 1
##$PHC0= -10689.33
##$PHC1= 9.000885
##$PH_mod= 1
##$PKNL= yes
##$PPARMOD= 0
##$PSCAL= 0
##$PSIGN= 0
##$REVERSE= no
##$SF= 200.130013532006
##$SI= 16384
##$SIGF1= 3
##$SIGF2= 2
##$SINO= 400
##$SIOLD= 16384
##$SREGLST= <1H.CDCl3>
##$SSB= 0
##$STSI= 0
##$STSR= 0
##$SW_p= 3612.71676300578
##$SYMM= 0
##$S_DEV= 0
##$TDeff= 0
##$TDoff= 0
##$TI= <>
##$TILT= no
##$TM1= 0
##$TM2= 0
##$TOPLEV= 0
##$USERP1= <user>
##$USERP2= <user>
##$USERP3= <user>
##$USERP4= <user>
##$USERP5= <user>
##$WDW= 1
##$XDIM= 8192
##$YMAX_p= 0
##$YMIN_p= 0
$$ End of Bruker specific parameters
$$ ---------------------------------
##NTUPLES= NMR FID
##VAR_NAME=  TIME,          FID/REAL,        FID/IMAG
##SYMBOL=    X,             R,               I
##VAR_TYPE=  INDEPENDENT,   DEPENDENT,       DEPENDENT
##VAR_FORM=  AFFN,          ASDF,            ASDF
##VAR_DIM=   8192,          8192,            8192
##UNITS=     SECONDS,       ARBITRARY UNITS, ARBITRARY UNITS
##FACTOR=    0.000296,      1,               1
##FIRST=     0,             0,               0
##LAST=      2.424536,      0,               0
##MIN=       0,             -414581,         0
##MAX=       2.424536,      458238,          0
$$ Real data points
##PAGE= N=1
##DATA TABLE= (X++(R..R)), XYDATA
$$ [...]
$$ plain form
2641 949 -1711 -1182 3051 -1427 -165 2626 -1907 -840 931 1229 -2633 2362 888 -1930 916 1011
2657 1011 -127 -1662 2294 -1120 1450 1522 -1315 -421 1398 213 -2292 3512 -41 -1993 1519 3097
2673 3097 -1993 -2108 3565 -1772 27 1888 967 -2671 714 1872 -2764 1163 -109 -738 -637 2608
2689 2608 -1632 -1971 1432 -1511 -137 93 1002 -2979 817 713 -1742 -17 -607 -1014 -1261 3088 -1646
2706 -1646 -1719 -29 -653 -721 -219 762 -2904 1804 110 -1278 -146 204 -1978 -1023 4267 -2012 -1898
2723 -1898 1105 1611 -3155 41 2692 -2690 199 1195 1084 -1959 924 -724 -536 2189 -603 -98
2739 -98 5 1331 -1820 1989 1163 -2285 915 1528 972 -1289 2678 -1982 -1172 3112 1142 -2322 -545
2756 -545 4148 -2341 85 941 -535 -1511 1336 1893 -1521 891 -1717 596 588 -455 -2270 787 2014
$$ packed form
2641I49k660N29M233m478J262K791m533J067J771K98l862M995j474k818K846R5
2657A011j138j535L956l414K570P2k837Q94J819j185k505N804l553j952L512J578
2673C097n090j15N673n337J799J861r21l638L385J158m636L927j272o29J01L245
2689B608m240l39L403k943J374K30R09l981L796j04k455J725n90m07k47M349m734
2706a646p3J690o24o8N02R81l666M708j694j388J132L50k182R55N290o279J14
2723a898L003N06m766L196K651n382K889R96j11l043K883j648J88K725k792N05
2739i8J03J326l151L809q26l448L200O13n56k261L967m660Q10M284j970l464J777
2756e45M693o489K426Q56j476r76K847N57l414K412k608K313qj043j815L057J227
$$ plain form
2773 2014 -3560 632 992 -1451 -3414 2054 -48 -2942 707 -873 -1552 -1864 1344 -2960 -1542 525
2789 525 -2006 -543 -40 -1322 -4014 1688 -439 -2457 -589 39 -1613 -1765 2071 -2966 -1760 -48
2805 -48 515 -1083 -332 -51 -2272 1198 -1107 -430 -630 229 -839 1004 1897 -2594 1060 1666 867 -1394
2823 -1394 3272 1241 -1748 2665 1750 -77 5 4324 -259 918 3844 1209 402 1446 3388 -251
2839 -251 3339 1993 646 1728 2922 1603 -468 3584 471 1800 2043 1772 168 1147 2170 -515
2855 -515 2800 -56 619 1550 1807 -1440 -193 2857 -2203 -177 1467 800 -2955 1641 927 -3099
2871 -3099 605 382 -1147 -2028 2528 -1669 -1956 848 -907 -1786 -708 1287 -3047 -85 -276 -1101
2887 -1101 -1052 -436 -932 -1696 1751 -2254 -890 626 -244 -2378 49 1595 -3105 553 318 -132 -1715
$$ packed form
2773B014n574M192L60k443j963N468k102k894L649j580o79l12L208m304J418K067
2789E25k531J463N03j282k692N702k127k018J868O28j652j52L836n037J206J712
2805d8N63j598P51K81k221L470k305O77k00Q59j068J843Q93m491L654O06p99k261
2823a394M666k031k989M413r15j827Q2M319m583J177K926k635q07J044J942l639
2839b51L590j346j347J082J194j319k071M052l113J329K43k71j604R79J023k685
2855e15L315k856O75R31K57l247J247L050n060K026J644o67l755M596p14m026
2871c099L704k23j529q81M556m197k87K804j755q79J078J995m334K962j91q25
2887a101M9O16m96p64L447m005J364J516q70k134K427J546m700L658k35m50j583
$$ plain form
2904 -1715 1047 -648 -1736 1793 -959 134 284 855 -2407 537 1495 -2100 735 1090 245 -2310
2920 -2310 2285 -267 -1096 1467 123 -396 211 2454 -2060 633 988 -458 -421 1407 1183 -2113 2628
2937 2628 202 -236 -106 718 -274 508 2286 -2278 639 1260 394 -1783 1698 1460 -1801 1553 181
2954 181 98 -1572 1320 -479 -271 483 -1195 1364 -192 -734 -1861 2576 -865 -2362 1426 437 -1103
2971 -1103 -873 2274 -2822 -609 1475 -379 -1461 310 855 -2317 1901 -902 -1519 612 2169 -1408
2987 -1408 -1577 2246 -1691 83 907 654 -2000 1223 1783 -1800 561 -128 543 -1005 1688 -637
3003 -637 -148 999 -1179 614 -399 232 -1328 2262 -656 -2084 1816 817 -1756 -1591 3484 -2053
3019 -2053 -1215 1538 -2 -1993 70 1988 -2874 -220 48 -81 -663 357 -1354 -1156 2324 -1978
$$ packed form
2904a715K762j695j088L529k752J093J50N71l262K944R58l595K835L55q45k555
2920b310M595k552q29K563j344n19O07K243m514K693L55j446L7J828k24l296M741
2937B628k426m38J30Q24r92P82J778m564K917O21q66k177L481k38l261L354j372
2954A81q3j670K892j799K08P54j678K559j556n42j127M437l441j497L788r89j540
2971a103K30L147n096K213K084j854j082J771N45l172M218k803o17K131J557l577
2987a408j69L823l937J774Q24k53k654L223N60l583K361o89O71j548K693k325
3003f37M89J147k178J793j013O31j560L590k918j428L900r99k573J65N075n537
3019b053Q38K753j540j991K063J918m862K654K68j29n82J020j711J98L480m302
$$ plain form
3035 -1978 -1226 372 796 -2384 548 1594 -2795 -510 727 708 -2591 1069 224 -762 18 -969 406
3052 406 138 1128 -1768 1618 962 -1543 567 1097 235 -1554 3317 -200 -982 975 1063 -324 -188
3069 -188 1914 -1857 1876 996 -974 -630 2046 326 -1971 2354 -323 -472 -148 2033 -1380 -1125
3085 -1125 1386 -651 448 -525 -46 -1477 1663 -1083 -2218 834 32 -732 -1238 1518 -2235 -694
3101 -694 301 -1323 -1185 -454 173 -2508 709 -1540 -1205 -413 -444 -1544 -1207 1208 -2025 -49 -723 -1171
3119 -1171 -1146 678 -510 -2870 1945 -651 -1424 -1105 1768 -1787 -1259 2176 -1092 -645 -404 1355 -1377
3136 -1377 363 323 -528 1334 -42 -120 -498 2443 -1539 -168 2197 516 -580 680 2665 -1460
3152 -1460 1132 1198 970 917 1020 878 667 2708 -1096 1110 1770 1018 -585 1904 2460 -1328 1699 1240
$$ packed form
3035a978P52J598M24l180K932J046m389K285J237j9l299L660q45r86P80r87J375
3052D06k68R90k896L386o56k505K110N30q62j789M871l517p82J957Q8j387J36
3069a88K102l771L733q80j970L44K676j720k297M325k677j49L24K181l413K55
3085a125K511k037J099r73M79j431L140k746j135L052q02p64n06K756l753J541
3101f94R95j624J38P31O27k681L217k249L35P92l1j100L37K415l233J976o74m48
3119a171K5J824j188k360M815k596p73L19K873l555N28L435l268M47K41J759k732
3136a377J740m0q51J862j376p8l78K941l982J371K365j681j096J260J985m125
3152a460K592O6k28n3J03j42k11K041l804K206O60p52j603K489N56l788L027m59
$$ plain form
3170 1240 682 -386 2220 275 231 2027 -377 366 1004 1576 -1761 1749 1214 -1356 569 1001 323
3187 323 -1803 1895 -565 -723 329 -123 -360 -660 1105 -1840 690 -12 -624 -600 -45 -84 -1390 756
3205 756 -1268 -169 -378 162 -1340 -220 780 -2289 354 -1 -283 -1653 1054 171 -1695 510
3221 510 -564 89 -786 1151 -1381 725 439 -1626 164 414 467 -1674 2279 -16 -1072 508 809
3238 809 -92 -862 1776 -975 801 439 72 -70 612 553 -1040 2172 -335 259 417 1194 -627 -331
3256 -331 1909 -748 865 376 786 -842 1039 294 -637 1486 -291 376 83 1590 -1266 570 1318
3273 1318 -942 397 996 1130 -1878 1791 341 -962 -49 637 464 -1223 1472 -736 575 -202
3289 -202 54 -138 -70 26 -1766 1644 -927 -685 -241 832 -1553 -1387 1772 -1166 -750 -946 381 -1640
$$ packed form
3170A240n58j068K606j945m4J796k404P43O38N72l337L510n35k570J925M32o78
3187C23k126L698k460j58J052m52k37l00J765k945K530p02o12K4N55l9j306K146
3205G56k024J099k09N40j502J120J000l069K643l55k82j370K707q83j866K205
3221E10j074O53q75J937k532K106k86k065J790K50N3k141L953k295j056J580L01
3238H09r01p70K638k751J776l62l67j42O82n9j593L212k507N94J58P77j821K96
3256c31K240k657J613m89M10j628J881p45r31K123j777O67k93J507k856J836P48
3273A318k260J339N99J34l008L669j450j303R13O86j73j687K695k208J311p77
3289b02K56j92O8R6j792L410k571K42M44J073k385J66L159k938M16j96J327k021
$$ plain form
3307 -1640 -252 -62 -1507 251 -792 79 -1461 153 -1825 -524 508 -1448 -446 -636 811 -2063
3323 -2063 322 -308 -1133 -127 247 -61 -1549 1110 -1088 19 125 372 -617 177 1080 -1741 1079
3340 1079 204 500 -548 674 274 -369 1242 -922 435 30 739 -840 467 669 -1021 1470 116
3357 116 -637 -751 2269 -291 -623 995 47 -125 -356 2116 -1558 144 663 703 198 -485 387 -538
3375 -538 1553 -1071 390 683 58 -657 462 1497 -1931 604 708 214 -961 1076 739 -1589 533
3392 533 -188 698 -408 429 -421 670 584 -1468 710 -139 -361 -731 2021 -1073 -1796 1411 127 -1085
3410 -1085 -1174 1617 -1619 -538 689 -649 -1388 -334 833 -1724 189 -803 -351 -443 -234 -756 -1108
3427 -1108 646 -1778 167 -317 -372 -1338 358 11 -1770 822 -576 -544 -1051 908 -1318 -396 501
$$ packed form
3307a640J388J90j445J758j043Q71j540J614j978J301J032j956J002j90J447k874
3323b063K385o30q25J006L74l08j488K659k198J107J06K47r89P94R03k821K820
3340A079q75K96j048J222m00o43J611k164J357m05P09j579J307K02j690K491j354
3357A16p53j14L020k560l32J618r48j72k31K472l674J702N19M0n05o83Q72r25
3375e38K091k624J461K93o25p15J119J035l428K535J04m94j175K037l37k328K122
3392E33p21Q86j106Q37q50J091q6k052K178q49k22l70K752l094p23L207j284j212
3410a085q9K791l236J081J227j338p39J054J167k557J913r92M52r2K09n22l52
3427a108J754k424J945m84n5r66J696l47j781K592j398L2n07J959k226R22Q97
$$ plain form
3444 501 -1328 78 -61 499 -1682 1046 167 -877 563 225 -59 -798 1794 -612 111 438 252
3461 252 356 462 956 -1364 1884 519 -272 121 1207 511 -636 2099 46 376 182 1247 -4
3478 -4 280 1173 -382 1337 385 396 -30 1339 -200 -218 1506 -270 393 190 1069 -903 1040 574 -520
3497 -520 735 484 268 -481 1835 -809 -183 548 244 -43 65 1262 -1102 1158 39 -290 -70 981
3515 981 55 -814 1888 -823 -289 283 1149 -1092 -8 1433 -1347 -42 -5 568 -1095 966 -53
3532 -53 -953 538 -214 160 -680 941 -797 359 190 -605 458 -507 212 -124 1285 -1445 -450 1400
3550 1400 -52 -774 245 1738 -1618 790 1198 -133 -1099 1216 1410 -1611 565 365 636 -539
3566 -539 995 292 179 687 -700 797 263 632 -560 1436 114 -743 1162 79 -280 -1106 1658
$$ packed form
3444E01j829J406j39N60k181K728q79j044J440l38k84p39K592k406P23L27j86
3461B52J04J06M94k320L248j365p91L93J086o96j147K735k053L30j94J065j251
3478dK84Q93j555J719r52J1m26J369j539j8J724j776O63k03Q79j972J943m66j094
3497e20J255k51k16p49K316k644O26P31l04k87J08J197k364K260j119l29K20J051
3515I81r26q69K702k711N34N72Q66k241J084J441k780J305L7N73j663K061j019
3532e3r00J491p52L74q40J621j738J156j69p95J063r65P19l36J409k730R95J850
3550A400j452p22J019J493l356K408M08j331r66K315J94l021K176k00K71j175
3566e39J534p03j13N08j387J497n34L69j192J996j322q57J905j083l59q26K764
$$ plain form
3583 1658 -195 -322 -53 -135 271 -526 558 -1141 483 -328 390 216 -843 -348 -77 1300 -1956 227
3601 227 287 -544 -1158 930 605 -2610 614 729 -305 -2020 394 258 -1025 -341 -282 738 -1000 -322
3619 -322 -809 1153 -389 -1418 728 -260 -515 -944 1509 -1157 -1131 525 370 -643 -1445 675 -662
3636 -662 704 -318 -738 -333 170 500 -752 537 -956 179 311 248 -666 -488 734 -1060 1042
3653 1042 -599 -419 -593 1284 -376 -1157 943 -423 -153 -418 1030 -627 -200 146 -541 669 168
3670 168 -96 -1103 1224 -209 -624 559 117 -655 -697 1766 -1015 -471 -71 639 -50 -198 286 -765
3688 -765 912 6 376 -498 338 -63 161 987 -917 584 -116 278 -130 542 -478 -718 1283 -432
3706 -432 -600 -450 1309 -956 -451 1240 -225 -486 -473 884 -709 246 13 -115 329 -279 -14 -429
$$ packed form
3583A658j853j27K69q2M06p97J084j699J624q11P18j74j059M95K71J377l256K183
3601B27O0q31o14K088l25l215L224J15j034j715K414j36j283O84N9J020j738O78
3619c22m87J962j542j029K146r88k55m29K453k666K6J656j55j013q02K120j337
3636f62J366j022m20M05N03L30j252J289j493J135J32o3r14J78J222j794K102
3653A042j641J80j74J877j660p81K100j366K70k65J448j657M27L46o87J210n01
3670A68k64j007K327j433m15J183m42p72m2K463k781N44M00P10o89j48M84j051
3688g65J677r06L70q74Q36m01K24Q26j904J501p00L94m08O72j020k40K001j715
3706d32j68J50J759k265N05J691j465k61J3J357j593R55k33j28M44o08K65m15
$$ plain form
3724 -429 936 -1423 69 833 43 -997 -311 1006 -1092 198 -721 540 -427 -280 230 -99 -29 -1167
3742 -1167 879 -295 -616 -809 655 13 -949 709 -163 -279 -732 1133 -282 -248 594 -152 229 -295
3760 -295 1028 -1065 547 287 10 -14 314 680 -581 1066 -577 836 484 265 442 549 1176 -789
3778 -789 1163 445 345 -295 642 729 -319 956 -287 1003 -333 589 -8 772 485 -489 921 -27
3796 -27 387 -347 1053 -293 -26 953 50 404 -145 1007 -878 648 129 -146 443 76 178 -927
3814 -927 1196 -680 130 128 -65 -183 -49 1259 -794 828 45 306 -453 297 -36 -837 786 -417
3832 -417 482 -492 484 -488 -63 427 -407 510 -681 398 -376 549 -697 -121 480 -477 435 -574 662
3851 662 -963 278 89 -772 -246 -131 939 -848 395 -540 -154 -94 -69 52 -501 452 -1220 651
$$ packed form
3724d29J365k359J492P64p90j040O86J317k098J290r19J261r67J47N10l29P0j138
3742a167K046j174l21j93J464o42r62J658q72j16m53J865j415L4Q42p46L81n24
3760b95J323k093J612k60k77k4L28L66j261J647j643J413l52k19J77J07O27j965
3778g89J952p18j00o40R37Q7j048J275j243J290j336R22n97P80k87r74J410r48
3796b7M14p34J400j346K67R79r03L54n49J152j885J526n19k75N89l67J02j105
3814i27K123j876Q10kj93j18J34J308k053J622p83K61p59P50l33q01J623j203
3832d17Q99r74R76r72M25M90q34R17j191J079p74R25j246N76O01r57R12j009J236
3851F62j625J241j89q61N26J15J070j787J243r35L86O0K5J21n53R53j672J871
$$ plain form
3869 651 60 29 -646 309 275 -782 560 -188 96 -690 656 -11 -364 197 -512 370 -319 388 -517 775
3889 775 -352 -87 961 -441 -29 -256 1291 -903 116 279 -358 318 80 608 -1058 560 71
3906 71 -383 -11 63 -211 -548 1003 -637 -37 -393 233 -597 -41 328 -978 805 -422 -40 -519 508
3925 508 -767 -505 688 -544 -126 -539 470 -845 317 -77 -430 283 -610 230 -543 598 -979
3942 -979 -79 236 28 -205 -712 418 -170 641 -750 -239 246 288 139 -652 933 -709 86 286 776
3961 776 -540 -272 740 -518 484 -456 657 -477 435 170 223 435 -545 158 -397 950 -367 385
3979 385 -104 -153 691 -43 450 -854 941 -543 315 300 -382 -25 -216 1086 -887 434 -276 288 389
3998 389 -17 -270 -431 1438 -601 -147 72 269 -714 -335 1003 -647 -59 -428 779 -424 259 -85
$$ packed form
3869F51n91l1o75R55l4j057J342p48K84p86J346o67l53N61p09Q82o89P07r05J292
3889G75j127K65J048j402M12k27J547k194J019J63o37O76k38N28j666J618m89
3906G1m54L72P4k74l37J551j640O00l56O26q30N56L69j306J783j227L82m79J027
3925E08j275K62J193j232M18m13J009j315J162l94l53P13q93Q40p73J141j577
3942i79R00L15k08k33n07J130n88Q11j391N11M85M2j49p91J585j642P95K00M90
3961G76j316K68J012j258J002r40J113j134R12k65N3K12r80P03n55J347j317P52
3979C85m89m9Q44p34M93j304J795j484Q58j5o82L57j91J302j973J321p10N64J01
3998C89m06k53j61J869k039M54K19J97r83L79J338j650N88l69J207j203O83l44
$$ plain form
4016 -85 48 446 -937 71 -195 663 -1016 -52 341 -264 -220 -270 391 -960 647 -528 -384 -134 -241
4035 -241 -37 -384 254 -1214 560 -278 -553 -251 309 -126 -910 948 -841 -437 -200 917 -392 -872
4053 -872 1136 103 -279 -922 1232 -285 -242 59 304 867 -852 564 283 943 -814 304 1232 -297
4071 -297 -345 179 1439 -934 347 339 517 -96 -50 1037 5 809 -387 869 88 35 -105 255 301 -472
4091 -472 692 -422 326 3 645 -276 -438 985 -436 72 -397 661 -832 46 107 -842 202 14
4109 14 170 -894 378 -736 -254 224 -94 -504 -847 937 -904 -230 -357 -15 52 -561 272 -767 787
4128 787 -661 305 -60 -158 -484 45 953 -264 8 -237 924 -73 -419 176 323 727 -709 792 228
4147 228 503 -519 842 500 -543 788 385 66 -654 1483 127 -509 422 480 294 -707 1107 -81
$$ packed form
4016h5J33L98j383J008k66Q58j679R64L93o05M4n0O61j351J607j175J44K50j07
4035b41K04l47O38j468J774q38k75L02N60m35p84J858j789M04K37J117j309m80
4053h72K008j033l82o43K154j517M3L01K45N63j719J416k81O60j757J118R28j529
4071b97m8N24J260k373J281qJ78o13M6J087j032Q04j196J256p81n3j40L60M6p73
4091d72J164j114P48l23O42r21j62J423j421N08m69J058j493Q78O1r49J044j88
4109A4J56j064J272j114M82M78l18m10l43J784j841O74j27L42O7o13Q33j039J554
4128G87j448R66l65r8l26N29R08j217K72k45J161r97l46N95J47M04j436J501n64
4147B28K75j022J361l42j043J331m03l19p20K137j356o36R31N8j86j001J814j188
$$ plain form
4165 -81 -251 76 993 101 -867 841 88 331 -978 590 140 311 14 -414 330 -722 248 -199 292
4184 292 -628 26 378 -398 42 -593 486 -185 503 -749 149 786 -266 105 -441 420 -971 288
4202 288 120 -139 165 -423 61 -427 684 -779 368 308 -213 -576 36 898 -1056 -27 -73 360 -736
4221 -736 -158 279 -728 261 -349 541 -794 -112 -197 67 -394 -845 384 -493 -122 -758 409 -491 -349
4240 -349 208 -879 -227 -619 564 -941 -219 -398 1 -121 -961 184 -441 -2 -654 446 -407 -858
4258 -858 235 -190 -102 -1187 713 13 -238 -773 490 592 -954 490 349 265 -1257 822 240 -622
4276 -622 -82 356 656 -792 582 223 385 -598 103 492 -211 284 -166 780 -599 313 143 130 237
4295 237 -249 732 -90 494 -528 461 280 120 -38 -58 923 -711 370 112 158 -171 261 463 -807
$$ packed form
4165h1j70L27R17q92r68J708p53K43j309J568m50J71k97m28P44j052R70m47M91
4184B92r20O54L52p76M40o35J079o71O88j252Q98O37j052L71n46Q61j391J259
4202B88j68k59L04n88M84m88J111j463J147o0n21l63O12Q62j954J029m6M33j096
4221g36N78M37j007R89o10Q90j335O82q5K64m61m51J229q77L71o36J167r00J42
4240c49N57j087O52l92J183j505P22j79L99j22q40J145o25M39o52J100q53m51
4258h58J093m25Q8j085J900p00k51n35J263J02j546J444j41q4j522K079n82q62
4276f22N40M38L00j448J374l59J62r83P01L89p03M95m50R46j379R12j70j3J07
4295B37m86R81q22N84j022R89j81j60j58k0R81j634J081k58M6l29M32K02j270
$$ plain form
4314 -807 760 -234 134 -645 831 -174 -235 352 -370 516 -571 646 -341 301 -175 243 587 -166 170
4333 170 -391 772 -468 407 53 96 357 -313 420 22 480 -456 630 306 -252 -25 189 686 -947
4352 -947 526 202 276 -408 144 690 -509 715 -319 905 -468 252 514 105 -13 -23 960 -484
4370 -484 30 -184 709 -36 -26 376 -361 101 -565 765 -304 -65 -286 237 538 -658 683 -152 249
4389 249 -648 411 246 -85 -12 -276 457 -836 304 -102 -65 -259 -60 175 -902 446 -305 172 -611
4408 -611 20 -444 -390 293 -640 304 -538 154 -750 -280 -107 -292 -196 -541 339 -277 82 -636 -71 -334 -626
4429 -626 -49 -407 -138 -998 46 -42 -238 -476 -308 319 -806 102 -607 625 -427 -263 252 -85 193
4448 193 -552 874 -475 -76 -289 595 -132 -364 792 -309 386 -108 786 -251 339 297 211 499 -468
$$ packed form
4314h07J567r94L68p79J476j005o1N87p22Q86j087J217r87O42m76M18L44p53L36
4333A70n61J163j240Q75l54M3K61o70P33l98M58r36J086l24n58K27K14M97j633
4352i47J473l24P4o84N52N46j199J224j034J224j373P20K62m09j18j0R83j444
4370d84N14k14Q93p45J0M02p37M62o66J330j069K39k21N23L01j196J341q35M01
4389B49q97J059j65l31P3k64P33j293J140m06L7j94J99K35j077J348p51M77p83
4408f11O31m64N4O83r33R44q42O92r04M70J73j85R6l45Q80o16L59p18N65k63k92
4429f26N77l58K69q60J044q8j96k38J68O27j125R08p09J232j052J64N15l37K78
4448A93p45J426j349L99k13Q84p27k32J156j101O95m94Q94j037N90m2q6K88r67
$$ plain form
4467 -468 729 -287 686 289 617 -156 38 461 -65 575 -353 712 135 -30 -110 433 505 -467 617
4486 617 42 639 -521 308 248 -338 -61 -107 927 -283 204 -100 420 -171 -421 657 -470 239 -496
4505 -496 485 -122 -288 261 -25 355 -466 497 51 711 -594 211 598 -312 333 -178 541 -714 337
4524 337 -71 12 67 -150 486 -707 588 -405 455 -167 -157 218 -40 465 -270 502 -467 353 -245 14
4544 14 43 -222 371 -540 -61 -676 313 -437 -116 -306 -364 28 -690 364 -381 -410 -230 73 -84 -618 -4
4565 -4 -341 350 -605 16 -319 -54 -390 -289 205 -486 233 -315 84 -424 23 336 -381 193 -228 391 -244
4586 -244 326 -347 76 389 -310 252 -294 365 -652 553 31 166 29 29 487 -516 361 -21 439 -84
4606 -84 210 192 -299 726 -92 557 -318 708 92 265 215 -109 488 -265 369 -383 256 -303 12 -76 -506
$$ packed form
4467d68J197j016R73l97L28p73J94M23n26O40r28J065n77j65q0N43P2r72J084
4486F17n75N97j160Q29o0n86K77m6J034j210M87l04N20n91k50J078j127P09p35
4505d96R81o07j66N49k86L80q21R63m46O60j305Q05L87r10O45n11P19j255J051
4524C37m08Q3N5k17O36j193J295r93Q60o22J0L75k58N05p35P72r69Q20n98K59
4544A4K9k65N93r11M79o15R89p50L21j90n8L92p18J054p45k9J80L03j57n34O14
4565dl37O91r55O21l35K65l36J01M94o91P19n48L99n08M47L13p17N74m21O19o35
4586b44N70o73M23L13o99N62n46O59j017J205n22J35j37%M58j003Q77l82M60n23
4606h4K94j8m91J025q18O49q75J026o16J73n0l24N97p53O34p52O39n59L15q8m30
$$ plain form
4627 -506 127 -563 298 -495 -280 -288 -45 -294 -609 15 -399 357 -634 -179 -312 -76 -196 -614 13 -759 204
4648 204 -295 -101 -593 -47 4 -394 273 -386 75 -643 151 -315 -108 95 -621 109 -439 638 -753 55
4668 55 -53 -159 -199 -4 458 -379 599 -130 171 -121 -21 271 -105 593 -286 366 -463 412 -59 234 372
4689 372 246 534 -185 649 167 205 -120 395 295 -159 706 -116 547 -72 513 -239 136 594 -136 570
4709 570 144 549 -324 308 92 109 432 196 554 -254 574 -92 188 -9 260 501 -71 487 -228 145
4729 145 -370 458 101 214 439 -279 403 -125 455 -293 174 -75 219 40 -646 544 -450 246 -511 401
4749 401 -538 -435 275 -384 -84 -662 375 -499 100 -362 -69 69 -623 296 -505 210 -545 -207 30 -155
4769 -155 -127 -586 433 -982 -224 -39 505 -1015 -469 366 -464 -91 -483 354 -706 123 133 -294 -134
$$ packed form
4627e06O33o90Q61p93K15qK43k49l15O24m14P56r91M55j33K36j20m18O27p72R63
4648B04m99J94m92N46N1l98O67o59M61p18P94m66K07K03p16P30n48J077j391Q08
4668E5j08j06m0J95M62q37R78p29L01k92J00K92l76O98q79O52q29Q75m71K93J38
4689C72j26K88p19Q34m82L8l25N15j00m54Q65q22O63o19N85p52L75M58p30P06
4709E70m26M05q73O32k16J7L23k36L58q08Q28o66K80j97K69K41n72N58p15L73
4729A45n15Q28l57J13K25p18O82n28N80p48M67k49K94j79o86J190r94O96p57R12
4749D01r39J03P10o59L00n78J037q74N99m62K93J38o92R19q01P15p55L38K37j85
4769a55K8m59J019j415P58J85N44j520N46Q35q30L73l92Q37j060Q29J0m27J60
$$ plain form
4788 -134 -536 420 -457 298 -159 355 -314 77 622 -645 19 -300 512 -284 22 415 -153 134 -187 684
4808 684 -245 298 31 473 -24 347 214 -260 809 -225 376 38 261 -142 321 580 -234 234 38
4827 38 402 -263 428 237 -427 639 305 92 -391 680 163 -146 111 126 216 -706 551 130 172 -775
4847 -775 249 252 -662 3 204 752 -960 581 66 109 -229 268 303 -434 571 -169 34 -288 187 -90
4867 -90 -324 262 -325 118 -14 217 -534 178 -182 -25 55 -372 105 -362 609 -84 -252 171 -51 125 -569
4888 -569 397 -868 9 -75 97 -60 -165 325 -349 89 -84 243 -435 -198 189 16 96 -508 653 -193
4908 -193 -94 -112 712 -217 -265 465 -325 283 -210 480 -302 342 417 -282 -28 -97 539 -529 248 -308 -4
4929 -4 68 -393 -17 -482 384 -391 364 -194 -239 -243 4 39 -880 436 -161 40 -533 209 -150 -658 234 -114
$$ packed form
4788a34m02R56q77P55m57N14o69L91N45j267O64l19Q12p96L06L93n68K87l21Q71
4808F84r29N43k67M42m97L71j33m74J069j034O01l38K23m03M63K59q14M68j96
4827C8L64o65O91j91o64J066l34k13m83J071n17l09K57J5R0r22J257m21M2r47
4847g75J024Lr14O65K01N48j712J541n15M3l38M97L5p37J005p40K03l22M75k77
4867i0k34N86n87M43j32K31p51P12l60J57Q0m27M77m67R71o93j68M23k22J76o94
4888e69R66j265Q77q4J72j57j05M90o74M38j73L27o78K37L87j73Q0o04J161q46
4908a93R9j8Q24r29m8P30p90O08m93O90p82O44P5o99K54o9O36j068P77n56L04
4929dP2m61L76m65Q66p75P55n58m5mK47L5r19J316n97K01n73P42l59n08Q92l48
$$ plain form
4951 -114 194 -996 198 -23 36 -340 36 408 -914 271 -225 368 -422 337 -10 -332 479 -297 171
4970 171 -242 639 23 266 511 -45 106 -217 662 -306 346 -33 194 -68 -205 396 -177 306 -28 383
4990 383 -245 105 118 -270 -5 -426 349 -289 34 -449 119 86 -448 313 -406 387 -706 36 -285 2
5010 2 -54 -508 576 -261 49 -73 325 -519 -114 590 -207 -144 -193 1044 -355 274 -16 131 -232 10 754
5031 754 -656 264 501 388 -532 471 626 -126 389 -55 866 -32 218 316 613 185 -298 656 254 259
5051 259 -164 736 -121 39 270 379 423 -467 649 153 562 -382 347 540 44 390 59 645 -679 207
5071 207 165 -137 2 -303 -30 -939 447 -262 -313 -257 -15 -187 -692 402 -516 -87 -530 3 -340 -315 -378
5092 -378 -507 217 -757 -139 -434 9 -354 -408 -80 -312 154 -261 185 -680 269 -178 -81 347 -435 296 -544
$$ packed form
4951a14L08j190J194k21N9l76L76L72j322J185m96N93p90P59l47l22Q11p76M68
4970A71m13Q81o16K43K45n56J51l23Q79r68O52l79K27k62j37O01n73M83l34M11
4990C83o28L50J3l88K65m21P75o38L23m83N68l3n34P61p19P93j093P42l21K87
5010Bn6m54J084q37L10j22L98q44M05P04p97O3m9J237j399O29k90J47l63K42P44
5031G54j410R20K37j13r20J003J55p52N15m44R21q98K50R8K97m28m83R54m02N
5051B59m23R00q57J60K31J09M4q90J116m96M09r44P29J93m96L46l31N86j324Q86
5071B07m2l02J39l05K73r09J386p09n1N6K42j72n05J094r18M29m43N33l43K5o3
5092c78j29P24r74O18k95M43l63n4L28k32M66m15M46q65R49m47R7M28p82P31q40
$$ plain form
5113 -544 442 -438 478 93 -128 401 220 457 -334 890 54 366 450 707 216 -82 1479 130 429
5132 429 272 710 162 361 820 -94 612 187 806 -235 409 279 14 214 9 413 -276 516 -206 403
5152 403 74 -509 179 35 -9 -898 512 -392 -221 -108 -74 -131 -797 -13 -608 207 -781 -420 -338 -141 -496
5173 -496 -912 445 -771 -549 -460 400 -652 -687 -67 -416 200 -644 155 -635 61 -247 -446 42 -382 151
5193 151 -290 444 -469 122 147 52 54 -180 335 -257 686 14 28 -78 468 288 -251 283 51 589 -107 162
5215 162 211 123 330 -39 853 -145 60 -19 776 -77 -372 843 -188 -2 -85 718 -55 219 171 -142 633
5236 633 -159 140 70 717 -562 -219 241 -363 145 -127 675 -826 276 -166 -66 -201 -71 68 -282
5255 -282 587 -357 182 70 24 -158 -3 704 -335 212 -293 32 -526 104 -91 -498 456 -406 117 -542
$$ packed form
5113e44R86q80R16l85k21N29j81K37p91J224q36L12Q4K57m91k98J561j349K99
5132D29j57M38n48J99M59r14P06m25O19j041O44j30k65K00k05M04o89P92p22O09
5152D03l29n83O88j44m4q89J410r04J71J13L4n7o66P84n95Q15r88L61Q2J97l55
5173d96m16J357j216K22Q9Q60j052l5O20l49O16q44P99p90O96l08j99M88m24N33
5193A51m41P34r13N91K5r5Kk34N15n92R43o72J4j06N46j80n39N34k32N38o96K69
5215A62M9q8K07l69Q92r98K05p9P95q53k95J215j031J86q3Q03p73K74m8l13P75
5236F33p92K99p0O47j279L43M60o04N08k72Q02j501J102m42J00j35J30J39l50
5255b82Q69r44N39j12m6j82J55P07j039N47n05L25n58O30j95m07R54q62N23o59
$$ plain form
5275 -542 127 -439 396 19 -262 189 -111 236 -748 517 -441 27 -44 18 38 -453 651 -671 260 -157
5295 -157 180 50 44 -155 -405 430 -374 -11 32 239 -256 -50 448 -767 70 -346 120 -391 17 88 -268
5316 -268 75 -136 278 -378 343 -358 -95 -158 -419 204 -195 42 -540 479 -89 -445 -27 118 -34 -500
5336 -500 731 -247 -49 159 192 136 95 138 -275 863 -233 380 310 311 -43 38 590 -277 500 280 505 -155
5358 -155 575 308 -24 365 -83 544 -228 724 -102 117 152 -62 623 87 478 -257 399 80 -363 35
5378 35 11 17 -376 599 -243 -312 -180 -83 -434 -400 -46 -553 226 -460 -188 -413 -311 -611 -684 377 -681 -214
5400 -214 -434 73 -878 -310 -47 -331 -158 -343 79 -730 190 -162 -268 -70 -258 -136 -21 309 -725 34
5420 34 120 -255 -116 120 382 -508 116 -290 357 -136 -94 -15 -45 330 -442 263 120 268 -273 326 291 -169
$$ packed form
5275e42O69n66Q35l77k81M51l00L47r84J265r58M68p1O2K0m91J104j322R31m17
5295a57L37j30oj99k50Q35q04L63M3K07m95K06M98j215Q37m16M66n11M08P1l56
5316b68L43k11M14o56P21p01K63o3k61O23l99K37n82J019n68l56M18J45j52m66
5336e00J231r78J98K08L3n6m1M3m13J138j096O13p0Jl54Q1N52q67P77k20K25o60
5358a55P30k67l32L89m48O27p72R52q26K19L5k14O85n36L91p35O56l19m43L98
5378C5k4Ol93R75q42o9J32R7l51L4L54n07P79o86K72k25J02l00p3J061j058M67
5400b14k20N07r51N68K63k84J73j85M22q09R20l52j06J98j88J22J15L30j034P59
5420C4Q6l75J39K36K62q90O24m06O47m93M2P9l0L75p72P05j43J48n41N99l5m60
$$ plain form
5442 -169 431 -112 564 -64 232 -371 319 504 -199 413 301 477 -354 751 185 -3 363 57 14 -216
5462 -216 630 -817 287 422 148 162 361 891 -333 472 115 255 -116 283 111 -165 368 -172 637
5481 637 -196 58 29 213 132 -444 236 4 -342 -467 369 -108 32 188 -383 449 -351 -29 -431 592
5501 592 -251 -358 315 92 -352 -907 428 -603 -225 2 -52 -289 -577 -114 -701 117 -495 -300 4 152
5521 152 -98 -620 443 -279 -413 -161 579 -533 -274 222 -384 249 -521 332 -171 253 -354 -118 410
5540 410 -496 -85 -65 480 -514 341 214 -226 87 -187 287 41 736 -91 281 278 388 65 -80 676 -324
5561 -324 157 -65 289 165 111 455 -190 743 -231 304 337 369 -488 134 634 -341 167 26 545 -258 47
5582 47 -117 394 -188 -501 498 -173 -114 -891 654 -221 -749 54 2 4 -984 57 -451 -230 -372 -320 -31
$$ packed form
5442a69O00n43O76o28K96o03O90J85p03O12j12J76q31J105n66j88L66l06m3k30
5462b16Q46j447J104J35k74J4J99N30j224Q05l57J40l71L99j72k76N33n40Q09
5481F37q33K54k9J84q1n76O80k32l46j25Q36m77J40J56n71Q32q00L22m02J023
5501E92q43j07O73k23m44n55J335j031L78K27n4k37k88M63n87Q18o12J95L04J48
5521A52k50n22J063p22j34K52P40j112K59M96o06O33p70Q53n03M24o07K36N28
5540D10r06M11K0N45r94Q55j27m40L13k74M74k46O95q27L72lJ10l23j45P56j000
5561c24M81k22L54j24n4L44o45R33r74N35L3L2q57O22N00r75N08j41N19q03L05
5582D7j64N11n82l13R99o71N9p77J545q75n28Q03n2Kr88J041n08K21j42N2K89
$$ plain form
5603 -31 -200 -106 -915 356 -172 -653 -680 247 2 -825 72 -220 -120 -413 152 -59 -189 -212 -487 382 -1
5624 -1 -129 -454 411 -239 -447 432 98 -31 -293 521 84 94 56 237 664 -62 149 -135 672 -280 102
5645 102 604 357 -90 -160 568 -344 183 223 355 42 549 239 -458 716 164 113 -62 792 -212 -299 618
5666 618 -36 292 -93 585 -119 -115 -80 -63 383 -433 229 -291 530 -550 -73 150 -243 -317 -277 395 -529 183
5688 183 93 -95 300 -154 -54 -168 640 -468 -2 29 152 -88 177 237 -606 220 -200 30 -303 143 -297
5709 -297 -327 605 -418 22 339 633 -699 227 471 -431 -169 270 310 -494 301 40 354 -384 -123 114
5729 114 137 97 -465 503 88 -316 65 413 -112 -619 733 12 29 -213 -60 -87 -46 239 -370 432 -419
5750 -419 -257 -221 447 -332 -740 354 -413 -134 -213 213 -601 -207 196 -672 -104 68 321 -910 430 -276
$$ packed form
5603c1j69R4q09J271n28m81k7R27k45q27Q97k92J00k93N65k11j30k3k75Q69l83
5624aj28l25Q65o50k08Q79l34j29k62Q14m37J0l8J81M27p26K11k84Q07r52L82
5645A02N02k47m47p0P28r12N27M0J32l13N07l10o97J174n52n1j75Q54j004q7R17
5666F18o54L28l85O78p04ML5J7M46q16O62n20Q21j080M77K23l93p4M0O72r24P12
5688A83r0j88L95m54J00j14Q08j108M66L1J23k40K65O0q43Q26m20K30l33M46m40
5709b97l0R32j023M40L17K94j332R26K44r02K62M39M0q04P95k61L14p38K61K37
5729A14K3m0n62R68m15m04L81L48n25n07J352p21J7k42J53k7M1K85o09Q02q51
5750d19J62L6O68p79m08J094p67K79p9M26q14L94M03q68N68J72K53j231J340p06
$$ plain form
5770 -276 -674 -61 289 -44 -490 490 -300 -63 -173 -144 44 97 60 -380 700 -128 159 -69 475 -329 -63
5791 -63 733 -174 247 46 141 -135 679 106 -26 546 37 98 -49 717 59 23 357 -126 34 204 333
5812 333 -423 286 45 86 115 186 22 -576 628 -381 -61 140 8 -116 -159 84 -575 77 -486 -135 -159
5833 -159 -36 -207 -192 347 -269 158 -144 112 -536 351 38 -518 300 -195 263 -236 638 -302 -329 704
5853 704 136 28 341 787 -326 580 424 102 269 296 362 28 542 29 540 339 543 21 285 658
5873 658 -238 760 545 331 -86 783 392 70 609 -249 164 192 547 -192 216 393 -199 208 214 261 -276
5894 -276 588 -31 -389 -24 -290 83 -147 251 -598 -21 -109 -616 -369 -381 14 -1043 178 -370 -503 -468
5914 -468 -179 -435 -653 29 -889 -122 -421 -273 -450 -205 -462 -687 184 -600 -337 -408 211 -865 -437 158
$$ packed form
5770b76l98O13L50l33m46R80p90K37j10K9J88N3l7m40J080q28K87k28N44q04K66
5791f3P96r07M21k01R5k76Q14n73j32N72n09O1j47P66o58l6L34m83J60J70J29
5812C33p56P09k41M1K9P1j64n98J204j009L20K01j32j24m3K43o59O52n63L51k4
5833a59J23j71J5N39o16M27l02K56o48Q87l13n56Q18m95M58m99Q74r40k7J033
5853G04n68j08L13M46j113R06j56l22J67K7O6l34N14n13N11k01K04n22K64L73
5873F58q96R98k15k14m17Q69l91l22N39q58M13K8L55p39M08J77n92M07OM7n37
5894b76Q64o19l58L65k66L73k30L98q49N77q8n07K47j2L95j057J221n48j33L5
5914d68K89k56k18O82r18P67k99J48j77K45k57k25Q71p84K63p1O19j076M28N95
$$ plain form
5934 158 -460 -420 -223 131 -542 80 -275 -537 97 -186 55 -356 293 -559 361 296 -351 -65 -56 394 -693
5955 -693 432 169 -284 -268 261 164 -508 527 -266 459 -62 -12 66 135 401 -72 599 102 167 -146 516
5976 516 207 -18 472 -74 550 74 486 -408 315 265 187 495 -271 193 -243 691 -425 189 401 218
5996 218 -81 86 405 -503 267 93 1 -265 251 184 -372 520 -483 59 -75 -25 -168 190 269 -518 390
6017 390 29 20 -280 435 -269 -192 455 26 190 -334 103 -379 -38 -79 -283 136 -27 14 -690 515 -290
6038 -290 -421 154 154 -176 -542 381 -323 415 -283 -74 -160 311 13 -649 308 -362 54 163 213 -344 -242
6059 -242 370 -299 21 9 74 -593 100 90 147 221 -297 203 23 395 -289 392 146 -235 284 229 244 -226
6081 -226 616 6 122 201 350 68 68 589 -180 584 176 -17 143 104 32 -332 705 -239 49 -137 309
$$ packed form
5934A58o18M0J97L54o73O22l55k62O34k83K41m11O49q52R20o5o47K86RM50j087
5955f93J125k63m53J6N29r7o72J035p93P25n21N0P8O9K66m73O71m97O5l13O62
5976E16l09k25M90n46O24m76M12q94P23n0p8L08p66M64m36R34j116O14K12j83
5996B18k99J67L19r08P70j74r2k66N16o7n56Q92j003N42j34N0j43L58P9p87R08
6017C90l61rl00P15p04P7O47m29J64n24M37m82L41m1k04M19j63M1p04J205q05
6038b90j31N75%l30l66R23p04P38o98K09q6M71k98o62R57o70M16J09N0n57J02
6059b42O12o69L20j2O5o67O93j0N7P4n18N00j80L72o84O81k46l81N19n5J5m70
6081b26Q42o10J16P9J49k82%N21p69P64m08j93J60l9p2l64J037r44K88j86M46
$$ plain form
6102 309 -159 -7 496 -168 417 -158 256 -418 229 -231 -292 122 -42 125 -229 413 -521 276 46 -449
6122 -449 -43 99 225 -541 516 -206 -488 -176 115 -322 -538 419 -493 -73 32 5 -205 329 162 -357
6142 -357 360 -352 -102 -385 297 -312 -194 498 -116 -331 -257 249 -500 111 137 -385 275 -164 287 -353 579
6163 579 -279 -17 137 145 42 -18 201 -548 323 67 -25 62 -82 120 -187 423 -384 -8 410 228 -216 -12
6185 -12 289 -583 243 -370 -49 -233 229 150 -334 307 -161 10 -105 511 -681 374 469 -324 128 367
6205 367 171 -598 646 195 63 478 -90 111 -154 489 -472 346 95 -226 9 265 133 -665 670
6224 670 -113 129 22 172 -96 -110 526 -511 120 130 333 -166 305 -137 -199 361 222 -46 -342 462 -261
6245 -261 206 359 -540 -23 169 -195 -485 400 126 -559 0 188 -164 -635 519 -501 68 -176 -74
$$ packed form
6102C09m68J52N03o64N85n75M14o74O47m60o1M14j64J67l54O42r34P97k30m95
6122d49M06J42J26p66J057p22k82L12K91m37k16R57r12M20J05k7k10N34j67n19
6142c57P17p12K50k83O82o09J18O92o14k15P4N06p49O11K6n22O60m39M51o40R32
6163E79q58K62J54Qj03o0K19p49Q71k56r2Q7j44K02l07O10q07L76M18j82m44K04
6185a2L01q72Q26o13L21j84M62p9m84O41m68J71j15O16j192J055R5p93M52K39
6205C67j96p69J244m51j32M15n68K01k65O43r61Q18k51l21K35K56j32p98J335
6224F70p83K42j07J50k68j4O36j037O31J0K03m99M71m42o2N60j39k68k96Q04p23
6245b61M67J53q99N17J92l64k90Q85k74o85N59J88l52m71J154j020N69k44J02
$$ plain form
6264 -74 -37 36 191 -760 264 -259 -198 -27 -23 -403 -509 68 -513 118 169 160 -529 -151 -312 -722 225 20 187
6287 187 -426 43 -421 185 -26 -665 -4 143 396 -579 226 76 -592 -253 397 273 -547 599 -259 106
6307 106 77 55 55 -12 172 -352 587 3 78 -186 433 -110 -390 544 -305 -189 171 443 -514 -16 484 -380
6329 -380 221 -20 290 -410 61 -291 143 225 -391 35 -118 526 -970 437 127 -173 -267 488 228 -706
6349 -706 335 -23 -99 -213 339 76 -327 362 -583 193 -234 -174 27 306 -184 -470 745 -115 42 74
6369 74 277 -330 142 472 -293 -19 1 131 -474 303 196 -87 131 125 342 -34 172 83 305 266 -413 -3
6391 -3 386 110 -172 875 -30 -84 -2 669 226 -61 570 -211 189 -124 119 -36 309 258 -426 240 -262
6412 -262 32 -30 607 -106 -60 482 -597 289 297 152 -481 606 112 -743 -119 231 -14 -637 351 81 -89
$$ packed form
6264g4L7P3J55r51J024n23O1J71Ml80j06N77n81O31N1ro89L78j61m10R47k05J67
6287A87o13M69m64O06k11o39O61J47K53r75Q05j50o68L39O50j24q20J146q58L65
6307A06k9k2%o7J84n24R39n84P5k64O19n43k80R34q49J16L60K72r57M98N00q64
6329c80O01k41L10p00M71l52M34Q2o16M26j53O44j496J407l10l00r4P55k60r34
6349g06J041l58p6j14N52k63m03O89r45P76m27O0K01K79m90k86J215q60J57L2
6369G4K03o07M72L30p65K74K0J30o05P77j07k83K18oK17l76K06q9K22l9o79M10
6391cL89k76k82J047r05n4Q2O71m43k87O31p81M00l13K43j55L45n1o84O66n02
6412b62K94o2O37p13M6N42j079Q86Qj45o33J087m94q55O24L50k45o23R88k70j70
$$ plain form
6433 -89 22 -309 -106 -289 55 -501 257 -46 -389 -50 2 -498 -392 527 -375 -326 -43 -53 -463 90 40 -513
6455 -513 264 -5 -173 -345 350 -327 -377 425 -303 285 34 200 -419 229 47 -258 -6 -39 -73 -334 565
6476 565 -36 -81 -212 -61 28 5 357 -99 585 -47 -171 -34 275 141 -169 551 -76 234 80 294 -294
6497 -294 -186 493 -218 303 -168 212 -205 270 -49 -356 378 -254 44 114 204 -440 141 120 -287 -6 477
6518 477 287 -545 472 157 67 -120 13 395 -159 373 -411 141 17 -245 -18 440 -46 -654 549 -36
6538 -36 -236 -278 420 -289 54 685 -506 97 4 28 -365 152 72 -136 219 -226 185 -505 220 -510 140
6559 140 175 -281 317 87 18 -647 410 -13 -340 97 150 216 -519 342 -313 -120 51 -41 122 -8 151
6580 151 -643 637 74 -398 -251 370 -176 -275 408 -134 110 37 335 -172 302 136 -224 226 -19 81
$$ packed form
6433h9J11l31K03j83L44n56P58l03l43L39N2n00J06R19r02M9K83j0m10N53n0n53
6455e13P77k69j68j72O95o77n0Q02p28N88k51J66o19O48j82l05K52l3l4k61Q99
6476E65o01m5j31J51Q9k3L52m56O84o32j24J37L09j34l10P20o27L10j54K14n88
6497b94J08O79p11N21m71L80m17M75l19l07P34o32K98P0R0o44N81k1m07K81M83
6518D77j90q32J017l15r0j87J33L82n54N32p84N52j24k62K27M58m86o08J203n85
6538c6k00m2O98p09L43O31j191O03r3K4l93N17q0k08L55m45M11o90P25p30O50
6559A40L5m56N98k30o9o65J057m23l27M37N3O6p35Q61o55J93J71r2J63j30J59
6580A51p94J280n63m72J47O21n46r9O83n42K44p3K98n07M74j66l60M50k45J00
$$ plain form
6600 81 -40 571 -51 -66 635 89 21 -186 538 -303 123 112 43 -102 179 -255 -245 675 -297 252 73 172
6622 172 -131 14 317 -571 256 28 -151 -192 245 141 -72 346 -538 4 134 443 -342 270 14 -435
6642 -435 248 69 -7 -70 641 -159 -204 144 -189 -137 -121 207 -457 119 -71 -183 -335 199 14 -419 432 -345
6664 -345 -115 141 -343 -348 -70 198 -531 288 76 151 -377 97 -82 -319 299 -30 -81 -94 97 -644 -65 48
6686 48 -339 -60 137 -40 -733 303 -203 -476 156 -121 -39 -341 461 -463 101 110 -426 -227 301 204 -555
6707 -555 218 -158 -475 -104 330 -190 -360 456 -11 -121 -294 -74 -36 206 84 -399 711 75 -27 -313
6727 -313 406 -95 -118 612 288 -36 157 397 -43 433 92 -198 107 136 83 -248 629 -342 -66 429 24
6748 24 -291 206 473 -422 296 76 -5 79 212 -64 -265 650 -374 62 296 -36 -293 333 501 -473 251
$$ packed form
6600H1j21O11o22j5P01n46o8k07P24q41M26j1o9j45K81m34J0R20r72N49j79R9
6622A72l03J45L03q88Q27k28j79m1M37j04k13M18q84N42J30L09p85O12k56m49
6642d35O83j79p6o3P11q00m5L48l33N2J6L28o64N76j90j12j52N34j85m33Q51p77
6664c45K30K56m84nK78K68p29Q19k12P5n28M74j79k37O18l29n1j3J91p41N79J13
6686D8l87K79J97j77o93J036n06k73O32k77Q2l02Q02r24N64Rn36J99N28r7p59
6707e55P73l76l17L71M34n20j70Q16m67j10j73K20L8K42j22m83J110o36j02k86
6727c13P19n01k3P30l24l24J93K40m40M76l41k90L05K9n3l31Q77r71K76M95m05
6748B4l15M97K67q95P18k20q1Q4J33k76k01R15j024M36K34l32k57O26J68r74P24
$$ plain form
6769 251 51 -76 -227 479 -310 1 321 -111 -76 131 508 -438 263 39 20 -29 -74 -346 -293 426 -268 242
6791 242 314 -165 -254 31 426 -822 32 293 102 -630 157 82 -386 449 -118 -3 -96 -44 -459 -44 61
6812 61 -417 -72 47 -9 -478 456 -48 -511 280 102 45 -264 325 -318 -29 257 -343 -60 118 146 -471
6833 -471 553 -222 -228 -14 171 -118 -163 415 -184 327 185 -7 -215 365 267 -254 692 206 193 -109 257
6854 257 -92 -302 403 -133 -53 43 307 -381 181 100 -217 299 37 -248 -271 435 -320 -65 395 -145 -209 66
6876 66 278 -516 348 -148 -626 -77 -86 -122 -103 290 -510 -26 32 180 -370 348 451 -433 392 -66 -205 -164
6898 -164 210 40 -245 347 -316 -83 65 -57 -403 171 83 -259 306 -142 88 -374 531 -422 -91 133
6918 133 86 -226 112 403 -514 290 -182 -6 -132 -105 -39 -416 308 -545 -227 245 97 -283 42 574 -652
$$ packed form
6769B51k00j27j51P06p89L11L20m32L5K07L77r46P01k24j9m9m5k72N3P19o94N10
6791B42P2m79q9K85L95j248Q54K61j91p32P87p5m68Q35n67J15r3N2m15M15J05
6812F1m78L45J19n6m69R34n04m63P91j78n7l09N89o43K89K86o00K83J78K8o17
6833d71J024p75oK14J85k89m5N78n99N11j42j92k08N80r8n21R46m86j3l02L66
6854B57l49k10P05n36Q0R6K64o88N62q1l17N16k62k85k3P06p55K55M60n40o4K75
6876F6K12p94Q64m96m78N49rl6J9L93q00M84N8J48n50P18J03q84Q25m58j39M1
6898a64L74j70k85N92o63K33J48j22l46N74q8l42N65m48K30m62R05r53L31K24
6918A33m7l12L38K91r17Q04m72J76j26K7O6l77P24q53L18M72j48l80L25N32j226
$$ plain form
6939 -652 42 -43 9 -381 135 -58 -151 362 -204 -55 -332 226 -379 42 56 -111 141 -3 15 -359 239 -210
6961 -210 -99 197 -270 -189 -279 185 -581 115 140 -215 29 119 105 -512 236 -30 126 169 266 -40 -143 239
6983 239 -250 92 440 242 23 403 362 -449 260 166 155 180 274 -122 131 469 -283 91 60 150 -306 596
7005 596 -192 -119 232 209 -24 -382 260 -343 101 36 96 86 215 137 -471 223 -153 7 -116 135 -78 -133
7027 -133 192 -604 117 57 20 -344 220 50 -248 3 -141 62 -315 70 -514 -264 319 -504 32 -93 221
7048 221 -455 309 33 -301 229 -26 -130 -344 419 -348 -249 -82 -36 -233 -105 342 -483 570 -171 -153 -147
7069 -147 166 -232 -208 600 -162 -37 5 378 -263 149 149 -297 340 288 -27 -296 364 -270 -113 352 33 -41
7091 -41 -18 395 -306 197 102 -340 57 192 230 -182 316 -358 81 103 -9 -177 66 558 -409 230 -220 114
$$ packed form
6939f52O94q5N2l90N16j93r3N13n66J49k77N58o05M21J4j67K52j44J8l74N98m49
6961b10J11K96m67Q1r0M64p66O96K5l55K44R0j4o17P48k66J56M3R7l06j03L82
6983B39m89L42L48j98k19L80m1q11P09r4j1K5R4l96K53L38p52L74l1R0m56R02
7005E96p88P3L51k3k33l58O42o03M44o5O0j0J29p8o08O94l76J60j23K51k13n5
7027a33L25p96P21o0l7l64N64j70k98K51j44K03l77L85n84K50N83q23N36j25L14
7048B21o76P64k76l34N30k55j04k14P63p67R9J67M6j97J28M47q25J053p41J8O
7069a47L13l98K4Q08p62J25M2L73o41M12%m46O37n2l15k69O60o34J57M65l19p4
7091d1K3M13p01N03r5m42L97J35L8m12M98o74M39K2j12j68K43M92r67O39m50L34
$$ plain form
7113 114 -65 233 131 -228 436 -50 -52 57 297 -423 200 206 -368 -191 130 -298 -361 362 4 113 352 5
7135 5 -252 -144 486 -204 322 0 -157 33 -16 177 -410 472 -101 -282 129 334 -170 301 257 -418 210
7156 210 230 -11 -336 174 167 -342 539 -91 -48 -26 413 -234 -113 326 -419 29 258 -178 -247 641 -56 -520
7178 -520 -96 138 29 -398 439 -376 -10 199 -97 -40 37 96 -258 415 -189 -209 153 131 -318 -114 480 -381
7200 -381 172 104 102 -381 144 280 -196 41 -26 25 -274 140 -105 -42 159 -290 -68 192 203 -331 145 -92
7222 -92 -477 220 129 -7 -499 289 -338 -148 118 -3 -169 -244 669 -477 203 -274 45 115 155 23 -364
7243 -364 367 -633 -72 -407 214 -408 -14 401 -518 -88 70 -90 -279 -69 -141 -130 276 -494 -90 47
7263 47 148 -634 169 180 -202 11 175 -10 -454 325 -233 -82 8 327 -93 385 131 -517 248 310 -150
$$ packed form
7113A14j79K98j02l59O64m86kJ09K40p20O23On74J77L21m28o3P23l58J09K39l47
7135Ek57J08O30o90N26l22j57J90m9J93n87Q82n73j81M11K05n04M71m4o75O28
7156B10K0k41l25N10pn09Q81o30M3K2M39o47J21M39p45M48K29m36o9Q88o97m64
7178e20M24K34j09m27Q37q15L66K09k96N7P7N9l54O73o04k0L62k2m49K04N94q61
7200c81N53o8km83N25J36m76K37o7N1k99M14k45O3K01m49K22K60J1n34M76k37
7222i2l85O97r1j36m92P88o27J90K66j21j66p5R13j146O80m77L19P0M0j32l87
7243c64P31j000N61l35O21o22L94M15r19M30J58j60j89K10p2J1M06p70M04J37
7263D7J01p82Q03J1l82K13J64j85m44P79n58J51R0L19m20M78k54o48P65O2m60
$$ plain form
7284 -150 -140 406 -69 -159 419 -42 103 -160 391 -124 -13 203 -262 309 50 -125 -188 447 77 -281 263
7305 263 85 -136 -256 421 -50 329 213 -177 105 25 112 -405 484 -88 -181 426 149 -224 -380 333 -229
7326 -229 -68 248 233 -18 28 138 -298 353 102 -62 12 119 -153 -172 348 -169 -16 79 376 111 272 134
7348 134 -178 357 193 199 -170 187 -274 -90 446 -54 -69 -94 275 -315 19 -26 -111 -201 143 -24 -83 543 -342
7371 -342 77 317 -116 -267 265 273 -565 37 -269 110 -303 305 97 -196 463 -300 69 -159 78 -348 305
7392 305 155 -401 85 40 -37 -239 226 -197 53 -117 -181 -76 106 106 -468 263 97 -174 -67 30 -67 -146 419
7415 419 -231 -224 -12 108 40 95 194 -253 242 -54 74 -329 452 -122 -134 201 -59 163 -6 376 -61 -84
7437 -84 117 -223 360 123 -86 -331 563 -154 -65 276 48 -159 -220 493 -228 111 -158 -169 -77 266 34 -528
$$ packed form
7284a50J0N46m75r0N78m61J45k63N51n15J11K16m65N71k59j75o3O35l70l58N44
7305B63j78k21j20O77m71L79j16l90K82q0Q7n17Q89n72r3O07k77l73j56P13n62
7326b29J61L16j5k51M6J10m36O51k51j64P4J07k72j9N20n17J53R5K97k65J61j38
7348A34l12N35j64Ol69L57m61J84N36n00j5k5L69n90L34m5q5r0L44j67n9O26q85
7371c42M19K40m33j51N32Qq38O02l06L79m13O08k08k93O59p63L69k28K37m26O53
7392C05j50n56M86m5p7k02M65m23K50j70o4J05J82%n74P31j66k71J07R7r7p9N65
7415D19o50PK12J20o8N5R9m47M95k96J28m03P81n74j2L35k60K22j69L82m37k3
7437h4K01l40N83k37k09k45Q94p17Q9L41k28k07o1P13p21L39k69j1R2L43k32n62
$$ plain form
7459 -528 448 -318 -370 -202 368 -211 -296 302 -343 -128 -155 -181 -161 116 -414 -335 414 -246 -246 -185 267 -350 6
7482 6 198 -5 -180 -133 198 -539 132 76 8 51 11 -29 -34 384 -508 46 473 189 163 199 296 -277 167 200 246
7507 246 71 332 160 33 403 -16 228 217 358 36 538 438 -98 93 -60 -41 -131 233 -388 -20 525
7528 525 -234 79 -98 493 -205 194 144 -226 165 -5 153 -294 248 -357 -94 135 -156 -201 -185 154 -482
7549 -482 297 30 -415 -352 379 -181 -609 160 -182 -22 -163 89 -295 -44 -438 -319 70 -217 113 -199
7569 -199 242 -328 -413 102 -148 -330 -119 130 -366 163 72 -276 145 -117 13 -267 141 -37 -322 58 84
7590 84 -165 -99 229 -362 206 -13 84 -130 223 39 -83 634 180 -33 -163 226 -187 -7 29 -12 40 16
7612 16 -44 -424 417 -269 -197 444 190 0 -161 473 -406 -86 382 -35 20 26 100 -445 333 -45 -115 -140 117
$$ packed form
7459e28R76p66n2J68N70n79q5N98o45K15k7k6K0K77n30P9P49o60%O1M52o17L56
7482FJ92k03j75M7L31p37O71n6o8M3m0m0nM18q92N54M27k84k6L6R7n73M44L3M6
7507B46j75K61j72j27L70m19K44j1J41l22N02j00n36J91j53J9r0L64o21L68N45
7528E25p59L13j77N91o98L99n0l70L91j70J58m47N42o05K63K29k91m5J6L39o36
7549d82P79k67m45O3P31n60m28P69l42J60j41K52l84K51l94J19L89k87L30l12
7569a99M41n70q5N15k50j82K11K49m96N29r1l48M21k62J30k80M08j78k85L80K6
7590H4k49O6L28n91N68k19R7k14L53j84j22P17m54k13j30L89m13J80L6m1N2k4
7612A6o0l80Q41o86P2O41k54j90j61O34q79L20M68m17N5OP4n45P78l78p0k5K57
$$ plain form
7635 117 -328 -37 302 -304 -11 -158 146 -142 471 277 -196 204 -99 -351 120 255 -297 58 640 -72
7655 -72 -89 159 291 -262 55 253 30 266 -107 -90 -59 233 -400 61 155 70 -100 -140 262 -521 151 -20
7677 -20 14 -84 -11 200 -190 473 -82 127 -87 148 -47 -71 41 -159 321 -29 -20 -126 303 -34 -255 172
7699 172 -109 -210 90 195 -469 -72 289 -319 9 -49 -53 -523 272 -54 45 109 -1 -251 -42 260 -123 239
7721 239 -108 -116 -124 209 28 -150 729 -4 76 -47 331 -108 -85 300 -232 317 281 134 -365 362 132 -238
7743 -238 205 -200 103 0 322 -241 8 225 -261 -30 165 59 -267 395 -219 -255 234 415 -411 139
7763 139 630 -95 126 113 -114 -169 170 -143 -214 239 -65 -312 -99 25 -492 -250 146 -283 -65 136 71
7784 71 -515 -178 -126 -180 281 -105 -228 -72 308 10 -167 13 -266 -97 -6 9 -355 155 -385 22 16 -17 9
$$ packed form
7635A17m45K91L39o06K93j47L04k88O13j94m73M00l03k52M71J35n52L55N82p12
7655g2j7K48J32n53L17J98k23K36l73J7L1K92o33M61R4q5j70m0M02p83O72j71
7677b0L4r8P3K11l90O63n55K09k14K35j95k4J12k00M80l50Rj06M29l37k21M27
7699A72k81j01L00J05o64L97L61o08L28n8mm70P95l26R9O4j10k50K09L02l83L62
7721B39l47qqL33j81j78Q79p33Q0j23L78m39K3L85n32N49l6j47m99P27k30l70
7743b38M43m05L03j03L22n63K49K17m86K31J95j06l26O62o14l6M89J81q26N50
7763A39M91p25K21j3k27n5L39l13p1M53l04k47K13J24n17K42L96m29K18K01o5
7784G1n86L37N2n4M61l86j23J56L80k98j77J80k79J69R1J5l64N10n40M07ol3K6
$$ plain form
7807 9 -205 630 -564 -359 16 -83 -485 -58 277 -297 206 -165 -30 -280 29 -359 -200 239 -305 47 -39
7828 -39 111 -224 150 131 -73 101 125 80 -144 278 -201 20 332 45 -30 132 174 -438 210 -99 123 6
7850 6 224 -33 -105 320 -200 352 67 216 -183 -127 396 -513 217 196 72 -261 254 228 -55 162 -21 232
7872 232 44 199 -177 322 294 36 131 89 54 -262 575 23 16 157 -150 -248 -145 165 -495 344 254 -330 -67
7895 -67 -164 -124 -311 30 -303 -190 -35 140 -226 -129 110 -172 -59 219 19 -211 247 -147 -362 126 -113
7916 -113 -208 -145 298 -222 -110 -223 -308 -43 143 16 -258 359 -169 118 151 -225 -15 -6 591 -268 8 146
7938 146 3 -240 328 112 -277 251 -60 200 223 80 -237 59 255 -309 189 -55 129 -274 171 365
7958 365 -460 168 209 165 25 360 -84 159 130 -328 50 82 124 -291 232 103 -419 -155 254 -147 -209 103
$$ packed form
7807Ik14Q35j194K05L75r9m02M27L35n74N03l71J35k50L09l88J59M39n44L52q6
7828c9J50l35L74j9k04J74K4m5k24M22m79K21L12k87p5J62M2o12O48l09K22j17
7850FK18k57p2M25n20N52k85J49l99N6N23r09P30k1j24l33N15k6k83K17j83K53
7872B32j88J55l76M99k8k58R5m2l5l16Q37n52pJ41l07r8J03L10o60Q39r0n84K63
7895f7r7M0j87L41l33J13J55J75l66R7K39k82J13K78k00k30M58l94k15M88k39
7916a13r5O3M43n20J12j13q5K65J86j27k74O17n28K87L3l76K10RN97q59K76J38
7938A46j43k43N68k16l89N28l11K60K3j43l17K96J96n64M98k44J84m03M45J94
7958C65q25O28M1m4j40L35m44K43k9m58L78L2M2m15N23j29n22K64M09m01o2L12
$$ plain form
7980 103 -270 -161 37 -24 -233 -68 105 -425 17 -178 -41 -436 90 -159 -117 251 -38 -44 -27 -21 -459 177
8002 177 304 -210 352 173 -126 -257 143 162 -142 362 -91 68 45 185 -229 324 140 -60 284 74 382
8023 382 6 385 -67 -356 128 149 116 85 107 -130 270 -116 -46 -144 300 125 -155 364 -29 170 55 467
8045 467 56 268 307 -250 240 -73 45 -423 333 92 -137 226 -212 -44 103 284 -344 133 197 -174 -52
8066 -52 40 -5 -265 488 -120 84 230 45 52 -6 234 -444 159 116 48 -112 197 250 -447 158 -187 67 -178
8089 -178 342 -277 22 107 -298 96 -80 6 -359 406 38 -100 98 -118 58 -73 409 -316 -7 -70 -253
8110 -253 -70 42 76 -15 209 39 -133 -1 321 -204 -253 318 -232 271 -167 -131 -286 71 27 -368 275 -58
8132 -58 20 -84 265 -172 -230 387 -354 178 -200 -107 -211 259 -122 -397 159 -149 -112 -235 491 -404 -36 52
$$ packed form
7980A03l73J09J98o1k09J65J73n30M42j95J37l95N26k49M2L68k89oJ7Om38O36
8002A77J27n14N62j79k99j31M00J9l04N04m53J59k3J40m14N53j84k00L44k10L08
8023C82l76L79m52k89M84K1l3l1K2k37M00l86P0r8M44j75k80N19l93J99j15M12
8045D67m11K12L9n57M90l13J18m68P56k41k29L63m38J68J47J81o28M77O4l71J22
8066e2R2m5k60P53o08K04J46j85Pn8K40o78O03m3o8j60L09N3o97O05l45K54k45
8089a78N20o19K99Q5m05L94j76Q6l65P65l68j38J98k16J76j31M82p25L09o3j83
8110b53J83J12L4r1K24j70j72J32L22n25m9N71n50N03m38L6j55L57m4l95O43l33
8132e8P8j04L49m37n8O17p41N32l78R3j04M70l81k75N56l08L7j23P26q95L68Q8
$$ plain form
8154 52 -71 -29 17 323 -127 250 205 -158 83 77 110 25 279 -14 3 176 184 -120 415 401 -339 339 312 -67
8178 -67 -297 386 -282 -249 325 172 143 -176 194 -369 116 202 -319
$$ packed form
8154E2j23M2M6L06m50L77m5l63K41oL3q5K54k93J7J73Ql04N35j4p40O78k7l79
8178f7k30O83o68L3N74j53k9l19L70n63M85Q6n21
8191c19
$$ Imaginary data points
##PAGE= N=2
##DATA TABLE= (X++(I..I)), XYDATA
$$ plain form
0 0 0 0 0 0 0 0 0 0 -8 8 -8 9 -16 16 -24 32 -40 48 -57 72 -82 98 -119 138 -162 188 -220 252 -292 334 -382
31 -382 438 -495 559 -632 712 -798 895 -997 1114 -1238 1375 -1523 1688 -1866 2062 -2272
47 -2272 2506 -2760 3040 -3350 3687 -4065 4486 -4959 5491 -6096 6794 -7605 8566 -9721
61 -9721 11141 -12939 15289 -18517 23236 -30798 44909 -80134 353989 458238 -268121 133157
73 133157 384639 119193 -33955 252688 178185 99395 137095 202774 95921 77876 20130
84 20130 26530 237963 104379 -43204 87326 151521 -15279 -37510 66521 -7161 36757
95 36757 30368 9227 -5369 73207 -58142 -169644 45203 65832 -89360 -45490 75505
106 75505 -97903 -63558 25046 -106292 -94218 24 5418 -58636 65409 -63231 -214160
$$ packed form
0@%%%%%%%%qJ6j6J7k5L2m0N6p2Q8j05J29j54J80k17K57l00L50m08M72n44O26p16
31c82Q20r33J054j191J344j510J693j892K111k352K613k898L211l554L928m334
47b272M778n266N800o390P037p752Q551r445J0450j1587J2890j4399J6171j8287
61i721K0862k4080K8228l3806M1753n4034P5707j25043M34123J04249p26359M01278
73A33157K51482k65446j53148K86643p4503p8790L7700O5679j06853j8045n7746
84B0130O400K11433j33584j47583J30530O4195j66800k2231J04031p3682M3918
95C6757o389k1141j4596P8576j31349j11502K14847K0629j55192M3870J20995
106G5505j73408L4345Q8604j31338J2074R4242N394o4054J24045j28640j50929
$$ plain form
117 -214160 15400 120251 -136958 -140222 136887 3681 -82250 5193 -10346 -102139 -15844
128 -15844 80084 -17027 17567 6969 -18477 7027 48244 -55341 -35574 119340 26573 -2339
140 -2339 60107 42173 -60077 30868 56955 -18788 71598 83872 -3512 -17390 102244 -15041
152 -15041 -54524 77637 28262 -12665 78802 73667 -94535 -8795 49023 -19921 -12697 29258
164 29258 -1752 -17100 67680 -58047 -79250 13418 -21404 -61280 57160 35046 -144784
175 -144784 -2008 54196 -108308 -117085 63155 -2892 -102573 35528 -6378 -103374 -58598
186 -58598 6057 -84946 -23353 33541 -75789 -34685 14835 -51158 -112935 4981 -5407 -57986
198 -57986 -9181 2897 -19364 -46605 -35038 -67735 17666 -1873 -73135 16820 61670 -58997
$$ packed form
117b14160K29560J04851k57209l264K77109j33206q5931Q7443j5539r1793Q6295
128a5844R5928r7111L4594j0598k5446K5504M1217j03585J9767J54914r2767k8912
140b339O2446j7934j02250R0945K6087p5743R0386J2274q7384j3878J19634j17285
152a5041l9483J32161m9375m0927R1467n135j68202Q5740N7818o8944P224M1955
164B9258l1010j5348Q4780j25727k1203R2668l4822l9876J18440k2114j79830
175a44784J42776N6204j62504q777J80240o6047r9681J38101m1906r6996M4776
186e8598O4655r1003O1593N6894j09330M1104M9520o5993o1777J17916j0388n2579
198e7986M8805J2078k2261k7241J1567l2697Q5401j9539p1262Q9955M4850j20667
$$ plain form
210 -58997 -98776 59282 -19049 -91319 28848 72342 -48935 -34469 54929 -61514 -39805
221 -39805 35940 -9486 -38996 78797 29221 -94015 25644 36514 -56210 -27259 83762
232 83762 -4562 -24819 59217 -7043 -34618 7222 13912 -30460 59519 37544 -38106 18742
244 18742 39387 -19922 -44799 41037 8958 16014 37503 2545 -5446 7518 -16432 -32210
256 -32210 74239 6589 -50046 54168 75070 -71101 -60219 83130 -17962 -44156 65217
267 65217 52069 -63703 6128 47000 -55040 -6738 27844 -652 -851 54092 -13472 -31477
279 -31477 25812 -26993 -21155 40712 35643 -42121 34037 30180 -51839 4617 26784 -32635 -17143
292 -17143 90469 5749 -39458 16016 3562 -31720 11559 42022 -34184 21801 38655 -9424
$$ packed form
210e8997l9779J58058p8331p2270J20167M3494j21277J4466Q9398j16443K1709
221c9805P5745m5426k9510J17793m9576j23236J19659J0870r2724K8951J11021
232H3762q8324k0257Q4036o6260k7575M1840O690m4372Q9979k1975p5650N6848
244A8742K0645n9309k4877Q5836l2079P056K1489l4958p991J2964k3950j5778
256c2210J06449o7650n6635J04214K0902j46171J0882J43349j01092k6194J09373
267F5217j3148j15772O9831M0872j02040M8302L4582k8496j99N4943o7564j8005
279c1477N7289n2805N838O1867n069p7764P6158l857q2019N6456K2167n9419J5492
292a7143J07612q4720m5207N5474j2454l5282M3279L0463p6206N5985J6854m8079
$$ plain form
304 -9424 -12884 5421 -32764 -15256 73308 -3100 -26218 25950 17384 -53770 685 37522 -50343
317 -50343 721 52451 6343 -38499 13535 -28071 -43134 36464 3242 -24308 11963 23162
329 23162 -60049 -4569 24561 -64678 -34110 51019 15373 -56007 17870 -19265 -59755 502
341 502 11096 -35377 -16024 30052 -36393 -6202 4251 -56082 -50883 34964 14269 -47515 24301
354 24301 -3894 -43924 -12673 14271 -37781 -14776 36172 -13673 9505 17299 -32565 -52038
366 -52038 40732 16678 -35465 44119 27250 -35198 -938 51965 -40488 -23123 50762 14523
378 14523 7983 36891 7219 -47103 34923 25559 -21753 23238 39939 -3638 10780 50804
390 50804 -35953 -18141 34772 12417 -870 45709 20767 -41621 28034 16287 -31296 -1386
$$ packed form
304i424l460J8305l8185J7508Q8564p6408k3118N2168q566p1154N4455L6837q7865
317e0343N1064N1730m6108m4842N2034m1606j5063P9598l3222k7550L6271J1199
329B3162q3211N5480K9130q9239L0568Q5129l5646p1380P3877l7135m0490O0257
341E02J0594m6473J9353M6076o6445L0191J0453o0333N199Q5847k0695o1784P1816
354B4301k8195m0030L1251K6944n2052K3005N0948m9845K3178P794m9864j9473
366e2038R2770k4054n2143P9584j6869o2448L4260N2903r2453J7365P3885l6239
378A4523o540K8908k9672n4322Q2026r364m7312M4991J6701m3577J4418M0024
390E0804q6757J7812N2913k2355j3287M6579k4942o2388O9655j1747m7583K9910
$$ plain form
402 -1386 45875 -9546 -4559 51456 -21467 -35564 3209 6151 -23043 33293 15783 -44640 10691
415 10691 15093 -39235 -36983 28253 -25602 -19035 42160 -10546 -53330 -15179 7423 -42483 3195
428 3195 1821 -29203 7738 17772 -42162 -43933 27133 -31234 -23868 42606 12580 -46523 7426
441 7426 30184 -49774 -2515 33266 750 -366 49958 3423 -21459 40635 -3098 -12093 49747
454 49747 57801 -15083 31128 57712 -12653 10796 45733 20383 5952 74423 38011 4072
466 4072 39779 17449 -114 41242 57887 -9382 41292 65417 2348 -3306 37255 15523
478 15523 -11294 60049 31761 -2372 24602 25554 -18536 7116 32868 -24661 22354 47140
490 47140 -7123 -25615 31588 -5260 -46173 27757 16705 -18395 5588 27856 -35411 -19000
$$ packed form
402a386M7261n5421M987N6015p2923j4097L8773K942k9194N6336j7510o0423N5331
415A0691M402n4328K252O5236n3855O567O1195n2706m2784L8151K2602m9906M5678
428C195j374l1024L6941J0034n9934j771P1066n8367P366O6474l0026n9103N3949
441G426K2758p9958M7259L5781l2516j116N0324m6535k4882O2094m3733q995O1840
454D9747Q054p2884M6211K6584p0365K3449L4937k5350j4431O8471l6412l3939
466D072L5707k2330j7563M1356J6645o7269N0674K4125o3069n654M0561k1732
478A5523k6817P1343k8288l4133K6974R52m4090K5652K5752n7529M7015K4786
490D7140n4263j8492N7203l6848m0913P3930j1052l5100K3983K2268o3267J6411
$$ plain form
502 -19000 12567 -34130 -9415 25170 -3095 -34959 23333 -11725 -56265 -2714 10078 -25647
514 -25647 -16292 29352 -28580 -29542 -2739 -27309 -34270 2027 685 -34594 10983 -11999 -45482
527 -45482 -22639 -2608 -38209 -25567 20526 -30536 -21411 -3032 -37514 -52501 6822 -14665
539 -14665 -55165 15980 3555 -51055 -31700 10702 -54274 -45151 24947 -13794 -33894 -3234
551 -3234 -7607 -52384 -2270 -10961 -50547 5733 27231 -27217 -35364 24876 -28296 -41192 16192
564 16192 10951 -27651 6359 32836 -26280 -4926 -1590 -16633 10418 30526 -10090 -2055 49151
577 49151 -11310 -23533 19720 20007 -16220 30534 39795 -18498 19607 26066 -15509 -8440 43054
590 43054 463 1279 55751 2938 -29888 20977 39757 -35689 96 46145 5957 1161 20837
$$ packed form
502a9000L1567m6697K4715L4585k8265l1864N8292l5058m4540N3551J2792l5725
514b5647R355M5644n7932r62K6803k4570o961L6297j342l5279M5577k2982l3483
527d5482K2843K0031l5601J2642M6093n1062R125J8379l4482j4987N9323k1487
539a4665m0500P1145j2425n4610J9355M2402o4976R123P0098l8741k0100L0660
551c234m373m4777N0114q691l9586N6280K1498n4448q147O0240n3172j2896N7384
564A6192n241l8602L4010K6477n9116K1354L336j5043K7051K0108m0616Q035N1206
577D9151o0461j2223M3253K87l6227M6754R261n8293L8105O459m1575P069N1494
590D3054m2591Q16N4472n2813l2826N0865J8780p5446L5785M6049m0188m796J9676
$$ plain form
603 20837 -7915 -28343 30207 2309 -15263 21204 15404 -14458 5401 15472 -46943 -7188
615 -7188 33488 -1180 -21039 18369 1589 -28366 11638 -17021 -26028 13263 26045 -22506
627 -22506 -8087 17731 -26019 -13807 7202 -5416 -18548 30582 9987 -25636 2886 -5334
639 -5334 -13198 6302 15850 -27229 17368 42568 -23296 -30299 19180 11114 -27106 31593 17447
652 17447 -20514 15276 27616 -24120 -21521 29412 -1143 10512 23765 -3929 -15183 24201
664 24201 8364 -35352 14982 21910 2878 8550 16377 -22295 -3774 27506 -20422 -8579 27062
677 27062 16016 -17155 18304 2340 -34919 9407 23229 -8771 -11908 31635 -943 -7379
689 -7379 2874 -21550 -4701 26029 5736 -25642 30219 9997 -33132 1993 19143 -27370
$$ packed form
603B0837k8752k0428N8550k7898j7572L6467n800k9862J9859J0071o2415L9755
615g188M0676l4668j9859L9408j6780k9955M0004k8659r007L9291J2782m8551
627b2506J4419K5818m3750J2212K1009j2618j3132M9130k0595l5623K8522q220
639e334p864J9500R548m3079M4597K5200o5864p003M9479q066l8220N8699j4146
652A7447l7961L5790J2340n1736K599N0933l0555J1655J3253k7694j1254L9384
664B4201j5837m3716N0334O928j9032N672P827l8672J8521L1280m7928J1843L5641
677B7062j1046l3171L5459j5964l7259M4326J3822l2000l137M3543l2578o436
689g379J0253k4424J6849L0730k0293l1378N5861k0222m3129L5125J7150m6513
$$ plain form
701 -27370 -11006 54213 -7089 -29880 14763 13450 -28038 -3077 17021 -13055 16461 16247 -11763
714 -11763 -16467 11891 -7997 -9995 20334 -5447 -1017 19777 6097 -35738 3449 15125 -17878
727 -17878 10456 20787 -10543 -13735 31680 -15159 -35116 16864 19296 -11178 677 20967
739 20967 -20458 -3052 4576 -14362 -5230 15338 2079 -6054 21121 -21447 -20548 17316 2849
752 2849 -31788 12796 35575 -28281 -10474 14801 -13300 -28475 21898 8055 -23572 15694
764 15694 10506 -16479 -16084 6540 -16236 2609 16903 -11311 -13 8468 -9828 -22399 15351
777 15351 -8383 -15204 24954 12188 -21949 -5988 20488 -25450 -7349 18754 -1078 -4498
789 -4498 18820 3411 -24045 12033 -2051 -10958 12515 20293 -9859 3277 24007 -21030 -7914
$$ packed form
701b7370J6364O5219o1302k2791M4643j313m1488K4961K0098l0076K9516k14k8010
714a1763m704K8358j9888j998L0329k5781M430K0794j3680m1835L9187J1676l3003
727a7878K8334J0331l1330l192M5415m6839j9957N1980K432l0474J1855K0290
739B0967m1425J7406P628j8938R132K0568j3259q133K7175m2568Q99L7864j4467
752B849l4637M4584K2779o3856J7807K5275k8101j5175N0373j3843l1627L9266
764A5694n188k6985L95K2624k2776J8845J4294k8214J1298Q481j8296j2571L7750
777A5351k3734o821M0158j2766l4137J5961K6476m5938J8101K6103j9832l420
789d498K3318j5409k7456L6078j4084q907K3473P778l0152J3136K0730m5037J3116
$$ plain form
802 -7914 16716 5395 -8112 26805 12473 -17421 14858 5405 -13510 1951 29547 -5490
814 -5490 3740 28125 -6846 -12018 11497 10239 -16049 22187 18678 -6650 8190 9439 -9519
827 -9519 -7454 20712 -6201 6270 21891 -632 -9419 11666 -330 -25271 22607 14375 -14876
840 -14876 5778 25913 -18468 -22847 24437 -6410 -17570 14008 22696 -18138 -6297 6711
852 6711 -15288 -831 -2333 -4459 2643 16321 -17270 -9762 11141 -22968 -16698 18705 11062
865 11062 -32196 10678 16211 -28431 -14666 10815 -10463 -17570 26423 -3427 -17854 3543
877 3543 -1835 -22500 -1857 14751 -16715 6156 10573 -9298 -11240 6033 -11861 -13260 22719
890 22719 -816 -5149 9919 3287 -23999 5465 16139 -19898 3110 21855 3091 -13425
$$ packed form
802g914K4630j1321j3507L4917j4332k9894L2279r453j8915J5461K7596l5037
814e490R230K4385l4971n172K3515j258k6288L8236l509k5328J4840J249j8958
827i519K065K8166k6913J2471J5621k2523q787K1085j1996k4941M7878q232k9251
840a4876K0654K0135m4381m379M7284l0847j1160L1578Q688m0834J1841J3008
852F711k1999J4457j502k126P102J3678l3591P508K0903l4109O270L5403p643
865A1062m3258M2874N533m4642J3765K5481k1278p107M3993k9850j4427K1397
877C543n378k0665K0643J6608l1466K2871M417j9871j942J7273j7894j399L5979
890B2719k3535m333J5068o632k7286K9464J0674l6037K3008J8745j8764j6516
$$ plain form
902 -13425 14051 -7436 -18236 15510 9317 -4260 4233 13799 -16207 3980 6720 -19514 -2717
915 -2717 19727 2067 -13634 19778 -12028 -25573 9193 9582 -21883 -2583 24203 -19237 -10855
928 -10855 6453 -11908 -27017 5799 8450 -14718 3345 -8912 -13968 -7353 -3345 -21172 -1030
941 -1030 8825 -20902 1131 10409 -21062 -34499 16561 3089 -26631 9498 11809 -19568 -14259
954 -14259 17829 -18761 -16855 11839 2918 -2590 8491 1434 -21597 8810 485 -9001 11384
967 11384 13189 -9983 2681 24880 -17653 -9124 14405 4172 -3995 24980 12746 -22653 10632
980 10632 14057 -6252 -3968 20154 -894 3831 26339 -6810 -12613 7571 11479 -9810 17911
993 17911 14584 -12262 7711 14297 -8196 -13059 18864 -1722 506 19859 2032 -10586 3983
$$ packed form
902a3425K7476k1487j0800L3746o193j3577Q493R566l0006K0187K740k6234J6797
915b717K2444j7660j5701L3412l1806j3545L4766L89l1465J9300K6786m3440Q382
928a0855J7308j8361j5109L2816K651k3168J8063j2257n056O615M008j7827K0142
941a030R855k9727K2033R278l1471j3437N1060j3472k9720L6129K311l1377N309
954a4259L2088l6590J906K8694q921n508J1081p057k3031L0407q325r486K0385
967A1384J805k3172J2664K2199m2533Q529K3529j0233q167K8975j2234l5399L3285
980A0632L425k0309K284K4122k1048M725K2508l3149n803K0184L908k1289K7721
993A7911l327k6846J9973O586k2493m863L1923k0586K228J9353j7827j2618J4569
$$ plain form
1006 3983 6198 -16925 14951 13084 -8038 2957 16724 -5511 -12337 14787 -8850 -3546 20421
1019 20421 12406 -13901 3890 10011 -16491 8182 11501 -6102 -2856 26236 1205 -15416 9860
1032 9860 -4603 -6805 14798 17586 -17108 6899 17908 -13280 -6440 8960 -604 -9487 22666
1045 22666 4013 -9937 3550 -2262 -9157 3382 9746 -14746 12442 11316 -15825 -7471 11883
1058 11883 -9767 -19942 21200 4721 -11875 2313 6544 -20397 -5787 14400 -15235 -2514
1070 -2514 11876 -474 -13263 8325 -8166 -21010 12176 6112 -8632 388 12431 -17253
1082 -17253 -3594 10313 -15923 -6366 16691 6043 -15580 12892 -1348 -16691 4036 7492
1094 7492 -7480 840 19142 -11038 -1785 8371 -9534 -12105 16447 10011 -16147 14207 9106
$$ packed form
1006C983K215k3123L1876j867k1122J0995J3767k2235o826K7124k3637N304K3967
1019B0421q015k6307J7791O121k6502K4673L319j7603L246K9092k5031j6621K5276
1032I860j4463k202K1603K788l4694K4007J1009l1188O840J5400r564q883L2153
1045B2666j8653j3950J3487n812o895J2539O364k4492K7188j126k7141Q354J9354
1058A1883k1650j0175M1142j6479j6596J4188M231k6941J4610K0187k9635J2721
1070b514J4390j2350j2789K1588j6491j2844L3186o064j4744R020J2043k9684
1082a7253J3659J3907k6236R557K3057j0648k1623K8472j4240j5343K0727L456
1094G492j4972Q320J8302l0180R253J0156j7905k571K8552o436k6158L0354n101
$$ plain form
1107 9106 -12000 -7112 11099 -6361 -4260 18503 -2401 -1542 6223 -1732 -15752 11296 5641
1120 5641 -14905 13550 13044 -10317 -9154 14502 -11950 -8832 16384 856 -5971 7731 6972
1133 6972 -19291 3824 4616 -10452 3202 12156 -2479 -6771 11772 -13620 -8663 9246 2131
1146 2131 -8454 9950 10239 -19468 4082 7506 -12273 -11133 16522 4480 -7460 8667 -9019
1159 -9019 -7628 4219 2958 -14567 8175 11394 -13201 4435 6863 -15646 -17748 20337 4058
1172 4058 -12869 3834 2796 -4398 -4574 -517 -15353 5879 6406 -7290 2313 5775 -12755 -16367
1186 -16367 14431 -6046 -12353 8735 8501 -12531 -3875 8248 -15572 -2375 2995 -3532 843
1199 843 15595 -8761 -20048 13117 788 -10746 3201 11473 -12549 5721 19086 -15680
$$ packed form
1107I106k1106M888J8211j7460K101K2763k0904Q59P765p955j4020K7048n655
1120E641k0546K8455n06k3361J163K3656k6452L118K5216j5528o827J3702p59
1133F972k6263K3115P92j5068J3654Q954j4635m292J8543k5392M957J7909p115
1146B131j0585J8404K89k9707K3550L424j9779J140K7655j2042j1940J6127j7686
1159i019J391J1847j261j7525K2742L219k4595J7636K428k2509k102L8085j6279
1172D058j6927J6703j038p194j76M057j4836K1232N27j3696R603L462j8530l612
1186a6367L0798k0477o307K1088k34k1032Q656J2123k3820J3197N370o527M375
1199H43J4752k4356j1287L3165j2329j1534J3947Q272k4022J8270J3365l4766
$$ plain form
1211 -15680 -14017 8162 10537 -4871 12148 730 -8920 10015 7729 -7716 -6689 13046 1259
1224 1259 11030 8707 -8996 -3022 10555 1290 -8425 18655 3176 -5831 11551 10591 -14603 -3401
1238 -3401 19185 -8781 -61 17827 6133 -13079 3939 3359 -8637 12376 2662 -8643 3704
1251 3704 18773 -10060 -10429 6847 -8632 -1781 15495 7322 -20875 1732 9626 -6226 -5754
1264 -5754 -4868 -2984 4101 14493 -12702 -8918 3107 -7271 -7786 7618 2446 -18532 8461 7653
1278 7653 -13267 -11496 3781 -5536 -7355 11832 -5493 -5194 854 -5253 -14980 4582 5308 -14725
1292 -14725 2231 4894 -4658 -7852 2180 -14473 -8986 12764 -1147 -6357 -1049 -1704 -13886
1305 -13886 7043 1252 -19822 -611 14293 -198 -13058 5156 -10767 -9376 9746 3130
$$ packed form
1211a5680J663K2179K375j5408J7019j1418r650J8935k286j5445J027J9735j1787
1224A259R771k323j7703N974J3577r265r715K7080j5479r007J7382r60k5194J1202
1238c401K2586k7966Q720J7888j1694j9212J7018n80j1996K1013r714j1305J2347
1251C704J5069k8833l69J7276j5479O851J7276q173k8197K2607P894j5852M72
1264e754Q86J884P085J0392k7195L784J2025j0378n15J5404n172k0978K6993q08
1278G653k0920J771J5277r317j819J9187j7325K99O048o107r727J9562P26k0033
1292a4725J6956K663r552l194J0032j6653N487K1750j3911n210N308o55j2182
1305a3886K0929n791k1074J9211J4904j4491j2860J8214j5923J391J9122o616
$$ plain form
1317 3130 -12151 773 13139 -10033 -1405 1173 -6974 -3649 12178 4924 -6445 8286 -2255
1330 -2255 -2697 2494 3951 -2291 9286 9649 -6357 10280 7230 -6436 -3404 16986 2592 359
1344 359 18517 932 -6460 9291 14301 -10766 6339 17293 -436 6558 14701 -2233 -12851
1357 -12851 19164 8189 -6812 9640 14120 -4402 -1331 15813 -7731 -5971 9689 10109 -1789
1370 -1789 2818 3772 -5658 3254 -3848 -681 3568 3134 -4672 4777 4588 -16378 -776 5699 -6004
1385 -6004 -7749 14526 -2110 -15838 7034 246 -14917 -3537 13553 -10508 -4050 11333 -6629
1398 -6629 -11982 2194 2981 -12258 7707 4838 -6831 1470 4841 -8265 -7050 11497 -4203
1411 -4203 -702 8977 3152 -7187 2491 4125 -8534 6551 4324 572 4869 8381 -7851 -2690
$$ packed form
1317C130j5281J2924J2366k3172Q628K578q147L325J5827p254j1369J4731j0541
1330b255m42N191J457o242J1577L63j6006J6637l050j3666L032K0390j4394k233
1344C59J8158j7585p392J5751N010k5067J7105J0954j7729O994Q143j6934j0618
1357a2851L2015j0975j5001J6452M480j8522L071J7144k3544J760J5660M20j1898
1370a789M607R54r430Q912p102L167M249m34p806R449j89k0966J5602O475j1703
1385f004j745K2275j6636j3728K2872o788j5163J1380J7090k4061O458J5383j7962
1398f629n353J4176P87j5239J9965k869j1669Q301L371j3106J215J8547j5700
1411d203L501R679n825j0339R678J634j2659J5085k227l752M297L512j6232N161
$$ plain form
1425 -2690 11321 -6110 -994 10701 5927 -8675 8395 5525 -12078 1978 5920 -233 283
1438 283 11396 -7180 -4664 8143 -4592 -7573 4820 6938 -9194 7625 3842 -12177 -4639
1451 -4639 6401 -3469 -6603 10928 -4921 -5338 4272 -1734 -13014 663 5809 -9948 5555
1464 5555 5365 -9002 -7934 7359 -6312 -9752 11382 -1702 -8371 4219 7963 -14886 -5423
1477 -5423 6759 -4877 -540 5186 1436 -8994 3230 -2723 -3566 2054 -4386 -1203 7827 4332
1491 4332 -14480 2398 2412 -11405 551 12170 -5646 -12768 14527 -1369 -14733 1004 5343
1504 5343 -11977 376 15413 -11040 -8504 3690 -1757 -11799 5408 2209 -11245 4151 3872
1517 3872 -5799 -9042 929 -6571 -223 5725 -4612 -2074 -1363 -2942 -6827 5526 -5541 -8684
$$ packed form
1425b690J4011j7431N116J1695m774j4602J7070k870j7603J4056L942o153N16
1438B83J1113j8576K516J2807j2735k981J2393K118j6132J6819l783j6019P538
1451d639J1040r870l134J7531j5849m17R610o006j1280J3677N146j5757J5503
1464E555j90j4367J068J5293j3671l440K1134j3084o669J2590L744k2849R463
1477e423J2182j1636M337N726l750j0430J2224n953q43N620o440L183R030l495
1491D332j8812J6878J4j3817J1956J1619j7816p122K7295j5896j3364J5737M339
1504E343j7320J2353J5037k6453K536J2194n447j0042J7207l199j3454J5396k79
1517C872r671l243R971p500O348N948j0337K538P11j579l885J2353j1067l143
$$ plain form
1531 -8684 8383 4869 -7484 -4280 5074 -11850 -919 8668 -2919 -5325 5681 1239 -10246
1544 -10246 6759 -2370 -10142 4883 11109 -7018 -2977 11061 -11407 -6138 10734 3404 -12668
1557 -12668 5833 10658 -7896 239 3018 -4549 -6560 11315 4098 -2714 993 -2182 2580 1616
1571 1616 -1743 -5683 10037 3188 -4157 7946 2550 -10491 -1802 16807 -5076 -4196 12752 3726
1585 3726 -8040 5063 8242 -10556 4740 9735 1082 1642 8653 -2097 -4985 10450 124
1598 124 969 7397 4712 -3711 9327 6803 -11537 3412 9769 930 -566 13457 -2210 -7894
1612 -7894 9705 4127 -5943 93 10529 -2724 4102 5084 -7588 -3255 5395 697 -5546 8903
1626 8903 -1524 -4834 3639 -158 -8794 -1205 6544 -7346 3181 4205 -6951 -6408 4870 -4033
$$ packed form
1531h684J7067l514j2353L204R354j6924J0931R587j1587k406J1006m442j1485
1544a0246J7005r129p772J5025O226j8127M041J4038k2468N269J6872p330j6072
1557a2668J8501M825j8554Q135K779p567k011J7875p217o812L707l175M762r64
1571A616l359l940J5720o849p345J2103n396j3041Q689J8609k1883Q80J6948r026
1585C726j1766J3103L179j8798J5296M995q653N60P011j0750k888J5435j0326
1598A24Q45O428k685q423J3038k524j8340J4949O357q839j496J4023j5667n684
1612g894J7599n578j0070O036J0436j3253O826R82j2672M333Q650m698o243J4449
1626H903j0427l310Q473l797q636P589P749j3890J0527J024j1156N43J1278q903
$$ plain form
1640 -4033 -9822 9038 303 -6832 -164 5215 -8580 -4651 3514 -6279 1537 5481 -2111 -8677
1654 -8677 6212 -1756 -8942 5816 2382 -5744 882 11644 -8240 -5920 5188 -1066 -2636 5129
1668 5129 3960 -6603 6800 1269 -5957 -124 4089 -747 416 7937 -4079 433 1445 -2348
1682 -2348 -2705 5279 370 -4654 9976 -581 -7825 569 6414 -8570 -2017 10899 -3897 -4316
1696 -4316 3959 732 -10929 3511 3239 -7432 2899 4716 -4537 -6443 6099 -6693 -5638 5217
1710 5217 372 -3441 1444 1843 -8640 1993 -1130 -4835 2279 5060 -3593 -3327 7077 -6791
1724 -6791 -3845 4804 1440 -5074 5574 5540 -7892 2621 1635 -3427 -848 9134 -1747 -2365 9165
1739 9165 -1879 -3662 3014 3863 -6787 7822 8737 -6315 786 6374 -1141 -5487 8971 -430
$$ packed form
1640d033n789J8860q735p135O668N379j3795L929Q165r793P816L944p592o566
1654h677J4889p968p186J4758l434q126O626J0762j9884K320J1108o254j570P765
1668E129j169j0563J3403n531p226N833M213m836J163P521j2016M512J012l793
1682b348l57P984m909n024J4630j0557p244Q394N845j4984O553J2916j4796m19
1696d316Q275l227j1661J4440k72j0671J0331J817r253j906J2542j2792J055J0855
1710E217m845l813M885L99j0483J0633l123l705P114K781q653K66J0404j3868
1724f791K946Q649l364o514J0648l4j3432J0513r86n062K579R982j0881o18J1530
1739I165j1044j783O676Q49j0650J4609R15j5052P101N588p515m346J4458r401
$$ plain form
1753 -430 -2216 8117 3448 -4869 -528 5737 -5796 3939 5348 -2127 310 6106 -967 -7589 5818
1768 5818 -561 -713 3255 2906 -3260 2127 3097 -9310 2184 4844 -1409 -3358 7887 -1602 -7342
1783 -7342 5869 -380 -6042 -284 8608 -3142 -681 1498 -5845 468 3329 -2801 -6637 8931
1797 8931 1391 -5814 1107 -570 -6093 -1547 7835 -6185 -1861 3145 -1413 -4209 -913 -3007 -6658
1812 -6658 7077 -1009 -6319 -1024 3213 -7018 -5647 2458 -5349 318 924 -2527 -6448 1690 -3753
1827 -3753 -7899 3761 -2355 -5030 1817 5499 -11717 -5193 6770 -3370 -5465 1262 3040 -4724
1841 -4724 4603 -1507 -7517 1398 3967 -1852 -861 7373 -5154 71 6448 -1488 -6547 4870 8628
1856 8628 -3627 3813 1711 137 1363 3625 -2718 1064 9724 -1825 1660 4756 47 -5161
$$ packed form
1753d30j786J0333m669q317M341O265j1533R735J409p475K437N796p073o622J3407
1768E818o379j52L968l49o166N387R70j2407J1494K660o253j949J1245r489n740
1783g342J3211o249n662N758Q892j1750K461K179p343O313K861o130l836J5568
1797H931p540p205O921j677n523M546R382j4020M324N006m558k796L296k094l651
1812f658J3735q086n310N295M237j0231J371Q105p807N667O06l451l921Q138n443
1827c753m146J1660o116k675O847L682j7216O524J1963j0140k095O727J778p764
1841d724R327o110o010Q915K569n819R91Q234j2527N225O377p936n059J1417L758
1856H628j2255P440k102j574J226K262o343L782Q660j1549L485L096m709n208
$$ plain form
1870 -5161 7173 4273 -6483 5435 6323 -1290 -4329 5016 -2701 -982 6346 -2225 -2602 3770 3633
1885 3633 -9489 875 1533 -5221 1087 3967 -3681 -6288 5847 -4746 -5705 681 -838 -4341
1899 -4341 2481 2736 -11024 -32 2526 -4414 -6236 3977 722 -4409 3115 -3277 -2647 -481 1072
1914 1072 -3442 3830 3005 -5488 4795 3469 -4822 -4203 10803 951 -4299 6672 4061 -1272 114
1929 114 5500 -2912 4888 5720 -661 3375 5554 -759 -3207 10254 27 -3199 7383 7541 -3063
1944 -3063 -833 7648 -2933 1173 3022 1731 797 5431 -272 -4422 5967 -1428 -3083 2581 6672
1959 6672 -4880 -687 6129 -4515 -3069 848 1689 -2939 4057 -1700 -3765 3245 -2283 -5400 263
1974 263 5541 -7566 713 5717 -5590 -5882 3341 529 -8475 5050 1453 -4484 -557 3057 -5041
$$ packed form
1870e161J2334k900j0756J1918Q88p613l039R345p717J719P328q571l77O372j37
1885C633j3122J0364O58o754O308K880p648k607J2135j0593r59O386j519l503
1899d341O822K55j3760J0992K558o940j822J0213l255n131P524o392O30K166J553
1914A072m514P272q25q493J0283j326q291O19J5006r852n250J0971k611n333J386
1929A14N386q412P800Q32o381M036K179o313k448J3461j0227l226J0582J58j0604
1944c063K230Q481j0581M106J849j291r34M634n703m150J0389p395j655N664M091
1959F672j1552M193O816j0644J446L917Q41m628O996n757k065P010n528l117N663
1974B63N278j3107Q279N004j1307k92R223k812r004J3525l597n937L927L614q098
$$ plain form
1989 -5041 -3979 6003 -3984 -1141 3146 1133 -4555 1940 662 -5878 4278 1356 -1619 347 5683
2004 5683 -5112 -2624 6787 -2971 -2351 4257 5089 -5621 2835 2735 -3829 1260 1512 -92 683 6357
2020 6357 -4749 -83 5462 -3351 -3872 5711 4974 -8048 4092 4324 -4048 -3440 3903 15 -3496
2035 -3496 5379 -1922 -1007 852 -954 -5524 2222 2309 -7643 3093 3798 -4548 -6943 4729 -2033
2050 -2033 -7045 2344 -140 -2443 -2144 993 -6060 -725 -1393 -5249 1541 493 -4572 -4816 4883 -6295
2066 -6295 -6315 3094 -579 -5816 116 4665 -8295 -1783 739 -3321 -2835 3305 -599 -5001 4399
2081 4399 -2591 -3185 862 1694 -5067 2628 6570 -6091 112 4017 -912 -4877 6697 2349 -4472
2096 -4472 4999 3865 -842 -1710 4922 -1296 2473 4933 174 3143 2726 -186 -1896 8310 -500
$$ packed form
1989e041J062R982r987K843M287k013n688O495j278o540J0156k922k975J966N336
2004E683j0795K488R411r758O20O608Q32j0710Q456j00o564N089K52j604P75N674
2020F357j1106M666N545q813n21R583p37j3022J2140K32q372O08P343l888l511
2035c496Q875p301R15J859j806m570P746Q7r952J0736P05q346k395J1672o762
2050b033n012R389k484k303K99L137p053N335o68l856O790j048n065k44R699j1178
2066f295k0R409l673n237N932M549j2960O512K522m060M86O140l904m402R400
2081D399o990n94M047Q32o761P695L942j2661O203L905m929l965J1574m348o821
2096d472R471j134m707q68O632o218L769K460m759K969m17k912j710J0206q810
$$ plain form
2111 -500 -2470 7112 5540 -2540 -109 7645 -4499 -179 6225 2737 -2102 3178 2895 -2972 4594
2126 4594 -580 -2446 2463 6223 -3091 -974 5907 -4539 -2045 4110 2162 -6319 3367 3822 -4277
2141 -4277 352 159 -2173 -2457 4863 -1986 -878 2402 -2720 -2283 487 813 -5390 3480 718 -3371
2157 -3371 1089 1274 -4788 -4358 6365 -2932 -1986 2214 296 -4788 639 3081 -6619 158 1686
2172 1686 431 -1129 1479 -3782 -2875 4546 -3408 -1734 1904 1981 -4977 2869 2175 -6259 163 2763
2188 2763 85 -2589 4605 -2145 -2674 2687 -993 -2583 724 3719 -4724 2224 2523 -3276 -2681 1599
2204 1599 879 -2159 4418 -2179 -1359 1284 99 -2954 974 1737 -4976 3948 2729 -3625 -4587 3773
2220 3773 -223 -3832 3924 -825 -1871 571 2751 -4941 -708 1892 -2963 2311 2184 -1554 -3617
$$ packed form
2111e00j970R582j572q080K431P754j2144M320O404l488m839N280k83n867P566
2126D594n174j866M909L760r314K117O881j0446K494O155j948q481R686M55q099
2141d277M629j93k332k84P320o849J108L280n122M37K770L26o203Q870k762m089
2157c371M460J85o062M30J0723r297R46M200j918n084N427K442r700O777J528
2172A686j255j560K608n261R07P421p954J674L638P7o958P846o94q434O422K600
2188B763k678k674P194o750n29N361l680j590L307K995q443O948K99n799N95M280
2204A599p20l038O577o597Q20K643j185l053L928P63o713Q924j219o354r62Q360
2220C773l996l609P756m749j046K442K180p692M233K600m855N274j27l738k063
$$ plain form
2235 -3617 5082 -1859 -4522 3898 1988 -2844 277 6369 -4359 -1307 3323 -328 -2003 3123 3648
2250 3648 -3097 2435 -47 -61 910 1030 -960 2005 4667 -3026 2014 1664 -1683 -1114 6273 449
2266 449 -4105 5998 2519 -2772 -1030 5327 -2836 -576 6140 -147 -868 1101 2442 -2832 3202
2281 3202 174 -1866 3602 2089 -2314 -2084 5013 -3631 -1742 3209 1235 -2124 209 2453 -3548
2296 -3548 628 -1760 -289 1494 855 -2839 -190 3820 -5194 -1480 2444 624 -4282 2229 2803
2311 2803 -4601 -146 -147 -445 -1985 2467 -2032 -436 2769 -2998 -1931 547 1301 -4573 2675 1584
2327 1584 -3143 -133 799 -1874 -3280 4067 -2213 -1830 2088 353 -2975 -1069 1765 -4266 1178
2342 1178 563 -422 -901 125 -2002 -1012 3777 -5292 -1821 4137 2414 -5583 618 3220 -4905 56
$$ packed form
2235c617Q699o941k663Q420j910m832L121O092j0728L052M630l651j675N126N25
2250C648o745N532k482j4R71J20j990K965K662p693N040l50l347N69P387n824
2266D49m554J0103l479n291J742O357q163K260O716o287p21J969J341n274O034
2281C202l028k040N468j513m403K30P097q644J889M951j974l359K333K244o001
2296c548M176k388J471J783o39l694K649M010r014L714L924j820m906O511N74
2311B803p404M455jk98j540M452m499J596L205n767J067K478P54n874P248j091
2327A584m727L010R32k673j406P347o280L83L918j735l328J906K834o031N444
2342A178o15r85m79J026k127R90M789r069L471N958j723p997O201K602q125M961
$$ plain form
2358 56 2852 445 -3667 2879 1041 -1039 626 -2575 84 2345 2160 -3933 2592 2016 -3652 185
2374 185 2038 -783 -2985 5025 -1601 -2385 2086 249 -4122 -422 4223 -4179 197 1078 -2189 -3229
2390 -3229 2070 -128 -5303 1812 -466 -646 -515 -698 -5332 -773 3379 -3722 -1593 -529 -246 -2436
2406 -2436 1768 -3155 -4353 1823 305 -1175 -930 1668 -4873 544 3057 -2800 -2336 1872 2312 -2734
2422 -2734 2659 -574 -1384 1326 1693 -1005 1354 5257 -3339 571 3992 1550 -2121 3000 3485 -1392
2438 -1392 4703 2117 -273 -438 4119 1104 1917 4142 -1602 1798 4244 3260 -3008 2289 2890 1068
2454 1068 4252 926 -653 390 4842 -1674 702 3594 -857 197 3725 2513 -5295 2309 1880
2469 1880 -786 538 2030 -797 -1530 3243 -3187 -477 1389 -638 -3148 2309 2472 -4951 -198
$$ packed form
2358E6K796k407m112O546j838k080J665l201K659K261j85o093O525n76n668L837
2374A85J853k821k202Q010o626p84M471j837m371L700M645q402M376Q81l267j040
2390c229N299k198n175P115k278j80J31j83m634M559M152p101K129J064K83k190
2406b436M204m923j198O176j518j480K45K598o541N417K513n857M64M208M40n046
2422b734N393l233q10K710L67k698K359L903q596L910L421k442l671N121M85m877
2438a392O095k586k390j65M557l015Q13K225n744L400K446r84o268N297O01j822
2454A068L184l326j579J043M452o516K376K892m451J054L528j212p808P604m29
2469A880k666J324J492k827p33M773o430K710J866k027k510N457J63p423M753
$$ plain form
2484 -198 -520 -1507 -1244 2247 -2499 -2794 2338 -2192 -1673 -735 -358 -4661 2456 2269 -4304 -1913 252
2501 252 -325 -2672 1832 -2630 -1467 2309 -45 -2448 -990 1408 -3756 1881 1811 -1871 -927 1908
2517 1908 -22 -2032 3244 -1988 -208 2715 1776 -2440 1478 3408 -3709 1428 3657 965 -2353
2532 -2353 3566 1424 -1763 2783 -51 -644 803 4114 -1470 838 2146 -1852 580 2116 643
2547 643 -2934 3386 322 -1455 1169 -576 -2188 7 3615 -3469 -95 1080 -1708 -2422 861
2562 861 -601 -4435 2297 -714 -1973 -564 -27 -4100 -1708 2038 -3846 -1079 455 -697 -3905
2577 -3905 614 -890 -3927 877 -463 -1559 -1062 1671 -3571 -1077 1906 -2464 -1332 1595 1308
2592 1308 -3516 2070 355 -2400 603 1510 -104 -669 3601 -1991 473 1735 -537 -1192 2094 2059
$$ packed form
2484a98l22r87K63L491m746k95N132m530N19R38L77m303P117j87o573K391K165
2501B52n77k347M504m462J163L776k354k403J458K398n164N637p0l682R44K835
2517A908j930k010N276n232J780K923r39m216L918J930p117N137K229k692l318
2532b353N919k142l187M546k834n93J447L311n584K308J308l998K432J536j473
2547F43l577O320l064j777K624j745j612K195L608p084L374J175k788p14L283
2562H61j462l834O732l011j259J409N37m073K392L746n884K767J534j152l208
2577c905M519j504l037M804j340j096M97K733n242K494K983m370J132K927k87
2592A308m824N586j715k755L003R07j614n65M270n592K464J262k272o55L286l5
$$ plain form
2608 2059 -2546 3148 684 -1111 -103 2796 -937 -1177 4005 -921 -112 727 1340 -2549 946 1499
2624 1499 -1930 1049 -52 -318 -794 2486 -2914 -1251 3561 -1159 -2008 1122 1936 -4820 1125 2150
2640 2150 -2374 -999 1769 680 -2591 2654 -1627 -1644 1260 1354 -1312 272 2542 -2784 999 1281
2656 1281 -257 -1316 1874 979 -153 2479 -1639 -191 1168 1587 -1447 2218 2195 -2661 2049 2575
2672 2575 -477 -2881 4178 804 -1130 2579 847 -1138 -230 3530 -1795 684 1604 -516 -88 1690
2688 1690 268 -3033 2071 -215 -310 646 798 -1923 -907 2003 -2765 140 -442 -748 -1194 1469 -968
2705 -968 -4125 658 -1001 -819 -1244 -30 -2923 -525 580 -3317 -1041 -1084 -1560 -2446 2423 -2097 -4756
2722 -4756 753 7 -2682 -2786 2392 -3046 -1993 716 -678 -2567 -1708 257 -2322 1511 -946 -1453
$$ packed form
2608B059m605N694k464j795J008K899l733k40N182m926Q09Q39O13l889L495N53
2624A499l429K979j101k66m76L280n400J663M812m720q49L130Q14o756N945J025
2640B150m524J375K768j089l271N245m281j7K904R4k666J584K270n326L783K82
2656A281j538j059L190q95j132K632m118J448J359M19l034L665k3m856M710N26
2672B575l052k404P059l374j934L709j732j985R08L760n325K479R20k120M28J778
2688A690j422l301N104k286r5R56J52k721J016K910m768K905n82l06m46K663k437
2705i68l157M783j659J82m25J214k893K398J105l897K276m3m76q86M869m520k659
2722d756N509p46k689j04N178n438J053K709j394j889Q59J965k579L833k457n07
$$ plain form
2738 -1453 -849 243 -1101 -648 1938 -2667 524 1804 627 -1412 1055 380 -1840 4021 1458 -1303
2754 -1303 -118 4959 -57 -827 3005 665 382 2005 4111 -534 1515 1415 1279 3182 884 639
2770 639 1958 4603 -1074 811 3370 415 -627 2724 3712 -2146 1846 1510 -52 117 2060 102
2786 102 -1258 2901 -639 326 820 144 -2503 979 2227 -2729 154 160 -169 -1868 1657 -1305 -2589
2803 -2589 1273 210 -492 -1791 397 -1841 789 -28 -1675 -63 -588 -6 -1193 1226 -3128 -360
2819 -360 1686 -1014 -1544 492 1532 -3616 1079 1114 -1428 -1310 1931 215 -2412 2245 -606 -1165
2835 -1165 -367 1977 -708 177 1782 -1876 715 896 778 -1814 1801 575 -562 1440 -374 127
2851 127 -471 2142 -949 1222 699 -526 1826 890 -614 -1177 3280 -711 -421 2458 1021 -1139
$$ packed form
2738a453O04J092j344M53K586m605L191J280j177k039K467o75k220N861k563k761
2754a303J185N077n016p70L832k340k83J623K106m645K049j00j36J903k298k45
2770F39J319K645n677J885K559k955j042L351R88n858L992l36j562J69J943j958
2786A02j360M159l540R65M94o76k647L482J248m956K883Ol29j699L525k962j284
2803b589L862j063p02j299K188k238K630q17j647J612n25N82j187K419m354K768
2819c60K046k700n30K036J040n148M695L5k542J18L241j716k627M657k851n59
2835a165P98K344k685Q85J605l658K591J81j18k592L615j226j137K002j814N01
2851A27n98K613l091K171n23j225K352r36j504n63M457l991K90K879j437k160
$$ plain form
2867 -1139 504 3053 -2673 708 1693 55 -721 2099 723 -2682 2224 279 -645 -287 2037 -1046
2883 -1046 -996 1759 -1474 13 -413 172 -1459 1218 -760 -1952 1373 -958 -1579 -1147 1966 -2844
2899 -2844 -1108 927 -1654 -1802 -1126 266 -2764 933 -977 -1765 -298 -581 -1880 -1516 1738 -2987
2915 -2987 -984 549 -618 -2619 67 524 -2604 705 -574 -1171 -766 1353 -1834 -1656 1606 -1557
2931 -1557 -318 342 1235 -2606 756 1118 -1944 158 108 632 -761 2165 -1931 -630 2175 -92
2947 -92 -1144 479 2444 -2141 842 1173 -620 -468 564 1289 -998 1409 -1051 1420 486 -528
2963 -528 -563 1764 1463 -2522 2290 1116 -325 -806 2230 -620 -1197 3006 -352 -414 57 1763 -1418
2980 -1418 1148 1010 -1892 1585 1724 -6 -2218 2591 -113 -785 1781 474 -611 -34 2785 -1953
$$ packed form
2867a139J643K549n726L381R85j638p76K820j376l405M906j945r24L58K324l083
2883a046N0K755l233J487m26N85j631K677j978j192L325k331o21M32L113m810
2899b844J736K035k581j48O76J392l030L697j910p88J467k83j299L64L254m725
2915b987K003J533j167k001K686M57l128L309j279n97M05K119l187J78L262l163
2931a557J239O60Q93l841L362L62l062K102n0N24j393K926m096J301K805k267
2947i2j052J623J965m585K983L31j793J52J032P25k287K407k460K471r34j014
2963e28l5K327l01l985M812j174j441m81L036k850n77M203l358o2M71J706l181
2980a418K566j38k902L477J39j730k212M809k704o72K566j307j085N77K819m738
$$ plain form
2996 -1953 -123 696 186 -73 -9 528 -1231 1401 -1223 158 41 -249 -572 792 746 -3099 1553 500
3014 500 -2004 -1894 2380 -354 -3007 1577 -401 -1514 -1108 2311 -2529 -1358 1356 -876 -564 -1011
3030 -1011 -426 -1974 1747 -1056 -2301 704 148 -1373 -1280 2062 -2817 -813 1278 123 -2354 -291
3046 -291 1484 -1998 242 -1470 219 -193 314 -1140 -619 1853 -2361 201 586 190 -1776 1810
3062 1810 835 -2490 926 511 35 -1086 1594 -948 412 1771 -1684 -323 953 1588 -2265 1691
3078 1691 906 -1225 674 1436 223 -1520 2655 -63 738 642 236 125 1244 1736 -1739 2290 1151
3095 1151 303 -187 2035 597 -754 2439 29 670 524 1927 -560 711 1393 -892 1788 610
3111 610 719 -388 2079 -318 -144 1348 -478 702 494 1065 -2159 1581 1042 -1501 106 1245
$$ packed form
2996a953J830Q19n10k59O4N37j759K632k624J381j17k90l23J364m6l845M652j053
3014E00k504J10M274k734k653M584j978j113M06L419m840J171K714k232L12m47
3030a011N85j548L721k803j245L005n56j521R3L342m879K004K091j155k477K063
3046b91J775l482K240j712J689m12N07j454N21K472m214K562L85l96j966L586
3062A810r75l325L416m15m76j121K680k542J360J359l455J361J276O35l853L956
3078A691p85k131J899P62j213j743M175k718Q01r6m06j11J119M92l475M029j139
3095A151q48m90K222j438j351L193k410O41j46J403k487J271O82k285K680j178
3111F10J09j107K467k397J74J492j826J180k08N71l224L740n39k543J607J139
$$ plain form
3127 1245 268 -2462 2539 -300 -1612 -63 963 -809 -1202 1080 -1533 714 -401 -1165 -750 1016
3143 1016 -915 -2527 1897 -634 -1350 -1002 1496 -1719 -1287 1021 -810 232 -867 220 -849 1159
3159 1159 -1296 -1143 1660 -568 -672 -30 2278 -2173 63 1268 -158 -378 793 1332 -1372 1780
3175 1780 -214 -41 970 836 -740 144 2666 -1551 618 1267 1076 -935 1417 1770 -748 1702
3191 1702 341 534 -279 1515 -234 358 1793 -261 913 36 1207 -633 1342 319 -353 1412
3207 1412 -238 65 -217 1889 -1570 -123 1168 -734 -894 -83 1072 -2165 618 -341 -670 -629 -13
3224 -13 -531 -1146 723 -2078 -445 -321 -509 -2178 117 233 -2907 162 -523 -805 -2131 388 -937
3241 -937 -1371 -333 -1695 -724 -975 -316 -2117 544 -435 -1881 359 -301 -403 -1905 1457 -1347 -724
$$ packed form
3127A245r77k730N001k839j312J549J026j772l93K282k613K247j115p64M15J766
3143A016j931j612M424k531p16L48K498l215M32K308j831J042j099J087j069K008
3159A159k455J53K803k228j04O42K308m451K236J205j426k20J171N39k704L152
3175A780j994J73J011j34j576Q84K522m217K169O49j91k011K352L53k518K450
3191A702j361J93q13J794j749N92J435k054J174q77J171j840J975j023o72J765
3207A412j650L03k82K106l459J447J291j902j60Q11J155l237K783r59l29M1O16
3224a3n18o15J869k801J633J24j88j669K295J16l140L069o85k82j326K519j325
3241i37m34J038j362R71k51O59j801K661r79j446K240o60j02j502L362k804O23
$$ plain form
3258 -724 716 -485 -239 -530 1254 -1523 1166 159 -101 165 982 -295 -1009 2022 -671 323 717
3275 717 1048 -1210 733 1759 -1379 835 781 1071 -969 1157 273 -544 972 -461 860 -54 921
3292 921 -815 843 609 -1246 432 530 0 -1491 2304 -329 -999 242 558 125 -804 1691 -1061
3309 -1061 684 274 177 -553 31 208 -1021 1941 -882 -332 -224 821 -345 -337 1208 -1421 471 284
3327 284 598 -1461 563 170 -902 834 -316 301 -576 1169 -1341 -63 543 -715 -271 -530 684
3344 684 -1213 912 -715 -531 438 -386 -352 -777 712 -1442 691 356 -832 -677 790 608 -2171
3361 -2171 1050 -394 -344 -593 1202 -906 -1147 1468 -224 415 -879 649 -389 846 -83 -776 1635
3378 1635 -135 -16 -175 1701 -1322 -85 1799 9 -410 453 1640 -1240 532 547 559 -24 -160
$$ packed form
3258g24J440j201K46k91J784k777K689j007k60K66Q17j277p14L031k693R94L94
3275G17L31k258J943J026l138K214n4K90k040K126q84q17J516j433J321r14R75
3292I21j736J658k34j855J678R8n30j491L795k633o70J241L16m33r29K495k752
3309a061J745m10r7p30N84J77j229K962k823N50J08J045j166QJ545k629J892j87
3327B84L14k059K024l93j072J736j150O17q77J745k510J278O06j258M44k59J214
3344F84j897K125j627J84R69q24L4m25J489k154K133l35j188J55J467j82k779
3361b171L221j444N0k49J795k108k41K615j692O39j294J528j038J235r29o93K411
3378A635j770J19j59J876l023J237J884j790m19Q63J187k880J772J5J2n83j36
$$ plain form
3395 -160 902 -174 1289 -1225 703 728 -241 -175 1385 508 -2222 1991 813 -870 -1212 1637 -54
3412 -54 -1095 1472 -552 -454 -415 1502 -1069 -172 812 -598 415 -411 496 -758 1113 -917 -235 542
3430 542 -517 -219 14 974 -1591 910 637 -676 -386 609 483 -1188 1277 -847 114 435 124 -789
3448 -789 33 1155 -1401 560 22 177 -888 885 310 -1336 976 -373 554 -118 813 -829 635
3465 635 960 -1230 256 182 740 -1489 1324 595 -613 622 555 167 -591 1070 -780 818 372 -89
3483 -89 239 384 897 -853 1847 134 212 493 822 6 169 1341 -886 1005 559 254 -340 1468
3501 1468 619 -802 1561 119 323 -304 1340 -492 -6 1225 -709 725 459 442 -1064 1295 94
3518 94 -1020 963 460 -362 -1218 1675 -1033 -742 373 -58 -445 -213 560 -1854 354 -297 -387 -808
$$ packed form
3395a60J062j076J463k514J928K5r69O6J560q77k730M213j178j683l42K849j691
3412e4j041K567k024R8L9J917k571Q97R84j410J013q26R07j254J871k030O82P77
3430E42j059K98K33R60k565K501k73j313K90R95j26j671K465k124R61L21l11r13
3448g89Q22J122k556J961n38J55j065J773n75j646K312j349R27o72R31j642J464
3465F35L25k190J486p4N58k229K813p29j208J235o7l88p58J661j850J598m46m61
3483h9L28J45N13j750K700j713P8K81L29q16J63J172k227J891m46l05n94J808
3501A468q49j421K363j442K04o27J644j832M86J231j934J434k66j7j506K359j201
3518I4j114J983n03q22q56K893k708K91J115m31l87K32P73k414K208o51r0m21
$$ plain form
3536 -808 -141 -422 -838 504 -1464 25 -829 -408 -631 3 -724 -1691 1243 -943 -1233 -861 956 -1598
3554 -1598 -1284 1440 -1188 -1329 -179 1279 -2532 -631 307 -653 -903 -630 312 -1232 351 -987 -5
3571 -5 36 -452 -487 -195 611 -1646 780 146 -547 -820 987 439 -1441 721 -185 525 -640 322 -446
3590 -446 -319 626 -270 804 -1096 189 248 1452 -805 -678 1608 -445 -329 202 1599 -1814 549
3607 549 1939 -421 -1147 344 1634 -1129 384 151 813 -80 -369 602 335 466 -1800 1302 303
3624 303 -590 -442 893 334 -1710 947 143 -291 -1427 703 320 -228 165 -1147 97 59 646 -963
3642 -963 292 -274 -865 776 -664 -183 -683 817 -716 103 216 -961 99 398 199 -1974 1002
3659 1002 -185 -698 -220 277 59 -822 608 -905 700 -340 -93 -317 693 779 -1030 1280 153
$$ packed form
3536h08O67k81m16J342j968J489q54M21k23O34p27r67K934k186k90L72J817k554
3554a598L14K724k628j41J150J458l811J901R38r60k50K73R42j544J583j338R82
3571eM1m88l5K92Q06k257K426o34o93k73J807n48j880K162r06P10j165R62p68
3590d46J27R45q96J074j900J285N9J204k257J27K286k053J16N31J397l413K363
3607E49J390k360p26J491J290k763J513k33O62q93k89R71k67J31k266L102r99
3624C03q93J48J335n59k044K657q04m34j136K130l83n48L93j312J244l8N87j609
3642i63J255n66n91J641j440M81n00J500j533Q19J13j177J060K99j99k173K976
3659A002j187n13M78M97k18q81J430j513J605j040K47k24J010Q6j809K310j127
$$ plain form
3676 153 -168 -519 1662 270 -1282 766 395 677 -725 754 -654 619 560 -345 326 -83 725 -101
3694 -101 1055 -623 26 431 19 332 119 549 -1071 1608 305 -381 451 1167 33 -933 1806 -225
3712 -225 -179 -124 1129 -228 -159 630 -518 856 -429 542 5 636 -358 -399 1295 -138 -515 -574 1509
3731 1509 -503 -225 326 195 307 -455 1002 -113 333 -854 862 879 -627 -37 602 1055 -1096 1031
3749 1031 396 -263 -159 544 748 -1156 1148 -229 101 -123 599 -299 -204 991 -626 651 -498 451
3767 451 -612 591 -41 -523 1019 -443 65 -212 828 -960 -64 447 -613 -319 -414 731 -1123
3784 -1123 553 -63 -34 -112 -168 420 -609 569 -1147 420 -13 -283 -256 113 378 -980 1048 -289
3802 -289 -125 -135 706 -257 -297 1011 -753 399 -238 562 -330 504 59 -564 736 -318 565 -190 1199
$$ packed form
3676A53l21l51K181j392j552K048l71K82j402J479j408J273n9r05O71m09Q08q26
3694a01J156j678O49M05m12L13k13M30j620K679j303o86Q32P16j134r66K739k031
3712b25M6N5J253j357O9P89j148J374j285R71n37O31r94m1J694j433l77n9K083
3731A509k012K78N51j31J12p62J457j115M46j187J716J7j506N90O39M53k151K127
3749A031o35o59J04P03K04j904K304j377L30k24P22q98R5J195j617J277j149R49
3767D51j063J203o32m82J542j462N08k77J040j788Q96N11j060K94r5J145j854
3784a123J676o16K9p8n6N88j029J178j716J567m33k70K7L69K65j358K028j337
3802b89J64j0Q41r63m0J308j764J152o37Q00q92Q34m45o23J300j054Q83p55J389
$$ plain form
3821 1199 -608 27 643 -383 525 -246 762 -760 466 124 -145 238 -396 565 -651 657 -812
3838 -812 280 -410 -215 256 -526 -327 -1017 852 -855 -287 -495 -60 -667 -875 678 -969 -340 -416 291
3857 291 -1188 -439 -88 -830 290 -917 -193 -1303 253 -937 -246 481 -841 -216 -366 753 -1289
3874 -1289 530 228 -670 -237 -148 429 -1187 249 -571 417 72 -394 25 60 765 -379 1007 -384
3892 -384 -301 195 826 -210 -859 801 -543 554 -163 356 -748 263 830 -686 571 31 558 -464
3910 -464 1145 -69 -274 370 130 487 -144 765 -782 524 470 -132 384 438 360 -969 1170 172 13
3929 13 -254 307 180 -259 858 -1130 650 31 307 -216 68 -213 -756 1236 -150 151 -639 520
3947 520 -140 129 34 -997 419 -280 164 -796 599 -312 -550 665 -125 -245 -937 958 -641 -32
$$ packed form
3821A199j807O35O16j026R08p71J008j522J226l42k69L83o34R61j216J308j469
3838h12J092o90J95M71p82J99o90J869j707N68k08M35o07k08J553j647O29p6P07
3857B91j479P49L51p42J120j207P24j110J556j190O91P27j322O25j50J119k042
3874a289J819l02q98M33Q9N77j616J436q20R88l45m66M19L5P05j144J386j391
3892c84Q3M96O31j036o49J660j344J097p17N19j104J011N67j516J257n40N27j022
3910d64J609j214k05O44k40L57o31R09j547J306n4o02N16N4p8j329K139r98j59
3929A3k67N61j27m39J117j988J780o19K76n23K84k81n43J992j386L01p90J159
3947E20o60K69r5j031J416o99M44r60J395r11k38J215p90j20o92J895j599O09
$$ plain form
3965 -32 -111 -313 -202 -589 513 -650 558 -674 -113 -155 503 289 -948 700 -631 674 -220 314
3983 314 -363 541 463 -454 731 -520 371 -193 758 -363 -456 392 -150 820 -154 273 -651 1253 189
4002 189 -968 581 409 26 -657 1257 -373 -125 84 296 239 -478 616 -462 800 -616 34 336
4020 336 138 -592 -839 1191 -540 -69 -222 668 -360 -91 417 -765 383 -541 196 -392 369 -358
4038 -358 117 750 -709 309 84 380 -827 678 10 -1059 375 671 328 -1216 982 117 -545
4055 -545 -221 625 523 -775 438 6 725 -475 163 579 499 -116 -504 1591 -581 -172 -55 1331
4073 1331 -524 -595 912 -223 232 -544 883 -410 68 186 -35 473 -443 249 -329 513 -645 437
4091 437 65 -123 471 -430 195 -837 885 -230 -106 271 345 -143 -468 1094 -746 280 -219 303
$$ packed form
3965c2p9k02J11l87J102j163J208j232N61m2O58k14j237J648j331J305q94N34
3983C14o77R04p8r17J185j251Q91n64R51j121r3Q48n42R70r74M27r24J904j064
4002A89j157J549j72l83o83J914j630K48K09K12n7p17J094j078J262j416O50L02
4020C36j98p30k47K030j731M71j53Q90j028K69N08j182J148r24P37n88P61p27
4038c58M75O33j459J018k25K96j207J505o68j069J434K96l43j544K198q65o62
4055e45L24Q46j02j298J213m32P19j200O38M16q0o15l88K095k172M09J17J386
4073A331j855p1J507j135M55p76J427j293M78J18k21N08r16O92n78Q42j158J082
4091D37l72j88N94r01O25j032J722j115J24L77P4m88l25J562j840J026m99N22
$$ plain form
4109 303 -263 72 527 -812 855 -244 -109 -436 798 -21 -983 423 119 500 -663 414 -452 366
4127 366 5 -143 638 -582 456 -454 912 -371 -215 118 296 168 -1026 355 -138 563 -833 -120
4145 -120 536 -588 -252 -272 774 -1349 238 168 -269 -649 244 695 -1239 48 -56 -89 -1338 284
4163 284 140 -1277 214 -94 300 -1558 370 299 79 -755 -395 444 -454 292 -657 720 -636 -100
4181 -100 464 33 -21 -386 1028 -433 275 -206 345 253 -69 150 -706 870 -630 74 -39 580 75
4200 75 -322 623 -579 624 -346 337 -141 -13 -36 -355 674 -455 42 -214 941 -858 -565 661
4218 661 -172 -45 -816 533 -523 115 -73 212 -163 -681 634 -560 -63 -962 330 -232 -338 28
4236 28 -65 -87 -1108 798 -963 -201 -500 -6 -261 -654 253 -274 176 -893 442 13 45 -34 199 243
$$ packed form
4109C03n66L35M55j339J667j099J35l27J234q19r62J406l04L81j163J077q66Q18
4127C66l61j48P81j220J038r10J366j283J56L33J78j28j194J381m93P01j396P13
4145a20O56j124L36k0J046k123J587p0m37l80Q93M51j934J287j04l3j249J622
4163B84j44j417J491l08L94j858J928p1k20q34L60Q39q98P46r49J377j356N36
4181a00N64m31n4l65J414j461P08m81N51r2l22K19q56J576j500P04j13O19n05
4200G5l97R45j202J203r70O83m78J28k3l19J029j129M97k56J155j799K93J226
4218F61q33J27p71J349j056O38j88K85l75n18J315j194M97q99J292n62j06L66
4236B8r3k2j021J906j761P62k99M94k55l93R07n27M50j069J335m29L2p9K33M4
$$ plain form
4256 243 -1142 510 143 353 -726 564 701 -586 -122 426 1012 -1029 387 856 26 -255 449 1342
4274 1342 -760 464 639 936 1 230 923 164 -19 -164 960 -315 419 16 563 209 -125 944
4292 944 -171 829 -491 504 327 160 216 -63 1217 -293 418 -5 1079 -191 16 511 -72 350
4310 350 47 739 -483 650 264 46 8 -160 738 -516 969 13 195 -364 137 246 -404 526 -515
4329 -515 533 -389 350 -83 150 98 -280 524 -738 413 -753 513 -375 -564 -142 -236 640 -1062 13
4348 13 -286 184 -678 -530 366 -695 -337 -820 501 -714 -287 144 2 -261 -641 431 -670 -167 -389
4367 -389 566 -581 -484 -22 -353 118 -724 621 -448 -241 -344 173 326 -1041 146 -272 398 -648
4385 -648 291 -96 46 -89 -235 583 -617 299 -70 308 -349 -60 562 -393 221 -155 382 -655 329
$$ packed form
4256B43j385J652l67K10j079J290J37j287M64N48N86k041J416M69q30k81P04Q93
4274A342k102J224J75K97r35K29O93p59j83j45J124j275P34m03N47l54l34J069
4292I44j115J000j320R95j77j67N6k79J280j510P11m23J084j270K07M95n83M22
4310C50l03O92j222J133l86k18l8j68Q98j254J485r56J82n59N01J09o50R30j041
4329e15J048r22P39m33K33n2l78Q04j262J151j166J266q88j89M22r4Q76j702J075
4348A3k99M70q62J48Q96j061L58m83J321j215M27M31j42k63l80J072j101N03k22
4367c89R55j147R7M62l31M71q42J345j069K07j03N17J53j367J187m18O70j046
4385f48R39l87J42j35j46Q18j200R16l69L78o57K89O22r55O14l76N37j037R84
$$ plain form
4404 329 237 -327 205 -175 391 -423 785 -433 184 246 354 -15 -303 465 -185 408 41 443 28 34 91
4425 91 -181 801 -255 403 104 465 -212 218 524 -83 333 -364 704 -316 308 64 114 321 -461 520
4445 520 -329 232 -499 571 -26 -139 306 -65 361 -747 799 -277 80 -143 153 136 -409 614 -255
4464 -255 369 -241 250 -239 -194 176 -635 -30 -734 806 -70 34 -173 -289 509 -611 274 -521 672
4483 672 -765 1 157 -333 -280 -488 805 -680 195 -121 356 -271 -317 333 -75 218 -815 465 40
4502 40 -51 -165 106 421 -541 509 -7 428 -596 70 197 -76 -59 -436 833 -133 187 -284 149 10
4522 10 -283 338 -524 293 -435 428 -197 122 -193 -319 265 -499 249 -461 469 -293 -197 4 -64 309 -653
4543 -653 -42 -569 49 -379 84 -153 -199 288 -603 174 -584 368 -457 -62 -130 -460 181 -466 197 -610 170
$$ packed form
4404C29r2n64N32l80N66q14J208j218O17O2J08l69k88P68o50N93l67M02m15ON7
4425I1k72R82j056O58k99L61o77M30L06o07M16o97J068j020O24k44N0K07p82R81
4445E20q49N61p31J070n97j13M45l71M26j108J546j076L57k23K96j7n45J023q69
4464b55O24o10M91m89M5L70q11O05p04J540q76J04k07j16P98j120Q85p95J193
4483F72j437P66J56m90N3k08J293j485Q75l16M77o27m6O50m08K93j033J280m25
4502D0r1j14K71L15r62J050n16M35j024O66J27k73J7l77J269r66L20m71M33j39
4522A0k93O21q62Q17p28Q63o25L19l15j26N84p64P48p10R30p62R6K01o8L73r62
4543f53O11n27O18m28M63k37m6M87q91P77p58R52q25L95o8l30O41o47O63q07P80
$$ [...]
8191B78
##END NTUPLES=NMR FID
##END=
