##TITLE=1H_TG-2292-E3
 CDCl3, 8 sc, 
 22.10.2020
##JCAMPDX= 6.0         $$ Bruker NMR JCAMP-DX V2.0
##DATA TYPE= NMR FID
##DATA CLASS= NTUPLES
##ORIGIN= UXNMR, Bruker Analytische Messtechnik GmbH
##OWNER= root
$$ XWIN-NMR		Version 3.5
$$ Thu Oct 22 11:22:17 2020 Russian Standard Time (UT+4h)  she@DPX200
##.OBSERVE FREQUENCY= 200.1315066352
##.OBSERVE NUCLEUS= ^1H
##.DELAY= (6, 6)
##.ACQUISITION MODE= SIMULTANEOUS
##.ACQUISITION SCHEME= undefined
##.AVERAGES= 8
##.DIGITISER RES= 18
##SPECTROMETER/DATA SYSTEM= spect
##.PULSE SEQUENCE= zg30
##.SOLVENT NAME= CDCl3
##.SHIFT REFERENCE= (INTERNAL, CDCl3, 0, 15.7039)
##AUDIT TRAIL= $$ (NUMBER, WHEN, WHO, WHERE, WHAT)
$$ ##TITLE= Audit trail, XWIN-NMR		Version 3.5
$$ ##JCAMPDX= 5.01
$$ ##ORIGIN= Bruker BioSpin GmbH
$$ ##OWNER= she
$$ F:/spectra/data/she/nmr/H-F/1/audita.txt
$$ ##AUDIT TRAIL=  $$ (NUMBER, WHEN, WHO, WHERE, WHAT)
(   1,<2020-10-22 11:21:00.90 +0400>,<she>,<DPX200>,
      <created by zg, POWCHK disabled, PULCHK disabled
       configuration hash MD5:
       00 E9 B6 7A A2 85 ED C7 34 08 36 98 17 FE 4E 26
       data hash MD5: 16K
       B8 F9 2F 3B 2A 1A 0E 0F 34 48 64 EB DE 51 C5 70>)
$$ ##END=
$$ 
$$ hash MD5
$$ C6 AF 7E 76 80 F3 49 13 67 4B 70 B9 60 00 19 0D
##$RELAX= 
##$RELAX= 
##$RELAX= 
##$RELAX= 
##$RELAX= 
##$RELAX= 
$$ Bruker specific parameters
$$ --------------------------
##$DU= <F:/spectra>
##$EXPNO= 1
##$NAME= <H-F>
##$PROCNO= 1
##$TYPE= <nmr>
##$USER= <she>
##$AMP= (0..31)
100 100 100 100 100 100 100 100 100 100 100 100 100 100 100 100 100 100 
100 100 100 100 100 100 100 100 100 100 100 100 100 100 
##$AQSEQ= 0
##$AQ_mod= 1
##$AUNM= <au_zg>
##$AUTOPOS= <>
##$BF1= 200.13
##$BF2= 200.13
##$BF3= 200.13
##$BF4= 200.13
##$BF5= 200.13
##$BF6= 200.13
##$BF7= 200.13
##$BF8= 200.13
##$BYTORDA= 1
##$CFDGTYP= 0
##$CFRGTYP= 5
##$CHEMSTR= <none>
##$CNST= (0..31)
1 1 145 1 1 1 1 1 1 1 1 1 1 1 1 1 1 1 1 1 1 1 1 1 1 1 1 1 1 1 1 1 
##$CPDPRG= <>
##$CPDPRG1= <>
##$CPDPRG2= <>
##$CPDPRG3= <>
##$CPDPRG4= <mlev>
##$CPDPRG5= <mlev>
##$CPDPRG6= <mlev>
##$CPDPRG7= <mlev>
##$CPDPRG8= <mlev>
##$CPDPRGB= <>
##$CPDPRGT= <>
##$D= (0..31)
0 1.2 0 0 0 0 0 0 0 0.06 0 0.03 0 0 0 0 0.0002 0 0 0 0 0 0 0 0 0 0 0 0 
0 0 0 
##$DATE= 1603351260
##$DBL= (0..7)
120 120 120 120 120 120 120 120 
##$DBP= (0..7)
150 150 150 150 150 150 150 150 
##$DBP07= 0
##$DBPNAM0= <>
##$DBPNAM1= <>
##$DBPNAM2= <>
##$DBPNAM3= <>
##$DBPNAM4= <>
##$DBPNAM5= <>
##$DBPNAM6= <>
##$DBPNAM7= <>
##$DBPOAL= (0..7)
0.5 0.5 0.5 0.5 0.5 0.5 0.5 0.5 
##$DBPOFFS= (0..7)
0 0 0 0 0 0 0 0 
##$DE= 6
##$DECBNUC= <off>
##$DECIM= 32
##$DECNUC= <off>
##$DECSTAT= 4
##$DIGMOD= 1
##$DIGTYP= 9
##$DL= (0..7)
0 120 120 120 120 120 120 120 
##$DP= (0..7)
150 150 150 150 150 150 150 150 
##$DP07= 0
##$DPNAME0= <>
##$DPNAME1= <>
##$DPNAME2= <>
##$DPNAME3= <>
##$DPNAME4= <>
##$DPNAME5= <>
##$DPNAME6= <>
##$DPNAME7= <>
##$DPOAL= (0..7)
0.5 0.5 0.5 0.5 0.5 0.5 0.5 0.5 
##$DPOFFS= (0..7)
0 0 0 0 0 0 0 0 
##$DQDMODE= 0
##$DR= 18
##$DS= 0
##$DSLIST= <SSSSSSSSSSSSSSS>
$$ [...]
##$SUBNAM2= <"">
##$SUBNAM3= <"">
##$SUBNAM4= <"">
##$SUBNAM5= <"">
##$SUBNAM6= <"">
##$SUBNAM7= <"">
##$SUBNAM8= <"">
##$SUBNAM9= <"">
##$SW= 16.880792210976
##$SWIBOX= (0..15)
0 0 2 0 0 0 0 0 0 0 0 0 0 0 0 0 
##$SW_h= 3378.37837837838
##$TD= 16384
##$TD0= 1
##$TE= 0
##$TE2= 300
##$TE3= 300
##$TEG= 300
##$TL= (0..7)
0 120 120 120 120 120 120 120 
##$TP= (0..7)
150 150 150 150 150 150 150 150 
##$TP07= 0
##$TPNAME0= <>
##$TPNAME1= <>
##$TPNAME2= <>
##$TPNAME3= <>
##$TPNAME4= <>
##$TPNAME5= <>
##$TPNAME6= <>
##$TPNAME7= <>
##$TPOAL= (0..7)
0.5 0.5 0.5 0.5 0.5 0.5 0.5 0.5 
##$TPOFFS= (0..7)
0 0 0 0 0 0 0 0 
##$TUNHIN= 0
##$TUNHOUT= 0
##$TUNXOUT= 0
##$USERA1= <user>
##$USERA2= <user>
##$USERA3= <user>
##$USERA4= <user>
##$USERA5= <user>
##$V9= 5
##$VALIST= <valist>
##$VCLIST= <CCCCCCCCCCCCCCC>
##$VD= 0
##$VDLIST= <DDDDDDDDDDDDDDD>
##$VPLIST= <PPPPPPPPPPPPPPP>
##$VTLIST= <TTTTTTTTTTTTTTT>
##$WBST= 1024
##$WBSW= 4
##$XGAIN= (0..3)
0 0 0 0 
##$XL= 0
##$YL= 0
##$YMAX_a= 761950
##$YMIN_a= -606289
##$ZGOPTNS= <>
##$ZL1= 120
##$ZL2= 120
##$ZL3= 120
##$ZL4= 120
##$ABSF1= 10
##$ABSF2= 0
##$ABSG= 5
##$ABSL= 3
##$ALPHA= 0
##$AQORDER= 0
##$ASSFAC= 0
##$ASSFACI= 0
##$ASSFACX= 0
##$ASSWID= 0
##$AUNMP= <proc_1d>
##$AZFE= 0.1
##$AZFW= 0.1
##$BCFW= 1
##$BC_mod= 2
##$BYTORDP= 1
##$COROFFS= 0
##$CY= 11.3945322036743
##$DATMOD= 1
##$DC= 2
##$DFILT= <>
##$DTYPP= 0
##$F1P= 16.9975609425685
##$F2P= -3.02152046262296
##$FCOR= 0.5
##$FTSIZE= 0
##$FT_mod= 4
##$GAMMA= 1
##$GB= 0.15
##$INTBC= 1
##$INTSCL= 1
##$ISEN= 128
##$LB= 0.24
##$LEV0= 0
##$LPBIN= 0
##$MAXI= 10000
##$MC2= 0
##$MEAN= 0
##$ME_mod= 0
##$MI= 1.114404
##$NCOEF= 0
##$NC_proc= 0
##$NLEV= 6
##$NOISF1= 3.799351
##$NOISF2= 2.8
##$NSP= 1
##$NTH_PI= 0
##$NZP= 0
##$OFFSET= 15.70392
##$PC= 1
##$PHC0= -10683.81
##$PHC1= 4.000889
##$PH_mod= 1
##$PKNL= yes
##$PPARMOD= 0
##$PSCAL= 0
##$PSIGN= 0
##$REVERSE= no
##$SF= 200.130013532006
##$SI= 16384
##$SIGF1= 3
##$SIGF2= 2
##$SINO= 400
##$SIOLD= 16384
##$SREGLST= <1H.CDCl3>
##$SSB= 0
##$STSI= 0
##$STSR= 0
##$SW_p= 3612.71676300578
##$SYMM= 0
##$S_DEV= 0
##$TDeff= 0
##$TDoff= 0
##$TI= <>
##$TILT= no
##$TM1= 0
##$TM2= 0
##$TOPLEV= 0
##$USERP1= <user>
##$USERP2= <user>
##$USERP3= <user>
##$USERP4= <user>
##$USERP5= <user>
##$WDW= 1
##$XDIM= 8192
##$YMAX_p= 0
##$YMIN_p= 0
$$ End of Bruker specific parameters
$$ ---------------------------------
##NTUPLES= NMR FID
##VAR_NAME=  TIME,          FID/REAL,        FID/IMAG
##SYMBOL=    X,             R,               I
##VAR_TYPE=  INDEPENDENT,   DEPENDENT,       DEPENDENT
##VAR_FORM=  AFFN,          ASDF,            ASDF
##VAR_DIM=   8192,          8192,            8192
##UNITS=     SECONDS,       ARBITRARY UNITS, ARBITRARY UNITS
##FACTOR=    0.000296,      1,               1
##FIRST=     0,             0,               0
##LAST=      2.424536,      0,               0
##MIN=       0,             -606289,         0
##MAX=       2.424536,      761950,          0
$$ Real data points
##PAGE= N=1
##DATA TABLE= (X++(R..R)), XYDATA
$$ [...]
2326a774L317L09l673K594O41m85j077K980l480Q91K414k663k91J996O58l810
$$ -1774 1543 1852 -1821 773 1414 929 -148 2832 -648 243 2657 -6 -297 1699 2357 -1453
2342a453L997r39l000J487K128j035k511L487j936Q96n49j088j99K203m01l253
$$ -1453 2544 1605 -1395 92 2220 1185 -1326 2161 225 1121 572 -516 -715 1488 1087 -2166
2358b166M086j616j806Q08K308l608K86M088l825n1J335K24l635L620L56l732
$$ -2166 1920 304 -1502 -694 1614 -1994 -1708 2380 -1445 -1496 -161 63 -3572 48 404 -3328
2374c328L351K89k381j476M387k164r81J654q94P66L99n87k756L869r32j143J999
$$ -3328 23 312 -2069 -3545 842 -1322 -2303 -649 -1543 -777 -378 -965 -3721 148 -784 -1927 72
2391G2q6j794O54L846m751N05K275M31j351J346k78k657M455j442j570R10L056
$$ 72 -14 -1808 -1154 2692 -2059 -1554 721 1152 -199 1147 869 -1788 2667 1225 -345 565 3621
2408C621k952n74L446l171M09J140O49k268K637n23k295K475p37p43L52K091l832
$$ 3621 669 95 3541 370 779 1919 2568 300 2937 2414 119 2594 1857 1114 1466 3557 -275
2425b75R96L123k861j295J309J220k562L068k190j838K362R13k281j504L387k537
$$ -275 721 3844 983 -312 997 2217 -345 2723 533 -1305 1057 1970 -311 -1815 1572 -965
2441i65J219O13j673j367K160M51l089L005j696l13J137J124l540J23L798l223
$$ -965 254 867 -806 -2173 -13 438 -2651 354 -1342 -1655 -518 606 -2934 -2811 987 -2236
2457b236j32J474N09k494J848l70j418K626j428m96L88K656l635O44J732k099
$$ -2236 -2368 -894 -385 -2879 -1031 -1401 -2819 -193 -1621 -2117 -1729 927 -2708 -2064 -332 -2431
2473b431R17J611K44l589L300l32o84P84n07r86J585L050m680K87K290N1k004
$$ -2431 -1514 97 341 -3248 52 -280 -964 -180 -687 -1673 -88 2962 -1718 -1431 859 910 -1094
2490a094J765Q82l034L077l03j008n99J516j227Q36K018l516J311R69j26k585
$$ -1094 671 1553 -1481 1596 1293 285 -314 1202 -25 811 2829 -687 624 1593 1467 -1118
2506a118L021r2k350K023m68l89k97J562l214J914J987k876k69J391P51l459L219
$$ -1118 1903 1811 -539 1484 1016 627 330 1892 -1322 592 2579 -297 -566 825 1576 -1883 1336
2523A336n20k041J174J435r53j678J921j881J678L13j404m26J990l16k756L087
$$ 1336 816 -1225 -51 1384 431 -1247 674 -1207 471 784 -620 -1046 944 628 -2128 959
2539I59r88p27M62J974k295l40K584k737J153O56j85j833K935o52k487K616k45
$$ 959 -29 -756 -294 1680 -615 -955 1629 -1108 45 701 516 -1317 1618 966 -1521 1095 850
2556H50r41m85K703k211J5J280j243L00K63K28j761K951j690o13J444o41j002
$$ 850 -91 -576 2127 -84 -69 1211 -32 268 531 759 -1002 1949 259 -354 1090 449 -553
2573e53K64K512l327J348P76j051j052J767n14k373L217r73p14q5J299k223J92
$$ -553 -289 2223 -1104 244 1020 -31 -1083 684 170 -2203 1014 41 -673 -758 541 -1682 -1490
2590a490K598k831O95Q80n6k075J969n77j253K013o26k86l49J392k112J257O99
$$ -1490 1108 -1723 -1028 -148 -204 -2279 -310 -887 -2140 -127 -753 -1039 -1388 4 -2108 -851 -152
2607a52j799J190J004l9k394K844j019j085J124M83o19rJ904k683J470q1l77K35
$$ -152 -1951 -761 243 204 -2190 654 -365 -1450 -326 157 -462 -471 1433 -1250 220 139 -238 -3
2625cJ481p08k191L292j231r09L86J691k143K26K360k260J09M12N26j608J764
$$ -3 1478 770 -1421 1871 640 -269 117 1808 -335 -109 2251 -9 100 512 1038 -570 1194
2642A194j78j387J305j75j21j000J655j601J110M83j330N81j07j37j093K927k504
$$ 1194 1016 -371 934 759 638 -362 1293 -308 802 1285 -45 536 429 292 -801 2126 -378
2659c78o64K323l12j738J86K393l554J415J545o36j809J410R22k406J924n73l96
$$ -378 -1042 1281 969 -769 -583 1810 -1744 -329 1216 580 -1229 181 1103 -1303 621 48 -348
2676c48k29J743j086m54R23j815J984j79j07j551K103m84j169J925j628l92J066
$$ -348 -577 1166 80 -374 549 -1266 718 539 432 -1119 984 500 -669 1256 -372 -764 302
2693C02J791k965R59J192j776O21Q54m94j979L179o79j704J233J53j196l0K508
$$ 302 2093 -872 87 1279 -497 124 978 484 -1495 1684 1005 -699 534 687 -509 -539 1969
2710A969k672J179K30r50k15J595o80k657L247o74n70l02R90j976L98K133j867
$$ 1969 -703 476 706 -244 -459 1136 456 -2201 1046 372 -198 -500 490 -1486 -1088 1045 -822
2727h22M48m76N00n96J231j781q95K739r87k49j13R51k390J789P65k166O22R54
$$ -822 -374 -850 -350 -946 285 -1496 -2391 348 -639 -888 -1001 -50 -2440 -651 114 -2052 -1430 -476
2745d76J17j804K752j990q57J784N13j351j40K348k382L77O44M58j011J67O55
$$ -476 -359 -2163 589 -1401 -2258 -474 39 -1312 -1452 896 -1486 -1109 -465 -7 -1018 -851 -196
2762a96j42J586k051L28N78O66q31Q69N45k698K714J79r47j379K519o09p56J887
$$ -196 -338 1248 -803 -475 103 769 -62 807 1352 -1346 1368 1547 600 -779 1740 1131 375 2262
2780B262j459r84J140K525l654M96K109j007n97Q40N29k376J895k46k78j69K49
$$ 2262 803 -181 959 3484 -170 326 2435 1428 831 1671 2200 -176 1719 1473 1195 1026 1275
2797A275k09o74J027j701J719n67p00L15J122j023j634K524j769L69O39J22k138
$$ 1275 1066 392 1419 -282 1437 870 170 485 1607 584 -1050 1474 -295 74 713 835 -1303
2814a303J047J564k486J096j18R9p04K199k059j550K644o78r05M27J494k681J476
$$ -1303 -256 1308 -1178 -82 -200 -101 -805 1394 -665 -2215 429 -249 -1154 -727 767 -1914 -438
2831d38J229k350j26J487M62k476K321n56p31L13M71m69n19J451j361J404r97
$$ -438 791 -1559 -1685 -198 264 -2212 109 -447 -1178 -865 -394 -863 -1382 69 -1292 112 -885
2848h85J09J39M04q99J3K549k609M3J067N98k184J514J545k919J346J055n51j949
$$ -885 -776 -637 -233 -1132 -1119 1430 -1179 -1136 -69 529 -1655 -141 1404 -1515 -169 886 335 -1614
2866a614K310m14j065J557p50o2l2J499k397J004R03j190M63M15K33j648K004
$$ -1614 696 282 -783 774 24 -38 -70 1429 -968 36 939 -251 212 627 860 -788 1216
2883A216r84j33M72j79k70L72P15k278J887k93o83M4J042m91j427K488j696n73
$$ 1216 232 99 571 392 122 494 1209 -1069 818 525 -158 -114 928 437 -990 1498 -198 -771
2901g71Q29N61j375P68P98k007J154M01m10j309K036n27j032J440p21j90n01J626
$$ -771 58 619 -756 12 810 -1197 -43 358 -52 -1361 675 148 -884 556 -165 -355 -856 770
2919G70j476O72L55o90O01k05k36o61K223j797K01J005l25j084O31J460k651J704
$$ 770 -706 -34 321 -369 232 27 -209 -870 1353 -444 -243 762 437 -647 -16 1444 -1207 497
2937D97L09p69n05J733m15j972K032p80J27J28P90j774K78J373j580P81m59O60
$$ 497 806 37 -468 1265 850 -1122 910 130 257 385 1175 -599 -321 1052 -528 253 -206 454
2955D54p82J347j234q47J723q22k17J68J061k201J533L37j681M22P73m8j267J943
$$ 454 -328 1019 -215 -1062 661 -161 -378 -210 851 -1350 183 520 -1161 -739 34 -14 -1281 662
2973F62j371P0P43o37o38R87J291l166J813P16j152o94J845n48j899K896p82j199
$$ 662 -709 -639 104 -533 -1171 -184 1107 -2059 -246 470 -682 -1376 469 -79 -1978 918 136 -1063
2991a063J04J732j121q5N33j184J323J17p5j480J491n15j15J200j192J39L41J026
$$ -1063 -959 773 -348 -433 100 -1084 239 356 281 -1199 292 -223 -338 862 -330 -191 150 1176
3009A176k167J134K59r26J394K8p32p62K447k136l33J859j73j170M15J390k465
$$ 1176 -991 143 402 -524 870 898 166 -596 1851 -285 -618 1241 1068 -102 313 1703 -762
3026g62J602K65r91l89J530P6j898J480j199P76j18L59j403J040J020j501M83
$$ -762 840 1105 114 -275 1255 1331 -567 913 -286 490 372 731 -672 368 1388 -113 370
3043C70m21kj90J751j524p22J562p05J4l89R51j848J937K7j472L96P03O7j534
$$ 370 -51 -53 -243 1508 -16 -738 824 119 133 -256 695 -1153 784 811 -661 -265 438 505 -1029
3062a029J787j172M11M70n76k25K97P44j986J845o6r18L77J276j296j154K665
$$ -1029 758 -414 -3 467 -109 -334 -37 707 -1279 566 500 -418 -41 1235 -61 -1215 1450
3079A450j069p38j3J594j260J19N92j442J533l40rq78J482j163k01J555j481j20
$$ 1450 381 -357 -370 1224 -36 83 675 -767 766 426 417 -461 1021 -142 -343 1212 -269 -389
3097c89M37J357k323R85M23j070N58K74m71p25K125j713n67J227l30p34J52J232
$$ -389 48 1405 -918 67 490 -580 -22 252 -219 -944 1181 -532 -1099 128 -202 -936 -784 448
3115D48j798J233m35l27l08O11k32l71J298j805Q17O45j93j763J818Q84k338J331
$$ 448 -1350 -117 -552 -879 -1187 -576 -808 -1179 119 -1686 -869 -224 -417 -2180 -362 522 -1816 -485
3133d85L86l95j201K080r25r50J602l42j44O2P97j689J146N11j161R71J57j6q07
$$ -485 -99 -494 -1695 385 -540 -1490 112 -230 -374 -312 485 -1204 -58 453 -708 263 420 404 -403
3152d03J663j520M40Q56o12m09O51P70k233J982j90q87L48Q71o08q67J816j399
$$ -403 1260 -260 180 1036 424 15 666 1436 -797 1185 995 108 456 1327 719 -148 1668 269
3170B69K42J37L55r35Q61L38j653J398j99q49k54J692j584k79J540j200k47O2
$$ 269 511 648 1003 68 929 1267 -386 1012 813 -36 -290 1402 -182 -461 1079 -121 -368 -306
3188c06J145j752J307m72n36P50k61o05m02J892j933K55R96l71r66K48J134j704
$$ -306 839 -913 394 -78 -614 136 -125 -730 -1132 760 -1173 -918 78 -293 -1259 -1011 123 -1581
3206a581J096j7L2l51M70o09j06J493j932P06P61o8j440J519M92k043J522K80
$$ -1581 -485 -502 -470 -821 -351 -960 -1066 427 -1505 -799 -38 -106 -1546 -27 465 -1578 -56 224
3224B24l16p55J539p48n87J320p54L07J74O23j520J389r3q48N99L84k18o02J718
$$ 224 -92 -847 692 -56 -643 677 -77 230 404 1027 -493 896 803 -45 554 938 720 118 1836
3243A836j339J80M35l56m90N88O84j570J457m81l34m16J184q14q91J930j395J46
$$ 1836 497 677 1112 756 266 854 1538 -32 1425 944 610 194 1378 564 -327 1603 208 354
3261C54L0L29j148R02j3j259J357o2o01p75J623j200r4R14j002L24J76N56j888
$$ 354 384 713 -435 467 454 -805 552 490 -111 -886 737 -463 -557 357 -645 -321 -145 411 -1477
3280a477J701L5j288J057K22p84o45K340j758l25J116J60p12K7J057j427J156
$$ -1477 224 259 -1029 28 250 -534 -1179 1161 -597 -922 194 354 -358 -331 726 -701 455
3297D55l53p2OL13l12j26J333k047Q22Q11N1j490J339M07j732J173k51m71k99
$$ 455 102 30 36 349 37 -89 1244 -803 19 830 881 -609 730 1137 -595 578 327 -144 -443
3316d43J792j530m51J412p93M1k44O56j396J421l60q70N41K86j63p32J269j716
$$ -443 1349 -181 -632 780 -13 28 -216 440 -956 465 105 -765 -224 62 -101 -833 436 -1280
3334a280Q25N36o48o55J065L34j903J645k70n74J85P68r58l87J616j048J72j56
$$ -1280 -455 81 -567 -1222 -157 177 -1726 -81 -351 -925 -740 28 -930 -1317 299 -749 -577 -733
3352g33O29o25O56kj190J452m72p1j52O59r05P39O98j612N63N35N28j726J485
$$ -733 -104 -729 -73 -75 -1265 187 -285 -356 -508 151 -754 -15 683 -929 -366 169 697 -1029 456
3371D56Rj339J170L51n28r04K141j134k45M29J51m55q7Q88j049J200o32k61K72
$$ 456 465 -874 296 647 119 -785 1356 222 -23 406 557 102 15 903 -146 1054 422 161 433
3390D33M23o51RJ118j639L98P29P2j550J002O59j271Q64k64j73o46J473j204j03
$$ 433 856 205 214 1332 -307 91 820 892 -658 344 1003 -268 596 332 159 -487 986 -218 -321
3409c21Q36n96L54j39J98j153J376m84p92Q60j20n50j07J456k017M83J302o65
$$ -321 515 -81 273 134 332 -821 555 71 -721 139 19 -531 -638 818 -1199 -716 586 -79
3427g9j302J346O68k189J079M05k42m53Q59m41o13J009n91M24m23K13j17P11m87
$$ -79 -1381 -35 633 -1556 -477 -72 -314 -767 92 -349 -962 47 -544 -120 -543 -330 -447 264 -223
3446b23o36J344o79rK56P49j572O25J412j412j82O98N35j940J812O3j243O43M82
$$ -223 -859 485 -194 -203 53 802 -770 -145 1267 -145 -327 371 906 -1034 778 841 -402 241 723
3465G23l83p81J476r43K77J1n4q0K7J53q12J438r53l67N01N26j159j6J576j481
$$ 723 340 -441 1035 92 369 380 326 246 273 426 -386 1052 99 -268 233 759 -400 -416 1160 -321
3485c21J17K07L92r07M36M39q09L89q3K79m02O74q54L82L72q50M41J60K26j110
$$ -321 -204 3 395 -512 -76 363 -446 -57 -140 139 -263 411 -443 -61 311 -539 -98 62 288 -822
3505h22J414k52p86Q29N8m60k94J332j333L30K73N4l30K73K76q07J135n72j64
$$ -822 592 340 -446 383 441 -19 -313 1019 -314 16 289 343 13 286 562 -245 890 318 154
3524A54J33M58m35j45P48j366J024Mpq48R65K33j359J287l23m31l66J196r15k24
$$ 154 287 745 310 165 913 -453 571 575 568 -280 685 918 -441 846 523 92 -274 922 7 -217
3544b17O09j86j72q6P12j182P93O0m95K48j68J15m31O32r32P57r2q12K40N63k77
$$ -217 392 206 34 -52 660 -522 271 331 -164 84 -84 31 -400 232 -700 57 -35 -847 -607 -44 -321
3565c21r99J533o96m63M64P72j482J9J658j123k87J98L88n86P26k9j359J269N8
$$ -321 -1320 213 -483 -946 -482 290 -1192 -1173 485 -638 -925 -727 -339 -925 -199 -228 -1587 -318 -260
3584b60l5o12J005q62n3R32o86J01J2O07r70R70m33m05P98k50l38M7J101j205
$$ -260 -295 -907 98 -764 -817 115 -571 -470 -458 149 -821 149 -284 -689 109 -141 -479 -432 669 -536
3604e36M22P39m57j58M1K83o40J169n42l64J87M23n73M30L87j400R99M85j2j354
$$ -536 -114 625 168 10 51 334 -306 863 321 -43 144 567 -6 424 811 -589 410 895 883 -471
3624d71J042r8p79R51k61k44n88J574j105l44O86n08L62m34O27r43P88n00K33
$$ -471 571 473 -306 645 384 140 -448 1126 21 -323 363 -145 217 -217 410 -533 255 -245 -12
3643a2K77n31J4o2Q96j384R71j53m88j03J062k34j222J081m47J45k26P38q58k17
$$ -12 265 -266 -252 -314 582 -802 169 16 -472 -575 487 253 -969 112 -335 -190 -416 322 -536 -753
3663g53J335r38J74l00N54m37O89j52q83Q55k36N03k62K10r63N86Q19r18L98m0
$$ -753 582 -356 -182 -482 72 -365 324 172 -711 144 -92 411 149 359 -604 -18 801 -117 281 241
3683B41K38p47R84l22l00N62k07k26k67J063j062K69L92j18l93L34N4p34J200
$$ 241 479 -268 716 394 94 656 449 223 -44 1019 -43 226 618 500 107 441 495 -239 961
3702I61p05l1l57O64n61r7O10p02M25n8J78o82M98k70k63P40n78o7l7N65p25J79
$$ 961 256 225 -132 532 -29 -126 484 -218 207 149 327 -355 143 -127 -390 350 -228 -295 -332 233 -492 -313
3724c13M23q90N19L02j62r94J371m57m85O87J22n78m07J455n68k53J60lj84M51
$$ -313 110 -780 -261 41 -121 -1115 256 -201 -686 1 123 -455 -862 593 25 -228 -68 -71 -255 196
3744A96K1r12J102l91K6J7L08n15K23P12r75K77J24L73n95M48j3l11M32m57M07
$$ 196 217 -695 407 16 42 59 367 -148 75 787 -188 89 213 586 -9 439 426 115 547 90 497
3765D97k70K27p42P37J22o47L63J49N9j023J290p65l97P39K2n20k88J012j043
$$ 497 227 454 -288 449 571 -76 287 436 495 -528 762 -3 -400 339 361 -159 -447 565 -478
3784d78M30J8r4l44K77L99q36N98n10K07j04L51k82j17J82m61P60n63Q2l9N37
$$ -478 -48 -30 -124 -468 -191 208 -628 -30 -540 -333 -437 -86 -368 -485 -303 -764 -4 -567 -485 -524 13
3805A3m84k61O84l92l1l77R14q41K41O48n61J12r2M87q64O66m3j71K20J03J42
$$ 13 -471 -732 -48 -440 -471 -848 66 -775 -534 114 -447 -335 -427 60 -804 -138 -181 -352 -132 -29 113
3826A13m47P23o95L39N5l0J44k8p2j48O02n20ok3O63p82j2Q40q18L04o8N39q14
$$ 113 -334 389 -306 33 88 58 202 174 102 -46 556 36 30 7 670 -112 -124 716 -102 202 134 673 -141
3849a41M19q9l36O42m41L9l19Q27r46N28J09m60K04J50L54r33M77k89J02J07R2
$$ -141 278 189 -147 495 54 93 -226 601 -345 183 292 -168 36 186 540 -393 84 -205 -103 4 96
3870I6m68L0R40j002L83l1l7j56K18P3m88P04o31L36k9R0k61K79K44o36M65q4
$$ 96 -372 -342 598 -404 -21 -52 -89 -245 -27 46 -442 262 -369 -33 -62 28 -233 46 290 -346 119 35
3892C5L90q34P38o4l81L33k51N24l64M31p17K70L46l00P9j68J79m12Q14l60o2
$$ 35 425 -409 329 265 -116 217 -34 490 126 557 -160 110 456 156 235 67 246 -166 648 288 226
3913B26l16J14M25p5Q3j026R04J48l90j27M09n8n19P01p49K97k56N01l37q6K91
$$ 226 -90 24 449 374 457 -569 335 483 93 -34 375 317 -202 499 -250 47 -209 292 -45 -131 160
3934A60o10O01n59M98o00O61k16j95J08o3J04m87N31n32P76l51m80L09J10K07
$$ 160 -450 151 -408 90 -510 151 -65 -260 -152 -215 -111 -598 -67 -599 177 -174 -654 -345 -235 -28
3954b8p62P00m21J62J42N6j20l50P86l89K14k70k16K13N09J42j003P28l3M08q10
$$ -28 -790 -90 -511 -349 -207 -151 -271 -621 165 -224 -10 -280 -496 -283 226 368 -635 93 60 468 -342
3975c42P88j63p3M6j94O38m92J99k65N36l06m43R65n45l0o1P00p78r4N34l02O6
$$ -342 446 283 210 256 62 700 208 407 142 678 372 -71 894 349 319 258 958 180 86 620 318 384
3997C84l87M43p46Q79j90m58n6J04J99m01M22m90N06m07NJ13j76J63m98R57q89
$$ 384 -3 440 -306 573 383 -75 -131 -27 172 -229 193 -297 209 -198 -193 -80 -256 -93 -591 366 -523
4018e23r6M3P94p64l18M44q7L34o15L94q9L68m49j15P18l41j28k37Q48p16K23
$$ -523 -619 -576 218 -546 -864 -420 -507 -173 -788 -394 -483 -115 -564 -679 39 -302 -430 -667 181 -535 -312
4039c12K06j90J74k55N89l93N80p87K35O92m46m58P3R48o95L80k60N21l32k94
$$ -312 -106 -296 -122 -377 212 -181 399 -388 -153 539 93 -365 -292 656 -39 341 81 602 270 -24
4059b4M67j53L35r96Q13j01j72l70P04m3o41P04k24k29j76N65l89p3M83o28m3
$$ -24 443 290 625 -371 442 341 169 -201 503 460 -181 523 299 70 -106 459 70 -3 480 -148 -191
4080a91M6Q62j013M5N67j60n70P1O45o68K47k62M58J9k67j91K88m4n05O25j15
$$ -191 -145 717 -296 -251 316 156 -414 -343 302 -366 -119 -381 77 96 -171 -362 -74 -118 -623 2 -113
4101a13J8j98K95m0o24Q02m15K95j85J67k63J43L98n59L90j55M23p34J45M92L8
$$ -113 -95 -293 2 -38 -662 140 -275 20 -165 2 -261 -118 280 -279 111 -44 379 -355 -210 282 320
4122C20k70n05Q15l30M39q27N70R8l37K04J60L8n56P43n37L0M5m0K08j06M96q66
$$ 320 50 -455 360 30 469 -358 212 310 -27 177 337 375 -181 562 25 55 100 60 268 162 658 -208
4144b08M49m4J70m02j4K07%R2n40N67O1k71l07O57j13q03N85K53m23o34P95Q8
$$ -208 241 197 367 -35 -49 158 158 250 -290 277 338 67 -240 417 304 -499 86 339 -84 -718 77 165
4166A65p47M90M32j32r53M71L05K23n04J16K82l17L22l54M14q04Q10O5m03k11
$$ 165 -582 -92 340 208 -745 -274 31 254 -250 -134 148 -169 153 -201 213 -591 219 284 -119 -330
4186c30K39L85q18R17l19l34N0P33k54q68R97r2l4p31R81k12m23M95k38K28k61
$$ -330 -91 294 -524 393 74 -260 -210 523 269 -599 398 306 272 -459 522 310 -113 382 144 372 111
4207A11M02j67J52m41K39K02m06K11o1L42m56J74L2j34K25j62J5n31P61l49k03
$$ 111 513 346 498 57 296 498 92 303 242 584 128 302 334 200 425 263 278 -253 508 159 -44
4228d4p6L96r6l63M73n69O79p28L76k95k83N9R1O86r68M6J82L47n05K04M27p54
$$ -44 -120 276 180 -183 290 -279 400 -328 48 -247 -530 -471 -380 306 -662 -616 -434 -87 -592 -388 39 -715
4250g15L25j56O48r00L22L13l83j39J57O16r71M23K19K97q91L15L71m19K86n7
$$ -715 -390 -546 102 -798 -476 -163 -546 -685 -528 88 -883 -460 -241 56 -835 -520 -149 -568 -282 -339
4270c39N23p22K63L97Q7n87M1P81p15L02p6K30m14L76L32m97K96l31P01p00K22
$$ -339 184 -538 -275 122 209 -378 -337 444 -271 31 -45 185 -229 147 479 -18 278 -53 648 -52 170
4291A70KK5j73j4N55n06M08n54P65n66j45N70m22Q5k02N67m97l5K02j9j46r7K09
$$ 170 172 197 24 10 565 59 467 -87 678 112 -33 537 115 200 -2 565 68 33 235 216 70 -27 182
4314A82m82N38n48P24n65n6L25k84M48n36N04o48N77j53o9n8r3O48q57M03N1K42
$$ 182 -300 238 -310 414 -151 -207 118 -166 282 -254 250 -398 179 26 -43 -101 -194 454 -403 0 51 293
4336B93n48K19L41n10L67m8L37n38K21J43L4o1k10N24o07M08m87P89m58k4J81
$$ 293 -255 -36 305 -205 162 114 451 -87 134 277 311 250 40 564 -43 365 -122 667 209 185 366
4357C66j54Q5m28O76l00j9l56L83J58m28K26k23R8l24L74j55P7l9j29J23l98N25
$$ 366 212 297 -131 545 245 226 -130 253 411 -17 209 -14 84 -240 134 -21 56 17 -112 11 -387 138
4379A38j56k60p6J68j96l6M10m92q0K62K33m10o6M16j00J8l70O51q27M19M44l27
$$ 138 -18 -278 -354 -186 -382 -418 -8 -500 -580 -318 -85 -495 -561 -145 -245 -227 -597 54 -773 -354 90 -237
4401b37j13m8N60n59M4M3L63l10K04N1k50L07j76L56m57M33j22j21J67k81K73
$$ -237 -350 -398 162 -397 -353 -310 53 -257 -53 -2 -252 55 -121 235 -222 211 89 -32 135 -146 127
4422A27k22L36k4O7k39K81o2j56K40l18K13k30M84k70K82l35j93N10k75Nk36P88
$$ 127 -95 241 217 284 45 326 264 108 348 30 243 13 497 227 509 174 -19 491 216 221 -15 773
4444G73m54j90J13J71Kn18O99m99J41k76J32J29m29K61q6M12m58L10j17j3k93
$$ 773 319 129 242 413 415 -103 596 97 238 -38 94 223 -206 55 -31 381 -77 233 116 103 -190
4465a90J50K53l22K41n95K75K87r9o0k34L35m68N67l84J19k86N1K91l12J74k70
$$ -190 -40 213 -109 132 -463 -188 99 0 -60 -294 41 -427 140 -244 -125 -411 -360 -69 -381 -207 -477
4486d77M52l51K03k06J88J80k20K47n8K33m98L93k58kJ91j23M43o53M23j12K10
$$ -477 -25 -376 -173 -379 -191 -11 -231 16 -42 191 -307 86 -172 -174 17 -106 337 -316 107 -5 205
4507B05j52j34J35R2o1l12K93k25L95k79J15jn1K47m58L43l72M87j46m5j44p7
$$ 205 53 -81 54 146 85 -227 66 -159 236 -43 72 71 20 267 -191 152 -220 267 121 76 -68 -145
4529a45L18l65J71j58N63m41JJ84m41L91m03L85n53M62oJ07j93j85L11l73M75
$$ -145 173 -192 -21 -179 384 -57 -56 128 -313 78 -325 60 -493 -31 -37 70 -123 -308 3 -370 105
4550A05n49L11j77K54m6m57M24N4J19o54O12k34O9K34k60K95o72Q40m04J88k36
$$ 105 -444 -133 -310 -56 -102 -559 -135 -81 38 -616 -4 -238 -169 65 -195 100 -572 268 -136 52 -184
4571a84K39Q2MJ33l41N37k76o6j20L85k2k19L22l31J18o6M27m85J56J40k22J67
$$ -184 55 137 141 274 -67 470 194 128 8 393 371 152 474 143 261 195 622 137 293 433 211 378
4593C78l94N88m34K86k11j18J93k63M51m76N03k32Ol09O7N6k43K82k49N38m63
$$ 378 -16 572 138 424 213 95 288 25 476 0 503 271 277 -32 35 91 -152 130 -119 419 -44
4614d4L5j23P4j82r8O13k88N6l27K87n80J82K56k43L85l64K49j91L45m78K71L5
$$ -44 -9 -132 -58 -240 -338 275 -13 43 -284 3 -577 -395 -139 -382 3 -361 -112 -303 42 -436 -165 -130
4636a30Q7K2k45L97m33L97m11M70l01j02M5J62K83m83K95J4k62N8o4N40m94M31
$$ -130 -43 -21 -266 131 -302 95 -316 154 -147 -249 -204 -42 241 -242 53 67 -195 -137 -201 339 -155 276
4658B76l96N73l65L3k1K5K42m57L40q2J50l84L73L4n91M40j09n5j82L08k0j64
$$ 276 -120 453 88 121 100 125 367 -90 250 168 318 -66 307 341 -250 190 81 26 -156 152 132 -32
4680c2P5l93L59j30L15p57O50P6k84j41K78M5l35K84l30L00j21q5K41k50N9j93
$$ -32 43 -350 9 -121 194 -563 87 163 -121 -262 16 61 -274 10 -320 -20 -141 -226 15 -235 -176 -369
4702c69N39m62J70m9J66o9j60J99k99M99l04K22n02L45Q0q1K74l20M97m61L97
$$ -369 170 -292 -122 -171 -5 -74 -234 -35 -334 165 -139 83 -419 -74 6 -75 199 -121 376 -85 312
4723C12j75k27L87k36K67k03K74m25K16l1n5K48l34J70q7K95n64N80j11j28k19
$$ 312 137 -90 297 61 328 125 399 -26 190 159 104 352 18 188 101 396 -168 412 301 173 -46
4744d6K41L06p43L16P9J43l28K2K6j36K55k96J65l76M37j78M2k43j93O69o35N25
$$ -46 195 501 -242 74 153 296 -32 -10 16 -120 135 -161 4 -372 65 -113 -71 -314 -507 162 -473 52
4766E2m75L99l75J18L98n19J1J47L95q15M93J06j74k42L12L21n04L24%P8m47K74
$$ 52 -423 -24 -399 -281 117 -402 -391 -244 151 -664 -171 -65 -239 -481 -169 152 -352 -28 -28 50 -397 -123
4788a23K62j85j07p5M94l45j02K55J88l00k23O68l25j7j01M47k58j28L06j94L33
$$ -123 139 -46 -153 -228 266 -79 -181 74 262 -38 -261 407 82 65 -36 411 153 25 331 137 470
4809D70o57N46k65M09n14L57R4j52q8k3O3q7K0j72K25k7j29j5j90N19n93J94O0
$$ 470 -187 359 94 503 -11 346 440 288 200 177 240 153 173 1 226 199 70 55 -135 384 -209 -15 45
4832D5J71l44l9M87m93K18k10M24m22p8Q0n3J07l01L00l39J92q6K70k94j70N22
$$ 45 216 -128 -167 320 -173 45 -165 259 -163 -241 -161 -214 -107 -408 -108 -447 -255 -341 -71 -365 -535 -13
4854a3q8j71k78P13n60k5N35l65p6o4N21l44K47k00K58j32k14M15J37r3k54M88
$$ -13 -101 -272 -550 163 -397 -422 113 -252 -328 -392 129 -215 32 -168 90 -42 -256 159 296 203 -51 437
4876D37m05J6L47k19k8k18N71j24k77N3L63k93l67O48k37l8l12O72l94j01L33
$$ 437 32 48 395 176 148 -70 501 377 100 153 516 223 -144 504 267 229 -83 589 195 94 427
4897D27k55J85m97N10l49L00k31P9j39k58M78l21N9m53O77n34K31P9j65J09l65
$$ 427 172 357 -140 370 21 321 90 169 30 -228 250 -71 -12 -465 212 -322 -91 -12 -177 -68 -433
4918d33P05o78K01r6L10l83j22M93n18L09l46N90k07l59L86J04j12k76L60j99
$$ -433 272 -406 -205 -301 9 -374 -496 -3 -521 -212 -558 32 -175 -534 -148 -44 -156 -432 -72 -271
4938b71K80k31L84m9n15M14K35j46o26P11K02l21R5l4K18m75O08m03J83m66N92
$$ -271 9 -222 162 113 -402 12 247 101 -525 186 388 67 162 128 346 -129 479 76 259 -207 385
4959C85kn82L20J26P9n50O16N4j54k80J53J16o32O64q2k58R6L75m73l40O74k86
$$ 385 383 -199 121 247 326 -224 392 446 292 12 165 281 -351 313 231 -27 69 444 -29 -369 305 19
4981A9l9k05M63m95K38q8R0J53m54K12j38M29o88M85P9m81K91l8K51m96N72n84
$$ 19 -20 -225 238 -257 -19 -107 -17 136 -318 -106 -244 185 -503 -18 61 -420 -129 -167 84 -412 160 -424
5003d24J11J72J01K0m16N20m71L77p3M5j8J5J81l51L98m58K65J2q8j11L47M1n43
$$ -424 -313 -141 -40 -20 -436 84 -387 -10 -83 -38 -56 -41 140 -211 187 -271 -6 6 -82 -193 154 195 -348
5026c48P05Qj66n11N55O6m64J4K41L06q31N81j78J85j62j84M71k27j10l33O65
$$ -348 357 365 199 -312 243 309 -155 -141 100 406 -425 156 -22 163 1 -183 288 61 -49 -382 283
5047B83o57K99K53l54J78j38M64p28K59K22j38k28L74om18L30j89L47m81M79j34
$$ 283 -374 -75 178 -176 2 -136 328 -400 -141 81 -57 -285 89 83 -335 -5 -194 153 -328 151 17
5068A7l7m7j81P60n81n6Q2M57o08q6N86j86m11J42P43p48l7M53j25M9L9K39p60
$$ 17 -20 -67 -248 512 -69 -125 -43 414 -194 -280 306 120 -291 -149 594 -154 -191 262 137 186 225 464 -296
5091b96Q39j82k87kM09j82l88N74m48L53l02J39k8j15J29L6K31m81P6J90R2n40
$$ -296 543 361 74 72 481 299 -89 485 37 390 88 227 199 84 213 249 480 -1 75 265 357 -183
5113a83Q0M56l66L69m07J25l92L36m4k70K69q6n4K8M47p45J49J09j23J18oJ01
$$ -183 -103 353 -13 356 -51 74 -318 18 -26 -296 -27 -113 -167 -139 308 -437 -288 -179 -302 -184 -190 -89
5135h9n29O61m69K27Q5j66j24o9O92n96J01k11N58m70M8K63k03L63m40L78k51
$$ -89 -618 43 -426 -199 -114 -280 -404 -473 219 -377 -276 -487 71 -399 -351 -88 -291 72 -368 10 -241
5156b41O5k01K07J87m86N66k84K24j93l5J99j50M89l33J25l21L72l45J25M88k47
$$ -241 -176 -377 -170 17 -469 97 -187 37 -156 -191 8 -142 347 14 139 -182 190 -155 -30 458 211
5177B11j66o3M88n50L79J55k73J07j1K2k13K49k00J91k26K51j61K02N5k89Q6j37
$$ 211 45 -18 470 -80 299 454 181 288 277 299 86 335 135 326 100 351 190 392 447 158 244 107
5199A07K77pN6n08L41p4k17l4K25J35l54J22J50j38k05m5K40j57K15m12N16j36
$$ 107 384 377 433 -75 266 192 -25 -59 166 301 -53 69 219 81 -124 -169 71 -86 129 -283 233 97
5221I7l96K79q7N4j67J56k0k05o7K45j03k30N17m19K68j9J29l48J81K14n46N99
$$ 97 -299 -20 -107 -53 -220 -64 -84 -289 -356 -111 -214 -444 73 -346 -78 -97 32 -316 -135 79 -467 132
5243A32l40K86j88J86l13K7L77m67L51q5M7l04M35r0m97N96j72P2p1L27o58K39
$$ 132 -208 78 -110 76 -237 -210 167 -300 51 -34 13 -291 144 54 -443 153 -19 53 -18 309 -349 -110
5265a10J38j55O5J88K15n57L32k34M4Q3p2r7j2N13o18L40r9k49R4K42J18o44P45
$$ -110 28 -127 -62 126 341 -216 116 -118 -74 9 -63 -160 -172 341 -277 63 -36 -285 -191 51 169 -475 270
5288B70m16j03M8M08l66Q9K50l66L21j04K15n18K70J57o1o9j5M9j18L46l90J03
$$ 270 -146 -249 -201 207 -159 -70 180 -186 135 31 246 -272 -2 155 94 25 10 59 -59 287 -103 0
5310@Q5j40J73j02O8m12O29l92M0K51J48k23k26M34m88K91j46Q6k04K08O7l15
$$ 0 85 -55 118 16 84 -328 301 -91 -51 200 348 125 -101 333 -155 136 -10 76 -128 80 147 -168
5332a68O97n13R1j11K18k40r5M02l68K37m3L31m61K08k3j09J09k1r6L2K21l65
$$ -168 529 16 107 -4 214 -26 -121 281 -87 150 107 438 -23 185 162 53 162 141 45 77 298 -67
5354f7K21J18l56K66k75N15o33N46m56Q6Qj60r4o0N56m59K57P9j67k17K00Q6m33
$$ -67 154 272 -84 182 -93 422 -211 335 -121 -35 -27 -187 -281 -341 215 -244 13 92 -75 -292 -92 -6 -439
5377d39L23k24K88k13K18k60OL76n43K77Q6j72m14P06j74p4K45r1o5j9L39n15
$$ -439 -116 -340 -52 -265 -47 -307 -301 75 -468 -191 -105 -277 -691 15 -159 -233 12 -79 -144 -163 176 -339
5399c39M14k2l84K20Q4J87m07M81l97R7J36R9J26l29K36k69M25k50J85l15M28
$$ -339 75 53 -331 -111 -27 160 -247 234 -163 -66 70 169 295 -34 202 -67 358 108 293 -22 406
5420D06j07l41Q68p57n5j4M38n34R9M23n50N18k41l5j40L52m40k3M28k29j49k14
$$ 406 299 -42 826 69 14 0 438 -96 3 426 -124 394 153 118 -22 330 -110 -133 295 66 -83 -297
5442b97O11n33K95P6j06k5L4j17N9L22n91M06N8j14k44J28K00n41L02R9K35k36
$$ -297 314 -219 76 152 46 21 55 -62 -3 319 -272 134 192 78 -166 -38 162 -379 -77 22 257 21
5464B1K70k94j96L12k44K42R5Qj85k70M89n11K65K26j49k19L90j36j66J71P3k62
$$ 21 291 -3 -199 113 -131 111 206 214 29 -241 248 -263 2 228 79 -140 250 114 -52 119 192 -70
5486g0j61N10l91N8L3j83J14j3L21n34M38k93j78J50K00j73j75N97o72M08j16
$$ -70 -231 279 -112 -54 -21 -204 -90 -103 218 -316 122 -171 -349 -199 1 -172 -347 250 -422 -14 -130
5507a30j02j12K36j39j77L38j28k2k73M01m04J58J82l14M15r5p3q2L50l76n0M01
$$ -130 -232 -344 -108 -247 -424 -86 -214 -236 -509 -108 -512 -354 -172 -486 -71 -166 -239 -321 29 -347 -397 4
5529Dq2j5k9L09n97K90L18j05j44J14K01m82N32k44J48j26K12R1l42M95m94M12
$$ 4 -78 -93 -122 187 -410 -120 198 93 -51 63 264 -218 314 70 218 92 304 395 53 548 54 466
5551D66r3k3j42M99j13l46O04n22K18k98M81o10K71J89m40J58Q7J08l88L28l1
$$ 466 373 350 208 707 594 248 852 330 548 250 731 121 392 581 141 299 386 494 106 434 403
5572D03q8O2k86J09m8K47n96L68Q3m87M42N6m69L8M61m77l53L05L67n73J56N57
$$ 403 315 377 91 200 152 399 -197 171 254 -233 209 265 -204 -166 295 -182 -535 -230 137 -436 -280 277
5594B77p09J75p5L04l40J33J36m26L19k58L1K5K13j67K4K83m95L79k01K17q8L37
$$ 277 -432 -257 -332 -28 -368 -235 -99 -525 -206 -464 -433 -408 -195 -362 -338 -55 -550 -171 -372 -155 -243 94
5616I4m55J08L70j54j82J19M34p53M24K16l56L6J93L1l88M03j02n1K37q7k64N9
$$ 94 -361 -253 117 -37 -219 -100 334 -419 5 221 -135 -99 94 125 -263 140 38 -13 224 137 -127 -68
5638f8M11m32K56n3o8k97L69M0m42O59l46p0LK78k19j61M31n44K43J4k3j88L11
$$ -68 343 -89 167 114 46 -251 118 158 -284 375 29 -41 -38 240 21 -140 291 -253 -10 4 -19 -207 104
5661A04k25j75J42l4K21r5J49n10L83j15j65K16K61m7o51P30k76j93J36L84m77
$$ 104 -121 -296 -154 -188 33 -62 87 -423 -40 -155 -320 -104 157 110 -541 189 -87 -280 -144 240 -237
5682b37R8N37p99M27k09J64k14M49o3l15N22m85J65j69L47l03J45K17l81M47K
$$ -237 -139 398 -401 26 -183 -19 -233 216 153 -162 360 -125 40 -129 218 -85 60 277 -104 343 345
5703C45l91k00N26l4l95L15l8j96j02N99l45L1K19j76M8k6pl01M29n18K96K37
$$ 345 -46 -246 280 246 -149 166 128 -68 -170 429 84 115 334 158 206 180 173 -128 301 -217 79 316
5725C16J4m85J10M02p29N34l1l1l33M67r4p72O58j14j6j48L29m09J84Q5k95K46
$$ 316 330 -155 -45 357 -372 162 131 100 -233 234 140 -632 26 -88 -104 -252 77 -332 -148 -63 -358 -112
5747a12j4j6l06M14q8q6K89k13l3J4K77m96L70Nj76j39L68J12n77M12K7k8o3j62
$$ -112 -126 -142 -448 -34 -122 -208 81 -132 -165 -151 126 -370 0 5 -171 -310 58 170 -407 5 32 4 -59 -221
5771b21MK14J84m28M20j16j56K1K99l17k13P49m93j1n9K85m04J44L07o11N22j5
$$ -221 -217 -3 181 -247 173 57 -99 -78 221 -96 -309 440 -53 -64 -123 162 -242 -98 209 -402 120 105
5793A05l0m37M92l47J0K63j81P4j7K86o42L78Nj27J45j35O4j68K97k25n6L60L
$$ 105 75 -362 130 -217 -207 56 -125 -51 -68 218 -424 -46 -41 -168 -23 -158 -94 -262 35 -190 -246 114 117
5816A17l97L58K07m95K70r3jo1M19k13l19N70l72o3K85K39m71M04o7l90M58k57
$$ 117 -280 78 285 -210 60 -33 -34 -95 324 111 -208 362 -10 -73 212 451 -20 384 317 -73 385 128
5838A28J11l09M69k36p8N70l65k41K1M89o87L30K09j63L4j08l0k74O20l60J85
$$ 128 239 -70 399 163 85 655 290 49 70 559 -128 202 411 248 282 174 144 -130 490 130 315
5859C15j64K7l4Qm4l57O76K7m68R9q9J8l54N56k28K8J07k1n93L37P4k28P9K0O8
$$ 315 151 178 144 152 108 -249 427 454 -14 85 -4 14 -340 216 -12 16 123 102 -491 -154 -80 -308 -229 -209 -141
5884a41n14O32k58N6M3J7J2j77M08n81N02M0m16m8M43k26j52N70n36O8L46l4l75
$$ -141 -655 -23 -281 -225 -182 -165 -153 -330 78 -503 -1 39 -377 -425 18 -208 -360 210 -326 -258 88 54 -321
5907c21M8M90n21K67P0l11j16M94o8k27L48k28K32j69J60m40M34n2j24J66L2j28
$$ -321 -273 217 -304 -37 33 -278 -394 100 32 -195 153 -75 157 -12 148 -292 142 90 -34 132 164 36
5929C6k17N27k79j20K56m7p3Q6J24m83M12J38k14mJ16j61j40L02m75L05J12n2
$$ 36 -181 346 67 -53 203 156 83 169 293 -190 222 360 146 142 258 97 -43 259 -216 89 201 149
5951A49l46K77J39m87L31J6k12M4M73m46k72O01m56K1R6L27l91J63n8k81L58l16
$$ 149 -197 80 219 -268 63 79 -133 -89 384 -62 -334 267 -189 -168 -72 255 -136 27 -31 -312 46 -270
5973b70J26j05L77j83k47L78k12mJ03K34n27M68m1l63R9Q8Lk16N03k23QN7M8k18
$$ -270 -144 -249 128 -55 -302 76 -136 -140 -37 197 -330 138 97 -266 -167 -79 -76 -292 211 -12 -4 53 101 -117
5997a17k4N21p89M93QP5j74L31k57n45P27k90p2R2L38l78K38P7l67L96kJ0k85
$$ -117 -141 380 -409 84 92 167 -7 324 67 -478 249 -41 -113 -21 317 -61 177 254 -113 283 281 291 6
6020FL38l58l35N65r8k7k25O59o88J96O5l86K88K32j85k52N30m29J63p2L75q00
$$ 6 344 -14 -349 216 118 91 -134 525 -163 33 98 -288 0 232 47 -205 325 -104 59 -13 362 -438
6042d38M89J91l83L75j67n5j59K49k11nK39Ro2J2J53n38L70J09l68L67p3J48m85
$$ -438 51 242 -141 234 67 12 -147 102 -109 -114 125 134 72 84 237 -301 69 178 -190 177 104 252 -233
6065b33M53k35j65M91l26P5N6J86o66M09O5j75J23J69r8m11O13m85J69J26J65
$$ -233 220 -15 -180 311 -15 60 116 302 -364 45 110 -65 58 227 129 -282 331 -154 15 141 306
6086C06m93K01M29n34P1j4%m1L79k87k65O42n94P4J33J84l65K17J59n12L34j03
$$ 306 -187 14 443 -91 -20 -34 -34 -75 304 17 -248 394 -200 -126 7 191 -174 43 202 -310 24 -79
6108g9j36r8Q22o06j16K87o7k83K36J93l87J12o7Q1n1L2Nj83K14k74O4L22J29
$$ -79 -215 -313 509 -97 -213 74 7 -276 -40 153 -234 -122 -189 -108 -159 -127 -122 -305 -91 -365 -301 21 150
6131A50m33J39L24n87K42J39k0j91L91k95j82M93k99r9L30R8m19J93L12l32J76
$$ 150 -283 -144 180 -407 -165 -26 -46 -237 154 -141 -323 170 -129 -228 102 200 -219 -26 286 -46 130
6152A30J00j8k64M47k98k79L87k36J47m8J12n09O18j27j14j43M28j24m13O44l78
$$ 130 230 212 -52 395 97 -182 205 -31 116 68 180 -329 289 162 48 -95 333 209 -204 440 62
6173F2j03l5K26k02K14K23m31J93k8k39J50K23m92N2N38n19J18K32mn59K88L80
$$ 62 -41 -76 150 -52 162 385 -46 147 119 -120 30 253 -239 -187 351 -168 -50 182 178 -381 -93 287
6195B87m80K94j33J13l84M90n22N2N07k45q1j04L17m05M02J08m20K14L05l64l57
$$ 287 -193 101 -32 81 -303 187 -335 -283 224 -21 -102 -206 111 -294 108 216 -204 10 315 -49 -406
6216d06O45m03q4K45J27l93J61M12o94M06K13k22k97L67j70j06K78l74K35l3K47
$$ -406 239 -164 -248 -3 124 -269 -108 304 -390 16 229 7 -290 77 -93 -199 79 -295 -60 -93 154
6237A54m47K42L54n67K82j27m7q4M36k22k37L00k99J24K12J54p70N04K77n97P1
$$ 154 -293 -51 303 -264 18 -109 -156 -240 196 -26 -263 37 -262 -138 74 228 -542 -38 239 -358 -287
6258b87L06j91l32O83o24J90J51Q8k74J5L32k53K93l8k03j81N34n47M4L81k21
$$ -287 19 -172 -504 179 -445 -255 -104 -16 -290 -275 57 -196 97 59 -144 -325 209 -338 -294 87 -134
6279a34r5M14O2l16J38L09o53K68L6kn5M99n81Q3K47k40L37j49K94n90M00P7k31
$$ -134 -229 185 247 -69 69 378 -275 -7 29 27 -28 471 -110 -27 220 -20 317 168 462 -128 272 349 118
6302A18J79J17Jm22O72o73nL72Pl63K1M47p99P36kk60l06M90m8k29L89l13o8M6
$$ 118 297 414 415 -7 665 -8 -13 359 366 3 24 471 -328 408 406 146 -160 330 282 53 442 129 61 107
6326A07J01m63N89o4l95L43P0k82j68M24m76J90L05l54J3J4O5m73L93O0l18J16
$$ 107 208 -255 334 270 -125 218 288 6 -162 262 -214 -24 281 -73 -60 -46 19 -454 -61 -1 -319 -203
6348b03K67q9n46O28m26J30K34j08k74K45O8n37M83j05k00k5P67n28j41N34m17
$$ -203 64 -25 -571 57 -369 -239 -5 -113 -387 -142 -74 -611 -128 -233 -433 -458 309 -219 -360 174 -243
6369b43O6K2J53k39K29R4l99J46J51k3l37N93k10j43K73k60j06J68J24l17N92
$$ -243 -177 -155 -2 -241 -12 82 -317 -171 -20 -43 -380 213 3 -140 133 -127 -233 -65 59 -258 334
6390C34j28l35L79kk74m18Q86l97J47QM3j15rJ02o04N27Q8k15j74M71j56m11O40
$$ 334 206 -129 250 248 -26 -444 442 45 192 200 243 128 119 221 -383 144 232 17 -157 314 158 -253 387
6413C87m70j43R9K87m35L55L9m62N00l2n4k16P96r35o8N57k99j05J19N47q60N35
$$ 387 -83 -226 -127 160 -275 80 119 -343 157 125 71 -145 651 -284 -352 205 -94 -199 -80 467 -393 142
6435A42j36j87J93J38M8l24N77o96K31M37k99l72O31m7n22K83J07l48J2L84m19
$$ 142 6 -181 12 150 198 -126 451 -245 -14 423 124 -248 383 336 -186 97 204 -144 -132 252 -167
6456a67O8O65m15Rk97L10n96N68R8l25L00j83j52l44P73n46J89K17k62p6J37J82
$$ -167 -99 566 151 160 -137 173 -423 145 243 -82 218 35 -117 -461 312 -234 -45 172 -90 -166 -29 153
6478A53p74N44pj85K31J40k24k17N90o52N4K53J23k42L06J18o16M20kk28J43J69
$$ 153 -621 -77 -84 -269 -38 102 -122 -339 251 -401 -347 -94 29 -213 93 211 -405 15 13 -215 -72 97
6500I7j87l26P57m27l13M66K0l26M36J30m89M05j01k68J34M12j89n01O98l38j41
$$ 97 -90 -416 341 -86 -399 67 87 -239 197 327 -162 243 142 -126 8 420 231 -270 428 90 -51
6521e1J06K93m21N25l56K6R7n0k34n2O40n34K17K71k56m61O19qp19O22M7k54j04
$$ -51 55 348 -73 452 96 122 219 169 -65 -117 523 -11 206 477 221 -240 379 371 -348 274 321 67 -37
6544c7K87j09l15M59o16J88L07j00m88L89J53n16J84L13km53O58m88p5M37j45
$$ -37 250 141 -174 285 -331 -143 164 64 -424 -35 118 -398 -214 99 97 -356 302 -186 -261 176 31
6565C1n86P76N4p68O27k18q8o8M25j57k81P00o54J33m4n7j12L46Qj11J06K9l07
$$ 31 -555 221 275 -493 134 -84 -172 -240 185 28 -253 447 -207 -74 -118 -175 -287 59 67 -44 62 91 -216
6588b16p7O17m38j49P39n07j81J80K94n25M12K22n23K43Q1k42j1M86n17J42K61
$$ -216 -293 324 -114 -263 476 -31 -212 -32 262 -263 149 371 -152 91 172 -70 -81 405 -112 30 291
6609B91k18N8K17M7o49M64j55k03J52K76l14%N85o25QJ94L0n19M68l8k65M46j88
$$ 291 73 131 348 395 -254 210 55 -148 4 280 -34 -34 551 -74 -66 128 158 -361 107 69 -196 250 62
6632F2k52O5M27m04m7M38k08q4q2J42k27M11L4n89K25nk76N4P48l85k21K77l20
$$ 62 -190 -125 302 -102 -149 289 81 -3 -85 57 -170 241 275 -314 -89 -94 -370 -316 432 47 -174 103 -217
6655b17k7L05k01j84O17l12k18K96P2j90k63P13o57K70K44l20j23K60J67m02L09
$$ -217 -244 61 -140 -324 293 -19 -237 59 131 -59 -322 391 -266 4 248 -72 -195 65 232 -170 139
6676A39j13l9M0L40n71p2M65k29k7M6J10l67M22J10m98K73K88l09j99N68p17K34
$$ 139 26 -13 27 367 -204 -276 189 -40 -67 -21 89 -278 144 254 -244 29 317 8 -191 377 -340 -106
6698a06K92l27Q7K06P4l59L15j97l57K49L16l18j18N61n62J72J21r5k01K98J58
$$ -106 186 -141 -54 152 226 -133 182 -15 -372 -123 193 -125 -243 318 -244 -72 49 -46 -247 51 209
6719B09m74L53p4l19p0O08l79j95O90l46n3J52j31l79M99M7l69L21l4j06o0M21
$$ 209 -265 88 14 -305 -375 233 -146 -341 349 3 -50 102 -29 -408 91 138 -231 90 56 -50 -110 311
6741C11n78K91M01j70m95M44J03o77P38M0m47R2K68l05J47L99p45K06K46ll83
$$ 311 -267 24 425 255 -240 204 307 -370 368 408 -39 53 321 16 163 562 -183 23 269 266 -117
6762a17M53o2o27M36j29k37J59M80m51O6J91k98o0K39Qo5K66q6o11N76N5n29K65
$$ -117 336 274 -353 83 -46 -283 -124 356 -95 -29 162 -136 -196 43 51 -14 252 166 -445 131 186 -343 -78
6785g8L86l98j5L14m20J0P5L30n68O13k02k01J2K40l56J91L77o44J66M02k36m46
$$ -78 308 -90 -105 209 -211 -201 -126 204 -364 249 47 -154 -142 98 -258 -67 310 -334 -168 234 -2 -448
6807d48O91Ln77M77K4j97j19N44m03j28M09n07K16K28n1m04M77K4m04L38O2k14
$$ -448 243 246 -331 146 170 -27 -146 398 -5 -133 276 -231 -15 213 162 -242 235 259 -145 193 255 41
6829D1p9L40m62K12L49l14k34L20J90p15O34k59k88L24K3j53j93O44n42r2K14
$$ 41 -38 302 -160 52 401 87 -147 173 363 -352 282 23 -265 59 82 -71 -264 380 -162 -254 -40
6850d0j22J3L05q5m52L31j24j2j03L97j77mM70m99j8J39M7m91P19k49l58K99J66
$$ -40 -162 -149 156 71 -381 -50 -174 -186 -289 108 -69 -73 397 -102 -120 19 66 -425 294 45 -313 -14 152
6873A52k05j23M39n47J14K12j02LJ06j12k97N26j31k36J35J74l85K9M16l88n0
$$ 152 -53 -176 263 -284 -170 42 -60 -57 49 -63 -360 166 35 -201 -66 108 -277 -248 168 -220 -270
6894b70N16j3l73L66R9m43J70J48k79J06L57l61L1K44m70K24L4r7l23P31k16l77
$$ -270 246 233 -140 226 325 -118 52 200 -79 27 384 23 54 298 -172 52 86 -11 -334 397 181 -196
6916a96K99J31m41LM92m84J21O2k71Q6K75k3m71N11k4k71M07j98k66O3O45o58
$$ -196 103 234 -207 -204 288 -196 -75 -13 -284 -198 77 54 -417 94 70 -201 206 8 -258 -195 450 -208
6938b08L70Kj06m31J40L86l97M00J21l03j41L27k01k18N52m14J64M1j11k25L56
$$ -208 162 164 58 -373 -233 153 -244 156 277 -26 -167 160 -41 -259 293 -121 43 84 -27 -252 104
6959A04j43l94N60R6k92L4M77n48l0L76o8l98M95J56p22N18k11k50L48q1r6k2
$$ 104 -39 -433 127 223 -69 -35 442 -106 -136 240 172 -226 269 425 -297 221 10 -240 108 27 -69 -91
6981i1L83m17R3K4Mk26M58Q5k90L35k22k12J88J18k51p5M31k86j02J80p4n51N41
$$ -91 292 -125 -32 -8 -4 -230 228 313 23 358 136 -76 112 230 -21 -96 335 49 -53 127 53 -498 43
7004D3J44n00L19J98n58J31M60o15K15M88k49j68K32j30n60O16k90J59m9M09o18
$$ 43 187 -313 6 204 -354 -223 237 -378 -163 325 76 -92 140 10 -550 66 -224 -65 -114 295 -323
7025c23n9M64m79K63J45J35l19K29J89p68N50j61K14l00M25m30j1M18n24J14K93
$$ -323 -382 82 -397 -134 11 146 -173 56 245 -523 27 -134 80 -220 205 -225 -236 182 -342 -228 65
7046F5L1l55O05l56oO8J23k60O8M84n46J56O7k61K5J94P6l09N01j20k35k0K07
$$ 65 96 -259 346 -10 -16 52 175 -85 -17 467 -79 77 144 -117 -92 102 178 -131 370 250 15 -5 202
7069B02l90JQ18q70J10K96j8j87K58q7l98N19mj91k7J68m64J66K88l58J76J2l3
$$ 202 -188 -187 631 -239 -129 167 149 -38 220 133 -265 254 250 59 32 200 -264 -98 190 -168 8 20 -13
7092a3m23L89kk16M19j74q9n0N37o38j9N21k78j94K37R6m10N52k51j25O0M32k14
$$ -13 -436 -47 -49 -265 154 -20 -109 -159 378 -260 -279 242 -36 -230 7 103 -307 245 -6 -131 -71 361 147
7115A47k55L99m56R9J44Rl62N55j48m57N38j80j43jM11m90P5M41m73J04N6J38
$$ 147 -108 291 -165 -66 78 87 -275 280 132 -325 213 33 -110 -111 300 -190 -115 326 -147 -43 13 151
7137A51o35O26pm51K21J75k37l4M65n18J57J60l21J88J23k06l21O17j72j76j10
$$ 151 -484 142 135 -316 -95 80 -157 -191 274 -244 -87 73 -248 -60 63 -143 -464 153 -19 -195 -305
7158c05N51o16K11M57m84k7K01R7n45L73Q1l32L02p2k30k1O17n88j2N22n49J39
$$ -305 246 -370 -159 298 -186 -213 -12 85 -460 -87 -6 -338 -36 -108 -338 -359 258 -330 -342 180 -369 -230
7180b30K89J11m10N52p6n67M44O8j36o5M94n31p6N48k67j12M7Q7k98M60l0k69
$$ -230 59 170 -240 312 236 -331 113 181 45 -20 474 -57 -133 415 148 36 83 170 -128 332 302 33
7202C3J03R6m78K05N20l14M4q4k6k65O04k04k56K97p1j17k93N56n81J95L82n14
$$ 33 136 232 -246 -41 479 165 209 125 99 -166 438 234 -22 275 204 87 -206 350 -231 -36 346 -168
7224a68K00J29M0m96O25l19k09K76P4o4q1K25o46K74K26j73KK26J34p40N41k43
$$ -168 32 161 201 -295 330 11 -198 78 152 88 7 232 -414 -140 86 -87 -85 141 275 -465 76 -167
7246a67r5J75L00m45M4O82p27M4J23P6m20N68N4o58N63j09j93pM92l40J73J06
$$ -167 -262 -87 213 -232 -188 494 -233 -189 -66 10 -410 158 212 -446 117 8 -185 -192 300 -40 133 239
7268B39l72J15K24m7n41N80m5j48J58k59k3p4N24o8j65L27l97q0J52o6l75N95
$$ 239 -133 -18 206 159 -382 198 153 5 163 -96 -119 -193 331 263 98 425 28 -52 100 34 -341 254
7290B54j73l2J83M2m24k00N27n49L27K02q7m5J58k93k16L17k3p7J9M10n47oK99
$$ 254 81 49 232 274 -150 -350 177 -372 -45 157 70 25 183 -110 -326 -9 -32 -109 -90 320 -227 -233 66
7313F6n12J52K88M9m54N45k60l06M00l4l78J85O45n74o6L51j60r5K33j28l34N66
$$ 66 -446 -294 -6 43 -411 134 -126 -432 -32 -66 -444 -259 386 -188 -254 97 -63 -158 75 -53 -387 179
7335A79k63O2n8K47l52M1L92k45J17R2k28j29K68pk56K85p7%j74N72m79o5N35
$$ 179 -84 -22 -80 167 -185 -144 248 3 120 212 -16 -145 123 116 -140 145 68 68 -106 466 -13 -78 457
7358D57n28K46O1On34L68P2j77J13J56j90P6M09p09M9M49l61RK32p5l48N04l80
$$ 457 -71 175 236 242 -292 76 148 -29 84 240 50 126 535 -174 -125 324 -37 -28 204 129 -219 285 -95
7381i5j79J78L66k65L8L21n66M4K30j00o4L93O7o73N65j42k30o0L41l31K08M12
$$ -95 -274 -96 270 5 43 364 -202 -158 72 -28 -92 301 368 -305 260 118 -112 -172 169 -162 46 458
7403D58o07M9J82nm89O24j36LJ38j97j25nK90n74L29M65m09n4M14q6p94O72L3
$$ 458 -149 -100 82 77 -412 212 76 79 217 20 -105 -110 180 -394 -65 400 -9 -63 351 265 -529 143 176
7426A76k72K20K7k10q8L75n11K36L33k39l73M66k62j12K28r1PQ1K32n68K07K65
$$ 176 -96 124 151 -59 -147 228 -283 -47 286 47 -326 140 -122 -234 -6 -97 -90 -9 223 -345 -138 127
7448A27k80nJ69R5j95J76r3k77L10j77j44J49M02l95J47L7l34Q1J25R7l07N81
$$ 127 -153 -158 11 106 -89 87 -6 -283 27 -150 -294 -145 257 -138 9 46 -288 -207 -82 15 -292 289
7470B89k23j90L2L22m20K19M41m92J24K78k80k14L52o5l09K86J58r2k54M99o33
$$ 289 66 -124 -92 230 -190 29 470 -22 102 380 100 -114 238 173 -136 150 308 216 -38 461 -172
7491a72M6L92p5j22J44J03p69O99n9k77Q6J48K6l14N71o78L24K39l56L3R7K1n51
$$ -172 -126 266 191 69 213 316 -453 246 187 -90 -4 144 170 -144 427 -251 73 312 -44 -11 86 107 -444
7514d44M59M3m57K93K72j26j23M64n43J6K03k48j14M72j98l43N54j15l43O6K50
$$ -444 15 58 -399 -106 166 40 -83 381 -162 -146 57 -191 -305 167 -31 -374 180 65 -278 -212 38
7535C8l39J43K78k50j20J89ol71O01k15k51M74j92k29n9O03n93K58q3M2j43J26
$$ 38 -301 -158 120 -130 -250 -61 -67 -438 163 -52 -303 171 -21 -250 -309 294 -299 -41 -124 -82 -225 -99
7557i9J40l91P17k75k65J99L3l61J70L84m25J05k2Q6l15M73j61l23M52N4k38J71
$$ -99 41 -350 367 92 -173 26 59 -302 -132 252 -173 -68 -90 -4 -319 154 -7 -330 122 176 -62 109
7579A09L17m50j65M04k79j26M11q2l50N40k43k74J97N9j58O5L81m27M6p2j8j03
$$ 109 426 -24 -189 215 -64 -190 221 139 -211 329 86 -188 9 68 -90 -25 356 -71 -25 -97 -115 -218
7601b18J05L15n48O05j31l72K02K48l05p7M33l75j8R7O2k37K61k02K1K74q8q5
$$ -218 -113 202 -346 259 128 -244 -42 206 -99 -176 257 -118 -136 -39 23 -214 47 -155 -134 140 52 -33
7623c3J21K20n03j49M99l29k5M29N8p21N55j51l13M80L4k71R5L09m42l3L71j93
$$ -33 88 308 -195 -344 155 -174 -199 230 288 -433 122 -29 -342 138 172 -99 -4 305 -137 -170 201 8
7645Hl9L07n2m78M41J0l65J64L33m09j3M25m16K18o5p6o4K92r7k95M05k53j8J64
$$ 8 -31 276 224 -254 187 197 -168 -4 329 -80 -93 332 -84 134 69 -7 -71 221 124 -171 234 -19 -37 127
7669A27K04m63J03L74l06n6M6J22n29O46j70k91L89n2k72q4M32l34J55K69l42
$$ 127 331 -132 -29 345 39 -17 29 151 -378 268 98 -193 196 144 -128 -212 220 -114 41 310 -32
7690c2n0J99on32M64J22j28M5J29k12k01J04j00J98K68k56j85L92j45l59M38j52
$$ -32 -82 117 111 -421 43 165 37 82 211 -1 -202 -98 -198 0 268 12 -173 219 74 -285 153 1
7712Aj81K34L23n03JL40j57k71L60m5l42L97j83m9J34Q3k70j00N85m76J49M7k03
$$ 1 -180 54 377 -126 -125 215 58 -213 147 102 -240 157 -26 -75 59 142 -128 -228 357 -119 30 77 -126
7735a26j33L04J10l46L79q9k96L61j09j05PK67l34n9K92Q0j99L71k49l28K36j0
$$ -126 -259 45 155 -191 188 99 -197 164 55 -50 -43 224 -110 -169 123 203 4 375 126 -202 34 24
7757B4j2k88N96o63J18L10j43nK14n7m38L53l2p1K2J21j41q6L68m12K65m1k82
$$ 24 12 -276 320 -343 -225 85 -58 -63 151 94 -344 9 -23 -94 -72 49 -92 -178 190 -222 43 2 -280
7780b80J51M48j59m87L40j0k45n4N44m53J01L90o55J67K09o2r4N03l79l84M10
$$ -280 -129 319 160 -327 13 3 -242 -296 248 -205 -104 286 -369 -202 7 -55 -149 354 -25 -409 1
7801Aj01r6M2L79l37k43O20j95r1P5k26j52M86m4k69L64j01m23J30N97n35J41
$$ 1 -100 -196 -154 225 -112 -355 265 70 -21 54 -172 -324 162 118 -151 213 112 -311 -181 416 -119 22
7823B2J85q8M1k07K39j73J50J6j80k5L60l95Q6K42m78L58K9j08j25J67j01l08
$$ 22 207 119 160 -47 192 19 169 185 5 -20 340 -55 31 273 -205 153 182 74 -51 116 15 -293
7845b93N23j21q2P6L23o07K39K71l84l38N78J07m84N16k02l35L55j31j77J26L46
$$ -293 230 109 27 103 426 -181 58 329 -55 -393 185 292 -192 324 122 -213 142 11 -166 -40 306
7866C06k71k47O07k82k71K57k21O6J41K9j44J72k4l64J49L85k35J05k8k76p9L65
$$ 306 35 -212 395 113 -158 99 -122 -56 85 114 -30 142 118 -246 -97 288 53 158 130 -146 -225 140
7888A40j94k91M45K4j73NL63n07k6L22k08J35k77J67k47L97j16l30L86j8j04j72
$$ 140 -54 -345 100 124 -49 -44 319 -188 -214 108 -100 35 -242 -75 -322 75 -41 -371 15 -3 -107 -279
7910b79M97n72K04J13l23J26L09k58l62P03j90j44j34N62n50L5N40m56J83j1J9
$$ -279 218 -354 -150 -37 -360 -234 75 -183 -545 158 -32 -176 -310 252 -298 -263 277 -179 4 -7 12
7931A2k01Q7L08j69J43j22k43n2M92l69K83K69l57J06J81r6n55R10n31RJ89J04
$$ 12 -189 -102 206 37 180 58 -185 -237 255 -114 169 438 81 187 368 272 -283 627 96 105 294 398
7953C98l34r0L83l96J77J59o1r2L50l4o51N46l04j68K72J61j67j31J86k53K76
$$ 398 64 -26 357 -39 138 297 236 144 494 460 -191 355 51 -117 155 316 149 18 204 -49 227
7974B27M8k80m05N18j6j78K38L3l87L5M80m16LK76k85J24P2Q5l10L47k59r6J39
$$ 227 275 -5 -410 108 92 -86 152 185 -202 -167 313 -103 -100 176 -109 15 87 172 -138 209 -50 -146 -7
7997gJ75m59J22N59q40K92J46k84J04K65j46l39N36n8j73k8L53k42n2L27l67J66
$$ -7 168 -291 -169 390 -450 -158 -12 -296 -192 73 -73 -412 124 66 -107 -135 218 -24 -76 251 -116 50
8019E0j63J45l19L53k61P6K52l2j57J19nl56Q6L84j19j77J70Om29L53J31k93J67
$$ 50 -113 32 -287 66 -195 -119 133 101 -56 63 58 -298 -212 172 53 -124 46 52 -377 -24 107 -186 -19
8042a9K86m98J95L44m37J52k6p0m6K71j49k38K33K51l86j48M30m09p5M89n30K81
$$ -19 267 -231 -36 308 -129 23 -3 -73 -119 152 3 -235 -2 249 -137 -285 145 -264 -339 150 -380 -99
8064i9J02J50k87J74Kk48K53r6N5l16K97j2m4J57k0j7k01K39m27N14k71J20m9
$$ -99 3 153 -134 40 42 -206 47 -49 6 -310 -13 -25 -69 88 68 51 -150 89 -338 176 -95 25 -24
8087b4L6m6J6L48o25L04N7m9RO5L1k69M30j24k8j47L62l08j71M10l17O5j9K98
$$ -24 12 -34 -18 330 -295 9 66 17 26 91 122 -147 283 159 131 -16 346 38 -133 277 -40 25 6 304
8111C04k97J5M0k11L40k51N7Q5J8k84N8J52k23O2J78On69N00j14k4pP8M7r2M37
$$ 304 7 22 62 -149 191 -60 -3 82 100 -184 -126 26 -197 -135 43 49 -520 -20 -134 -158 -165 -87 -40 -132 305
8136C05o33J49K61r4n3l0K06l62N59k71L3r5K67l40J17K00l79J28j1K64m89N00
$$ 305 -328 -179 82 -12 -65 -95 111 -251 308 37 70 -25 242 -98 19 219 -160 -32 -43 221 -268 232
8158B32l8m65L88J84j53k45K36l41J19K72k14PQJ64l50L52n4j35J07j2o2p5K19
$$ 232 194 -271 117 301 148 -97 139 -202 -83 189 -25 -18 -10 154 -196 156 102 -33 74 62 0 -75 144
8181A44m07K56M5lq8l6K71m31L86k05
$$ 144 -263 -7 38 35 -53 -89 182 -249 137 -68
8191f8
$$ Imaginary data points
##PAGE= N=2
##DATA TABLE= (X++(I..I)), XYDATA
0@%%%%%%qJ6j6J6k4L2m0M8n6P2r6J20j44J76k08K44k92L44m00M70n50O36p32Q41
$$ 0 0 0 0 0 0 0 -8 8 -8 8 -16 16 -24 24 -32 40 -56 64 -80 96 -112 132 -160 184 -216 254 -296 340 -392 449
30D49r63J099j247J412j596J800k022K265k534K828l149L499l882M300m757N255
$$ 449 -514 585 -662 750 -846 954 -1068 1197 -1337 1491 -1658 1841 -2041 2259 -2498 2757
46B757n797O393p048P765q551R420j0382J1452j2650J3997j5525J7277j9310K1699
$$ 2757 -3040 3353 -3695 4070 -4481 4939 -5443 6009 -6641 7356 -8169 9108 -10202 11497
60A1497k4553K8034l2390L8025m5630N6503p3416J03484j72652O08767K64281
$$ 11497 -13056 14978 -17412 20613 -25017 31486 -41930 61554 -111098 497669 761950
71G61950j045880N34708L12912l58834m4754K90873k76088K6677K54405j27508
$$ 761950 -283930 250778 563690 204856 160102 450975 174887 201564 455969 328461
81C28461k65873J41189o9420m4833K90287j69471k40636K34401K5597k74527N9923
$$ 328461 62588 203777 134357 89524 379811 210340 -30296 204105 229702 -44825 15098
92A5098J09470j62744J44237M8926k30896J5012K32646k89726j73132M19107l1781
$$ 15098 124568 -38176 106061 154987 -75909 -60897 171749 -117977 -291109 127998 96217
103I6217l21243K05136J18962l56694J14130K01540k47972q290K12956n0863j06899
$$ 96217 -225026 -19890 99072 -257622 -143492 58048 -189924 -198214 14742 -36121 -143020
114a43020J39515j86791j14970L48375j2071l21228J86286K06846k82349M3576
$$ -143020 -3505 -190296 -305266 43109 31038 -290190 -103904 102942 -179407 -135831
124a35831J39280j82527j9210K47230m3385j59020J53398n3827j12166J47085
$$ -135831 3449 -179078 -198288 48942 5557 -153463 -65 -53892 -166058 -18973
134a8973L6804j93164J15029J65574j79650J7908P8569j38384l007J98958j23117
$$ -18973 17831 -175333 -60304 105270 -74380 -56472 22097 -116287 -119294 79664 -43453
145d3453p3522K29008j02952j87185J86152R2648k96810J00490K46693j96192
$$ -43453 -116975 112033 9081 -178104 8048 100696 -196114 -95624 151069 -45123
155d5123m5717J80512j24661j51582K30468m387j55416J14226O8830j22896K8994
$$ -45123 -90840 89672 -34989 -186571 43897 39510 -115906 -1680 67150 -55746 -26752
166b6752P4498j69273O3738J24481r4624J6729J03792j43637m7052K08194j40628
$$ -26752 47746 -121527 -57789 66692 -27932 -11203 92589 -51048 -98100 110094 -30534
177c0534j10399K36157K5184k34377J30488J41236k68241J3876K13912j01086
$$ -30534 -140933 95224 120408 -113969 16519 157755 -110486 -96610 117302 16216
187A6216r5368K12712p4873j74115J81271l516j69109J00648J27425j58519L5447
$$ 16216 -79152 133560 58687 -115428 65843 62327 -106782 -6134 121291 -37228 -1781
198a781J16653j51601m6669J29550k7285p7345J27261n4903n4141J22417q3432
$$ -1781 114872 -36729 -83398 46152 18867 -58478 68783 13880 -40261 82156 -1276
209a276j33231J54203P4964j99365J02274J29614j76737m1166J61161q8694j05379
$$ -1276 -134507 19696 94660 -104705 -2431 127183 -49554 -90720 70441 -18253 -123632
220a23632J91807l0914j04644J17723n649j73755J14063J00867j92273O9357J53582
$$ -123632 68175 37261 -67383 50340 44691 -129064 -15001 85866 -106407 -37050 116532
231A16532j25599p8411J59120p7212j25958J71479J2667j19521R0701O4718j76074
$$ 116532 -9067 -87478 71642 -5570 -131528 39951 52618 -66903 23798 88516 -87558
242h7558N7706J04302j46464R162J44871m5533q6440J08474n5116q4781R7051
$$ -87558 -29852 74450 -72014 -62852 82019 36486 -49954 58520 3404 -81377 15674
253A5674N190o5403Q4526L0879j35738R3584L4422j68675M9572J65667j09580
$$ 15674 20864 -44539 39987 70866 -64872 28712 63134 -105541 -55969 109698 118
264A18o8624J87583q6288j51558J28412O0900j54279P2137J27807j44872J0904
$$ 118 -68506 119077 32789 -118769 9643 70543 -83736 -11599 116208 -28664 -17760
275a7760R6854j08401p2766J47391n669o9202R5937l0138q8941N8134M4840j21227
$$ -17760 79094 -29307 -102073 45318 39649 -29553 66384 36246 -52695 5439 50279 -70948
287g0948N7684R3081q9447L1259O6607j24264n8091J61728m3855p1008J15737
$$ -70948 -13264 79817 -9630 21629 88236 -36028 -94119 67609 23754 -47254 68483
298F8483r113j03523O9009M6669j60730N6503J21427q4010j4233J05824q8221
$$ 68483 59370 -44153 24856 71525 -89205 -32702 88725 4715 -9518 96306 8085
309H085r6674J35472k2643p5574Q8426L4069j04007M9480O3275j41335J0678J01753
$$ 8085 -88589 46883 24240 -51334 37092 71161 -32846 16634 79909 -61426 -50748 51005
321E1005m3927k3888J10371p9482r5248J24181j3419r4019O9198N7564j03769
$$ 51005 7078 -16810 93561 14079 -81169 43012 29593 -64426 4772 62336 -41433
332d1433O3101O8771j49267j7515J21475l7169o1105J25247n4503r3307J13321
$$ -41433 21668 90439 -58828 -76343 45132 7963 -53142 72105 17602 -75705 37616
343C7616J086j23024N6204P8777j02864O0428O9726j24687k9511J15650m7046
$$ 37616 38702 -84322 -28118 50659 -52205 8223 77949 -46738 -76249 39401 -7645
354g645p1465J27213l1939q3114R0081K7167j25483L1300P1892q3030N4076O7317
$$ -7645 -79110 48103 16164 -66950 23131 50298 -75185 -43885 28007 -55023 -947 66370
366F6370r4971l9622J11841n2233p5104J11416j6563p3267Q9474M1014j43689
$$ 66370 -28601 -68223 43618 -8615 -83719 27697 11134 -62133 27341 68355 -75334
377g5334L4167P4673r0350L2455Q7118p5540m6986J16581n9270p9337J00877k641
$$ -75334 -41167 33506 -56844 -24389 62729 -12811 -59797 56784 -2486 -81823 19054 16413
389A6413q7450Q9923O9575j43956K2317P2320q2787K394J02771n3206o1330J08379
$$ 16413 -71037 18886 88461 -55495 -33178 39142 -43645 -41251 61520 8314 -53016 55363
401E5363k5412o9071M3893M957n8888Q4225N4686j19176K5569O0501p1298j2481
$$ 55363 29951 -39120 4773 9730 -49158 35067 89753 -29423 -3854 56647 -14651 -27132
413b7132R6686o1561m4411J27168k2826r8352M1282M4105q6108N2351P3415r0097
$$ -27132 69554 7993 -36418 90750 67924 -30428 10854 54959 -31149 21202 94617 4520
425D520J157P4109n5033n6003Q9214l5155m3978R1032q15q0660L3873L3771r8586
$$ 4520 5677 79786 24753 -31250 57964 22809 -21169 69863 69048 -11612 22261 56032 -42554
438d2554M5704O7984p5291o996Q2603n7987o2919R0730m3959o2650Q7073L3757
$$ -42554 3150 71134 -4157 -11153 71450 13463 -49456 41274 -2685 -65335 21738 55495
450E5495r3052K3054M7449r4554J6645O5035n4076l1187R7703k9918p6104O4283
$$ 55495 -37557 -14503 32946 -61608 -44963 20072 -34004 -65191 32512 2594 -73510 -9227
462i227j8606o0367N6432M8416q0953K9955N1060q0899n548N9100m0981l3897
$$ -9227 -27833 -88200 -31768 16648 -64305 -34350 16710 -64189 -69737 -10637 -51618 -85515
474h5515J04876k9695o3915P1291j1239q6013N4178O6327q5516L3360O2913o9049
$$ -85515 19361 -10334 -74249 -2958 -14197 -100210 -46032 20295 -65221 -31861 31052 -37997
486c7997k3187O6484m3405m7027J07123j1820n5859N6971M100r0395M7084N9401
$$ -37997 -61184 5300 -38105 -85132 21991 10171 -45688 11283 15383 -75012 -27928 31473
498C1473q6669L1910P8002n0801m5883O5757l4208n0830Q4296J817m7967M7843
$$ 31473 -55196 -23286 54716 3915 -41968 23789 -10419 -61249 23047 24864 -23103 24740
510B4740K6445q9940L0791M4745p3876K9613P9095m8269m6091Q2001m0455o3442
$$ 24740 51185 -38755 -7964 36781 -37095 -7482 71613 23344 -22747 59254 18799 -44643
522d4643P3898J4921n6145M9232M5751r3666K0366M4121o4536L607Q3848l3657
$$ -44643 29255 44176 -11969 37263 83014 -10652 9714 53835 -10701 -7094 76754 43097
534D3097m9393P9794k8012o3040M3769K3443n1779M1624M3751p3151J5780L1060
$$ 43097 -6296 73498 45486 -17554 26215 49658 -2121 39503 83254 10103 25883 56943
546E6943n3474j0275P3501l6098l4386Q0484k6946o8666L9440L2107p3057L3050
$$ 56943 3469 -6806 66695 30597 -3789 76695 49749 -18917 20523 52630 -20427 12623
558A2623N5227o0143J321M2027m9991l9440P8773k5000m5300O3595K130o3429
$$ 12623 67850 7707 9028 51055 1064 -38376 40397 15397 -29903 33692 35822 -27607
570b7607K7393L0932q6645K7928O7928m7480k6035N1557k3413m4566N6761k6171
$$ -27607 -214 30718 -55927 -27999 39929 -7551 -33586 17971 -5442 -50008 6753 -19418
582a9418m0722N4958L1181n9818N638L0706n2423J9742L0821l5796o861O5638
$$ -19418 -60140 -5182 25999 -33819 -28181 2525 -49898 -30156 665 -35131 -41992 23646
594B3646k9583m4712N0154k2595l4653N5704K3772p5216M1886N4440p9277j6958
$$ 23646 -5937 -50649 -495 -23090 -57743 -2039 21733 -53483 -11597 42843 -36434 -53392
606e3392O3380j5640l9328P1244j3047n0906M9543P135o5726J9176N7318m4289
$$ -53392 9988 -5652 -44980 26264 13217 -37689 11854 18989 -46737 -27561 29757 -14532
618a4532J6813K8684m9103o766N3516l2248m6914P1646K427l3194K8489l380o1589
$$ -14532 2281 30965 -18138 -24904 28612 -3636 -50550 21096 23523 -9671 18818 15438 -46151
631d6151L9525M7901p2908J3332O0900l0641l7132M8980k8552m6817P1569J2363
$$ -46151 -6626 41275 -31633 -18301 42599 11958 -25174 23806 -4746 -51563 20006 32369
643C2369n4034J7696M3376n4365J683K4899m2025K5282M8030l9655l2225O5838
$$ 32369 -21665 -3969 39407 -14958 -13275 11624 -30401 -5119 42911 3256 -28969 36869
655C6869k9705m7708N2855L004m6215N0143M1554r3042J0242O0891m3502k5995
$$ 36869 7164 -40544 12311 15315 -30900 19243 60797 -32245 -22003 38888 -4614 -30609
667c0609N4308q094l0729N8375k4770n6712L4128L4202m3399J1612L5235m1807
$$ -30609 23699 15605 -15124 43251 18481 -38231 -4103 30099 -13300 -1688 33547 -8260
679h260J8881K1294n1717j7608O7972j6714l5002N3310j6050m2098L4541J7592
$$ -8260 10621 31915 -19802 -37410 30562 13848 -21154 32156 16106 -25992 8549 26141
691B6141p4408L0689O8767m9550k1178M0286j7303l7903M6157j5420k6681M8951
$$ 26141 -48267 -17578 51189 1639 -19539 20747 3444 -34459 11698 -3722 -30403 18548
703A8548Q584m2257O055J7643m5653L0748K7954m4688Q723N6696m0577n0501N8300
$$ 18548 27132 -15125 -9070 8573 -37080 -6332 21622 -23066 -14343 42353 1776 -48725 9575
716I575j2477l3886M6413K1281n6851J7326M2393o1482r258M4227k524k0957L8255
$$ 9575 -2902 -36788 9625 30906 -25945 -8619 33774 -27708 -36966 7261 4737 -16220 22035
729B2035j2426l6458L2698p522k7547K2815K6704l1156K2508J1613n5350J2348
$$ 22035 9609 -26849 5849 -1673 -29220 -6405 20299 -10857 11651 23264 -32086 -19738
741a9738M1558l0532k5896O9543j3703m7138L7637K020n2652K4198N2722m9551
$$ -19738 21820 -8712 -34608 34935 21232 -25906 11731 13751 -38901 -14703 38019 -11532
753a1532K650L8389k6893k4043K7647j0504k2899N1175p811k8705K2710M692m3114
$$ -11532 -8882 29507 2614 -21429 6218 -4286 -27185 23990 16179 -12526 10184 14876 -28238
766b8238K0607K8357m5590K5210L6692m0107k3893N0474k4195l9581N7077M387
$$ -28238 -7631 20726 -24864 346 37038 -3069 -26962 23512 -683 -40264 16813 21200
778B1200m1528K4557L2475o1477K308M4982l2133o927L8206p834l1368L6513j6445
$$ 21200 -20328 4229 36704 -24773 -22465 22517 -9616 -16543 21663 13829 -17539 18974 2529
791B529l0627L4863O292k8891K5274K5807n7265J6235L2430m2653p414N3990j6524
$$ 2529 -28098 6765 13057 -15834 9440 35247 -22018 -5783 26647 -16006 -23420 30570 14046
804A4046l6217N3128j4296m4370K8474K2964m1460J6600L9430m3783L318K6152
$$ 14046 -22171 30957 16661 -27709 765 23729 -17731 -1131 38299 -5484 -2166 23986
816B3986k8565j9696M6891j1335k6126M3051j1188l3154K1874J4735m8282K6580
$$ 23986 -4579 -24275 22616 11281 -14845 28206 17018 -16136 5738 20473 -27809 -1229
828a229L8848m3757J561L6490l1851l4698N7774j0955m0378M3206J9488m5215
$$ -1229 37619 -6138 -4577 31913 62 -34636 23138 12183 -28195 15011 34499 -10716
840a0716J38L3999m0640K187L3025j3224r620K3487j3890k4151L2011j9942j4489
$$ -10716 -10578 23421 -17219 -15032 17993 4769 -4851 18636 4746 -19405 12606 -7336 -21825
853b1825L8142L638l9945K6554K1723o1860J3849M4733k8958k3025N6336j3239
$$ -21825 16317 19955 -19990 6564 28287 -33573 -19724 25009 -3949 -26974 29362 16123
865A6123m9214L8176O756l8644J1722L9969l0112m1K1453k8770m704K1772q822
$$ 16123 -33091 5085 11841 -26803 -15081 24888 -5224 -5265 16188 -12582 -17286 4486 -4336
878d336j5257L9034j3936k2602L1457q065l8971K4039L4761m3596J4025L2604
$$ -4336 -19593 19441 5505 -17097 14360 6295 -32676 -8637 26124 -17472 -3447 29157
890B9157l4868j7752L8833j1163l5295M5193L405k7878J8779J2971m2492O416
$$ 29157 -5711 -23463 15370 4207 -31088 14105 17510 -10368 8411 21382 -21110 -14694
902a4694L6372k9997M951K5749j7407j8298L3068j7679l1822M0561L612k4823
$$ -14694 21678 -8319 -3368 22381 4974 -13324 19744 2065 -29757 10804 14416 -10407
914a0407K0003J8502n2058R112L7294l4920p314L8830p239l3704L6109p735l7647
$$ -10407 9596 28098 -23960 -14848 22446 -12474 -19788 19042 11803 -21901 14208 6473 -31174
927c1174K1114J8030j9972P971K2804l8001N617J8700k4785l324L1577j4518j7921
$$ -31174 -10060 7970 -12002 -4031 18773 -19228 -13611 5089 -19696 -23020 8557 -5961 -23882
940b3882M5559k2235l9371K9164J9393l8636J9641L8011m8017k585L7799j9213
$$ -23882 21677 -558 -39929 -10765 8628 -30008 -10367 27644 -20373 -22958 14841 -4372
952d372l4744L9238P506k5375K9282l23l0458N354K3280k6079J2016K3306k6413
$$ -4372 -39116 122 7628 -17747 11535 11212 -19246 -13892 9388 -16691 -4675 18631 -7782
965g782N204K3531k1839k5285L9840r640j9326L7615J538l9159J1967K7498m0662
$$ -7782 -2578 20953 -886 -26171 13669 4029 -15297 22318 23856 -15303 -3336 24162 -16500
978a6500J0890L0241k4640p843L6876j4862l8682L2887j609j8578K4215J3010
$$ -16500 -5610 24631 -9 -7852 29024 14162 -24520 8367 6758 -11820 12395 25405
990B5405l6790P882K6909l3628Q03J8667j0480n681L2484j7584k9234K9521l754
$$ 25405 -11385 -3503 23406 -10222 -9419 9248 -1232 -6913 25571 7987 -21247 8274 4520
1003D520k1941J9719K0188l6757J2032K7030l3386p188K4901p399j8925L7119
$$ 4520 -17421 2298 22486 -14271 -2239 24791 -8595 -15783 9118 1719 -17206 19913
1015A9913n842k6670J8380K681k4000J4743K3753l6639J2501K8163k4263j4459
$$ 19913 14071 -12599 5781 8462 -15538 -795 22958 -13681 -1180 26983 2720 -11739
1027a1739K3338j0889j8942M1821o303k8487J7436J5397l2339N442K5449l0986
$$ -11739 11599 710 -18232 23589 17286 -11201 6235 21632 -10707 -5265 20184 -10802
1039a0802P184K9864j3589k5810K2155m077j8758K4514j602j5270J2796J4066
$$ -10802 -3618 26246 12657 -13153 9002 4925 -13833 10681 9079 -6191 6605 20671
1051B0671l3502P812J9752k9959M886L2503j3254k7780L3506q941k9345K3477
$$ 20671 -12831 -5019 14733 -15226 -10340 22163 8909 -18871 14635 5694 -23651 -174
1063a74J1770k4211Q632K6690l3414J369J9450k2022q421L3531l676k6557K7638
$$ -174 11596 -12615 -3983 22707 -10707 -9338 10112 -11910 -20331 13200 9524 -17033 10605
1076A0605o234k1581J3633J0188k3851J3520K4472k9879L899J5386j9964j2055
$$ 10605 4371 -17210 -3577 6611 -17240 -3720 20752 -9127 -5228 10158 -9806 -21861
1088b1861L5527q737k3871L1480m63k6130P546J6841k9032J2092K6546k4904l231
$$ -21861 13666 4929 -18942 12538 12075 -14055 -6509 10332 -18700 -6608 19938 -4966 -8197
1101h197K1650j3789k3874L2502n114j9622K3837O888k3970L528J6512k8511J1234
$$ -8197 13453 -336 -24210 8292 3178 -16444 7393 14281 -9689 -6161 10351 -18160 -6926
1114f926J9338j9028j469K5345j6455k4076L2163q977j9595K3175J3779k8664
$$ -6926 12412 -6616 -8085 17260 805 -23271 8892 -85 -19680 3495 17274 -11390
1126a1390O210J9749k9815M279J8792j1596q005K9136j2015k3357K4926n760j8905
$$ -11390 -5180 14569 -15246 -10967 7825 -3771 -11776 17360 5345 -18012 6914 1154 -17751
1139a7751J6155J8832k7055Q571J7560k5942j014J8203r947j3490L2956p564k0067
$$ -17751 -1596 17236 -9819 -1248 16312 -9630 -10644 7559 -2388 -15878 17078 9514 -10553
1152a0553J6586k012j9727J3682J8697k8292J1214J8142j9997p039J8688j3907
$$ -10553 6033 4021 -15706 -2024 16673 -11619 -405 17737 -2260 -9299 9389 -4518
1164d518j5298L7620n005k2916J1935J0720k3268M889J7669k2117R120J7899j1856
$$ -4518 -19816 17804 12799 -10117 1818 12538 -10730 -5841 11828 -10289 -1169 16730 4874
1177D874j3463J7941j2232j3216K9574l572j8086J2688J4502k9299M893J8102
$$ 4874 -8589 9352 -2880 -16096 13478 9906 -8180 4508 19010 -10289 -5396 12706
1189A2706j9331J305J9877m971j5144J9051j4452j3949K4389L111k0068R798J7258
$$ 12706 -6625 -5320 14557 9586 -5558 13493 -959 -14908 9481 12592 -7476 2322 19580
1202A9580k6903P603J3178k2509m675L0227l135k3286J9628o558j4857J4156R061
$$ 19580 -7323 280 13458 -9051 -13726 16501 13366 -9920 9708 3150 -11707 2449 11510
1215A1510k4865P031K4547j9536k379O748j0840o808K3690p386j5052K1053n962
$$ 11510 -13355 -6324 18223 -1313 -3692 3056 -7784 -14592 9098 1712 -13340 7713 1751
1228A751j5697J0248R685k6320J1348K0165j9671M44J4369j4181j6593K8685n462
$$ 1751 -13946 -3698 5987 -20333 -8985 11180 -8491 -8047 6322 -7859 -24452 4233 -1229
1241a229j5027J8080K90j7697J2417J4641l4129O060K6063r872r343J6478q198
$$ -1229 -16256 1824 2114 -15583 -3166 11475 -22654 -16594 9469 -403 -9746 6732 -1466
1254a466j8348K5102j353j6253Q514J2223j0679O005N834k5342J0570J6803r963
$$ -1466 -19814 5288 3935 -12318 -3804 8419 -2260 3745 9579 -15763 -5193 11610 1647
1267A647p212K0944j0683j4040K2954p071j7386J3180J6099k1095Q992J2976k3682
$$ 1647 -5565 15379 4696 -9344 13610 6539 -10847 2333 18432 -2663 6329 19305 -4377
1280d377p85J7013n920j1505K4018r350j5844J8646K166k2084M412J9197j6780
$$ -4377 -5162 11851 5931 -5574 18444 9094 -6750 11896 14062 -8022 -3610 15587 -1193
1293a193P690J1210j8216q761J8259j080j5569J5917l556n726J0757R79k1347
$$ -1193 6497 17707 -509 -9270 8989 7909 -7660 8257 4701 -1025 9732 10711 -10636
1306a0636M922J5680j3510P456O873j2775m842J8873j1576j4457K0774j669r998
$$ -10636 -5714 9966 -3544 3912 10785 -1990 -6832 12041 465 -13992 6782 5113 -4885
1319d885J0290Q016k5332N561J6194j6139J482J5524p296j4302K0331o836j5998
$$ -4885 5405 13421 -11911 -6350 9844 -6295 -4813 10711 3415 -10887 9444 2608 -13390
1332a3390J2903N423j2191O727J4666k2664p3J1592p297m410J2237l467j0169
$$ -13390 -487 4936 -7255 -528 14138 -8526 -8599 2993 -4304 -8714 3523 56 -10113
1345a0113J7456p559j2054O670N408j1551R837J1312k1209M122J0801r695r457
$$ -10113 7343 -216 -12270 -5600 -192 -11743 -1906 9406 -11803 -7681 3120 -6575 -16032
1358a6032J7981m952j0233J9217m252j5384N763J1369j7934P772J5145j5375j657
$$ -16032 1949 -3003 -13236 5981 1729 -13655 -7892 3477 -14457 -6685 8460 -6915 -8572
1371h572J3066n946j5177J7942k644q842J4260J852j3763L322J0433j7553P587
$$ -8572 4494 -1452 -16629 1313 -1331 -10173 4087 5939 -7824 -4502 5931 -11622 -4035
1384d035J1660j0296j560J4206p939j3763J7788n790q176J3873N381j7778P222
$$ -4035 7625 -2671 -4231 9975 2036 -11727 6061 271 -7905 5968 11349 -6429 793
1397G93J2064k1794M230J4901p800r289K0315m662j7944J3528J572j0684M221
$$ 793 12857 -8937 -4707 10194 2394 -6895 13420 8758 -9186 4342 5914 -4770 -549
1410e49J3319j3668K144Q976j1908j846Q030j950o414J5042o174q593R520k182
$$ -549 12770 -898 1246 10222 -1686 -3532 4498 2548 -3866 11176 5002 -3591 5929 3747
1424C747r787O716Q977j5141R897P485j4553k890J2914o744r058J9509o531r750
$$ 3747 -6040 676 9653 -5488 4409 11894 -2659 -5549 7365 621 -8437 11072 4541 -5209
1438e209J0653L286j7710N776J2794j5441N569J1165r333j0743J5793l979j3036
$$ -5209 5444 8730 -8980 -3204 9590 -5851 -282 10883 1550 -9193 6600 2621 -10415
1451a0415J3987J257q425L536R696j5706J71R385p628J384P460k771r209J1674
$$ -10415 3572 4829 -3596 -60 9636 -6070 -5899 3486 -4142 -2758 4702 1931 -7278 4396
1465D396m762p531P231M49m812O247O622j5868N108N270q869J587J1453p183q303
$$ 4396 -366 -7897 -666 -217 -5029 1218 7840 -8028 -2920 2350 -6519 -4932 6521 -662 -8965
1480h965J7895o483j1432P680N777j2205P796J3183j6935k99R790m112r043J3036
$$ -8965 8930 2447 -8985 -1305 4472 -7733 63 13246 -3689 -3988 5802 1690 -7353 5683
1494E683j052q895J1526P6q039p72O160q069P153O814j1264J842O947n544q233
$$ 5683 4631 -4264 7262 7338 -701 -1473 4687 -3382 3771 10585 -679 1163 8110 2566 -5667
1509e667J3753o195o668J3229J896j3115O14J0015j3172L902R248p135m734J0025
$$ -5667 8086 1891 -4777 8452 10348 -2767 -2153 7862 -5310 -1408 7840 705 -4029 5996
1523E996k517j1375J0507m218n258Q381N436j1680P85P424j2330M374P068n691
$$ 5996 3479 -7896 2611 -1607 -6865 1516 6952 -4728 -3943 3481 -8849 -4475 2593 -3098
1537c098n755J3407l412r995Q492l657n640P523Q502j3665L136P821j0155J144
$$ -3098 -8853 4554 1142 -8853 -361 -4018 -9658 -2135 6367 -7298 -4162 3659 -6496 -5352
1551e352O822m652o940J6255l188q741O010o12o945N375R253j2892M721P026p621
$$ -5352 1470 -3182 -10122 6133 2945 -5796 214 -398 -7343 -1968 7285 -5607 -886 6140 -1481
1566a481k701Q363m896q116J5535r82q098K724M188r286K181Q916r455K176N099
$$ -1481 -4182 4181 -715 -8831 6704 5722 -2376 348 4536 -4750 -2569 6347 -3108 -932 4167
1581D167j677n086O287n892n288J1877j814n029K896L659j1088N652N553j1074
$$ 4167 2490 -2596 3691 -2201 -7489 4388 2574 -2455 441 4100 -6988 -1336 4217 -6857
1595f857K617R203l512q511J1603o432q238J0412L405q483J328R805j1027J232
$$ -6857 -4240 4963 1451 -7060 4543 -1889 -10127 285 3690 -4793 -3465 6340 -4687 -3455
1609c455M668m648k773Q331J78o729Q613n095m885M594M458o978K671P121q910
$$ -3455 1213 -3435 -6208 2123 2301 -4428 4185 -910 -5795 -1201 3257 -3721 -1050 6071 -2839
1624b839L165L013n065m659J1281j751o163R127l407o642L823P206j1370K975
$$ -2839 326 3339 -1726 -6385 4896 3145 -3018 6109 2702 -3940 -117 7089 -4281 -1306
1638a306Q842o334o16M411l628p237J1693k710n708P742P87q193K206Q007j2740
$$ -1306 7536 1202 586 4997 1369 -5868 5825 3115 -2593 5149 5936 -2257 -51 7956 -4784
1653d784L367Q398m540m044P380j854r664R278r62m314L422M489p359J381O123
$$ -4784 -1417 6981 2441 -1603 5777 3923 -5741 3537 2575 -1739 1683 6172 -1187 194 6317
1668F317r921J987N066j662m075Q412l916o902Q066j723n479L352P353r845L147
$$ 6317 -3604 -1617 3449 1787 -2288 6124 2208 -4694 3372 1649 -3830 -478 6875 -2970 177
1683A77O200r460j017O903j399o963J0943k682o997N646J141p381J596R332r397
$$ 177 6377 -3083 -4100 2803 1404 -5559 5384 2702 -4295 1351 2492 -4889 -3293 6039 -3358
1698c358K264N174m807m316O251j365n978R852k964l699L582J934r367L686P697
$$ -3358 -1094 4080 -727 -5043 1208 -157 -6135 3717 753 -2946 636 2570 -6797 -3111 4586
1713D586r424K734O052l244p256Q509j648p340Q285O45l892Q32N011q601J842
$$ 4586 -4838 -2104 3948 704 -6552 1957 309 -7031 1254 1899 -1993 -1161 3850 -4751 -2909
1728b909N174n934J463N618j639o813Q660l902n333O344J675n091K207O622j0220
$$ -2909 2265 -3669 -2206 3412 1773 -5040 3620 -282 -5615 729 2404 -2687 -480 6142 -4078
1743d078K054M934m299k459O946j56o768P810k915n202L139M539o231K123O328
$$ -4078 -2024 2910 -1389 -3848 3098 2942 -3826 3984 1069 -4133 -994 3545 -2686 -563 5765
1758E765q271J805L671l145n781R173K1o410O218q17m381L85O167p672K480N851
$$ 5765 -2506 -701 2970 -175 -5956 3217 3238 -3172 3046 2229 -2152 -1767 4400 -3272 -792 5059
1774E059n421l69L704j857o730R279j438m892N161K093n916k82O776p778K047
$$ 5059 -362 -731 2973 1116 -5614 3665 2227 -2665 2496 4589 -1327 -1609 5167 -2611 -564
1789e64M427k597j878N207k011p575Q245j411l308L114L762p339J116O895q795
$$ -564 3863 1266 -612 4595 2584 -4991 3254 1843 -1465 1649 5411 -1928 -812 6083 -2712
1804b712J42M965m1n070O566k004o662O268m67m222R35O393p141J910M084o974
$$ -2712 -2570 2395 2354 -2716 3850 1846 -4816 1452 985 -3237 -2302 4091 -3050 -1140 2944 -4030
1820d030n31N044p27o721Q961k144n166L543R27m659J004O732p777K755L808m089
$$ -4030 -4561 483 -244 -6965 1996 -148 -5314 -1771 -844 -5503 -4499 2233 -5544 -2789 1019 -3070
1836c070l144N129r85m980R087k562m617L089M175o783M57O341n759K742L527
$$ -3070 -6214 -1085 -2070 -7050 2037 -525 -5142 -2053 2122 -4661 -4204 2137 -3622 -880 2647
1851B647k378n267O870o31m994N994j85k392J481M778q186J953N089m572M12M164
$$ 2647 269 -4998 1872 1241 -3753 2241 2056 -336 1145 5923 -2263 -310 4779 207 619 4783
1867D783p97n387P504l141m754N011K432m749L32O328p602J579K400k857j662
$$ 4783 3986 -1401 6103 2962 -1792 3219 5651 902 1234 7562 -40 1539 3939 1082 -580
1882e80N339p27n833O383k977k893K014K485n953K694N958p832M2K829p97m718
$$ -580 4759 4032 -1801 4582 1605 -1288 726 3211 -2742 -48 5910 -1922 -1880 949 152 -4566
1898d566O184p55n116N999j145l968k92N268o241K452M622n098l89L489p82o519
$$ -4566 1618 863 -4253 1746 601 -3367 -3659 1609 -4632 -2180 2442 -2656 -3045 444 -338 -6857
1914f857P561r15l415L533J117m022K83N070p135K998L744k455j819M217j336
$$ -6857 704 -211 -3626 -93 1024 -2998 -2715 2355 -4780 -1782 1962 -493 -2312 1905 569
1929E69n796P811j950l375K834M309n525j70M870n883J750K962k42m087N863j423
$$ 569 -5227 2584 634 -2741 93 4402 -1123 -1293 3577 -2306 -556 2406 2164 -1923 3940 2517
1945B517m940N269j568k354K088N191p625J923M676n678p60M450j18o071P957
$$ 2517 -2423 2846 1278 -1076 1012 6203 -1422 501 5177 -501 -1261 3189 3071 -3000 4957
1960D957j582n061L055J471l668L4N707o229K532K083l200j990M421j148m650
$$ 4957 3375 -1686 1369 2840 -828 -794 4913 -1316 1216 3299 99 -1891 2530 1382 -3268
1975c268P524k836l317K562K267o151J845N203o397K040K660j674m418N912j832
$$ -3268 4256 1420 -1897 665 2932 -3219 -1374 3829 -2568 -528 2132 458 -3960 1952 120
1990A20m485N995q68k884Q87M073p368K104M271m653K79L584p75n615O751k476
$$ 120 -4365 1630 762 -2122 -1235 2838 -4530 -2426 1845 -2808 -2529 1055 280 -5335 1416 -1060
2006a060l856M028J355l355O73M495o957K477K636l290j107N202r98n389O674
$$ -1060 -4916 -888 467 -2888 -2215 2280 -4677 -2200 436 -2854 -3961 1241 243 -5146 1528
2021A528k404l075J749L579m300R28M356n371J832P54o04k494N289k114k796N759
$$ 1528 -876 -3951 -2202 1377 -2923 -1995 2361 -3010 -1178 -424 -1028 -3522 1767 -347 -3143 2616
2037B616k234l488J882M938p219K718M817m653q02L222j69n260O257j242k340
$$ 2616 382 -3106 -1224 3714 -3505 -787 4030 -623 -1425 1797 1628 -3632 2625 1383 -957
2052i57L143K75l495P63M465o746L336K968k723j837M560j414n444O460j351j825
$$ -957 2186 2461 -1034 -271 4194 -2552 784 3752 1029 -808 3752 2338 -3106 3354 2003 178
2068A78J215L155m661N60L786n062J665J888m30k530M595k644l403N142j604k345
$$ 178 1393 4548 -113 447 4233 -829 836 2724 2294 -236 4359 1715 -1688 3454 1850 -495
2084d95J676L997o622K590L119n382R2L754k84m968O491k288l362K813M71l262
$$ -495 1181 5178 -1444 1146 4265 -1117 -1025 2729 2445 -2523 3968 1680 -1682 1131 1602 -1660
2100a660R13M569o509K973J982l615j461M125j307m432O748k264k832J210K906
$$ -1660 -747 3822 -2687 286 2268 -1347 -2808 1317 10 -4422 2326 62 -2770 -1560 1346
2115A346m905R68L790n021K700J426j669l472N291k229k912N257j466k236R65
$$ 1346 -3559 -2591 1199 -3822 -1122 304 -1365 -4837 454 -1775 -4687 570 -896 -3132 -2167
2130b167M021o415J604L483l200M81K696q60l846N720l103k183L994N03l152J310
$$ -2167 1854 -4561 -2957 526 -2674 -2193 503 -357 -4203 1517 -1586 -3769 225 728 -2424 -1114
2146a114M152o383K293K113k356p50M222o38m053M838k696n40J886J313l919K791
$$ -1114 3038 -3345 -1052 1061 -1295 -2045 2177 1539 -2514 2324 -372 -912 974 2287 -1632 1159
2162A159L719o365J730J817q17k362N244k222l514N016n77k862j73M009m397K184
$$ 1159 4878 -1487 243 2060 1243 -1119 4125 1903 -1611 3405 2828 -34 -207 3802 -595 1589
2178A589K541l647m44J929K19l811M587j933r54K501j132k273J112K935n518K965
$$ 1589 4130 483 39 1968 2187 -1624 2963 1030 76 2577 1445 -828 284 3219 -2299 666
2194F66J783k603q47L017k151l436O142k590j934J725K117l936Q78K562m855K763
$$ 666 2449 -154 -1001 2016 -135 -3571 2571 -19 -1953 -228 1889 -2047 -1169 1393 -3462 -699
2210f99J837j660k850M997j685l242L812r96j700Q36L984n312J420K078k656O81
$$ -699 1138 -522 -3372 1625 -60 -3302 510 -486 -2186 -1350 2634 -2678 -1258 820 -1836 -1155
2226a155J446n51k760N607k832j976K711K42k702J198L733m739K210J201k005
$$ -1155 291 -260 -3020 2587 -245 -2221 490 732 -1970 -772 2961 -1778 432 1633 -372
2241c72q09L002j087k731N084k831o15J686M71m324K692L738n475J949J749j087
$$ -372 -1181 1821 734 -1997 3087 256 -359 1327 1798 -2526 166 3904 -1571 378 2127 1040
2257A040k818M192j846k896M325o21j865n14L228m185J638J579k573J039R31l00
$$ 1040 -1778 2414 568 -2328 1997 1376 -489 -1003 2225 -1960 -322 1257 -1316 -277 654 354
2273C54k451L522l207l36L166j171k513K242K532o142K835K084k643q05L828j335
$$ 354 -2097 1425 -1782 -2118 1048 -123 -2636 -394 2138 -4004 -1169 915 -1728 -2533 1295 -40
2289d0l753N047k106j405Q09K124k847J043K439l638J724o9p4j195L288k090j080
$$ -40 -3793 1254 -852 -2257 -1448 676 -2171 -1128 1311 -2327 -603 -672 -746 -1941 1347 -743 -1823
2306a823L364k205o74O74K470l835K631J600l099R75J368m76k691M743k278r92
$$ -1823 1541 -664 -1338 -664 1806 -2029 602 2202 -897 78 1446 970 -1721 3022 744 -248
2322b48K610j81k420J018K985m547K369J230j003q67J672j031j830M179k703m56
$$ -248 2362 2181 -239 779 3764 -783 1586 2816 1813 946 2618 1587 -243 3936 1233 777
2338G77J693J003l427J318K222m728K226J753n87l156K824j71j521J120j841R75
$$ 777 2470 3473 46 1364 3586 -1142 1084 2837 2250 -906 1918 1747 226 1346 -495 480
2354D80N14J037l720K480L71l194J618J244j317k066M873k999j909K783l32k479
$$ 480 994 2031 -1689 791 1162 -2032 -414 830 -487 -2553 2320 -679 -2588 195 -137 -2616
2370b616J399K899m888K363J204k467j279L523J3l586L149j049M88j30j26j875
$$ -2616 -1217 1682 -3206 -843 361 -2106 -3385 138 151 -3435 -286 -1335 -847 -977 -1103 -2978
2386b978K285J432l598K566k2j125o94L740l189j605M235q06j270k17J434k894
$$ -2978 -693 739 -2859 -293 -315 -1440 -2134 1606 -1583 -3188 1047 241 -1029 -1246 188 -2706
2402b706L159N71l423J622J952j261k797M210k084j198K350k1j153J12J548l370
$$ -2706 453 1024 -2399 -777 1175 -86 -2883 1327 -757 -1955 395 374 -779 -667 881 -2489
2418b489K579Nj053K95J526j591j374M622l348j151J396J622j871J003M77l338
$$ -2489 90 95 -958 -663 863 -728 -2102 2520 -828 -1979 -583 1039 -832 171 648 -2690
2434b690L146P61j515j928L559q38j120K306k487k73J423K096l678K035P32j996
$$ -2690 456 1217 -298 -2226 1333 495 -625 1681 -806 -1079 344 2440 -1238 797 1529 -467
2450d67J774L82j678j440M854k320j385J871M55j669J53J966k900K453m04j383
$$ -467 1307 1689 11 -1429 3425 1105 -280 1591 2046 377 530 2496 -404 2049 1645 262
2466B62P20J577j706j568L350k140K96J102L23l248J374K117k937J324o70k07
$$ 262 982 2559 853 -715 2635 495 791 1893 2216 -1032 342 2459 -478 846 176 -31
2482c1K78K734l857j355L874r47j563K04K110l018J365Q75k005k0P91L99j208
$$ -31 247 2981 -876 -2231 1643 696 -867 -663 1447 -1571 -206 669 -1336 -1356 -565 -166 -1374
2499a374K351k729J03J958p69j603Q88K487l892J898L89q69m20J345j151k84L407
$$ -1374 977 -1752 -1649 309 -460 -2063 -1175 1312 -2580 -682 -293 -1162 -1582 -237 -1388 -1672 1735
2516A735l153n06J621J074k520J197J959l271J987R77p06k087K225m57J44J765
$$ 1735 -1418 -1924 -303 771 -1749 -552 1407 -1864 123 1100 394 -1693 532 75 219 1984
2532A984k668P42Q25J204l337K117J001j833J246P42r39k004L457j812l28J496
$$ 1984 -684 58 883 2087 -1250 867 1868 35 1281 2023 1084 -920 2537 725 397 1893
2548A893p24r89J130J342m025K385Q61j403n17K093r35j940K505k057M09M47K23
$$ 1893 1169 180 1310 2652 -1373 1012 1873 470 -47 2046 1111 -829 1676 -381 28 475 698
2565F98j531J481L00k877K369j020l96l01K463k491o20K601k111l32O38J183k671
$$ 698 -833 648 948 -1929 440 -580 -976 -1277 1186 -1305 -1925 676 -1435 -1767 -1129 54 -2617
2582b617K143M62k281Q96O28l29j336L191k225k76J559m20j032L03J896k645K374
$$ -2617 -474 -12 -2293 -1397 -769 -1098 -2434 757 -1468 -1744 -185 -605 -1637 -1334 562 -2083 291
2599B91j39n91l13J010o98n80K638k494J016J170m13k162J761J043k497K109k63
$$ 291 152 -439 -752 258 -440 -1020 1618 -876 140 1310 897 -1265 496 1539 -958 1151 888
2616H88l4p09J619j564l03J622j552Q46M57K43k483K429Q9k145R48R59n45j853
$$ 888 854 145 1764 200 -103 1519 -33 813 1270 1513 -970 1459 1548 -597 351 1310 765 -1088
2634a088L147k311o13R66K00q29K38J356k577J656n1n70p63J255k53q50J657j910
$$ -1088 2059 -252 -865 101 301 -528 -290 1066 -1511 145 94 -476 -1239 16 -237 -1087 570 -1340
2652a340M46J95Ko76J503l07k451L081l29j627l79K915k473o00L197j470j345
$$ -1340 -894 -699 -697 -1373 130 -177 -2628 453 124 -1503 -1882 1033 -1440 -2040 1157 -313 -1658
2669a658O72K055k400J057N01j165O23P18J39j785J919j541J206O42r19o66R92
$$ -1658 -986 1069 -1331 -274 227 -938 -315 403 542 -1243 676 -865 341 983 64 -602 390
2686C90J149k742K470q21p79J031J227j486j164K951k424O19Q89L8j898J856J003
$$ 390 1539 -1203 1267 446 -333 698 1925 439 -725 2226 -198 421 1310 1348 -550 1306 2309
2703B309k906J560j59l55m82K188j678m26J639j821N52O13K66k705K386N89j708
$$ 2309 -597 963 804 449 -33 2155 477 51 1690 -131 421 1034 1300 -1405 981 1570 -138
2720a38N2L11j06j137K861j757o81L48J32L83l70k96j537L097n78j403K69M75
$$ -138 -86 225 119 -1018 1843 86 -595 -247 -115 268 -102 -398 -1935 1162 584 -819 -550 -75
2738g5q94J30K164k831R52N19K86j713J638k9k261K738j39r07r05K377j524j038
$$ -75 -969 -839 1325 -1506 -554 -35 251 -1462 176 147 -2114 624 485 -422 -1327 1050 -474 -1512
2756a512K065n90L1p13J355q78P96j077n56J826m18jq78J579k295J465J009j541
$$ -1512 553 -37 -6 -719 636 -242 554 -523 -1079 747 329 328 -550 1029 -1266 199 1208 -333
2774c33q47J573J137k713K177j086j300J583J503k356j199L407j492o01K02R67
$$ -333 -1180 393 1530 -1183 994 -92 -1392 191 1694 -662 -1861 1546 54 -547 -345 622
2790F22j611P49J472j899P84m70M62p09J069r54N12Q78j624J170L3J72k076K143
$$ 622 -989 -240 1232 -667 117 -353 109 -600 469 -485 27 905 -719 451 484 656 -1420 723
2808G23l7r82J208n25r09o4K527k449K12J262n41m11O50J82k714L130j14j474
$$ 723 686 -296 912 387 -522 -586 1941 -508 -296 966 425 14 664 846 -1868 1262 1148 -326
2826c26J71J380j274n38K612k877J91J402Q26k527J271Q82k049Q77J04K88j282
$$ -326 -155 1225 -49 -587 2025 -852 -661 741 1567 -960 311 1193 -856 21 125 413 -869
2843h69J703p14l60N02j133J099m43J24q70K282j529j587K317l63j176j09K606
$$ -869 834 120 -240 262 -871 228 -215 -91 -961 1321 -208 -1795 522 159 -1017 -1126 1480
2860A480k911N45J584j144j287J130J277k569J851m43n84L03J015j173p37K424
$$ 1480 -1431 -886 698 -446 -1733 -603 674 -1895 -44 -487 -1071 -768 247 -926 -1663 761
2876G61j908L75L89M49j694J285M23j451J593j007K48j47J006j674N12J474j821
$$ 761 -1147 -772 -383 66 -1628 -343 80 -1371 222 -785 -537 -684 322 -1352 -840 634 -1187
2893a187R26K92J10j652K100m10j488J567K22m41m99J881k164P92J120r12n51
$$ -1187 -261 31 141 -1511 589 179 -1309 258 480 39 -460 1421 -743 49 1169 257 -294
2910b94R28J208k443J679r8n31l4Q61n04m48J640j908J172k41j01o18J211j68
$$ -294 634 1842 -601 1078 980 449 415 1276 772 324 1964 56 1228 987 886 268 1479 1311
2928A311j689K146q64p64j42J714j695J47J686j813j7Q02O35k612J545M37r71
$$ 1311 -378 1768 904 140 -2 1712 17 164 1850 37 20 822 1457 -1155 390 827 -144
2945a44N25k80l52p47K265j734P1L70k83J64P9J4j981K305m56m94J99P14q98k74
$$ -144 381 101 -251 -998 1267 -467 -396 -26 -309 -145 -66 -52 -2033 272 -184 -678 -479 235 -663 -937
2965i37J800k352P25O31M13j527J295Q6j523J789q55j68M21J426k516M88K226
$$ -937 863 -1489 -764 -133 280 -1247 48 134 -1389 400 -455 -623 -202 1224 -1292 -804 1422
2982A422k046j89J123N08k110K134R4j911M83J152R1j629J732j286P73N18o33
$$ 1422 -624 -813 310 818 -1292 842 936 -975 -492 660 751 -878 854 -432 341 859 226
2999B26q07N47J077j523J644j116m29Q29O02j335l97J788j650R00K80p57p70J814
$$ 226 -581 -34 1043 -480 1164 48 -381 448 1050 -285 -682 1106 -544 356 636 -121 -891 923
3017I23p16j682K436n25j017j9J723j885k6J870j641M3O59O63k414J373J16n46
$$ 923 207 -1475 961 436 -581 -600 1123 -762 -788 1082 -559 -516 143 806 -1608 -235 -119 -665
3035f65P98n30m01M0J780k079L41L79j50J27Q64n27j848K315m89o17J12N93l27
$$ -665 133 -397 -798 -758 1022 -1057 -716 -337 -487 -360 504 -23 -1871 444 -45 -662 -550 43 -284
3054b84j2J691k339O72N67L63j247J410J0j146J591j120K08j18J056j702P81J405
$$ -284 -296 1395 -944 -272 295 658 -589 821 831 -315 1276 156 364 246 1302 -400 381 1786
3072A786j812N65M88p1j649K449k06k033P63R54k82j376J676j321Q29K89p32k17
$$ 1786 -26 539 1027 956 -693 1756 1550 -483 280 1234 952 -424 1252 -69 760 1049 317 100
3090A00K51M85j494J638r02o39O27R24j710k73J564j409M64J50lj074J407m86
$$ 100 351 836 -658 980 78 -561 66 990 -720 -993 571 -838 -374 -224 -227 -1301 106 -380
3108c80j477J678k53n40l65J689j673J28J132j289M05J6P47j353J581j150k49
$$ -380 -1857 -179 -432 -972 -1337 352 -1321 -1193 -61 -1350 -945 -929 -182 -1535 46 -1104 -1353
3125a353J479j055l19M08K047k691N82J275q09q28J400M84k026K141l31m76kN45
$$ -1353 126 -929 -1248 -840 1207 -1484 -902 373 -436 -1264 136 620 -1406 735 404 -72 -74 471
3143D71q56J01J405j672J035j15J75q59J002k93p32J599q28j87l8J267k109Q18
$$ 471 -385 -284 1121 -551 484 369 544 -315 687 394 -338 1261 433 246 208 1475 -634 184
3161A84J135j710Q60N26M2j772J642n82o83R10k0m84P8J221k128J096M73j027
$$ 184 1319 -391 469 995 1037 -735 907 325 -358 552 532 48 126 1347 -781 315 788 -239
3179b39J1R58k05j713K175q94p43N30J097j180l10J349j651R54R9m33l16J359
$$ -239 -228 730 525 -1188 987 93 -650 -120 977 -203 -513 836 -815 139 238 -195 -511 848
3197H48o16j108J829p77o69J21J478j299J04Q98q36L35k50M07r08J739j098k10
$$ 848 232 -876 953 176 -493 -372 1106 -193 -89 809 -27 308 58 465 -443 1296 198 -12
3215a2J265q54o10K50J500k361J173R40j085m06Q71J46j698J874n92k99K34L39
$$ -12 1253 399 -211 39 1539 -822 351 1291 206 -200 671 817 -881 993 401 102 336 675
3233F75r82Q8R92j625P55K28r5r20J222l61j364J614q03j66J24R47j631N49P10
$$ 675 -307 -219 773 -852 -97 131 36 -884 338 -23 -1387 227 -576 -742 -618 329 -1302 -753 -43
3252d3j419R18L5P7j276J730n96p87R09j96r7k11J208j651Q14O67r63j81O36O49
$$ -43 -1462 -544 -509 -432 -1708 22 -574 -1361 -452 -648 -745 -956 252 -1399 -585 82 -881 -1062 -426 223
3272B23j380J982j079j30L80L69q66N18J141j857J135J93p6r85J788m78j524J759
$$ 223 -1157 825 -254 -384 -4 365 -501 17 1158 -699 436 629 553 -432 1356 878 -646 1113
3290A113o0p10k62J551j531M69O52j069P53j93K3p65J341j228k93J559r57p20
$$ 1113 1053 343 81 1632 101 570 1222 153 906 713 736 -29 1312 84 -209 1350 393 -327
3308c27N99J156k228R46L95r58J66R21l08j704J975p90k42J85L16q98L54J151
$$ -327 272 1428 -800 146 541 -417 -251 670 362 -1342 633 -157 -399 -214 102 -796 -442 709
3326G09k025Q29J57L03q85Q45k62o77J482j164k21M07R32j532P56P43j291P63
$$ 709 -1316 -487 -330 -27 -912 -67 -329 -1006 476 -688 -909 -502 430 -1102 -346 397 -894 -131
3344a31N8o9j166K058n48p49L59L29r1m23P90j170J008L10n96r4L24m8n61J357
$$ -131 -73 -142 -1308 750 202 -547 -188 141 50 -373 417 -753 255 565 -31 -125 199 151 -410 947
3364I47j228l2Q30M03j514N20J057j884R87P28m56j213J391Pj435J118M5n0p98
$$ 947 -281 -313 517 920 -594 -74 983 -901 86 814 358 -855 536 543 -892 226 271 221 -577
3383e77R42m80K69R7q63P04n6p5n82J275j283j65J286n34q14J8J683j459L46K10
$$ -577 365 -115 154 251 -612 92 36 -39 -621 654 -629 -794 492 -42 -856 -838 845 -614 -268 -58
3403e8n24j21P61Nj301J555m60o1l8J53o81Q27N76j375R95j35m19k97J396r69
$$ -58 -582 -703 58 63 -1238 317 -143 -204 -242 -89 -770 57 633 -742 253 118 -301 -598 798 -171
3423a71p01J954p40r85O22J523j906J08J407r13k16N29L79j209J198l05j95K07
$$ -171 -872 1082 342 -643 -21 1502 -404 -296 1111 198 -18 511 890 -319 879 574 379 586
3441E86r4M73k11K13j278J485k69p18K30O14m31n03J494j469n0O43K90j386N32
$$ 586 492 965 754 967 -311 1174 905 187 417 1031 600 97 1591 122 72 715 1005 -381 151
3460A51J252j848N10O26k43j060J032k03n30O04p02K46j29L76r36J039p1j155
$$ 151 1403 -445 65 691 448 -612 420 217 -313 291 -411 -165 -294 82 -854 185 114 -1041
3478a041O34N15p15o05J966j439j28R01l49m47r7J173j047M21m8J34k43RJ24k93
$$ -1041 -407 108 -607 -1212 754 -685 -813 88 -261 -708 -805 368 -679 -258 -306 -172 -415 -406 -282 -575
3498e75Q02q70M33N10l58m46M80P60j766J197J2k04m47J259p65o65J318o28K1
$$ -575 227 -643 -210 300 -58 -504 -24 736 -1030 167 179 -25 -472 787 22 -643 675 47 68
3517F8j10O40j065P49J86q32N42l4K17n73R53j005K18Q35r87j65L23J040j569
$$ 68 -42 598 -467 282 468 -364 178 144 361 -212 741 -264 -46 789 -198 -363 -40 1000 -569
3536e69R93l3p05j48J095l12j265J459o83j90J60N68r62J51J034j028L01k47M43
$$ -569 424 391 -314 -462 633 321 -944 515 -168 -358 -198 370 -592 -441 593 -435 -134 -381 62
3555F2n65N78k90N5L71r26M66N16j18j243J396j88r90J044L6l68q58J859o72r97
$$ 62 -503 75 -215 -160 211 -715 -249 267 149 -1094 302 114 -876 168 204 -164 -1022 837 165 -832
3575h32O03M60k03r5N32j414J181K12m46j40M82Q7q02J239j019J91O9O37l99j70
$$ -832 -229 231 28 -67 465 -949 232 444 -2 -142 340 427 -375 864 -155 36 105 742 343 173
3595A73M49j019R16k49j67k06R49o33n02Q52m60j73J05L50p06P55N8r41Q44k12
$$ 173 622 -397 519 270 103 -103 846 213 -289 563 103 -70 35 385 -321 434 492 -449 395 183
3615A83j31k75O54r89L12J124r54n02K68J000j258Q97l29m96L1P27L3j356J395
$$ 183 52 -223 431 -558 -246 878 -76 -578 -310 690 -568 329 0 -496 -465 262 295 -1061 334
3634C34n31J98k44K92n83J28O57q42Q33n07O3O4O09n18j48P79r57K08O17M36j518
$$ 334 -197 1 -243 49 -534 -406 251 -591 242 -265 -202 -138 471 -47 -195 584 -373 -165 452 888 -630
3655f30R77K55p16N16m0K30r43J342m08m04J03P4J42l0M20j020O69l0P6k1J9j33
$$ -630 347 602 -114 402 362 592 -351 991 583 179 282 356 498 468 888 -132 537 507 583 562 581 448
3677D48m01J238j052o9L7N26m22K3K89j045R96l44M1o32N91m50n7R47p02k52j80
$$ 448 47 1285 233 164 201 727 305 328 617 -428 568 224 265 -367 224 -226 -283 664 -38 -290 -470
3698d70O54r24P68P9p00K43K32L77j016O90o08K86K78j26o9m85O43l14M27m34
$$ -470 184 -740 28 107 -593 -350 -118 259 -757 -67 -675 -389 -111 -237 -306 -791 -148 -462 -35 -469
3718d69p5J67K15O5p16J031r85M47K98k2p74P77N41j209P29M4k08m33J050j99
$$ -469 -544 -377 -162 -97 -813 218 -767 -320 -22 -44 -818 -41 500 -709 20 64 -144 -577 473 274
3738B74n66N85l65J9l2P24r84M59M04o25M16j48q1l36R74o29l45M40j32N6k72
$$ 274 -292 293 -72 -53 -85 639 -345 114 518 -107 309 161 80 -256 718 89 -256 184 52 108 -164
3759a64N56r58R21m96J3k7k9L4k0M73p69K00J02J26n89M10L22j197R47j41J7m37
$$ -164 392 -566 355 -141 -128 -155 -184 -150 -170 303 -466 -266 -164 -38 -627 -217 105 -1092 -145 -286 -269 -706
3781g06P18k56m99Q02n59K33j33P15r10M56J05k54J80p7L78n22O95o01L25p4R7
$$ -706 12 -244 -743 59 -500 -267 -400 315 -595 -139 -34 -288 -108 -185 193 -329 366 -235 90 16 113
3802A13K2N9J14p42Q17K6l17L3N64l35m21Q08n76L1Q5L53k22n7L10o64M03k64
$$ 113 135 194 308 -434 383 409 92 125 689 354 -67 741 165 196 281 634 412 355 665 1 404 140
3824A40M54n38M32m7m36O18l30k0k73M10o21N56qo72M17J16J61r17J064p45j09
$$ 140 594 56 488 441 5 623 293 273 0 410 -211 345 337 -335 82 198 359 -558 506 -239 -348
3845c48L13J46k75l24P25o82M92l12l9l3L01Rn18R81j046L78K2N19p49KM38k93
$$ -348 -35 111 -164 -488 237 -445 47 -265 -304 -337 -36 -27 -545 436 -610 -232 -210 309 -440 -438 0 -293
3867b93M77l75J35l85P89m61k81Q12n59L39k14N63j003N66J54k74L99j97j71j67
$$ -293 184 -191 -56 -441 348 -113 -394 418 -141 198 -16 547 -456 110 264 -10 389 192 21 -146
3887a46Q43q40M27P3j96j15K14N59j056N15p1K47j13j6P8m62O70m59J98m20M02
$$ -146 697 -143 284 357 161 46 260 819 -237 278 207 454 341 325 403 -59 611 152 350 -70 332
3908C32k82J51K84o73K27j99P16p50K34o74N78O71j001J58m3M43n69M47k57m79
$$ 332 50 201 485 -188 39 -160 556 -194 40 -634 -56 615 -386 -228 -271 172 -397 50 -207 -686
3928f86N03qL37p12N41n13J91K24m11K88l46N69q33N75k62K91l18K09K64j92M75
$$ -686 -183 -191 146 -566 -25 -538 -347 -123 -534 -246 -592 -23 -856 -281 -543 -252 -570 -361 -97 -289 186
3949A86q95L55L48L55p60j7P13l93K35j64N8k97Q12l71k38M05n37M81j4M70r16
$$ 186 -709 -354 -6 349 -411 -428 285 -108 127 -37 21 -276 536 165 -73 332 -205 276 262 732 -184
3970a84L70M15j88k92k31P15n69L40m77O79m45n4K98j31K32p64O71j87k43N2K05
$$ -184 186 601 413 121 -110 605 36 376 -101 578 133 79 377 246 478 -286 385 198 -45 7 212
3991B12Q5p68Q25n48L50o03L80k95L51M13j094K06L83K72p51M56l52L09R3o23
$$ 212 297 -471 354 -194 156 -447 -67 -362 -11 402 -692 -486 -103 169 -582 -126 -478 -169 -76 -699
4011f99Q31l39J69m89O97k70p86Q42L89m40n06J006l86j48J55j70K58m5j2l61
$$ -699 132 -207 -38 -527 170 -100 -886 -44 345 -95 -601 405 19 -129 26 -144 114 69 57 -304
4031c04P26j47l57pO49k67n99Q67m72K40l70M21j25N4k23j16P19n58j84j35J010
$$ -304 422 275 -82 -89 560 293 -306 561 89 329 -41 380 255 309 86 -30 689 131 -53 -188 822
4052H22n69m81O91m77L09p49J000n47j67k7J45L89n55K02q2J81p47M95J17l56
$$ 822 253 -228 463 -14 295 -454 546 -1 -168 -195 -50 339 -216 -14 -96 85 -662 -167 -50 -406
4072d06J30J86J19p74R31l79j47j12O49l95p05J041l58m7l30J001n26k66L47j45
$$ -406 -276 -90 29 -745 186 -193 -340 -452 197 -198 -903 138 -220 -267 -597 404 -122 -388 -41 -186
4092a86M72p53M36jK71n96L43J47j57J17j01M62q00P54r0l30K17Q9K02l75N81
$$ -186 286 -467 -31 -32 239 -357 -14 133 -24 93 -8 454 -346 408 318 -12 205 294 496 121 702
4113G02n40M4J2Q2j39j25N38l97J67m33O44J0n17L0K6O60q69M41k1k3m41K80N14
$$ 702 162 206 218 300 161 36 574 177 344 -89 555 565 48 78 104 764 -105 336 315 292 -149 131 645
4136F45r50L76j13M58o59L43l38J02J85Q3j13m94O45l89O6j33K50K55o92L26J05
$$ 645 -305 71 -42 416 -243 100 -238 -136 49 132 19 -475 170 -219 -153 -286 -36 219 -473 -147 -42
4157d2L45j105L67O83n33q9kQ44j180K93N00J54r50L53P39q06M77o03Q84m29J96
$$ -42 303 -802 -435 248 -285 -374 -376 468 -712 -419 81 235 -715 -362 377 -429 48 -555 329 -100 96
4178I6k17K06m14J95O25p01J16j15M92n41M37K30j005M73N51K96j334Q02M06o43
$$ 96 -121 85 -329 -134 491 -210 -94 -209 283 -258 179 409 -596 -123 428 724 -610 192 598 -45
4198d5j81M83J88q96M73K13Q6m98J77K03k41O2o1M13o93K73J62q5k20k3M20m08
$$ -45 -226 257 445 -451 22 235 321 -177 0 203 -38 24 -37 376 -317 -44 118 33 -187 -210 210 -198
4220a98L61k85lk91M60R5n52K97k83M70o90L92k37K14p5j06M26n38L65l08P11
$$ -198 163 -122 -125 -416 44 139 -413 -116 -399 71 -619 -227 -464 -250 -325 -431 -5 -543 -178 -486 225
4241B25o90k29Q34j43j49j15O48p72J88L38P3r9m02O90o65M03p7O88o45k96Q48
$$ 225 -465 -694 140 -3 -152 -267 381 -391 -203 135 208 109 -293 397 -268 135 58 746 101 -195 653
4262F53j53j45l83Q24n16j14MM02m24j47P85l27j66l37R39o95j36L73k58J77l58
$$ 653 500 355 -28 796 280 166 170 572 148 1 786 459 293 -44 895 200 64 437 179 356 -2
4283bP38p42n0%L69m22m3L11l06L64m96M66k90l26M03P6j56m55Q28m66l05L50
$$ -2 736 -6 -56 -56 313 -109 -152 159 -147 217 -279 187 -103 -429 -26 50 -106 -561 267 -199 -504 -154
4305a54J70j84l17N61m89J33k32M82m17J81J44Lp0n28P04k68M88k49qM7k86M61
$$ -154 16 -168 -485 76 -413 -280 -512 -30 -447 -266 -122 -119 -189 -717 -13 -281 207 -42 -50 -3 -289 172
4327A72l25J98j75J42q4K27K11k85j13P4L54l98J76rJ85k1l26N50m78K48m11N43
$$ 172 -153 45 -130 12 -72 155 366 81 -32 42 396 -2 174 165 350 329 3 553 75 323 -88 455
4349D55j86k64q6J61l8o89J006l35N3j78P6J84l35nL9M92q62M33J01k26Nj25L98
$$ 455 269 5 -81 80 42 -647 359 24 77 -101 -25 159 -176 -181 -142 350 -512 -79 22 -204 -199 -324 74
4372G4l51L08l68N45n88K72n5k91N18k30J85m59O12m72Q6L50j91r9l27Q86p96
$$ 74 -277 31 -337 208 -380 -108 -163 -454 64 -166 19 -440 172 -300 -214 136 -55 -154 -481 405 -391
4393c91J35K03K10j74j75P84n37m7k16O16m65LK88j45J03k39M01m31L82j97K46
$$ -391 -256 -53 157 -17 -192 592 55 8 -208 408 -57 -54 234 89 192 -47 354 -77 305 108 354
4414C54k40L3K98m70K88l87M67l02k0L67m08J71l14L93l40M37k78J10m4l04M40
$$ 354 114 147 445 -25 263 -124 343 41 21 388 -20 151 -163 230 -110 327 49 159 115 -189 251
4435B51l10J46l22N62l43j80P6N7J69n32N00l59L42n10L96j04j48K73j21O2k57
$$ 251 -59 87 -235 327 -16 -196 -120 -63 106 -426 74 -285 57 -453 -57 -161 -309 -36 -157 -95 -352
4456c52M44k08K4j87o2M72n21L62l14K90j84K18k32n7L68m19L10j83L27l28J71
$$ -352 92 -116 -92 -279 -341 131 -390 -28 -342 -52 -236 -18 -250 -307 61 -358 -48 -231 96 -232 -61
4477f1J7j51K64l58O05n22K84k4K89Qp23N00k06N01m82K68k01K05j37mM12l00
$$ -61 -44 -195 69 -289 316 -206 78 54 343 351 -372 128 -78 423 -59 209 8 213 76 72 484 184
4499A84K60l98M38p31K81K58k35P0n6L72j46m8k70Q0J05l13L11k93K69l59K28
$$ 184 444 46 484 -247 34 292 57 127 71 443 297 249 -21 59 164 -149 162 -131 138 -221 7
4520Gk15P7L9j04M26o23L14m43Q61n72q2Q4J32R7m44M09k84K82j7K8j99RK15m91
$$ 7 -208 -131 -92 -196 230 -393 -79 -522 339 -233 -315 -231 -99 -2 -446 -37 -321 -39 -56 -28 -227 -218 -3 -494
4544d94M83k75K53j37J41Jj15K90j99L07n42M66j00O0o1j21M16l68K41j41M4L
$$ -494 -11 -286 -33 -170 -29 -28 -143 147 -52 255 -287 179 79 139 78 -43 373 5 246 105 149 152
4566A52j29L34k19J44k84O23q10M55j75K83j04k07j2r9M37m32J95j28L41j93k40
$$ 152 23 357 138 282 -2 621 -189 266 91 374 270 63 51 -48 389 -43 152 24 365 172 -68
4587f8J94k66M53l19K60m57K85k4k14rj47N33m96L09l84K66J01n1Jl47L96k59
$$ -68 126 -140 313 -6 254 -203 82 58 -156 -165 -312 221 -275 34 -350 -84 17 -34 -33 -380 16 -243
4609b43J33k34K21Q1jQ0o2r6j63L93q3k40J36K07J09l26L01j78K25k45K2r6R1
$$ -243 -110 -344 -123 -42 -43 37 -25 -121 -284 109 26 -214 -78 129 238 -88 213 35 260 15 37 -59 32
$$ [...]
8191b24
##END NTUPLES=NMR FID
##END=
