##TITLE=1H_TG-2292-E
 CDCl3, 8 sc, 
 26.8.2020
##JCAMPDX= 6.0         $$ Bruker NMR JCAMP-DX V2.0
##DATA TYPE= NMR FID
##DATA CLASS= NTUPLES
##ORIGIN= UXNMR, Bruker Analytische Messtechnik GmbH
##OWNER= root
$$ XWIN-NMR		Version 3.5
$$ Thu Aug 27 11:34:39 2020 Russian Standard Time (UT+4h)  she@DPX200
##.OBSERVE FREQUENCY= 200.1315066352
##.OBSERVE NUCLEUS= ^1H
##.DELAY= (6, 6)
##.ACQUISITION MODE= SIMULTANEOUS
##.ACQUISITION SCHEME= undefined
##.AVERAGES= 8
##.DIGITISER RES= 18
##SPECTROMETER/DATA SYSTEM= spect
##.PULSE SEQUENCE= zg30
##.SOLVENT NAME= CDCl3
##.SHIFT REFERENCE= (INTERNAL, CDCl3, 0, 15.7039)
##AUDIT TRAIL= $$ (NUMBER, WHEN, WHO, WHERE, WHAT)
$$ ##TITLE= Audit trail, XWIN-NMR		Version 3.5
$$ ##JCAMPDX= 5.01
$$ ##ORIGIN= Bruker BioSpin GmbH
$$ ##OWNER= she
$$ F:/spectra/data/she/nmr/H-F/1/audita.txt
$$ ##AUDIT TRAIL=  $$ (NUMBER, WHEN, WHO, WHERE, WHAT)
(   1,<2020-08-27 11:33:26.25 +0400>,<she>,<DPX200>,
      <created by zg, POWCHK disabled, PULCHK disabled
       configuration hash MD5:
       00 E9 B6 7A A2 85 ED C7 34 08 36 98 17 FE 4E 26
       data hash MD5: 16K
       54 EB DB E3 35 33 98 D2 4F AD 9D 20 FB D9 10 BA>)
$$ ##END=
$$ 
$$ hash MD5
$$ 77 67 B3 8D 56 BA BB 9D 13 B1 0F A6 75 3F 2A E4
##$RELAX= 
##$RELAX= 
##$RELAX= 
##$RELAX= 
##$RELAX= 
##$RELAX= 
$$ Bruker specific parameters
$$ --------------------------
##$DU= <F:/spectra>
##$EXPNO= 1
##$NAME= <H-F>
##$PROCNO= 1
##$TYPE= <nmr>
##$USER= <she>
##$AMP= (0..31)
100 100 100 100 100 100 100 100 100 100 100 100 100 100 100 100 100 100 
100 100 100 100 100 100 100 100 100 100 100 100 100 100 
##$AQSEQ= 0
##$AQ_mod= 1
##$AUNM= <au_zg>
##$AUTOPOS= <>
##$BF1= 200.13
##$BF2= 200.13
##$BF3= 200.13
##$BF4= 200.13
##$BF5= 200.13
##$BF6= 200.13
##$BF7= 200.13
##$BF8= 200.13
##$BYTORDA= 1
##$CFDGTYP= 0
##$CFRGTYP= 5
##$CHEMSTR= <none>
##$CNST= (0..31)
1 1 145 1 1 1 1 1 1 1 1 1 1 1 1 1 1 1 1 1 1 1 1 1 1 1 1 1 1 1 1 1 
##$CPDPRG= <>
##$CPDPRG1= <>
##$CPDPRG2= <>
##$CPDPRG3= <>
##$CPDPRG4= <mlev>
##$CPDPRG5= <mlev>
##$CPDPRG6= <mlev>
##$CPDPRG7= <mlev>
##$CPDPRG8= <mlev>
##$CPDPRGB= <>
##$CPDPRGT= <>
##$D= (0..31)
0 1.2 0 0 0 0 0 0 0 0.06 0 0.03 0 0 0 0 0.0002 0 0 0 0 0 0 0 0 0 0 0 0 
0 0 0 
##$DATE= 1598513605
##$DBL= (0..7)
120 120 120 120 120 120 120 120 
##$DBP= (0..7)
150 150 150 150 150 150 150 150 
##$DBP07= 0
##$DBPNAM0= <>
##$DBPNAM1= <>
##$DBPNAM2= <>
##$DBPNAM3= <>
##$DBPNAM4= <>
##$DBPNAM5= <>
##$DBPNAM6= <>
##$DBPNAM7= <>
##$DBPOAL= (0..7)
0.5 0.5 0.5 0.5 0.5 0.5 0.5 0.5 
##$DBPOFFS= (0..7)
0 0 0 0 0 0 0 0 
##$DE= 6
##$DECBNUC= <off>
##$DECIM= 32
##$DECNUC= <off>
##$DECSTAT= 4
##$DIGMOD= 1
##$DIGTYP= 9
##$DL= (0..7)
0 120 120 120 120 120 120 120 
##$DP= (0..7)
150 150 150 150 150 150 150 150 
##$DP07= 0
##$DPNAME0= <>
##$DPNAME1= <>
##$DPNAME2= <>
##$DPNAME3= <>
##$DPNAME4= <>
##$DPNAME5= <>
##$DPNAME6= <>
##$DPNAME7= <>
##$DPOAL= (0..7)
0.5 0.5 0.5 0.5 0.5 0.5 0.5 0.5 
##$DPOFFS= (0..7)
0 0 0 0 0 0 0 0 
##$DQDMODE= 0
##$DR= 18
##$DS= 0
##$DSLIST= <SSSSSSSSSSSSSSS>
$$ [...]
##$SUBNAM2= <"">
##$SUBNAM3= <"">
##$SUBNAM4= <"">
##$SUBNAM5= <"">
##$SUBNAM6= <"">
##$SUBNAM7= <"">
##$SUBNAM8= <"">
##$SUBNAM9= <"">
##$SW= 16.880792210976
##$SWIBOX= (0..15)
0 0 2 0 0 0 0 0 0 0 0 0 0 0 0 0 
##$SW_h= 3378.37837837838
##$TD= 16384
##$TD0= 1
##$TE= 0
##$TE2= 300
##$TE3= 300
##$TEG= 300
##$TL= (0..7)
0 120 120 120 120 120 120 120 
##$TP= (0..7)
150 150 150 150 150 150 150 150 
##$TP07= 0
##$TPNAME0= <>
##$TPNAME1= <>
##$TPNAME2= <>
##$TPNAME3= <>
##$TPNAME4= <>
##$TPNAME5= <>
##$TPNAME6= <>
##$TPNAME7= <>
##$TPOAL= (0..7)
0.5 0.5 0.5 0.5 0.5 0.5 0.5 0.5 
##$TPOFFS= (0..7)
0 0 0 0 0 0 0 0 
##$TUNHIN= 0
##$TUNHOUT= 0
##$TUNXOUT= 0
##$USERA1= <user>
##$USERA2= <user>
##$USERA3= <user>
##$USERA4= <user>
##$USERA5= <user>
##$V9= 5
##$VALIST= <valist>
##$VCLIST= <CCCCCCCCCCCCCCC>
##$VD= 0
##$VDLIST= <DDDDDDDDDDDDDDD>
##$VPLIST= <PPPPPPPPPPPPPPP>
##$VTLIST= <TTTTTTTTTTTTTTT>
##$WBST= 1024
##$WBSW= 4
##$XGAIN= (0..3)
0 0 0 0 
##$XL= 0
##$YL= 0
##$YMAX_a= 556532
##$YMIN_a= -450385
##$ZGOPTNS= <>
##$ZL1= 120
##$ZL2= 120
##$ZL3= 120
##$ZL4= 120
##$ABSF1= 10
##$ABSF2= 0
##$ABSG= 5
##$ABSL= 3
##$ALPHA= 0
##$AQORDER= 0
##$ASSFAC= 0
##$ASSFACI= 0
##$ASSFACX= 0
##$ASSWID= 0
##$AUNMP= <proc_1d>
##$AZFE= 0.1
##$AZFW= 0.1
##$BCFW= 1
##$BC_mod= 2
##$BYTORDP= 1
##$COROFFS= 0
##$CY= 11.3945322036743
##$DATMOD= 1
##$DC= 2
##$DFILT= <>
##$DTYPP= 0
##$F1P= 16.9975609425685
##$F2P= -3.02152046262296
##$FCOR= 0.5
##$FTSIZE= 0
##$FT_mod= 4
##$GAMMA= 1
##$GB= 0.15
##$INTBC= 1
##$INTSCL= 1
##$ISEN= 128
##$LB= 0.24
##$LEV0= 0
##$LPBIN= 0
##$MAXI= 10000
##$MC2= 0
##$MEAN= 0
##$ME_mod= 0
##$MI= 1.114404
##$NCOEF= 0
##$NC_proc= 0
##$NLEV= 6
##$NOISF1= 3.799351
##$NOISF2= 2.8
##$NSP= 1
##$NTH_PI= 0
##$NZP= 0
##$OFFSET= 15.70392
##$PC= 1
##$PHC0= -9969.719
##$PHC1= 6.600922
##$PH_mod= 1
##$PKNL= yes
##$PPARMOD= 0
##$PSCAL= 0
##$PSIGN= 0
##$REVERSE= no
##$SF= 200.130013532006
##$SI= 16384
##$SIGF1= 3
##$SIGF2= 2
##$SINO= 400
##$SIOLD= 16384
##$SREGLST= <1H.CDCl3>
##$SSB= 0
##$STSI= 0
##$STSR= 0
##$SW_p= 3612.71676300578
##$SYMM= 0
##$S_DEV= 0
##$TDeff= 0
##$TDoff= 0
##$TI= <>
##$TILT= no
##$TM1= 0
##$TM2= 0
##$TOPLEV= 0
##$USERP1= <user>
##$USERP2= <user>
##$USERP3= <user>
##$USERP4= <user>
##$USERP5= <user>
##$WDW= 1
##$XDIM= 8192
##$YMAX_p= 0
##$YMIN_p= 0
$$ End of Bruker specific parameters
$$ ---------------------------------
##NTUPLES= NMR FID
##VAR_NAME=  TIME,          FID/REAL,        FID/IMAG
##SYMBOL=    X,             R,               I
##VAR_TYPE=  INDEPENDENT,   DEPENDENT,       DEPENDENT
##VAR_FORM=  AFFN,          ASDF,            ASDF
##VAR_DIM=   8192,          8192,            8192
##UNITS=     SECONDS,       ARBITRARY UNITS, ARBITRARY UNITS
##FACTOR=    0.000296,      1,               1
##FIRST=     0,             0,               0
##LAST=      2.424536,      0,               0
##MIN=       0,             -450385,         0
##MAX=       2.424536,      556532,          0
$$ Real data points
##PAGE= N=1
##DATA TABLE= (X++(R..R)), XYDATA
0@%%%%%%%%%%%qJ6j6J7k5L2m0N2o0P2q8J05j27J53j80K08k43K83l26L77m33M93
33B62n61O38p21Q12r15J026j150J286j429J589j765J957k169K399k647K920l220
50a688L548l909M304m741N228n771O383p075P861q770R835j1100J2634j4539J6979
65I179k0239K4852l1970M4885j11725M35309k71872n28804L86143J62822l12647
76b14067N0096J92724j95450M4796J75267j5011j05940O6399j85301Q4157K35611
87A33281j53444q7064J91114J6283j86448J12806k8754r5745J71140L4090j65897
98e8638J04492K11412l48223q0368L18799l9627k00868K02888N1890k40203J61061
109H2615N4645j89932n938J69161o6638L0095J70448k82137j00309L18411P973
$$ plain form
0 0 0 0 0 0 0 0 0 0 0 0 0 -8 8 -8 9 -16 16 -24 28 -32 40 -48 57 -70 83 -97 111 -132 151 -175 202 -231 262
33 262 -299 339 -382 430 -485 541 -609 677 -752 837 -928 1029 -1140 1259 -1388 1532 -1688
50 -1688 1860 -2049 2255 -2486 2742 -3029 3354 -3721 4140 -4630 5205 -5895 6739 -7800 9179
65 9179 -11060 13792 -18178 26707 -85018 350291 78419 -450385 -64242 98580 -214067
76 -214067 -163971 28753 -166697 -121901 53366 38355 -67585 -1186 -186487 -102330 133281
87 133281 -20163 -107227 83887 100170 -86278 26528 -2226 -97971 73169 107259 -58638
98 -58638 45854 257266 -90957 -171325 147474 107847 -93021 109867 161757 -78446 82615
109 82615 137260 -52672 -58610 110551 43913 74008 244456 -37681 -137990 180421 188394
120A88394l29802J72236J88379j78798M2912P9104j49231p8903K19520n0225o2945
131D0641J36221p1387q8846J25499J5849k17698J42245J02134j20957O1438P8419
142B03558j58181l9541J83561j57366l3340K25341n2944k21581J67199J22298
152B39004k95170M5144J58941j07676k6442J87987j19205j71438J60811n470j03541
163c7055M5513O3443j07514Q7817M3949j86311L7006N9091q6701K9983J64992
174A14213j87559o7039K30188j06441k10125J63757J36350k44295R1289J76039
184I6377j88813q5410J67031n3710j32592K03002j8355j21251J03618M6063j68610
195a52650K7337J39387j29657K3626J21835l8853q3679O9806m2988m1511J36826
$$ plain form
120 188394 -141408 30828 219207 40409 83321 162425 13194 -65709 153811 103586 40641
131 40641 176862 105475 16629 142128 157977 -59721 82524 184658 63701 125139 203558
142 203558 45377 5836 189397 32031 -1309 224032 171088 -50493 116706 239004
152 239004 -56166 -11022 147919 40243 13801 201788 82583 -88855 71956 66486 -37055
163 -37055 8458 71901 -35613 52204 96153 -90158 -53152 5939 -80762 -50779 114213
174 114213 -73346 -140385 89803 -16638 -226763 -63006 73344 -170951 -79662 96377
184 96377 -92436 -177846 -10815 -64525 -197117 5885 -12470 -133721 -30103 15960 -152650
195 -152650 -125313 14074 -115583 -91957 29878 -8975 -92654 -22848 -65836 -107347 29479
206B9479p9603m5968J54886K1191k14306Q8795J31031j88843K1565J84662o1568
217D1321j28190J67378l8821j40217J21897J6674j08495J03920J23750k12674
227e3457K0890J50096j31657p5760J68152K500j44836J56085Q458j52322M0673
238a1178P9154j06804L1575J38091j37495j2356J10325n2679j18948R3298K7936
249D0919p4289J05292j3825q5489L5542L7819j27553P3521J03537j63194L8265
260b9455J67780j12650j78747J91118J8664j79777J22261J17364j51611l7186
270g2239J63838j28627o4866J31340k5287p2400J04099L2194j39009O2555K970
281e432p8066O7204P9953j03339j459J25588j23684k5406R6407o3175p9161J75388
$$ plain form
206 29479 -50124 -96092 58794 79985 -134321 -45526 85505 -103338 -81773 102889 41321
217 41321 -86869 80509 41688 -98529 23368 40042 -68453 35467 159217 -53457
227 -53457 -32567 117529 -14128 -89888 78264 80764 -64072 92013 100471 -51851 -11178
238 -11178 67976 -38828 -7253 130838 -6657 -19013 91312 38633 -80315 12983 40919
249 40919 -33370 71922 58097 -27392 8150 45969 -81584 -8063 95474 -67720 -29455
260 -29455 138325 25675 -153072 38046 56710 -123067 -806 116558 -35053 -72239
270 -72239 91599 -37028 -101894 29446 4159 -68241 35858 68052 -70957 -8402 -5432
281 -5432 -83498 -16294 63659 -39680 -41139 84449 -39235 -64641 31766 -31409 -110570 64818
293F4818L1606j75461P1526M5127j02320J2747J25058j11147k5794J61057o3507
304C3710q9886N7213q94r8946J36659M3166j32511N0258O7391j00051l2101J27199
316F1207r8747l2569J46318j7694j05751N7459J5969j32063J06457O3947j00954
327c6421J7441R4305r0723m5482J21764j01379n9269J41524L9099j26922N4114
338H051L7909j37787O6704P7355q5283k2127J31314o1779n8692R5821p4774q0082
350a03370J13093P4535j31414N3407O2017j15462J0507Q1899o1141n2218J29962
361F1815l2095m0754O9350n1022r4079Q8690P5249j23762O4149O6676j05036o686
373b7505J10096r0126r1961J57457p22p0012N8298J4255j25867M9402R2480j12946
$$ plain form
293 64818 96424 -79037 -7511 37616 -64704 -51957 73101 -38046 -63840 97217 33710
304 33710 -56176 1037 143 -98803 37856 81022 -51489 -1231 66160 -33891 -65992 61207
316 61207 -37540 -70109 76209 58515 -47236 10223 26192 -105871 586 64533 -36421
327 -36421 -18980 75325 -15398 -60880 60884 -40495 -99764 41760 80859 -46063 8051
338 8051 45960 -91827 -25123 52232 -33051 -55178 76136 14357 -44335 51486 -23288 -103370
350 -103370 9723 84258 -47156 6251 68268 -47194 -36687 45212 -15929 -68147 61815
361 61815 29720 -11034 58316 7294 -86785 1905 77154 -46608 17541 84217 -20819 -27505
373 -27505 82591 -7535 -99496 57961 57239 -12773 45525 59780 -66087 -16685 75795 -37151
385c7151J8741Q7898m9114m7697J00515p0546r5287J15718J2981o4139M9947M7613
397F9479j28356L0536P5593r6340p006R0294l2321n7461J17479o0350j09498P9075
409b8876L7288p5418M4316P2615j26066K2893Q3687q2663o3639J01550Q36o7963
421h1440J08068k6204j04713M4107O6537r0296J7991Q8334p6923J2909O5929n9914
433c5615p2996J06442q780p1432J09851J4744r9462K7653Q2719j11653J1277J08303
445F1051n7918k5145R0316j1532j00917P9009P71o1897Q2038N0700r4312N522
457A7686J00589r7068k0111P8872k7895l6762R6635J139j09590O1297J3494o1548
469A6738L0688O2218p9733J2765R6671j00172m3674P5763j1166p4278R2807J6951
$$ plain form
385 -37151 -18410 69488 20374 -27323 73192 2646 -92641 23077 36058 -28081 21866 69479
397 69479 -58877 -28341 47252 -49088 -56094 34200 1879 -55582 61897 1547 -107951 -28876
409 -28876 8412 -67006 -22690 49925 -76141 -53248 30439 -52224 -115863 -14313 -13477 -81440
421 -81440 26628 424 -104289 -60182 6355 -83941 -65950 22384 -54539 -41630 24299 -35615
433 -35615 -108611 -2169 -10949 -82381 27470 42214 -57248 -29595 53124 -58529 -47252 61051
445 61051 3133 -22012 68304 56772 -44145 34864 35635 -26262 55776 106476 12164 17686
457 17686 118275 21207 1096 79968 52073 15311 111946 113085 3495 64792 78286 16738
469 16738 47426 109644 29911 42676 139347 39175 -4499 71264 60098 -14180 78627 95578
481I5578r8613M7805K7629q1741r909Q9247o9341p517Q6583o1399n7062O5534
493B6794n997j00623Q8341L8067q0526K2282N0000p3157k9933Q6331o2612j6343
505e7376Q3459j8516o7064O1990K816j04692P6113M3499p1993J0272Q9362o9498
517b1628n1199Q7240m3392m3769P4128K9361q2188N1958K8597q8839K8760M3361
529A2390m6958p853R7094n1554m6608O2731k8103n0235N8132K9427q2140O7401
541A3724L6127q5951L157N1951n5019j8539J09255n0952n2106P0820K910q8852
553f3475L8560M6483q0486N7522N4832p6460k7742Q1812m8832n6882R1849p882
565I299m8268N0046L4371j00786J8296O1332o3159J0866N6407k2996l0657O2751
$$ plain form
481 95578 -3035 44770 72399 -9342 -19251 69996 655 -6862 79721 18322 -38740 26794
493 26794 20797 -79826 8515 46582 -33944 -11662 38338 -34819 -64752 21579 -41033 -57376
505 -57376 26083 7567 -59497 2493 5309 -99383 -23270 20229 -51764 -41492 47870 -21628
517 -21628 -72827 14413 -28979 -72748 1380 30741 -51447 511 29108 -59731 -30971 12390
529 12390 -34568 -42421 54673 3119 -43489 19242 -8861 -59096 -964 28463 -53677 13724
541 13724 49851 -36100 -32943 19008 -36011 -54550 54705 3753 -48353 22467 25377 -63475
553 -63475 -24915 21568 -58918 -1396 53436 -23024 -50766 31046 -17786 -74668 17181 9299
565 9299 -38969 11077 45448 -55338 -37042 24290 -38869 -28003 28404 5408 -25249 37502
577C7502n1717m7833P3529N309m9822L6240M7195p8544K7206K9712p5037Q033
589c8227Q5773k9910n0093P9451l9708n0472O2537N444q9812N6541R5924r7220
601i772j7722N9197l5742m5718P5661j0155n8034P4350P775n7862J254K8739n3163
614d1192L4888N3325o9872O565O4889l9232p1552P1294m232m1378O2869O896o4289
627c1021K2241N8481q9711m375O9609k1417j7243N4413k6042p1440P6286K813
639B2594o3407K4288N2211l1725N801K8965q2545J5509O8038l5656m8393Q1209
651C6889L420p0985N5680l677p2718L0203Q5584o6571k2713O9206l0703l2175
663a8560K7280p935m4180P8393J1042o8251K7319K6287m6240n154M9607n5289
$$ plain form
577 37502 -14215 -62048 11481 16790 -33032 3208 50403 -28141 -935 28777 -46260 -38227
589 -38227 47546 17636 -32457 46994 7286 -43186 19351 24795 -65017 -8476 87448 -9772
601 -9772 -27494 31703 -4039 -49757 25904 15749 -42285 32065 39840 -18022 -16768 11971 -41192
614 -41192 -6304 47021 -22851 -16286 48603 9371 -62181 9113 4881 -36497 26372 33268 -31021
627 -31021 -8780 49701 -40010 -44385 25224 3807 -13436 40977 14935 -56505 19781 22594
639 22594 -40813 -16525 35686 3961 9762 38727 -43818 -28309 39729 4073 -44320 36889
651 36889 40309 -30676 25004 21327 -51391 -21188 64396 -2175 -24888 44318 13615 -18560
663 -18560 8720 785 -43395 34998 46040 -22211 5108 31395 -14845 -19999 29608 -25681
675b5681J8435P0417m5699n5952N3918J0550p1209N8269J9297n2929K7554N5855
687F2825p0868m1962P5430j9588j9531L2727J624l3466M2368q979o8778M8292
699I4K3152l7440J7622N0894p5084r320Q0474n6828n3221P2901L7721p7458L4330
712G837K4931o5943J3103M6714l9249k6920P7787k0474l4243K3148j3358k9301
724c5968L8637J7763n6515M7251J9913n1659K962L5428n0845p384Q7892m3566
736C909m3920N7731J5601q1597K5047M8274n4410K0075M1985l0757l1604M8641
748A8975k5232k8482M4686j2147j1536L9435Q81p3535M5343L0570o5913J7222
760a9733N8248l5836l1215P3737m2107n5134N7119K2509n4221K1892N0865o0815
$$ plain form
675 -25681 -7246 63171 17472 -38480 15438 25988 -45221 13048 32345 -20584 6970 62825
687 62825 -8043 -50005 25425 5837 -13694 19033 20657 -12809 29559 20580 -48198 94
699 94 23246 -14194 3428 54322 -20762 -30082 50392 -6436 -59657 13244 50965 -26493 7837
712 7837 32768 -33175 -20072 26642 -12607 -39527 38260 17786 -16457 6691 -6667 -35968
724 -35968 2669 20432 -36083 11168 31081 -20578 -17616 17812 -33033 -40417 47475 3909
736 3909 -40011 17720 33321 -48276 -23229 25045 -29365 -9290 32695 1938 -29666 18975
748 18975 -6257 -34739 9947 -2200 -13736 25699 26580 -46955 -1612 28958 -36955 -19733
760 -19733 38515 2679 -28536 45201 3094 -52040 5079 27588 -26633 -4741 46124 -14691
772a4691N576K9917l4429j7200N1313p633l0281M8473k2658l1342K5989J0453
784A3487m8116L6138M1385n8855J2987L5031m1131l1601O7459j9527m1478O4404
796C0183M036n6829J1503M2754n9537Q829M9762k8616r138L4680j6331m2270M6829
809A5855j6481k4288M7716P616m8277K3254L7831p6024J0818N6764l0637k9098
821b4951O4320m819o8607M3844J1968m0877R474M5416l1360l207L3568m0444p150
834a2825K3703o951j8262M7695j4901l6160M4854r637n0841K3210N0203n7816
846a7728J0260N6530m7913l6543N0943L762o4353M9768K5376m0783P283K5196
858B1798l7974j5212M5463k8686J502L0128j3826k4908K9223r803m3596M8428
$$ plain form
772 -14691 -9115 20802 -13627 -30827 20486 12853 -17428 31045 8387 -22955 3034 13487
784 13487 -34629 1509 42894 -15961 -2974 32057 -9074 -40675 26784 7257 -34221 30183
796 30183 34219 -22610 -11107 31647 -27890 -19061 30701 2085 -7053 27627 11296 -30974 15855
809 15855 -626 -24914 22802 30418 -17859 5395 43226 -32798 -21980 34784 4147 -24951
821 -24951 39369 34550 -34057 9787 21755 -19122 -9648 35768 4408 1201 34769 -5675 -12825
834 -12825 10878 3927 -14335 33360 18459 -17701 27153 17516 -33325 -10115 40088 -17728
846 -17728 -7468 49062 1149 -35394 15549 19311 -45042 4726 30102 -10681 -3398 21798
858 21798 -16176 -31388 14075 -14611 -13109 17019 3193 -21715 7508 -2295 -45891 2537
870B537M789l3767K3014L5589n8888p774N3672m2735j2122N3204L72n7146M3972
883D717J9639o0467J1653L2858j7781p368M7250l3280j8468K9752j6285j3616
895b1396K9173K411l6931N2044M470n8142J2579L8371l5992j0741O6654l3344
907I156l0995L7234N086m7245J8427K6529l3533K6723J2597k7112p749K3636l2810
920b0056J00N1675l5846j8429M3536L09o2050L4857K2523n4200K4480M7644l3465
933A078l8470N0652j7150l2656L4190O212k6710J6883K7067m1872Q020O693k3329
946b9392J4142L1757k2193j7561M3356l1215j9836L6031j789m1317L7989L7132
958C7104n5242R130K3304l2051j2104N6333j5409l7232M5742k78l1565J0658J8980
$$ plain form
870 2537 7326 -26441 -3427 32162 -26726 -34500 19172 -23563 -35685 17519 17891 -39255 4717
883 4717 24356 -36111 -24458 8400 -9381 -16749 30501 -2779 -21247 8505 -7780 -21396
895 -21396 7777 10188 -26743 25301 29771 -28371 -15792 22579 -13413 -24154 42500 9156
907 9156 -21839 15395 20481 -26764 -8337 18192 -15341 11382 23979 -3133 -10882 12754 -20056
920 -20056 -19956 31719 -4127 -22556 20980 21289 -40761 -5904 16619 -37581 -13101 34543 1078
933 1078 -37392 13260 -3890 -36546 -2356 3856 -22854 -5971 21096 -20776 -12756 -6063 -29392
946 -29392 -15250 16507 -5686 -23247 20109 -11106 -30942 5089 3300 -38017 -28 37104
958 37104 -18138 -9008 14296 -17755 -29859 26474 11065 -26167 19575 19297 -12268 -1610 17370
971A7370m2555K1703M0512l2111m968J7913j5215j9703M2053j8007k2912L9934
983B4014M518l2594J0146K1218n0325J8532L7470k5672j0910L3289j5363l6545
995b2222M3474p761l0668K2264K6052l0312L993K4417m6195L135L3107r205k0792
1008a0713L3643j0915k9715L9227q365l9687J5073M3697l2872j184K6962l3933
1020h782q502L0467m476l3080L7650K238k4282K0880q50l3926Q081L9433l5751
1033a0900M915L0361k3142k0069K9636n295l6977M1876L952k8772J7348K4236
1045B7169m2884j0615M3610k3471o776K7102k313l0580K6148M348l5735K0197
1057c800Q104j2214J1141K4250m2083n187L6696k1887j4133K6232O083k9709L2066
$$ plain form
971 17370 -25185 -3482 37030 4919 -49 17864 2649 -17054 24999 6992 -15920 24014
983 24014 28532 -4062 6084 27302 -23023 -4491 32979 7307 -3603 29686 14323 -22222
995 -22222 21252 13491 -17177 5087 31139 827 4820 29237 -16958 -13823 19284 10079 -10713
1008 -10713 22930 12015 -17700 21527 13162 -26525 -11452 32245 -627 -1811 25151 -8782
1020 -8782 -17284 13183 8707 -24373 13277 15515 -8767 12113 11263 -22663 -14582 24851 -10900
1033 -10900 -5985 24376 1234 -18835 10801 5506 -31471 10405 14357 -14415 2933 27169
1045 27169 -15715 -26330 17280 -6191 -12967 14135 11822 -18758 7390 11738 -23997 -3800
1057 -3800 4304 -7910 3231 27481 -14602 -19789 16907 -4980 -19113 7119 13202 -16507 15559
1070A5559j549l8801J7858J8946k3680J953M1126l6572j2313L4355j2192l2970
1082b8280K7009K1281l5207K1578J0126k5090k850K0375k0449l693L7783k3740
1094a157r976K3270l911l5506K4576J4945l2379K1774J7295k3787j1269L0186
1106A4061k5939j1774L6913j0771j7258K2115J0566m1741J6647J5298k5278J0381
1118f780K2974j7364j3202L4209k6502j6347K8991K30k2861K2515K0050m2053
1130a6140J0047J6887j8476m768K6369j2313j0559L5084k2502k2242K0510J0885
1142A2782k8798K0795K1928l6301O566K2105j7105k3062L0712m526j1269K6552
1154B0379j0139k3566J2428J6819l3130J3215K0872k1271K186K0153j7573k4756
$$ plain form
1070 15559 14010 -24791 -6933 12013 -11667 -9714 31412 -5160 -17473 16882 4690 -28280
1082 -28280 -1271 20010 -15197 6381 16507 -8583 -11433 8942 -11507 -15200 22583 -1157
1094 -1157 -11133 12137 8226 -27280 -2704 12241 -20138 1636 18931 -4856 -16125 14061
1106 14061 -11878 -23652 13261 2490 -14768 7347 17913 -23828 -7181 8117 -17161 -6780
1118 -6780 16194 -1170 -14372 19837 -6665 -23012 5979 6209 -16652 5863 25913 -16140
1130 -16140 -6093 10794 -7682 -12450 13919 1606 -8953 26131 3629 -18613 1897 12782
1142 12782 -16016 4779 26707 -9594 -3028 19077 1972 -21090 9622 5096 -6173 20379
1154 20379 10240 -13326 -898 15921 -17209 -3994 16878 -4393 -2207 17946 373 -24383
1166b4383L3783r891j6470K6000O706k9281O245K2175l5350P579K2434j4170j0317
1179a4940K8159o526k6759K1381j0506j1541K4777J4429l8002P003L1969k8273
1191h829q212J7644m161j5842L5279q14k9955J0154L895o394O696J1516k7976
1204a6999J7921K5030k7989j2627K1307l690k0456L5799k806k5400J5232J2268
1216A7590k6870Q07K8819k5986K166K4085r458j9698K0316l879l0459L1108J2956
1229B1497k1364l915J8990j7276j436J8993k4859m043K5046P241k3260Q535o805
1242b656j4778K6091K794k4178L194K8779k1840l162J4262k2982n594L2487K702
1255A5119l5272K3001P244k4132N729J6936j9550m666L4147j8500j0399J6549
$$ plain form
1166 -24383 9400 -491 -16961 9039 15745 -13536 -7291 14884 -20466 -12887 9547 -4623 -14940
1179 -14940 13219 6693 -20066 1315 -9191 -20732 4045 18474 -19528 -12525 19444 -8829
1191 -8829 -17041 603 -3558 -19400 15879 15065 -14890 -4736 -841 -7235 -539 10977 -16999
1204 -16999 922 25952 -2037 -14664 6643 2953 -17503 18296 15490 -9910 5322 17590
1216 17590 -9280 -8473 20346 -5640 -3474 20611 11153 -8545 11771 7892 -22567 8541 21497
1229 21497 133 -3782 15208 -2068 -3504 15489 -9370 -13413 11633 18874 -4386 4149 -2656
1242 -2656 -17434 8657 11451 -12727 -9533 19246 -2594 -5756 8506 -14476 -20070 12417 15119
1255 15119 -20153 2848 10092 -14040 -8311 8625 -10925 -15591 18556 56 -10343 6206
1267F206m131k3216J8255J5298k1664J3051L917j5747J47K1206j9746j0412K5091
1280H255n594j498Q638p927k4375K4754J0767k3568R714Q633j1690J530K1874
1293A9513l2387j0409L3817j020j8428J2307P856k9662J6533J2111k1938j357
1305a3064K2611o218j2499K0036j5584j0654J4353M173j4410J4513R087k6939
1317a4595J2001J0122j4708o532K1567r942o142K6276j4243j9383J2509J3202
1329A0132k0339J3713J0492k2563R210J8064j6446k0065K7569k795r750J7795
1341A5017j861j9148P233J7102k3032M904J2468p613M49J2416j0686j5555K0894
1354A2588o772p486J3263M769j7627P736J0188k3550Q371J1055j2105l300K4653
$$ plain form
1267 6206 2075 -21141 -2886 12412 -9252 3799 7716 -8031 -7884 13322 -6424 -16836 8255
1280 8255 2661 1163 9801 1874 -22501 2253 13020 -10548 -834 7799 -3891 -2361 19513
1293 19513 -12874 -23283 10534 9514 -8914 3393 11249 -18413 -1880 10231 -11707 -13064
1305 -13064 9547 3329 -9170 10866 -4718 -15372 -1019 3154 -11256 3257 12344 -14595
1317 -14595 -2594 7528 -7180 -13712 7855 -2087 -8229 18047 3804 -15579 -3070 10132
1329 10132 -10207 3506 13998 -8565 645 18709 2263 -17802 9767 6972 -2778 15017
1341 15017 13156 -5992 1241 18343 -4689 215 12683 5070 5519 17935 7249 -8306 12588
1354 12588 5816 -1670 11593 16362 -1265 6471 16659 -6891 1480 12535 430 -2870 21783
1367B1783j3548k0670K3346m551j8642J3119J9576k8181K279K2784j8758j0913
1379a2376J3994J014j6121K1629K73j8200O436O440j1793k466J5749j2639M709
1392c351Q423r252n422P669n652p768K2564r470j0756J5259M214k4530O435K0570
1406H933k2900L574K0999q961j8874K0263k99k2399J7308P848j3040J836J9230
1419A3518k0300o476J8047q401o127J3021M469j6947J4415o33j4675O865P050
1432C826p986J367J7703j7648k855J1907o902q363J3306K359j4130J7221k125
1445G680j4508M971R546j5413L226K2911j9025o463J5780k316j9667J5623O307
1458H652j9334J4272J0078j4820q533J7102j0768n613J7265n197r719P999P669
$$ plain form
1367 21783 8235 -12435 10911 6360 -12282 837 20413 -7768 -5489 17295 -1463 -12376
1379 -12376 1618 2632 -13489 8140 8413 -9787 -3351 3089 -8704 -11170 4579 -8060 -3351
1392 -3351 5072 -4180 -9602 -1933 -7585 -15353 7211 -2259 -13015 2244 6458 -18072 -11637 8933
1406 8933 -13967 -10393 10606 1645 -17229 3034 2735 -19664 -2356 5492 -7548 -5712 13518
1419 13518 -6782 -13258 4789 -3612 -9739 3282 7751 -9196 5219 4586 -10089 -3224 3826
1432 3826 -4160 -2793 14910 -2738 -5593 6314 -588 -8951 4355 6714 -7416 9805 7680
1445 7680 -6828 -1857 7689 -7724 -4498 18413 -612 -7075 8705 6389 -13278 2345 8652
1458 8652 -10682 3590 13668 -1152 -9685 7417 -3351 -8964 8301 3104 -6615 1384 9053
1471I053j7938O203J771p635R553O108j0066m036J3330j5472m04J5210p642j1887
1485a3852J7771P279k5990J0849P276j4941M53K1853r487j4713J7762l559r453
1498h752M646O400j2576Q452J0295j2036K924k26o421J444J5464j2603l868J7090
1512A0233q336q662J0551L303k1990J5664J5184j6821k157J2512p835j1705K0421
1525A0362n473j0982J0595O441j0910J577P083j7730P429J2230o546o386J1003
1538H693n869j0065J5693n551j0357O670J1707j0860P31N452j4011M236Q243l497
1552A215o889J2819o913n776J2392p272j0203Q958J1092j5924Q547P657j7412
1565g709m81J6849o580j5301K1872j152j4843R899R218j7956m104K1062p666l061
$$ plain form
1471 9053 -8885 -2682 -911 -8546 1007 7115 -2951 -6987 6343 -9129 -9533 5677 -1965 -13852
1485 -13852 3919 11198 -14792 -3943 3333 -11608 -11155 10698 1211 -13502 4260 701 -8752
1498 -8752 -4106 2294 -10282 -1830 8465 -3571 -647 -873 -7294 -5850 9614 -2989 -6857 10233
1512 10233 1897 -6765 3786 7089 -14901 763 15947 -874 -3031 9481 1646 -10059 10362
1525 10362 4889 -6093 4502 10943 33 1610 8693 -9037 -1608 10622 4076 -2310 8693
1538 8693 2824 -7241 8452 2901 -7456 -786 10921 61 792 6244 -7767 -3531 4712 1215
1552 1215 -5674 7145 232 -5544 6848 -424 -10627 -1669 9423 -6501 2046 9703 -7709
1565 -7709 -8190 8659 2079 -13222 8650 7498 -7345 2554 11772 -6184 -10288 10774 3108 47
1579D7O351j192q372P750K008j0188Q277p97Q8M498J461j3987L561J1111j0905
1594b89L398P518o667p890J7436p042j6344J3824N636j0517J349J4317j7009l077
1608e357J2052n870o081Q593K115j2242J1704j384j1782M142O495q846R18J4850
1622I307j4271l847Q859j521r478Q268K312j0986J2468J571j1693k149J1339p871
1636g692j347J2689q381l489P287J490j2510P949K378p417J0119K445r669j513
1650g661J3451j2233k376J3119l565o727Q320M457j5743Q073L919p654K599R326
1664G305o170m844J0998r141k293P730j19p845R176L840j3428P350J953q509N14
1679c483J3897r151o314J4475n908q705N129O485j1821O804P486r662L47M297
$$ plain form
1579 47 6398 5206 -3166 4584 6592 -3596 4681 3884 3972 8470 9931 -4056 -495 10616 -289
1594 -289 3109 10627 3960 -3930 13506 6464 -9880 3944 9580 -937 412 14729 -2280 -5357
1608 -5357 6695 825 -5256 3337 5452 -6790 4914 3530 -8252 -4110 2385 -6461 -5543 9307
1622 9307 -4964 -8811 48 -1473 -10951 -2683 -371 -11357 1111 2682 -9011 -11160 179 -7692
1636 -7692 -9039 3650 -4731 -8220 -933 557 -11953 -4004 -1626 -9043 1076 3521 -6148 -7661
1650 -7661 5790 -6443 -8819 4300 735 -5992 2328 6785 -8958 -885 3034 -4620 -2021 7305
1664 7305 1135 -3709 7289 -1852 -4145 3585 3466 -4379 4797 8637 -4791 2559 4512 -3997 -3483
1679 -3483 10414 1263 -5051 9424 3516 -5189 -60 6425 -5396 1408 8894 -768 -421 3876
1693C876l892n437J1391n765k736Q731k315o900K980M699j1227Q572L966p521
1707a578J277P726q047o183J3818p141m904J0121K926j2859M358Q302j2894K913
1721b165O800l262m622J0832n118q577R397k387m972M323O979j1089L830O073
1735F042r899J07N707j764n755J1739n102o591O858l27q185L304R639j0873K960
1750b140N404n403l919O366k670o439J2721l488n608M133K892r942L648R184j1905
1765g166K727Q546k708r078Q353j688p254J0069k6n816J612Q309j0071J55O650
1780B614o448P51O865k32r311R092j952o748N562K891n345J472R058j1138O76
1795b193O500m411n216Q380J919q376Q562k408p049L297O774q120o20J0060p118
$$ plain form
1693 3876 -16 -5453 5938 173 -2563 6168 3853 -3047 -67 4632 -6595 1977 5943 -1578
1707 -1578 -301 7425 -622 -6805 7013 -128 -5032 5089 8015 -4844 -486 7816 -5078 -2165
1721 -2165 4635 1373 -3249 7583 2465 -6112 3285 898 -4074 249 7228 -3861 -31 6042
1735 6042 -3857 -3750 1957 193 -5562 6177 1075 -5516 1342 1015 -7170 -3866 5773 -5100 -2140
1750 -2140 3264 -2139 -6058 308 -2362 -8801 3920 432 -5176 -1043 1849 -8093 -4445 4739 -7166
1765 -7166 -4439 4107 1399 -7679 674 -1014 -8268 1801 1775 -4041 -2429 5880 -4191 -4036 2614
1780 2614 -3834 -3083 3782 3550 -5761 3331 1379 -5369 193 3084 -2261 -789 8269 -2869 -2193
1795 -2193 4307 -104 -5320 3060 4979 -3397 5165 2757 -4292 -995 5779 -2341 -2961 7099 -19
1810a9n99L908k290p715R504K128q740N991J502n071m57P088r713K38J0508m550
1826A713m291M702J352r933Q091P14o701M590N084n770l533Q816p930q02O392
1841B494r07n146O277K187j1052O057K117l855J45O102n269j399Q711q157k994
1856d689N473K565p412O977K376r810N192L502n354m113J0324l689k651O019l616
1871A094l999L835L790r441O354L395n318J056L291m356l524R680n481j544N540
1886D372L6o558L188L849r619O608L642n009j998P838m562n898P959l005k811
1901a968L837L771q267K719M351p950K459L161k279l366R360n617n542O774j058
1916C85m880K387O462q678K998M046o228j492N103r70n154Q455l299l184L169
$$ plain form
1810 -19 -618 3290 1000 -6715 2789 4917 -3823 2168 3670 -1401 -1858 5230 -4483 -4245 6263 1713
1826 1713 -2578 2124 3476 -6457 1634 2348 -4353 237 5321 -449 -3982 4834 -3096 -3898 2494
1841 2494 1587 -3559 2718 4905 -6147 -90 2027 -1828 -1683 4419 -850 -2249 6462 -1695 -4689
1856 -4689 784 3349 -4063 2914 5290 -4520 672 4174 -1180 -5293 5031 1342 -1309 4710 1094
1871 1094 -2905 930 4720 -4721 1633 5028 -290 766 4057 -299 -3823 5857 376 -1168 4372
1886 4372 4408 -2150 1038 4887 -4732 1876 5518 509 -1489 6349 1787 -4111 3848 843 -1968
1901 -1968 1869 5640 -2627 92 4443 -3507 -1048 2113 -166 -3532 5828 211 -5331 1443 385
1916 385 -4495 -2108 4354 -4324 -1326 2720 -3508 -5000 103 -867 -6021 2434 -865 -4049 -880
1931h80O12n646K508O295q049L868L255m088k995O824k640n215R044j642l589
1946b338J780M475p782J740O247o131J230M853j198o052P073j981m659N786N33
1961C576l492R38O225q393Q17M567l402j469M752M92o728O865k372m290K707K660
1977C453m470Q45O222p917P33L288j947n144O227Q28o463N573j016l712k94M607
1993H13n379N62N841n665K4L263j436o447P547K45o203M862K559m916k134P439
2009I75n704p65N029q43k826K902J601o671N459J96k941K360L578l789j417O669
2025C813o262m8M387N78m647M702J712o607M391O55k025o25N683m038p78N110
2041F001m617j266K948J834n824N521J525o051K468K398l410k765P381m228r78
$$ plain form
1931 -880 -268 -5914 -3406 2889 -5160 -1292 1963 -2125 -5120 1704 -936 -6151 2893 1251 -2338
1946 -2338 -558 3917 -3865 -2125 4122 -2009 -779 4074 2876 -3176 3897 1916 -2743 3043 3576
1961 3576 84 1022 7247 -1146 -329 4238 836 -633 4119 4611 -2117 4748 2376 -1914 793 3453
1977 3453 -1017 -172 6050 -1867 -1134 2154 207 -4937 1290 2118 -4345 1228 212 -3500 -3794 813
1993 813 -4566 -4004 1837 -3828 -3804 -541 -1977 -8424 -877 -632 -6835 -1973 586 -4330 -6464 975
2009 975 -4729 -5494 -465 -1308 -4134 -1232 369 -6302 -843 -647 -3588 -1228 2350 -1439 -2856 3813
2025 3813 -2449 -2497 1890 2468 -2179 2523 4235 -2372 2019 2674 649 24 5707 1669 891 6001
2041 6001 1384 118 3066 4900 -924 4597 6122 71 2539 4937 1527 -1238 6143 1915 937
2056I37L905k026l315J924K804o519M396J551l841J41L877l748l832P259l995
2071d82j099K666J289n521K414K873o092L159J214j571j418N052m258k904N709
2086A031k661j519K162L218o410L179K247m939J138K788r38k853O365l351k427
2101b970L519p82k672K543L592o926M090K396l725j683M635j257m063P227k219
2116A705k713Q08L083m329J236L731m791K361J717j306l389M482k362k543N592
2131C282j290k546N28L632n618J689K491l639P47K675k58m608M439k242j757L125
2147F50J63k969J047M056o287J849K364k754j995N163L9n799N198p52k488K77
2163b238L801l798l79M593l550O74N37k88k780M816n16l565L838m49k189K89L873
$$ plain form
2056 937 4842 2816 -499 1425 4229 -2290 2106 3657 -184 -43 3834 86 -3746 3513 -482
2071 -482 -1581 1085 2374 -3147 -733 2140 -3952 -793 421 -1150 -2568 2484 -1774 -4678 1031
2086 1031 -1630 -3149 -987 2231 -4179 -1000 1247 -3692 -2554 234 -704 -3557 2808 -543 -2970
2101 -2970 549 -233 -2905 -362 3230 -3696 394 2790 -935 -2618 2017 760 -3303 3924 1705
2116 1705 -1008 -200 2883 -1446 -210 3521 -1270 1091 2808 1502 -1887 2595 233 -2310 3282
2131 3282 1992 -554 -26 3606 -2012 -323 2168 -1471 -724 1951 1693 -2915 1524 -718 -2475 650
2147 650 813 -2156 -1109 2947 -3340 -1491 873 -1881 -3876 1287 1326 -4473 725 -27 -2515 -2238
2163 -2238 1563 -2235 -2614 1979 -1571 -897 -360 -648 -3428 1388 872 -2693 1145 696 -1493 -1204 2669
2180B669n016Q49M222k202p18J373L84m256N010p21k675K352J748k834r24M797
2196D058n467R76K829n86k495L093Q5n038M196K00k012l79L451k890n46L748m443
2213a220nK170J062l775L314Q3m293L273P68k457j396M969l132o72L024k396j599
2230b282J720J781m299L921j98k257J187J510k703j482N480l572l91K535K9l611
2246b632K043K087m624L199O57j136o68L008k727j340L936k798Q5J650Q44m088
2262b504L223R87l851K267J291j374j652M858l233j969K841m50j282Q42K474m402
2278a934K548P24k330J49J827o87k229M496k805j214J872M62k608R52K643l723
2294a857K185L99j441j242K775j741j398M169k332j016J385J603m668K246K582
$$ plain form
2180 2669 -2347 -1498 2724 522 -196 1177 1561 -2695 2315 1594 -1081 1271 3019 185 -739 4058
2196 4058 -1409 -433 2396 1810 -685 2408 2493 -2545 1651 1851 -161 -540 2911 21 -525 3223 -1220
2213 -1220 -1225 945 2007 -1768 1546 1629 -2664 609 1377 -1080 -2476 2493 -639 -1311 1713 -683 -2282
2230 -2282 -562 1219 -3080 841 643 -1614 -427 1083 -1620 -3102 2378 -1194 -1585 950 979 -2632
2246 -2632 -589 1498 -3126 73 730 -406 -1074 1934 -793 -2133 1803 -995 -910 740 1584 -2504
2262 -2504 719 1706 -2145 122 1413 39 -1613 3245 12 -1957 884 434 -848 -6 2468 -1934
2278 -1934 614 1338 -992 -843 984 297 -1932 2564 -241 -1455 417 879 -1729 -777 1866 -1857
2294 -1857 328 727 -714 -1956 819 -922 -2320 1849 -483 -1499 -114 1489 -3179 -933 1649
2309A649l262O01J600k06l185L846j526j378K628o00q41L93K391m515K422J153
2325A170k157M52K407q04l215M315j511j465J025J900k047o0K950l822J048P81
2341I67k29r82J928j028j670M016k422j365J008K381l930J668K467l561R8J778
2357A124J80l343L008m09j229J649l98j303k96K655l627J528J824j657p82J912
2373H36l35l365L731r83p50Q52J107j930k02K674l269J423J282o31k091L001P2
2390A422k863K216l83n53L30K670l207K8K294j644m4N87P13k294L244n65k090
2407a39R49K57n47j73K209l241J188J807j734j549J659R74l193K476K61j469j54
2424d19R62j358l79K548k865Q46M68j18j902J904j75k936K884N64j110j660K530
$$ plain form
2309 1649 -1613 -1012 588 382 -2803 1043 -483 -1861 767 167 -674 -281 2110 -2405 17 1170
2325 1170 -987 -535 1872 1068 -2147 2168 657 -808 217 2117 70 10 2960 -862 186 967
2341 967 738 -244 1684 656 -1014 3002 580 -785 223 2604 -1326 342 2809 -752 -654 1124
2357 1124 1304 -2039 969 560 -669 980 582 -721 -1017 1638 -1989 -461 1363 -294 -1076 836
2373 836 501 -2864 867 -116 -866 -14 1093 -837 -1039 1635 -1634 -211 1071 440 -1651 1350 1422
2390 1422 -1441 775 392 -161 169 2839 -368 -340 1954 310 266 853 1566 -728 2516 1951 -139
2407 -139 810 1067 520 347 2556 -685 503 2310 576 -973 686 1660 -1533 943 1204 -265 -419
2424 -419 543 -815 -1194 1354 -1511 -665 -197 -315 -2217 -313 -488 -3424 -540 24 -1086 -2746 -216
2441b16j807j05K155k141m17J367J587l056J369j20j210J334Q07p76j363L137
2457E45k097J22J318j097p29J593J646l197K304O0j114j06J792r30j164K779j766
2474d1R9R59L71k305J665J635k425J396K0l73j293L079j513j534K131n70O7j12
2492A256N44k761K468N58j612L32N18j21j778K439j839o40J449%j335M81J339
2509A298l059J787L90r12r32J919o12j854K342j395l60K0R83j415J083P67k700
2526b650J615M66m73j550K819j072j100J729m93j064J96K167k250J222P56j302
2542i84L31J103k43k091K921p22n93R12L86j225L48J434j677J305M9m82k57J220
2560A735n19j512K539r00p34L65J442j735n3J685j908N17N88o1j435K135r80j556
$$ plain form
2441 -216 -2023 -2128 27 -2114 -2531 -1164 423 -2633 -1264 -1384 -2594 -1260 -453 -1229 -2592 545
2457 545 -1552 -1430 -112 -1209 -1938 -345 1301 -1896 408 468 -646 -752 1040 110 -1054 1725 -41
2474 -41 58 1017 1388 -917 748 2383 -42 1354 1374 1001 -292 2787 1274 -260 1871 1301 1368 1256
2492 1256 1800 -961 1507 2065 453 785 1303 1182 -596 1843 4 -636 813 813 -522 -41 1298
2509 1298 -1761 26 416 -496 -1428 491 -121 -1975 367 -1028 -1388 -1368 -385 -1800 -717 50 -2650
2526 -2650 -1035 -569 -1042 -2592 227 -845 -1945 -216 -709 -1773 -1577 590 -1660 -438 318 -984
2542 -984 -653 450 207 -1884 1037 315 -278 634 1020 -205 143 1577 -100 1205 1254 772 515 1735
2560 1735 1216 -296 2243 1343 609 974 2416 681 628 2313 405 922 1510 1449 14 2149 1169 -387
2578c87J534n06l24o20K318k427K45R48j050j27L23M03j875K275j241m35M39Q76
2596C69j448n25K068j908M36N35k43o85Q01M6j456K010n83l44JJ318j781J1K117
2615G39j754N48P18M71k003J718L8j473J316O4j67n70J851j464k02J235n25l73
2633A67M86O63j699J813n97o46M39Q7l17k66J726k164N69O68k83j074J196K52
2651A020k082J918k53r08q27K049j006q81J739j198l29K19L83j300J215r7o83
2668a021Q44l77l31q21J834j456L13J090j048k39P30O59k324J853K80j142K05
2685i51J161n48j216J860r84K46M10M59r72Q84M68j290J128l61P8l00J562j059
2703E75p29J376m20l19L1J003j368J173M85j466L40K05M77j083J526j130M06M74
$$ plain form
2578 -387 1147 641 317 -303 2015 -412 -167 781 -269 -396 -73 330 -1545 730 -511 -946 -507 369
2596 369 -1079 -1604 464 -1444 -1008 -473 -716 -1401 -600 -554 -2010 0 -583 -927 -926 392 -1389 -1378 739
2615 739 -1015 -467 251 722 -1281 437 475 -998 318 382 215 -355 1496 32 -170 1065 540 167
2633 167 653 1316 -383 1430 833 187 626 713 396 130 1856 -308 261 929 646 -428 768 1020
2651 1020 -1062 856 603 -305 -1132 917 -89 -970 769 -429 -758 -539 -156 -1456 -241 -338 -1021
2668 -1021 -177 -554 -885 -1706 128 -1328 -1015 75 -973 -1212 -482 177 -2147 -294 -14 -1156 -951
2685 -951 210 -338 -1554 306 -678 -432 -22 437 -535 349 817 -473 655 294 372 72 1634 575
2703 575 -154 1222 802 483 514 1517 149 1322 1807 341 681 886 1363 280 1806 676 1082 1556
2721A556p24k79L50N40j788J797m19q97o1J253j003j519K560j113p07n5J304j348
2739e53q1J017j589P77J67L88j359L46k19K71R84j308L89lO62j351P30j15j130
2758a977J269M21p73r87K216p58q95O44J41j6k15J533k012Q03N24J43j179J028
2776i0N69j462J487o72q8j08R89o53m19J094n58Q75o69k05l52J490m80j118J562
2795A192q34J48o7N73j566P48R58j205L10mL85j065J443p28r29J112J99p00n01
2814e31J652j517M44MJm51R74J09j547J145k04n1m21N98l85k18P37r39O88l71
2834b83N99o61Q96r52l01J750o32p19q4J326r84j51R66q52J5K96M97j552J354
2853E28J06n51J32J0J02o16J165r91K18J77p6n4k48J50m26J134j041k41N80M20
$$ plain form
2721 1556 832 553 903 1443 -345 1452 1033 136 75 1328 325 -1194 1366 253 -454 -509 795 -553
2739 -553 -634 383 -1206 -429 -262 126 -1233 -887 -1106 -835 149 -1159 -770 -773 -111 -1462 -732 -847 -1977
2758 -1977 -708 -287 -1060 -2047 169 -589 -1484 -840 -699 -715 -930 603 -1409 -606 -82 61 -1118 -90
2776 -90 479 -983 504 -168 -256 -364 625 -28 -447 647 89 964 295 90 -262 1228 748 -370 1192
2795 1192 358 506 439 1012 -554 194 1152 -53 257 253 638 -427 1016 288 -641 471 670 -30 -531
2814 -531 1121 -396 48 52 53 -398 576 685 -862 283 79 28 -393 205 -180 -398 339 -600 88 -283
2834 -283 316 -345 551 -401 -702 1048 416 -303 -387 939 -45 -196 770 -82 -67 229 726 -826 528
2853 528 634 83 215 225 327 -289 876 -115 103 280 204 150 -98 52 -374 760 -281 -522 58 478
2873D78j143K76J332j651M72J42L61j337J112K87r72K78n2L14p11J483r55j78
2891d64L72l06k5k17J054j197Q59M7n63J1K70L40p47J006q36L87n0J29j82J84
2911G2K09o60J389r43OP3N40o39k46J258j336P15M28K14j571J076Q34j451K33
2930B01J94P38j258J246l77o72Q9L63L07p04O72r49P68j15o92M53L50k20p50J001
2950F45r45K26J35R9n20K82O56j094M98n78M62j40L36q21k21J533j189o2K4N62
2970a12j080J000K00j273M38O68N51j771R70J40J26J12p64L01O0P84j021N66n87
2989f92L54O60k19l81p52J775n77k35K73L27p19K73J071j837Q30Q37r0j322N40
3008A16R33n05Q6j043Q88m06P33n73J07K02m83P35p68j08k64J584o74r93R9M67
$$ plain form
2873 478 -665 -389 943 -708 -236 -94 267 -1070 42 329 -643 -365 -417 -103 -814 669 -286 -464
2891 -464 -92 -398 -423 -640 414 -783 76 123 -440 -429 -159 181 -566 440 -396 -9 -59 70 -112 72
2911 72 281 -379 1010 67 73 146 686 47 -199 1059 -277 438 866 1080 -491 585 1419 -32 201
2930 201 395 1133 -125 1121 744 72 161 524 831 127 799 -150 618 503 -189 264 614 394 -356 645
2950 645 -300 -74 61 160 -360 -78 578 -516 -18 -596 -134 -274 62 -759 -980 553 -636 -698 -674 -112
2970 -112 -1192 -192 8 -1265 -827 -159 392 -1379 -409 -269 -143 -31 -795 -494 -434 350 -671 -105 -692
2989 -692 -338 322 103 -278 -1030 745 168 -67 206 533 -186 87 1158 -679 151 988 898 -424 116
3008 116 1049 544 630 -413 475 69 802 229 336 538 55 790 22 -86 -350 1234 560 -433 -334 133
3028A33L73o20L75j303J241M30q83l38O20O0n41R95j331L36K23L61k07r06J061
3047G9m17P12j154L96k2J149p30j266J592m20L50p25Q80p09K92M03m94M5j26O49
3067D84n18N07j161L63J127p31k97j89J449j008K09J16l04j30N61L11j298R54
3085D45n8J72m12On6n55J206j261L83r1N79n02l60J47J27O18r61M21j68M69q20
3106f71L77L72r71N31J07K35j176J212l07m31K20j79N04k63N78j090M65K89o3
3125b61j3j22L79q22J069k49k04j96P22l31k32O88p66N60J24P2q13R30O19j405
3145b51P81m9L04o44N96J71m10L98l49N44o14J60j95R38q85n26P93k27l6m90J026
3166A035n36k99L68j2l33P7L89p77N94k78k2k51M82k70l12M83p11K81j40J25k07
$$ plain form
3028 133 506 -114 261 -1042 199 629 -254 -592 28 88 -453 542 -789 -453 -230 131 -76 -982 79
3047 79 -338 374 -780 -384 -406 743 13 -1253 339 -81 269 -456 424 -285 7 410 -84 -39 -165 484
3067 484 -34 473 -688 -325 802 71 -226 -415 1034 26 235 351 47 -83 478 789 -509 445
3085 445 387 559 147 153 97 -458 748 -513 -130 -221 358 -144 -504 -357 -230 388 -573 -152 -320 149 -671
3106 -671 -294 78 -893 -362 -255 -20 -1196 16 -291 -722 -502 -681 -177 -440 138 -952 -487 -198 -261
3125 -261 -274 -396 -17 -839 230 -19 -223 -419 303 -28 -260 428 -338 222 346 418 -395 535 1154 -251
3145 -251 530 481 785 141 737 908 498 896 547 1091 477 637 442 1380 495 -31 762 535 499 9 1035
3166 1035 499 200 568 556 223 300 689 -88 506 228 206 -45 437 167 -145 338 -373 -92 -232 -107 -314
3187c14J43k91k44M70k69J05o03P61l14k60N58m20J24m23Q69p18L74k01k72O51
3207b74j88P4m32J237r21J62j34M55m10K1N84n39P35l50j01K45J03l33j40J120
3227I14j162O09l5N25j177M51Q56p00L0n2O59p03J46np6jk48M22q0L04n75L15
3249D17k81m6K62k52K84m32N11o78J29M37m62L6k02R53j137N83J5j56l06J4M21
3270A10n80L32m62N96l78P4m6M60J34r26O23J5k48n38Q74l36k6N33k57k55j41
3291d42Q35q50K00O15k84J13k38K11n69N57K33P7n38J93L10k4j46r98J339j23
3311D71o03J17N15k78n72J122n48l60k47J006m62p33Q27q2K71q34O44n73O8L3
3331b18K2L91n79M90j79M3o80R05J88j082M60p7L50q12R37l31m54M86M81m31r05
$$ plain form
3187 -314 -171 -462 -706 -236 -505 -400 -1003 -242 -556 -816 -258 -678 -554 -977 -108 -826 -452 -653 -925 -274
3207 -274 -462 -388 -820 417 -504 -342 -476 -21 -431 -410 174 -365 370 20 -81 164 267 -66 -206 914
3227 914 -248 361 326 851 -326 125 981 281 311 259 918 215 361 356 280 279 31 453 373 677 102 417
3249 417 136 90 352 100 384 -48 463 -215 -86 351 -111 -75 -277 676 -461 122 137 -19 -325 -311 110
3270 110 -470 -138 -600 -4 -382 -308 -354 106 240 -686 -63 -48 -296 -834 40 -296 -322 211 -46 -301 -442
3291 -442 393 -457 -257 358 74 187 -51 160 -409 148 381 458 -80 113 423 399 253 -745 594 471
3311 471 -132 -15 500 222 -350 772 224 -136 -383 623 161 -572 255 173 444 -390 254 -319 -251 -218
3331 -218 -196 195 -384 106 -73 -30 -710 195 383 -699 -239 -316 34 -778 159 -172 -626 -140 341 -90 -995
3352i95J093m5J38j041N75K91L72k59k33M42r29P90K44m00o74N25Q95r26Q0N9
3372BN95m68J06M5k73K20K06J32o70Q89k10k07l08J41M72k06L5m82O05l33jR4
3394C84m87j53M53Q12j722M75K70L22o98K77L38q25P31p3q4n26R1M81K6o07l59
3415h74J070l21m49lN03k15k38N54m38m04K36R34j024j68J098Lq83j87J118m15
3435a03j75N7K51j00k11P99o27J14j22Q25o81n26P53K17k18l24J178j178L3J91
3455A53R58j291o3J135n07k47j48P59n26j21L94r0q4j32N89l01j78l90M46j1m23
3476g8J71l54P79o94O01m54j72K44J73j20m82O01k83l05j40L60Q0m00L12R6n8
3497a23p60Q21M63o09m77N80M79j540O12O94j12r82J148K99r56k67J113K73j498
$$ plain form
3352 -995 98 53 191 -850 -275 16 388 129 -104 338 -591 199 443 43 -631 -106 789 -137 -57 2
3372 2 597 129 235 280 7 227 433 565 -105 784 574 367 59 200 672 466 501 19 624 291 290 384
3394 384 -103 -256 197 1009 -713 -238 32 354 -344 -67 271 -554 177 104 20 -506 -415 66 92 -515 -874
3415 -874 196 -125 -574 -577 -74 -289 -527 27 -411 -815 -579 355 -669 -837 261 264 -619 -806 312 -103
3435 -103 -278 -221 30 -70 -281 518 -109 5 -117 708 27 -499 254 471 253 -71 1107 -71 -38 153
3455 153 1111 -180 -243 892 385 138 -10 749 223 102 496 406 322 190 779 478 300 -90 356 345 -78
3476 -78 93 -261 518 -176 425 -29 -201 43 216 96 -386 215 -68 -373 -513 -153 -73 -473 -161 -65 -123
3497 -123 -883 -62 401 -208 -685 -105 374 -1166 -554 140 28 -954 194 493 -463 -730 383 656 -842
3516h42L57Q43l73j94j6O14m51J00L15j90n14N37M57n81n17O08Q23j171K19N37
3536E61m36n49O44O99j275K34O97K56j354J34R26m16J0n25P69k99j69K17J98n69
3556b47j7N38l91k19j29R50n89k78K16M00m38k48M01m22K56M9j81m4p7O55k62
3577g7N2p80N30M75l65l57K72M39k90L86n11K15m42O17M11q28J32Q0Q29m92n32
3598b36P6N85k02k27M69p58P80n1J4n13K45M90q64L87J10L66q48M09J88l34j28
3619d2M09K97j264P68K57l1o64Q2L50j8K59q73L55k20N91q6o28NK08M41k34M7
3641In17p3L67M17o93o04J180P4o27k19P36J09r30P59o2j08m7N88o12n3O15l24
3663a5q6k6K36k2L15k29j89k79O16J98o15p6J69Q20n62k01m4O31m13j59N78o59
$$ plain form
3516 -842 -485 358 -15 -209 -225 389 -62 38 353 163 -351 186 643 62 -455 153 976 -195 24 561
3536 561 125 -424 220 919 -356 -122 575 831 -523 -389 537 121 131 -394 375 76 -93 124 322 -247
3556 -247 -264 274 -117 -336 -465 485 -104 -382 -166 234 -204 -452 -51 -473 -217 -168 -349 -393 -470 185 -77
3577 -77 -25 -805 -275 200 -165 -522 -250 189 -101 285 -226 -11 -453 164 575 -253 -121 -41 788 296 -236
3598 -236 -160 425 223 -4 465 -293 487 436 450 -63 182 672 -192 195 305 671 -177 232 420 86 -42
3619 -42 367 664 -600 168 425 394 -270 -188 162 144 403 -470 -115 -335 256 170 -458 -453 -245 196 -38 9
3641 9 -508 -581 -214 203 -490 -1094 86 160 -467 -686 50 159 -771 -12 -74 -182 -229 359 -253 -306 309 -15
3663 -15 -101 -127 109 87 402 173 -16 -295 321 519 -96 -172 -3 817 255 54 10 641 228 69 647 -12
3685a2J72J88N06n97l69L30r1O34p48LQ7N09p23k1P27m57j66j04N11o23l8L22
3707D0p8l06K1O00o84j8M8N30k02n37L04J66J71m99K06O1j10j00L27l66k16P70
3729A28j00j24j09K22l84Q2O96m73l54M82K90l71o6K0K41M7n89M96O1j13l46M04
3751A40J42l30K90J44j4n35P00m49Q3j23l9J0J64p9l71O23j85k34L5M20K6n12
3773i4R5M0k51K2K14R6l04K98j28J88m11L66m18O3J95r7K20m97K14J39l2m96O92
3796A14r3o53M35K43k75o07J137l68n58K09N39k4n32N36l00K19k23L66j95p6M93
3817C87m49M75m10K7o9K48Q5j92K28k70K73j44J87j80J18l02O0P4j75Lq1L74j11
3840A56Kj84J21J23j60J50k80M93k98k13L91j31m09q8P20n93l20M10M96m41j91
$$ plain form
3685 -12 160 348 854 257 -112 218 127 761 13 16 103 612 -111 -132 595 138 -28 -132 379 -244 -282 40
3707 40 -38 -344 -323 277 -407 -425 -377 153 -49 -586 -282 -116 55 -444 -238 -177 -287 -387 -60 -426 -642 128
3729 128 28 -96 -205 17 -367 -285 411 -62 -416 66 356 -15 -81 -61 180 227 -362 134 195 82 -264 140
3751 140 282 -48 242 386 372 -163 537 88 171 48 9 19 183 104 -267 356 171 -63 -28 392 418 -94
3773 -94 1 41 -210 -188 26 122 -182 116 -12 176 -235 131 -287 -224 -29 -126 94 -403 -189 -50 -82 -578 114
3796 114 21 -632 -197 46 -229 -836 301 -67 -625 -416 123 99 -433 103 -197 22 -201 165 -30 -106 387
3817 387 -62 413 3 30 -39 209 294 102 330 60 333 189 376 196 314 12 72 146 -29 -26 -107 267 156
3840 156 158 -26 95 218 58 208 -72 421 123 -90 301 170 -239 -327 393 -200 -520 -110 386 -55 -246
3861b46M04j89j28k18M81m54K04K5j32M26m55L78J01k14n17O82k9m13K83K1K70
3882B80l76L45m79J36J92k15R8m06K88M3M51l50n7q7K83q5R3J26n28M93OJ6k98
3905c1K70L12m38J88j11jj38L31j58q3L97k88k34r3P29l86L3k22p2K16j74J34
3927A81l28K8j17O89m70j60j28J23O09r06l0K09J33L26k59l85Q7N41m43J7K99
3948A6j92j36J29L39o01Q5L09J05m50J56K03j1N6m26K69K4L41n78J24O09J66k01
3970C36o00J67L05M49p42j62M90p8J7R1K27p39J63Q66J07q68l53P73J38m40k49
3991a02K97L01l28m18M81K48r15J54L25K72m37Q4K05r0K21m31O5k42K45r5J3L30
4013A83m17j83q0R15o26m96K12P66l9p96l0O37k9l68R8N65p08j60O78K28p65q4
$$ plain form
3861 -246 158 -31 -159 -377 104 -350 -146 -121 -253 173 -282 96 197 -17 -534 148 119 -294 -11 10 280
3882 280 -96 249 -230 -94 98 -117 -19 -425 -137 -94 357 7 -50 -137 146 61 154 280 -248 245 251 267 -31
3905 -31 239 551 113 301 190 189 51 382 224 141 538 250 16 -77 652 266 299 77 5 221 47 181
3927 181 -147 -119 -236 453 -17 -177 -305 -182 427 -479 -509 -300 -167 159 -100 -485 -398 143 -300 -283 16
3948 16 -176 -312 -183 156 -445 -360 -51 54 -396 -240 -37 -48 8 -418 -149 -125 216 -362 -238 371 537 336
3970 336 -264 -97 208 657 -85 -247 243 165 182 273 500 -239 -76 790 897 29 -324 449 587 147 -102
3991 -102 195 496 168 -250 231 479 -436 -282 43 315 -122 -38 167 77 298 -133 -68 -310 -65 -160 -147 183
4013 183 -234 -417 -497 418 -208 -704 -492 274 235 -561 -591 46 17 -351 -253 312 -396 -556 122 350 -415 -499
4035d99L68M03n37K6L37O9J31o23O20k46r3K8J77j04K44K0k36j96K98Q0n24J98
4057e9P03o75m04O29L17r12N42O69n78n96K32Q31m22l31J75K41k91J8M5j33k58
4078b57K29J46j87k10L94m08p9M18J94p70L36M32k59p33P17N21q15k3J22N04n40
4099b68p1L19J79l09l65O26K15k49n20M47L15m71j27M82j37l40N01l50j14L01
4119F4L35n90Q1L77m72K62j6L74m25l25Q77k08m94ON77K44r24J24P75j55p45K37
4141b1O96o10O3J71p4o29M14M82m86l38M71K10n11j44J50J73K7Q2k23l15K08M85
4163B81lp83k5Q67l12o28N35L62n73j06P96j78q55L69P34l66o86M64N54l13k60
4184a26J65L16n98J49L23j77k40L93K13p42L35P05l93o95L60M07k63J06j54M69
$$ plain form
4035 -499 -131 272 -265 -239 98 167 298 -325 295 49 -44 -16 161 57 301 321 85 -111 187 267 -257 -59
4057 -59 644 -31 -435 194 511 -401 141 810 232 -364 -132 699 277 -54 121 362 71 89 134 1 -257
4078 -257 -28 118 -69 -279 115 -293 -372 46 240 -530 -194 238 -21 -754 -37 484 -331 -354 -232 272 -268
4099 -268 -339 -20 159 -150 -515 111 326 77 -443 4 319 -152 -279 203 66 -274 227 -123 -237 64
4119 64 399 -191 -110 267 -205 57 41 415 -10 -335 542 334 -160 -154 423 667 -257 -133 642 487 -258 -21
4141 -21 675 65 128 299 225 -404 10 492 6 -332 139 349 -162 -306 -156 17 44 126 -97 -412 -204 281
4163 281 278 -505 -530 337 25 -603 -68 294 -279 -385 411 233 -622 -253 481 115 -571 -107 447 134 -126
4184 -126 39 355 -243 -94 229 52 -188 205 418 -324 11 716 323 -372 -12 395 132 238 84 553
4204E53o18N39L1l87j39L14L79q20N9J7L88R5k82l2M08o2n33J06n5r4K61J86l10
4227Dj54N46k37l59K59J51l76k15J96J2o9j08N17k31n61J02O15j47o63O41L82
4248C05n12l01N48j04k82N98j45k07n06N99q3l62K93J62j21J6K57m49j37M51L54
4269C74n61j31L60J40k09j24M06j03o33L73N51o36q3P86k05m16q8O72m45l69M67
4290A26Q0J01l64L99k94K12n9j89J46m29K33J83j2k02M4J86n60n6K72K29m65L39
4312h0J02k99k43N39p4m28J62L65mp76N36M78m60j27J66K01l37r0M29l8o47N10
4334a15L09j85l72MO71m87J53M44k60q1J5J94j45O1j20K26k52j03K94m00K86p6
4356F1N19k98k98M86jl54j27L54L9m30K13M06n19k89N38j40j08m7L07n2l22K33
$$ plain form
4204 553 -65 474 505 118 -21 293 672 -148 -89 -72 316 411 129 97 505 443 -90 16 -39 -133 128 314 4
4227 4 -150 396 159 -200 59 210 -166 -381 -185 -173 -242 -350 167 -64 -625 -523 92 -55 -718 -77 305
4248 305 -207 -508 40 -64 -346 252 107 -100 -606 -7 -90 -452 -159 3 -118 -102 155 -294 -431 20 374
4269 374 -187 -318 42 182 -27 -151 255 152 -481 -108 443 -193 -276 510 305 -111 -199 473 28 -341 126
4290 126 206 307 -57 342 48 260 201 12 158 -271 -38 145 133 -69 -25 161 -399 -455 -183 46 -419 -80
4312 -80 22 -277 -520 19 -55 -483 -321 44 40 -736 -200 278 -182 -309 -143 58 -279 -369 60 22 -625 -115
4334 -115 194 9 -363 -359 312 -175 -22 422 162 81 96 290 145 206 86 312 60 -43 251 -149 137 61
4356 61 580 282 -16 470 469 115 -12 342 381 -49 164 570 51 -238 300 160 52 5 312 260 -62 171
4378A71j84K93m22L80l86J42l61L09P6l40J18Q9M0j19K98k25n1M4r3J43k54K77
4400e5l04L33O6r3K2l02M2J05K04k64j9L17rl54K41N03m68l2K52q7n8l7M29l71
4424F1J5l5J74k43p9J25M17l58l60M58j20L2m2K05m71M01k46L7q8o7L61k72K27
4447A32j50L3l3K28l91rJ58K9j25oL01k10o8n2J05k46M38k94l0PR7J02J4l31J62
4472a39J0P2P0l70l0M73l4P7n4k85M77q2n33N27k94J58l23N09j0k59J95j1J7q3
4496G8l5J34R9l48m9K88p8p1j9J88n5k11M26j54k60J66J37p5r4K34J15m2j94l1
4520A49l0K75j94n92N20J34j0o17L99k93K43J07l37J76J14j61j09K26J3l32M11
4541I2J62o35N1J43K5Q6m11K98L47j0j95p3O5k4j24M7R7o3L13Jl16KQ0J48Q5o4
$$ plain form
4378 171 -13 280 -142 238 -148 -6 -367 -58 18 -322 -204 -115 -75 -194 104 -121 -172 -128 -221 -78 -332 -55
4400 -55 -359 -26 40 -53 -31 -333 -291 -186 18 -246 -265 52 43 -311 -70 433 -35 -67 185 98 40 3 432 61
4424 61 76 41 215 -28 -107 18 435 77 -283 175 55 87 45 250 -221 180 -66 -29 -117 -184 177 -95 132
4447 132 -18 15 -18 210 -181 -190 -32 -3 -128 -134 167 -43 -111 -163 -58 -304 134 -160 -190 -183 -86 16 30 -301 -139
4472 -139 -129 -57 13 -357 -387 86 52 129 75 -210 267 185 -348 179 -115 43 -280 229 219 -40 155 144 161 78
4496 78 43 177 276 -72 -121 167 89 18 -1 187 132 -79 347 193 -67 99 236 161 67 301 416 374 180 149
4520 149 119 394 200 -392 128 262 252 -365 34 -259 -16 91 -246 -70 44 -117 -226 0 13 -319 92
4541 92 254 -381 -330 -187 -162 -76 -487 -189 158 148 -47 -120 -55 -79 -203 -156 -59 -122 191 192 -124 -122 -42 106 191 127
4567A27j07j8K70k66J04L4n3q0K81j89J21p8J61l68K26j80L36k84J37j25Q1J4
4589A44j12k85M10p7J01j67J53p8j36l1R6P2j87L0L78k78k38J85M7k5j41K87M8
4612A96j20l83J49MK10j75l6M2j83O6Q7m87L06k4L05m7q7k40K82J78j77Rm0J22
4636d3n6j09M3J22J01j39J10O6P7J2l53K75J10k83k1j68L03L9m9J82j1l82J87
4659A3K4O4k19J05J47j6j70K50k5K10P9l23j39M0L0k15K63Kk37Q2K34j71j2p5
4683e9q4k2K78l81M75k9l49N5Q8R6k71J36J71p6q1Q9J35m99J80K16J63k02j99
4706a70nJ17n6J64J29m64R8K01K61l14J13n9j41K34R6m8m05M72j6k56j61M76K8
4729B94k14j1O8J86l09l0kO3j31J01N2j80J91K14j10m84N10J5m9j76K31k76J21
$$ plain form
4567 127 20 2 272 6 110 144 91 11 292 103 224 146 307 -61 165 -15 321 37 174 49 130 144
4589 144 32 -253 157 80 181 14 167 89 -47 -78 18 90 -97 -67 311 33 -205 -20 27 2 -139 148 196
4612 196 76 -307 -158 -154 56 -119 -155 -113 -296 -230 -143 -630 -324 -348 -43 -90 -177 -417 -135 43 -134 -125 -165 -43
4636 -43 -99 -208 -165 -43 58 -81 29 95 172 184 -169 106 216 -67 -88 -256 47 86 37 219 208 -174 13
4659 13 37 101 -118 -13 134 118 -52 198 173 383 462 139 0 40 70 -145 118 120 -117 -35 199 28 16 -59
4683 -59 -143 -165 113 -268 207 178 -171 -116 -28 68 -203 -67 104 28 -53 36 171 -328 -148 68 231 29 -170
4706 -170 -175 -58 -114 50 179 -285 -187 14 275 -39 74 15 -126 108 204 156 -249 223 207 -49 -210 266 294
4729 294 80 69 137 323 14 -16 -18 45 -86 15 67 -113 78 292 182 -302 208 223 174 -2 229 -47 74
4752G4P9J96l18o6k30K99P0m25K32Q0P7l35L04j87j55N7J76O4l40K99p1j2o4J48
4776d8J0oNm6j68K60R7l50J88K93j50mk92L87n8J13r6N1k51J4L53k01j19q9L64
4801B57j61P1m16M35J80l89K72k46J62l58K30J64m6k90J09M26m92k45M17L0k01
4822i1Q9j93N9J70N8r4m89O03j84k58J61M34l27k27K28K53l15k01K64j35j32N5
4844b72J56J0j78J03N20m04k03R6J81k37K52K9j30j25J35K30j85k11J92L55k65
4865D9K79l72K43l62J90J44j54o1m9M98n78J71M94l54P3K1J85l21R4j57J14k11
4887f4J12K37l34O6L20p6l44J80O3j90j41k12O11j41j90K65J56o86J73M74k80
4908aj28Q9K16l48J09j54J50j76o2J76J98j55j8j41L02J4k45L69n12J77O3R8m05
$$ plain form
4752 74 153 349 31 -35 -265 34 104 -321 -89 -9 68 -267 37 -150 -305 -248 -72 -8 -348 -49 -120 -132 -196 -48
4776 -48 -38 -44 -39 -85 -253 7 104 -246 -58 235 85 81 -211 176 118 231 135 186 -65 -51 302 101 -18 -107 257
4801 257 96 167 -249 186 366 -23 249 3 165 -193 37 201 155 -135 -26 400 -92 -337 80 110 -91
4822 -91 -2 -195 -136 34 92 -2 -491 112 -72 -330 -169 265 -62 -289 -61 192 -123 -324 -60 -195 -327 -272
4844 -272 -116 -106 -284 -181 339 -65 -268 -172 9 -228 24 53 -77 -202 -67 163 -22 -233 -41 314 49
4865 49 328 -44 199 -163 27 171 17 -44 -93 405 -173 -2 492 138 211 232 417 96 190 33 147 -64
4887 -64 48 285 -49 17 337 261 -83 97 160 -30 -171 -383 228 87 -103 162 318 -368 -195 279 -1
4908 -1 -129 -40 176 -172 -63 -217 -67 -243 -305 -129 69 -86 -104 -245 57 71 -174 195 -317 -140 -77 21 -384
4931c84M84Q9j94m70O77p1p00L35M29k19l21K15K47j90k46M11J45m95L14L19l41
4952C4n26M02M84l63k55L16J26l66n6M18j09l10K80R0m03j61L64J32l06L64l74
4973b19K40L8l9K1k17L55l37P2J67q9j02J43j49r6L48m25J54K03k66q9J53L32
4995A98o72M50k2K28k65m6L95k74j90o0L28k23O5l4M01k82k63L16R2l28j1N46
5017C49k56j31R3J19k22O4K29j44J70l74K77n7o5K58k74J84KQk56n4K25J52m47
5040a50q9O32k29l73L61j41J49m50M58j2p4l78K48L49k28q6M2Q1m04M63j23J56
5062B02k98k86M51o4j29L4M30k87J9j61j30L70R3m47m54P75L0n44L07L85n19k6
5084b49J81K3r9M9PLK33j54O9K68m60J66J18K3l19nL08l12Q3J55j14L6L24j73
$$ plain form
4931 -384 100 189 -5 -475 202 131 -569 -234 195 -24 -345 -130 117 -73 -319 92 237 -258 56 375 34
4952 34 -492 -90 394 31 -224 92 218 -148 -204 214 105 -205 75 165 -238 -399 -35 97 -209 155 -219
4973 -219 21 59 20 41 -176 179 -158 -86 81 -8 -110 33 -116 -212 136 -289 -135 68 -198 -287 -134 198
4995 198 -474 -24 -46 182 -83 -129 266 -8 -198 -258 70 -153 -88 -122 279 -3 -266 50 142 -186 -197 349
5017 349 93 -38 55 174 -48 16 245 101 271 -103 174 117 52 310 36 220 222 230 -26 -80 145 297 -150
5040 -150 -239 393 164 -209 152 11 160 -290 168 156 82 -296 -48 301 73 -13 29 110 -294 169 46 202
5062 202 -96 -382 69 5 -124 -90 340 53 72 -89 -219 151 244 -203 -657 118 148 -396 -89 296 -223 -249
5084 -249 -68 -45 -144 -95 -88 -85 148 -6 63 331 -129 37 155 178 -141 -146 162 -150 -67 88 -26 10 334 161
5108A61j22r3J75Q8l28L21l18J03k24L47K04m67M13k66M07k16j58K77K6l16J10
5129A24K46k69k86M12l27J6N48J03p89J78J40R2m75K57L15l62J5P4k41j7J09j65
5151c02O57n78j18L50J4j74k60M31k01R7j31R6j35J8J48r2O2J26k29pO6oj33J73
5175a28j42j89M44J9QJ01j22j10J98K11m38j41L63M4l15J54L60l49m9K38j50R6
5197A03j90J53K94l23j62J73L86n92N8M87j32k61k45K96j77L52l68N9N9R8o1k74
5219b67M72j78j87K19j17j88K11J2k08K64JJ24j29k6k61K02L27m14j33N55j18
5240A61l60K12K22l36jL03l24N9J24J1k1l1O7j58J11L22n07K40N3l22J47J67R3
5263B32k23L47k61j16J43n2k41j2K81k24p1Q2o5J15L5j97N6K54j3j04k53J19o1
$$ plain form
5108 161 39 -54 121 209 -119 202 -116 -13 -237 110 314 -153 260 -6 401 185 27 304 330 14 124
5129 124 370 101 -185 227 -100 -84 464 567 -222 -44 96 188 -287 -30 285 -77 -62 12 -229 -246 -137 -302
5151 -302 355 -223 -341 9 23 -151 -411 20 -181 -84 -215 -119 -254 -236 -88 -180 -118 8 -221 -228 -162 -168 -301 -128
5175 -128 -270 -459 -15 4 12 113 -9 -119 79 290 -148 -289 74 118 -197 -43 317 -32 -81 157 7 103
5197 103 -87 66 360 37 -125 48 434 -158 -100 387 255 -6 -251 45 -132 220 -148 -89 -30 68 7 -267
5219 -267 205 27 -160 59 -58 -246 -35 -23 -231 33 34 158 29 3 -258 -56 271 -143 -276 279 161
5240 161 -199 13 235 -101 -102 201 -123 -64 60 71 50 19 86 -72 39 361 -146 94 147 -175 -28 139 232
5263 232 9 356 95 -21 122 70 -171 -183 98 -126 -197 -115 -180 -65 -30 -227 -171 83 70 -34 -287 -168 -229
5286b29J46K60j66rm7Pq8N5j91MJ0K55k4j37L45o37N54k69J84j44M82o94j05M63
5310B5J0l93J94N15l64n7n2J05K3j60O2j18L26n5q8J36m2k84K59K85j64l12L71
5333B22q4l34K62J26j88L76k04J25N0kj42K44J27o76O4M57k03j82P2o5K9J65k89
5356e0J20J13J85k97k3K8k62P4R2Mr5J27K86n78J07L48m43K13L38n99K30J78k87
5379a91n9J06L21n19K11M3j8j73K39k59J49K3j19J84j40k2PJ92J21l64K16mn5
5402a11o7Q9n8j63L86m39K92k02J35o4L03j77j26K71K78l83l31Q18m75l03K22
5423a05K63l49K8J64j31K78j35J59j17J07j10o2K24k14j72L12K12l43j47J87K92
5444C41j86l41L01p9J2j62m3M65l62k47J61K46j86OO21l71J72j16k67j51L66J92
$$ plain form
5286 -229 -83 177 11 2 -45 -38 -126 -71 -262 -258 -248 7 -17 -154 191 -446 108 -161 23 -121 361 -333 -438 25
5310 25 35 -358 -164 351 -13 -70 -122 -17 6 -154 -92 -210 116 61 -27 109 67 -217 42 327 163 -149 222
5333 222 138 -196 66 192 4 380 176 301 351 349 207 451 578 -98 -34 423 220 38 110 45 74 239 -50
5356 -50 70 183 368 71 48 76 -186 -112 -20 -16 -111 16 302 -276 -169 179 -264 -51 287 -312 -82 96 -191
5379 -191 -250 -144 177 -342 -131 -88 -106 -279 -40 -299 -150 -127 -246 -62 -202 -224 -217 -25 96 -268 -52 -56 -111
5402 -111 -178 -89 -147 -310 76 -363 -71 -273 -138 -202 101 -76 -202 69 347 -36 -367 451 -24 -327 -105
5423 -105 158 -191 -163 1 -130 148 13 172 55 162 52 -10 214 0 -172 140 352 9 -138 49 341
5444 341 155 -186 115 36 48 -114 -157 308 -54 -301 -140 106 -80 -74 547 176 348 232 -35 -186 180 372
5466C72n44N42j83k09k10Q87o06N8J8m6K03j85K75m24L62k26m8p0K29l57J95L10
5488C43n10Q4J71K1m50M94Q9n90P32l77j82K07J24k36K6K15j70p6K34l83j1L28
5510H3j03k68J87oj19j82M39n77N13J33m67j05N22r4n69L85J97j47k3N15m14n3
5532a53J28k5Oq9n4M0K31j83l32O87o1m58P9M70k0m32N92k15k12k55M94m21J56
5555b7L60k36L7m16L44k87O12k13J25J09j79l05J21L0j03M87j25l33K19M8k86
5576a8q1M59k34l27L00J32n26K9M74k80J37j16J08q3j34O0m8J45k66N5J19J67
5598G2m40M14j95j51J03R0R4n21N87k00l30M23j56r7K34J46m59O4M49k18n0k7
5620a68K8j87L03M6k3N11p22p7L13M82q06L71L84l67l21M03K11m36P4J17j14J03
$$ plain form
5466 372 -172 370 187 -22 -232 655 49 107 125 79 282 97 372 -52 310 84 36 -34 195 -162 33 343
5488 343 -167 -83 88 109 -341 153 242 -348 384 7 -175 32 156 -80 -54 161 -9 -85 149 -234 -245 83
5510 83 -20 -288 -101 -107 -226 -408 31 -546 -33 100 -367 -472 50 -44 -613 -228 -31 -178 -201 314 -100 -153
5532 -153 -25 -50 -44 -133 -187 -147 84 -99 -431 256 195 -263 -184 286 266 -166 426 211 -1 -256 238 -183 -27
5555 -27 333 97 134 -282 62 -225 387 174 299 408 229 -76 45 75 -28 459 334 1 220 268 -18
5576 -18 -99 360 126 -201 99 231 -295 -266 208 -72 65 -51 57 -26 -160 -100 -148 -3 -269 -214 -95 72
5598 72 -368 46 -149 -300 -197 -107 -13 -534 53 -147 -477 -54 -210 -307 -73 73 -386 -322 127 -91 -141 -168
5620 -168 -140 -327 -24 22 -1 510 -212 -289 24 506 -300 71 455 88 -233 170 381 -55 19 136 22 125
5642A25o8J27k32J74j5L8L76n77L5M02k34l06N28k37l68L66J65m40K18K01l15
5663c7R1J00k32k70N17l7j70J08p3m2RL39k84j63J41m3r3L12k17k78N72k54k68
5686b72J84N04o15q0M82j28j07K16K7l61K00O0n8j53MN5j79L13m09K21L31j15
5708A20l06J11K1k52M65q3q6K46J02n29j23N97m65o5O62k91m21K90L56o19L49
5729G9j55J85j81J71j20qJ98m90K96k3J83o22O82j74m06K91j69J68k54O77m88
5750a60N0n3r7m1N2K48l50L31l6k35K83p0l1p1J26j61M36j37j63k48K37L83m98
5773b05J55K20l73J37M16l35l50N54n5j6K5K27J6j55k2l17M99N7l94M9M46k98
5795B81j94K25j27oM7K97m09k02M91n6k85K32j16k71L68j84J5q7K42k98p2M83
$$ plain form
5642 125 57 184 -48 126 111 149 525 -52 -17 385 151 -155 373 136 -232 134 299 -141 77 278 -37
5663 -37 54 154 -78 -348 169 132 -38 70 -3 -45 -36 303 19 -144 -3 -46 -139 173 -44 -322 250 -4 -272
5686 -272 -88 416 -199 -279 203 75 -32 184 211 -150 50 110 52 -101 -97 -42 -221 92 -317 -96 235 120
5708 120 -186 -75 -54 -306 159 76 -10 236 338 -191 -314 283 -182 -247 415 124 -297 -7 349 -270 79
5729 79 -76 109 -72 99 -21 -29 169 -321 -25 -48 135 -487 195 21 -385 -94 -263 -95 -349 328 -160
5750 -160 -110 -163 -260 -301 -249 -1 -351 -20 -56 -291 -8 -78 -109 -180 -54 -215 221 84 -79 -327 -90 293 -205
5773 -205 -50 170 -203 -66 350 15 -335 219 164 148 173 400 416 261 239 -78 421 478 84 133 579 281
5795 281 87 312 185 179 226 523 114 -88 403 347 62 294 178 -93 275 91 106 19 261 -37 -109 374
5817C74p14K32QJ7j40M83m40m15P15l49k23M12L01p13Q9M65j78k01J25J97l39
5838b94K72J19l46L19j26N0o8L37n16K57l1K4j26R9K94l19K89j59j72K68r1k95
5860b15K7N68o04J57K08r3l28M12K14o15O18l63j99K00K57m58K24K70k62k3K35
5881B30j40m25K09M07o18L17j1k54m7M10l88K28N4k05j5J96Ll21K34J95k14J17
5903c8J88j69L2L3m17Q8O1L39o01M03J40m28L43l37P2J37J47j5q8Q4j43P2n5L79
5927B27n43M75L6n80P1M16k84QL61j19L0q3L09n46L59j59j79N45m11j02P9N47
5949D57o66Q9M27k19P8M1K59n11J98k88N7J96o4j44J59K38k94o4M60k15o8J17
5971B43L8n42M43K09k60k92L15k5m6L11l40MR5j18l99N33K44o46L95O9j03p0P5
$$ plain form
5817 374 -340 -108 -100 -83 -223 260 -180 -595 120 -229 -452 -40 261 -452 -363 102 -76 -277 -152 45 -294
5838 -294 -22 97 -249 70 -56 -6 -74 263 -253 4 -27 -3 -129 -30 264 -55 234 75 -97 171 80 -215
5860 -215 -188 380 -224 -67 141 48 -280 132 346 -269 349 -14 -213 -13 244 -214 10 280 18 -5 230
5881 230 90 -335 -126 281 -337 -20 -31 -285 -332 78 -310 -82 -28 -233 -248 -52 -49 -370 -136 59 -155 -38
5903 -38 150 -19 13 46 -371 -283 -222 117 -484 -81 59 -369 -26 -363 -291 -154 -7 -22 -110 -26 -169 -97 -152 227
5927 227 -316 159 195 -385 -314 102 -182 -174 187 68 98 15 324 -222 137 -22 -201 344 -67 -169 -90 457
5949 457 -209 -120 307 88 166 207 466 -45 153 -135 -78 118 54 -90 69 307 13 -51 409 194 126 243
5971 243 281 -261 182 391 131 -161 154 129 83 394 54 58 153 35 -364 169 413 -233 162 231 128 58 133
5994A33l6j5M03m29r7J4K17k96K42J37m73L85k5N4m70L47q9j89L99K8j53R4J21
6017C02m70K23J4l52J89M03k82k12N22l61r4M43m66j00L05J16m83K94P2l30L1
6038b36J50J11k73M26l97RK07l24j18M16j1k06K79q7oj81L30L2n02M08p0j09j87
6061c39L94j96P1K39j85J48k80J74j65M14o8l94J80J7l24K03P69n05r0K82J07
6082D52o06L95j3k28R3J59l16N2K77m40J19L15k52J23J07j99j35L17q7k59J89
6103F3k80j1Q4J15j14J22K99j01m46M99ro30M16k4m55L08L31m39O8O21r65M84
6125f4J23Q7n50K75K26n87M14n8J35n3Q7O5j98K82l75J32K23M1m19M87l61j97
6147b85J96K78j6j99J54l36Q4M67l65QK63m4m31M34k0l35K78QJ13m80O38m70J57
$$ plain form
5994 133 97 82 485 56 -41 -27 190 -106 136 273 -200 185 160 214 -256 91 2 -187 212 240 87 181 302
6017 302 -168 55 69 -283 -94 309 27 -185 337 -24 -118 325 -141 -241 64 180 -303 -9 63 -267 -236
6038 -236 -86 25 -248 178 -219 -210 -3 -327 -445 -29 -40 -246 33 -54 -60 -241 89 121 -381 27 -43 -152 -339
6061 -339 55 -141 -70 169 -16 132 -148 26 -139 275 207 -187 -7 10 -314 -111 658 153 63 345 452
6082 452 -154 241 228 0 93 252 -64 -12 265 -175 -56 259 7 130 237 38 -97 220 133 -126 63
6103 63 -217 -228 -144 -29 -143 -21 278 177 -269 230 221 -409 7 -17 -472 -164 167 -272 -204 417 -548 -64
6125 -64 59 146 -404 -129 97 -490 -76 -134 1 -52 35 100 -98 184 -191 -59 164 205 -214 273 -88 -285
6147 -285 -89 189 173 -26 128 -208 -124 343 -22 -14 249 205 -226 208 188 -147 131 139 252 -228 410 -60 97
6170I7L5r7j60L43J60o65J66L74l10K1K62l63O2J35NM7k41L98o07M43J15m81K67
6193FJ68l43K5L68k54l11M25pk63Q9M06n53O0L79j90k03L33j10l57K33P2n9M2
6216d4K22j51j44M73l74M2L0J62l24J89J9j17j16Q9k43K81L32l46R5K72n53J26
6238h0J02J13m20N22l74J91J19L9m14K2J32l33L67K29m47j60O01l24l19N09l71
6259b96K08N7j42M3K07kn04K74L87m46j45N85l4n99K70K2R8k08M15k79k2P4k52
6282b89J65J1L58n61N12j73m03L83o2n0j1L83k55j49M00m80P9J75J92m70O37j79
6304B13M3l1J3k61L70k19j1J65j07N8k40L90q0m14M59J23l77M1J97j26j30N02
6326E78n46M2P5Q4k42J86o6k88N16j00R6l56L49k23k67N1M1J93l9P1l42M61k88
$$ plain form
6170 97 132 35 -125 218 378 -287 -121 253 -57 -36 226 -137 -75 60 65 112 -129 269 -338 105 220 -261 6
6193 6 174 -169 -144 224 -30 -341 84 77 -186 -97 309 -244 -184 195 5 -198 135 25 -332 -99 -27 -86 -44
6216 -44 178 27 -117 356 -18 24 54 216 -108 81 100 -17 -133 -44 -287 -6 326 -20 75 347 -206 -80
6238 -80 22 135 -285 237 -137 54 173 212 -202 -180 -48 -381 -14 215 -232 -392 209 -115 -434 75 -296
6259 -296 -88 -31 -173 -130 77 75 -429 -155 232 -214 -359 226 192 -407 -137 -115 -17 -225 190 -89 -111 -37 -289
6282 -289 -124 -113 245 -316 196 23 -380 3 -59 -109 -120 263 8 -141 259 -221 -142 33 225 -245 392 213
6304 213 256 225 238 -23 347 128 117 282 175 233 -7 383 303 -111 348 471 94 135 332 206 76 578
6326 578 32 74 149 233 -9 177 111 -177 339 239 335 -21 328 105 -162 -111 -70 123 84 155 -187 274 -14
6349a4k69J05L33j12k86N39m37j5J5J00j88L33On98N25P2j81j82M38j91k15K87
6371F5l17p0J22J02k31J42J70k45K33L44k60m49P47m11k94L22J17k45M5L21m26
6392b18K77j51j82K48K38j64j51K14l36K00m2P1k5K23j34k61K15L7m74M42L51
6413C78k86o18M17J87m01J64N16j82l8J21m53N0J24j10oL32k73J9N10k97k74K08
6435H8Q5j59J90J48m86L00K65l12o49Q22J7m47K9N84n08j56M75m97J38N2L4j49
6457a36M75m55k49P88l45l80M26K00m26m0L76l27k15M52J04n82N49l66M8J92n0
6478C9k16j18L81k40J04J05q6m34Q29j94n49O64l45j52J68L82n39LL06m3M7j13
6500aQ4k63L96n12j6L81K08m50K69K44m23J21K9o4K04O8l0m80L49q5k04J42J83
$$ plain form
6349 -14 -283 -178 155 43 -243 296 -141 -156 -141 -41 -229 104 110 -488 37 109 -72 -254 184 -7 -222 65
6371 65 -252 -322 -200 -98 -329 -187 -17 -262 -29 315 55 -394 353 -58 -352 -30 87 -158 -113 208 -218
6392 -218 59 -92 -274 -26 212 48 -103 111 -225 -25 -67 4 -21 202 68 -193 22 59 -415 27 378
6413 378 92 -526 -109 78 -323 -159 357 175 137 258 -195 -145 -21 -131 -137 195 -78 -59 451 154 -120 88
6435 88 173 14 204 352 -134 166 431 119 -530 292 309 -138 -109 475 -33 -189 286 -211 -73 -21 13 -136
6457 -136 339 -116 -365 423 78 -302 124 324 -102 -142 234 -93 -308 144 248 -334 215 -151 -103 89 39
6478 39 -177 -295 86 -154 -50 55 -31 -465 364 170 -379 285 -60 -212 -44 338 -201 -198 108 65 112 -1
6500 -1 83 -180 216 -296 -312 69 277 -173 96 340 -83 38 67 3 207 275 245 -235 114 29 -175 -33 150
6523A50k95P6N61p24M9K93L0n41N87M2k91M14p3l70K7L87m16l9N58l28m75O35
6545B57j33j76J70K99n14J34p5k82J73P78p79j01N75j33k02j16L97n78N86j75
6565A05l9p2o0k5K15mm89N34k33M46o54L04K9j45J58O3k50R2L17l05k19M45j02
6588A11n01M89J96m75J30M11k62m63M90j91o7O87p84K62j02M4m40L17N12r14M85
6609f5J47j69j48K30N0l60P21m66k44M70q6k00n0M41l38J37k30J38KL26m70k68
6631d32O90k0n08L38K09n94L42L40m14j32K09j1q6L19k98k02K98k91Q9j13M59
6652A92m86k8K72j79J97op8qK32o0l16K83R7k04M6K65l51O5L87l02j40J31O3k46
6676a74M98l28J41J3M1o45M16K78j73q1K05p3l91N19jn28L15J74r1k4K90o67M16
$$ plain form
6523 150 -145 -69 492 -232 -183 110 140 -401 186 228 -63 351 278 -92 -65 322 -94 -133 425 97 -378 257
6545 257 124 -52 118 417 -97 37 -38 -320 -147 631 -148 -249 326 193 -9 -125 272 -306 280 105
6565 105 66 -6 -66 -91 124 120 -369 165 -68 378 -276 28 57 -88 70 133 -117 -25 292 -13 -232 213 111
6588 111 -390 99 295 -180 -50 361 99 -364 126 -65 -132 555 -229 33 -69 -25 -465 -148 364 -550 -65
6609 -65 82 -87 -235 -5 45 -315 406 -60 -304 166 80 -120 -170 271 -67 70 -160 -22 -20 306 -164 -432
6631 -432 258 238 -270 68 277 -317 25 365 -49 -181 28 17 -69 250 -48 -250 48 -243 -154 -267 192
6652 192 -294 -322 -50 -229 -32 -38 -116 -124 108 48 -268 15 112 -92 -46 219 -132 -67 320 18 -122 9 72 -174
6676 -174 324 -4 137 150 191 -454 -38 240 67 -14 191 118 -273 246 245 -283 32 206 115 91 381 -286 130
6699A30J89k52j20N62l05l84M70j55l63RL56l40J7M92l74q3O0P5l94P15l06m80
6721d81O88j82j37l27O13m50p7L47j09j61O5K04l33J77L1j07J90J51l62N0K55
6742D5l21j1K35r7Q4J48J2m00J49J37q8J08N62p10k41O17m39r6M37L4k57O7J42
6765A17l15L57Q4j34k38O16m23P6K00l11k4k3M03n28K84J22l04k8J81j96r7L52
6787A71l06k20M98Pn02M91m8l14K23K33r4l94O18n03K24m3j3oj30K46l97K93J96
6810B30l77P4K15K1n33Q99o42j37L09K47m10O5K78m33K56l7O8k00K08j61j60M46
6832B26j96k16K89j27l29M41K97n22L47j06k33r1O77m63j23N02l25j28K3L13o06
6853c50L17L33m05K28j21N1l75N10j10l06N42k31k62J6N25o82J57L67m29Q8L22
$$ plain form
6699 130 319 67 -53 509 204 -180 290 135 -228 -219 137 -203 -186 306 -68 -151 -91 -16 -410 305 -1 -481
6721 -481 207 25 -112 -439 174 -276 -353 -6 -115 -276 -211 -7 -340 -163 -132 -239 -49 102 -260 -210 45
6742 45 -276 -287 -52 -149 -65 83 95 -305 -156 -19 -107 1 563 -147 -388 229 -210 -306 131 165 -92 -25 117
6765 117 -198 159 243 109 -129 487 64 140 340 29 5 -18 385 -143 141 263 -41 -69 112 -84 -181 171
6787 171 -135 -355 143 150 -352 139 91 -223 0 233 139 -255 363 -140 84 41 28 22 -108 138 -259 34 230
6810 230 -147 -73 142 163 -370 529 -113 -250 59 306 -104 -39 239 -194 62 25 93 -107 101 -60 -220 226
6832 226 30 -186 103 -24 -353 88 385 -137 210 104 -129 -220 457 -6 -129 373 48 -80 -57 256 -350
6853 -350 -33 300 -105 123 2 53 -322 188 78 -228 314 83 -179 -163 362 -320 -163 204 -225 -137 185
6874A85j16j94L5nl5rK88k58J04K99l19m64M21J63L5R6k52m50L97pl9K40J09o14
6898c90M19K96n79k1N89j27n18N75n3m51M81M6n34Q0N93o72J60K59l91j09N48
6919B01l6l55L16n7j60J09K52n63J41L67o04O03J89l34k45L70m7j15J11rl2l11
6941b09M20l78J7J66j91O9K36p6m86N55q3o67O45O0k3l95O57l62j0M19o56n6J86
6964a62K64l22J42K26l81Q2K21k5l54N19l75j7p6M25n30L30J10m56K53J75j57
6985a08k34O03m95J5L47k51O9R9M7l08L71N5n15K09J55k31p5N33l11l2L21k08
7007E6j96L91l2o17L65J64l38L3O29l46n22Q08n41P1L62k2l69K10K62l83o8L33
7029B50j06m13N03k19R9k2j21j12J02J90m54J84J34j19K61mJ5m94N90m37N1K02
$$ plain form
6874 185 69 -125 -90 -95 -130 -139 149 -109 -5 294 -25 -489 -68 95 130 226 -26 -476 -79 -86 -125 115 224 -390
6898 -390 29 325 -254 -275 314 187 -331 244 191 -260 221 267 -267 -187 406 -266 -106 153 -238 -347 201
6919 201 165 -190 126 69 -91 18 270 -293 -152 215 -389 214 403 69 -176 194 147 32 143 134 102 -209
6941 -209 211 -167 -150 16 -175 -106 130 54 -432 123 40 -627 18 78 55 -340 317 -45 -55 364 -292 -348 -162
6964 -162 102 -220 -78 148 -233 -151 70 45 -309 210 -165 -182 -258 167 -363 -33 77 -379 -126 49 -108
6985 -108 -342 261 -234 -219 128 -123 -54 45 92 -216 155 210 -305 -96 59 -172 -247 286 -25 -57 264 56
7007 56 -140 251 219 -398 -33 131 -207 -174 455 109 -413 395 -146 -75 287 265 -104 106 368 -15 -83 250
7029 250 144 -269 234 15 114 92 -29 -141 -39 151 -303 -119 15 -104 157 153 168 -326 264 -173 -122 80
7051H0M53p45j3O29o85L58J73j66k78M25q2m02L71j90L6k8M21k63j82N06p95L83
7073FK73K0q05O65j53l37M72l8o3r2L44m95K08L48m67r6L57l02k63N97j60k24
7095b05kK74l64j98P30m79JM56m3n03N33j97k21K49M5k70J31L71p31O2M54m17
7117c24J99k7J02k45N16l44j63N40l77K28k33O45r27L47K38l01k16L98J76m23
7137a91L07J0j83j15K31k8r0M41l41k6K42k33j53K08L58p23O83m4p23L15N32n06
7159b9l22N23k4j23R5K05r34P67J02m96J06M79m79p9P10q14K73L70l78j43Q8J20
7181A7l28M78j33j40j0M07l13k24M41m34K29J3J37k74J79M67o86K17J94l15j93
7202b71M43k90J39M98n14Lj54L96k88K93j05m32N32j35k54o0O32n96j46P65j20
$$ plain form
7051 80 533 -212 -225 404 -281 77 250 84 -194 231 149 -253 118 -72 -36 -64 357 94 -88 418 -377 6
7073 6 279 299 -506 159 6 -331 141 103 40 -52 292 -203 5 353 -114 -210 147 -155 -418 179 19 -205
7095 -205 -207 67 -297 -495 235 -244 -243 213 170 -333 200 3 -218 31 76 -194 -63 308 -423 -361 93 -324
7117 -324 -125 -152 -50 -295 221 -123 -286 254 -123 105 -128 517 -410 -63 175 -126 -342 56 232 -191
7137 -191 116 126 -57 -172 59 31 -59 382 41 15 257 24 -129 79 437 -286 397 353 -370 -55 477 -29
7159 -29 -351 172 148 25 120 325 -609 158 260 -236 -130 349 -130 -209 501 -313 -40 330 -48 -191 -103 17
7181 17 -311 167 34 -106 -116 291 -22 -246 195 -239 -10 3 140 -134 45 512 -174 43 237 -78 -271
7202 -271 172 -118 21 519 5 8 -146 250 -38 255 150 -282 250 115 -139 -199 433 -163 -309 456 336
7223C36m36j9K20l64L02K34l45J26q5M2k35L43m35J53K32L4j59P7M47j020M53
7244i9L27l90J11R5j6k78L63j40m2k27N67l00m6K94o39K57M25l57k42M12N9m38
7266c04L29j3k97M4M32o12L56L28l95N6J91l6k36L65M0k29j21K72o7k32M54m74
7288a49L20l16L11k44J15j27j84M12k00M1N4J64p00M94J09l01j02L31J2m30N17
7309A27l16M1m6K93r4k85N39n77K23K64k09j82M7L32n31O45k73q9m16P55o07K15
7331a44J87p3k44L12o2l06M16k12r9J52L07m33K56Q7k34mJ07l2J10n4n6m69N63
7354G5j4n27L42K72k55k2L34l98p7M30k96J1K40J81p00O49j84k58J39M23l60l9
7376c4P59q81N2Q6L72m94K28K06m80M02K09m04j10M78k84j38M11k80j38rM44n89
$$ plain form
7223 336 -100 -119 101 -263 39 273 -72 54 -31 11 -224 119 -316 -163 69 103 -56 21 468 -552 -99
7244 -99 228 -162 -51 44 28 -250 113 -27 -69 -296 271 -29 -75 219 -420 -163 262 -95 -337 75 134 -304
7266 -304 25 12 -285 -241 191 -421 -65 263 -132 -76 115 79 -157 208 248 19 -102 170 103 -129 325 -149
7288 -149 171 -145 166 -78 37 -90 -274 138 -62 -21 33 197 -503 -9 100 -201 -303 28 40 -390 127
7309 127 -189 -148 -194 99 5 -280 259 -318 -95 169 -40 -222 -175 157 -374 271 -2 -91 -507 248 -359 -144
7331 -144 43 -30 -274 38 -24 -330 86 -126 -225 -73 234 -199 57 144 -90 -94 13 -19 91 37 -19 -488 75
7354 75 61 -466 -124 148 -107 -129 205 -193 -270 160 -136 -125 115 296 -404 245 61 -197 -58 365 5 -34
7376 -34 725 -156 -104 -18 354 -140 88 294 -186 216 425 21 -89 389 105 -33 378 98 -40 -49 395 -194
7398a94M19j01j63K72K10l68k83O18n34J10ML5m7j69K32l71M06O9j78N5J33j98
7420d3l22O74p42J37K31O9m38L44L55o82L31J06m4j56K87n0j01M72j47q43M00
7441a62M58m27m4L96l39N7o3J18j62M71o0l23J42J86o32K78L82m34M61p8j11j54
7463d0L6r5j85L97L08l87r5M32o04J61J90l50L54j03J9j37K51k69k27M37j1l40
7485b58J54K85n10R5K18q6j32J97j04k79N29l68o5K36J59j83J30L60n22j66L33
7506B3k08K2Q1J86k09K43j24j33O4O2k39O3N40n09j10J81O9k75O14k26k40K72
7528A47j2j8k37L46n10j80P14j37k1K6K88m89n3J82j85J06K84k09q5M55m62Q2
7550C2J56l1l81N37j17m99N20j12l04K28K94q3j82K76m18J68j51J92l58K94L12
$$ plain form
7398 -194 225 124 -39 233 443 75 -208 410 -124 -14 -10 25 -22 -191 41 -330 76 145 -33 22 155 -43
7420 -43 -365 309 -433 -296 -65 4 -434 -90 265 -417 -86 20 -24 -180 107 57 -44 428 281 -562 -162
7441 -162 296 -131 -175 221 -118 -61 -124 -6 -168 303 243 -80 62 248 -384 -106 276 -158 303 225 114 -40
7463 -40 -4 -99 -284 113 421 34 -61 371 -233 -72 118 -232 122 19 38 -99 152 -117 -344 93 82 -258
7485 -258 -104 181 -329 -234 -16 -102 -234 -37 -141 -420 109 -259 -324 -88 71 -112 18 378 -144 -310 23
7506 23 -185 -163 -82 104 -105 138 14 -119 -55 7 -232 -169 371 -138 -248 -67 2 -273 341 115 -125 147
7528 147 135 117 -120 226 -284 -464 250 113 92 118 406 -83 -136 46 -139 -33 251 42 -43 412 -50 32
7550 32 188 157 -224 313 196 -303 217 105 -199 29 323 240 58 334 -84 84 -67 125 -233 61 373
7571C73o29J62p0P5k21P64n01K4L51l38l41M18J95n63K11K88m9m%j08m15N25j08
7594C9n15N07J7j12K10J5l72R3J4r4P4M18m92p0L07J67n81R9O08m88O7K47m72
7617c14p6K87K49m64O29m18l50N23r5l57L02M39o12L64j13j02k09J03J7j38L79
7638D4Jl05M6PK9J96K51m23J15J30Pl19M91j49m84M94j98K00j18M28n92J04Q3
7661C8n8J56N04n12k29M43j66k26R5K22l98J43M12o21L00J00r4l52L04O8l11M91
7683C09j54l19K68R7l29J58J68j64%J04k90m88P16j26j93J43L23l53r5L91l82
7704b16K7L69j54l21K06K09l55K93J25l73K81M28p37j5M78n74L30J21j34j60K23
7725E1L9k0N3L25q18J45N86o59L22J37k48jL5J96l79L98L12n81J5k3L5J3M36n35
$$ plain form
7571 373 -256 -94 -164 -89 -310 454 -47 -23 328 -10 -351 67 262 -301 -90 198 149 145 145 37 -378 147 39
7594 39 -476 31 48 -64 146 161 -211 -118 -104 -198 -124 294 -198 -268 39 206 -375 -276 332 -156 -89 158 -314
7617 -314 -390 -103 146 -318 311 -107 -457 66 -29 -386 -84 355 -257 107 -6 -108 -317 -214 -197 -335 44
7638 44 45 -260 -214 -207 -178 18 269 -154 -39 91 98 -221 270 121 -363 131 -67 133 15 443 -149 -45 38
7661 38 -20 136 640 128 -101 342 176 -50 45 267 -131 12 424 -197 103 203 109 -243 61 129 -182 309
7683 309 155 -164 104 201 -128 30 198 34 34 138 -152 -640 76 -50 -243 -100 223 -130 -225 166 -216
7704 -216 -189 180 26 -295 -89 120 -235 58 183 -190 91 519 -218 -233 245 -329 1 122 -12 -172 51
7725 51 90 70 123 448 -370 -225 361 -298 24 161 -87 -88 -53 143 -236 162 474 -107 -92 -115 -80 -67 369 -166
7749a66M1N32k36m09L44R8m73K88K91l19J71Q3j92l20N03k46j24N21m37j31J8
7770a63L6j52L59k04K31k13K07J04n18L51j17j25K23L18n12K58j40j84L55O1l0
7791A45m27O04m47%K59j58j67K71J96m42M80k75k07M5J28R1k89N08j78m61M65
7812A41j57l36L68L34n45K96K66k49j68J83l03r5M08j78J22P8K22o05L81K40m73
7833g0Q5L79k25n86P27m08j98K72j40M9q2M07p26N08n6k94k1L86P6n52N59k81
7855a91k41L87R3l48J91K27p93M72L1J62n82P48k55j97K39o9N8K4m0q5K90j30
7877iJ06j08K86k41k70M61l2m08N58q0m17M3M22n04K75M42m20k6J38K32l57K44
7899C35l6j31J27J30l20J79K33n67kK01p6J44N5l8m01N38j39k39k62N75k70pJ37
$$ plain form
7749 -166 -125 407 171 -238 106 204 -269 19 310 -9 162 245 53 -267 236 -10 -134 387 -50 -181 -163
7770 -163 -127 -279 80 -124 107 -106 101 205 -313 38 -79 -204 19 337 -175 83 -57 -241 114 175 145
7791 145 -282 322 -125 -125 134 -24 -191 80 276 -166 314 39 -168 -123 5 96 -193 315 137 -324 141
7812 141 -16 -352 16 350 -195 101 367 118 -50 133 -170 -265 143 -35 87 165 387 -218 163 403 -70
7833 -70 15 394 169 -417 310 -98 -296 -24 -164 -115 -197 210 -516 -8 -64 -358 -379 7 83 -469 90 -191
7855 -191 -432 -45 48 -300 -109 118 -675 -203 -172 -10 -592 156 -99 -296 -57 -126 -68 -44 -84 -169 121 -9
7877 -9 97 -11 275 34 -236 225 193 -215 343 263 -154 -111 311 -193 82 524 104 78 216 448 91 335
7899 335 299 168 295 425 105 284 517 -50 -52 149 73 217 272 234 -167 371 232 -7 -269 306 36 29 166
7922A66m15o7J34K71n95P16o6m43MJ71k57M0O56o30L05J04j68k42K74k20rM5K27
7945Aj20p9J08l73J20O16l58K1K92q6o01O36k08l35M48m7Q3j42J23l18J30K68
7967A79l05J62J72Q2k40L08l8n07k6M9J73l0N27n89j35K95p7ON7K89l79O8K33
7990B74m23k0K91j10k67N49l42Q3L66j80l89J58K55m38L84J81m08j33J40n7pJ59
8012F6k08J21L7O3k59K4J00j19J86J71k77l3M28k97k51K34J54k36j6R8k45L20
8034F1J50k50k21N89j82l15J60J45l13P6K66l46Q0M90o18K96k12p4o4M66J1n11
8056c16O78k30j67k3M86p67K53J28k1oJ5K68o45N85l14j6J68j46L7j05J63m6J47
8079A26m7j08l25M27L12p28K79j67q9K78K25j87k11N08l20j47L6K1m13P05k9k81
$$ plain form
7922 166 -249 -316 -182 89 -506 210 144 -299 -295 -124 -381 -341 315 -315 -10 94 -74 -316 -42 -262 -271 -226 1
7945 1 -119 -198 -90 -463 -343 273 -85 -64 228 142 -459 177 -31 -366 82 35 118 -24 99 -219 -89 179
7967 179 -126 36 208 290 50 358 320 -187 -213 -164 9 -21 506 -83 -218 77 0 6 63 352 -27 41 274
7990 274 -149 -169 122 12 -255 294 -48 35 401 221 -168 -10 245 -193 191 372 -36 -169 -29 -86 -93 66
8012 66 -142 -21 16 79 -180 -156 -56 -175 11 182 -95 -128 300 3 -248 -14 140 -96 -112 -14 -259 61
8034 61 211 -39 -260 329 147 -168 -8 137 -176 -100 166 -180 -100 390 -228 68 -144 -218 -282 184 195 -316
8056 -316 362 132 -35 -58 428 -339 -86 42 21 15 30 298 -347 238 -76 -92 76 -70 -33 -138 25 -21 126
8079 126 79 -29 -354 73 385 -343 -64 -231 -320 -42 183 -4 -215 293 -27 -174 -138 -117 -530 175 146 -135
8101a35K26r8j06P6L74m38L01Q8l78K51P5k41l79P64k81j31K3J05j90l48Q76m85
8123e1J42R8j31j37R0K63m76L91j17m9q4J99j56j29M99l73m3J71Pk64J56j0j37
8146a41J36p1J61k55N28o01J16J48j15J85k02K41n29L48J25l07J13J46o2k63P29
8167D30m29j75J8L98n09K84J70o17M04q4K35n07N16m08n5O53k77k50J31P1k93
8188b94N67k85j67
$$ plain form
8101 -135 91 -7 -113 -37 337 -101 200 288 -90 161 236 -5 -384 380 99 -32 -9 96 -94 -442 434 -51
8123 -51 91 189 58 -79 11 274 -202 189 72 23 -61 138 -18 -147 352 -21 -64 107 114 -150 6 -4 -141
8146 -141 -5 -76 85 -170 358 -243 -127 21 -94 91 -111 130 -399 -51 74 -233 -120 26 -36 -299 430
8167 430 1 -174 -156 242 -267 17 187 -430 -26 -110 125 -382 134 -274 -329 324 47 -203 -72 -1 -294
8188 -294 273 -12 -179
8191a79
$$ Imaginary data points
##PAGE= N=2
##DATA TABLE= (X++(I..I)), XYDATA
0@%%%%%%qRrJ6j6K4l2M0n6O4q0J04j21J45j76K09k49K96l46M04m70N44o27P19
30C84q24R42j070J211j370J543j733J945k176K427k702L002l331L691m083M512
46B368m979N492o055O668p344Q092q916R834j0861J2014j3323J4822j6556J8592
60I848k1022K3981k7674L2437l8842M7959o2067Q6986j43856N03457J45325p93430
72b36898M38313K56395l02724j02868L12445j88058k8672J54985k6796j94227
82H1895M9307n6254j0478K41054j44145j73798J59630L4617k15740L1708R3778
93I1574j44280J28867M3439j67003n564J94172k52206j67566L60310Q515k59533
104a69275J07704J39087k64878O3375J47826j97888j0336J82228q394j02896J40630
$$ plain form
0 0 0 0 0 0 0 0 -8 1 -8 8 -8 16 -16 24 -32 32 -48 56 -65 80 -96 113 -136 160 -186 218 -252 292 -335 384
30 384 -440 502 -568 643 -727 816 -917 1028 -1148 1279 -1423 1579 -1752 1939 -2144 2368
46 2368 -2611 2881 -3174 3494 -3850 4242 -4674 5160 -5701 6313 -7010 7812 -8744 9848
60 9848 -11174 12807 -14867 17570 -21272 26687 -35380 51606 -92250 411207 556532 -236898
72 -236898 201415 457810 155086 52218 364663 176605 147933 302918 276122 81895
82 81895 131202 74948 64470 305524 161379 -12419 147211 181828 -33912 -2204 91574
93 91574 -52706 76161 119600 -47403 -52967 141205 -111001 -278567 81743 90258 -169275
104 -169275 -61571 77516 -187362 -123987 23839 -174049 -184385 -2157 -10551 -113447 27183
115B7183j79293j43608L18393O3472l22006Q2666K94989k08349n3767J20215r7166
126i7271p5470K05894L7790j61909J24729k3878j08750R4884P0116j77750P2477
137c9138J92611j54034l003Q6958j07349p7840J96717n3512j16251K16142k4189
148A17112k22961Q9818J93343k58104l0502K46867q6565q5510J38163m3876k14984
159a57199J62177P4362j32970L3325Q4957p8250p901R4096j74402O738J26903
170C1836n7203j6482J29697j05936j49510K29906l7919k17460J34098J92771k11909
181g8111l0145K27892j72176j25513J73658L2127j64565J49805O1662j84426P4272
192c5520O9350j32385k2106J82625q8370n1669J37426m6151j04374M5446L7113
$$ plain form
115 27183 -152110 -295718 22675 86147 -235859 -153193 141796 -66553 -120320 -105 -97271
126 -97271 -172741 33153 70943 -90966 33763 9885 -98865 -3981 66135 -111615 -39138
137 -39138 153473 -561 -3564 83394 -23955 -101795 94922 41410 -74841 141301 117112
148 117112 -105849 -16031 177312 -80792 -111294 135573 49008 -36502 101661 57785 -157199
159 -157199 4978 79340 -53630 -20305 64652 -13598 -21499 72597 -101805 -95067 31836
170 31836 -25367 -41849 87848 -18088 -167598 62308 24389 -193071 -58973 133798 -78111
181 -78111 -108256 119636 -52540 -178053 -4395 27732 -136833 12972 74634 -109792 -35520
192 -35520 33830 -98555 -120661 61964 -26406 -78075 59351 13200 -91174 -45728 -8615
203h615p5739J18619j9565r4646J22588K8829j87943J7462K01337j54868l8423
214i0964J93322m1124j67014J13187N4008j79167J06827P6836j07120L9532J28400
225A26723j71053o6040K01821r2939r9272J51278N6330j74124Q3653P8190j76627
236h2060K9555J13718o0905l4670J46014j01216q1436J30409l2996j10390P0182
247a3795R6222j01898N4766K2893j08209K3927O1694p5456O043J44646j35259
258b4426k8942J62946q0213j83670J52103J18794k02734P2953J43504j39026r1945
269a00656J67021m9601j26038J56568J0132r2523N8706O0555j42749J7532Q1150
280D0097p9860M9809P7514p7456o0090J30144p4427q1606J23381k1128p8823J17473
$$ plain form
203 -8615 -84354 34265 14700 -79946 42642 71471 -116472 -99010 102327 -52541 -90964
214 -90964 102358 61234 -105780 7407 61415 -117752 -10925 65911 -41209 -1677 126723
225 126723 -44330 -110370 91451 -1488 -100760 50518 106848 -67276 16377 94567 -82060
236 -82060 -52505 61213 308 -34362 111652 10436 -71000 59409 26413 -83977 -13795
247 -13795 82427 -19471 35295 58188 -50021 -26094 35600 -39856 -33813 110833 -24426
258 -24426 -53368 109578 29365 -154305 -2202 116592 -86142 -13189 130315 -8711 -100656
269 -100656 66365 16764 -109274 47294 57426 -35097 23609 84164 -58585 -41053 40097
280 40097 -39763 10046 87560 10104 -49986 80158 5731 -75875 47506 26378 -52445 65028
292F5028P1289k03389K6929J08565r0897r750J19320n2948r3050J56889l7802
303F0184j30366N8404N0375p7928P1234Q8610j59654J1673Q9794p5096n9310J24713
315E2633k9148r0521J41061p711j29945K4012P1228j07154N3034J12373j19238
326b9376j7630Q8088n1634r0643J20732l1978r2574J35579M4950j37722r175R5695
338B4312j16620K5940J15228p8398m8179J08081j5388j18491R3583j8239q2990
349a11161J00882Q7562j26170k1164J10067j05643j4641R9088k7537p0416J07743
360B8610J4694j01839O2019j6735p4652O9347J05722j12567m832J05684r9259
371b3808l1200J04447k9794j11861J45863M8180j21288L4636L4887r0820J0240
$$ plain form
292 65028 136317 -67072 -40143 68422 -22475 -32225 87095 34147 -58903 97986 60184
303 60184 -70182 -11778 38597 -39331 31903 120513 -39141 -27468 62326 -12770 -72080 52633
315 52633 23485 -67036 74025 66314 -63631 -39619 31609 -75545 -22511 89862 -29376
326 -29376 -47006 41082 -10552 -101195 19537 -12441 -105015 30564 75514 -62208 -71383 24312
338 24312 -92308 -66368 48860 -29538 -77717 30364 14976 -103515 -9932 -28171 -111161
349 -111161 -10279 77283 -48887 -70051 40016 -65627 -80268 18820 -8717 -79133 28610
360 28610 43304 -58535 3484 -13251 -87903 -18556 87166 -25401 -30233 75451 -23808
371 -23808 -55008 49439 19645 -92216 53647 101827 -19461 15175 50062 -40758 -30518
382c0518J32446r1110k9113J05804l8083p2252P0852l771j14586J15266N3150
393I8085q8696J5949N5781r6285j8490J19060p7053l1198R3576o894q5824P5165
405E3176j509j31824Q5044P0819p0337m514Q4020r8516l2315J12965o5017o7436
417f5444R1479M6576r9917O1001J5179j19527M0634Q5889o0404l2693J07581o0975
429I379l7860P1096m2518p0880Q4290M8355j03092P3673L6436j10263J561R5755
441E5932o8954m1848J30265m5377o2053O9064Q336j07698M8278O1814q0015N4610
453B2354N1793q7435l6014J06292n9009o4930J01925r278n1758N6220K5853j22300
465f6287L4997O3698o6443J6149O2750n0590l9433J00872p0657p2074R3108J8648
$$ plain form
382 -30518 101928 10818 -18295 87509 49426 -22826 48026 44255 -70331 44935 98085
393 98085 9389 25338 81119 -15166 -33656 85404 8351 -22847 70729 63835 -21989 53176
405 53176 51667 -80157 4887 75706 5369 855 84875 -13641 -45956 67009 1992 -65444
417 -65444 26035 72611 -27306 33695 48874 -70653 -30019 55870 -4534 -37227 70354 9379
429 9379 -28481 42615 97 -70783 13507 61862 -41230 32443 68879 -41384 -39823 55932
441 55932 -13022 -54870 75395 30018 -32035 37029 45365 -62333 -14055 47759 -32256 22354
453 22354 74147 -13288 -49302 56990 -2019 -66949 34976 25698 -26060 30160 56013 -66287
465 -66287 -31290 32408 -34035 -17886 44864 -5726 -45159 55713 -14944 -87018 6090 24738
477B4738p2776N1094N6665j14462K2688N8655o4855j9756R4682k4487n8447R2674
489D6413m0406p1528O0628L3710q7135N2556Q1031r7056o46N7943m4909m9734
501e9133R2635j5693n4888Q4568q798p6071L1165M4650r6253M5394Q0311p9955
513a2068j3626P5675l8555q6916R0010k101o5108O3403L6618q2363J237O3754
525B9960q8797P099O6042l5915k7917P3415k1744q8682O6197Q9n3586M2341M9560
538A8062p6297J6386O6030r2686j1004O6504k1216m0315R4192j6909q9311O8044
550a8520K1428p6752J4105Q4785o5666J2269P3619p4914l9608P8220j155p7072
562f9261Q8219K4632o9100L1077M1286p6178j3542R8621m7911j4220O2901j5596
$$ plain form
477 24738 -48038 3056 59721 -54741 -32053 26602 -38253 -58009 36673 12186 -46261 46413
489 46413 6007 -65521 -4893 28817 -58318 -5762 75269 -21787 -22433 35510 -9399 -59133
501 -59133 33502 17809 -37079 47489 38691 -37380 -6215 38435 -57818 -12424 67887 -12068
513 -12068 -25694 49981 11426 -75490 14520 12419 -52689 10714 47332 -35031 -33794 29960
525 29960 -58837 -51738 14304 -21611 -49528 23887 2143 -86539 -20342 -20253 -73839 -31498 18062
538 18062 -58235 -41849 24181 -68505 -79509 -13005 -34221 -74536 19656 2747 -86564 -18520
550 -18520 2908 -73844 -59739 25046 -40620 -28351 45268 -29646 -69254 8966 7811 -69261
562 -69261 18958 43590 -25510 5567 46853 -29325 -42867 55754 7843 -6377 56524 40928
574D0928m8403M3225o328o4883P8302K4517n5616J1538N4659o5160j5805O3831
586F0805o0265j933Q1239j2603p9475N8537J956p5031N9367K4809p0996J9888
598F298J04134q9325o1589P9536j5029n0788N5627K7085p9776N0813K5886p2715
610a9843n188M3240k4015k475O6695o3864k2512O3698k4858p4330N7728M2254
622C6530o5908M4475J7221o4476K39O5784n9271l4643R3106j4870l9532L1933
634A0588j048p4392N6850M0692p5639K0181N6668k4621l4264L7898n3080n978
646d6145Q3286k6057n5327N5688L4139r0843L2106L1591o5165K1595Q3776m5381
658A3263o3755P8017j4651m9535K9148J6680l6094M5418L5728q6690J4256M2132
$$ plain form
574 40928 -7475 35750 29422 -35461 42841 67358 11742 23280 77939 12779 -3026 60805
586 60805 540 -1393 79846 67243 -12232 46305 48261 -26770 32597 57406 -13590 6298
598 6298 110432 21107 -40482 39054 24025 -26763 28864 55949 -23827 26986 52872 -19843
610 -19843 -25031 18209 -5806 -8281 58414 -5450 -27962 35736 10878 -63452 -5724 36530
622 36530 -29378 15097 32318 -32158 -31919 33865 -25406 -60049 33057 18187 -21345 10588
634 10588 9540 -64852 -8002 32690 -42949 -22768 33900 9279 -24985 12913 -40167 -46145
646 -46145 37141 11084 -44243 11445 45584 -45259 -13153 18438 -46727 -25132 58644 13263
658 13263 -50492 27525 12874 -36661 -7513 9167 -26927 18491 54219 -32471 -18215 23917
670B3917l4960j9674N6470k2936k0037P1526m1670o3061M4536M1690o8867K9683
682c383N1035o2283P945M8482m7674n9069Q5203Q906m7035L1450O588l3839J4017
695C43J9187o6993L7668M8500m3273k607M2906m5878m1612Q8556k9989o3437O7190
708A0561N0470p9547o316N7073o1791J473N5695k0892m0889O5375J988o5192K8353
721c639L788k1526K4491L3639n3525J5923M1275n7991n866M1094j9766k7482Q0290
734E0705k1332p0047N2511K6358o9182R2P7372m7074q572M8137k8587m0370L8423
747H434P895m7081M7104M154k6761K3229O845o1518J7897O1781o3788Q06O0687
760C9684k4276n2996N6841o125p2744N9485L6142n1902n533N9273n0033k5086
$$ plain form
670 23917 -11043 -30717 25753 2817 -17220 54306 12636 -50425 -5889 35801 -33066 -3383
682 -3383 47652 -14631 -6686 41796 -5878 -64947 20256 29162 -17873 13577 20165 -13674 343
695 343 19530 -47463 -9795 38705 -4568 -7175 35731 -10147 -51759 36797 6808 -56629 10561
708 10561 61031 -18516 -24832 32241 -29550 -28077 27618 6726 -34163 31212 33200 -31992 -3639
721 -3639 149 -21377 3114 36753 -16772 -849 40426 -17565 -23431 17663 -2103 -29585 50705
734 50705 29373 -40674 11837 38195 -30987 -30895 46477 -597 -9169 38968 10381 -29989 8434
747 8434 16329 -30752 16352 20506 -6255 16974 23819 -37699 -19802 41979 -21809 -21003 39684
760 39684 15408 -37588 19253 13128 -59616 -131 36011 -15891 -21424 37849 -12184 -37270
772c7270M9633k5767j8661M2457J1845n0730L4064m72m4618K7906K0670l2822
784b3765Q533N5194n6564j3009M6567k9055l3119N6367J3786o1799N0908J7287
796C1331o1227Q01N3367l4628j8745O6470k5931k5772K8177j209m4427L5835J8413
809B2455m0515M1459J2537m6580O77M9539n4536j3180P4825k3895l9710M3702
821B6778J7358p7854K9667M0471m4122L462M3131j8243l2740L8728k7429j8947
833a9740L3722J652k0745K5625O603n4001L4642Q756m7848J5108N5205m0137k6687
846b7845O3994l9460m5619M6377K4973o1894K5824M9252n4112n981K7712k1397
858a8176k5913M9722q443k3104L4351j3624k7382J6568J4096m3541L5792K6963
$$ plain form
772 -37270 12363 -13404 -32065 10392 22237 -28493 5571 5099 -39519 -11613 9057 -23765
784 -23765 -15232 39962 -16602 -29611 16956 -12099 -45218 11149 24935 -36864 14044 31331
796 31331 -29896 -29095 24272 -10356 -29101 37369 11438 -14334 13843 12634 -31793 4042 22455
809 22455 -18060 23399 35936 -10644 -9967 39572 -14964 -28144 46681 22786 -16924 26778
821 26778 44136 -33718 -4051 36420 -7702 -4240 38891 20648 -12092 26636 -793 -19740
833 -19740 13982 15634 -5111 20514 27117 -26884 7758 16514 -31334 -16226 38979 -1158 -27845
846 -27845 36149 -3311 -48930 -2553 22420 -39474 -13650 35602 -18510 -24491 3221 -18176
858 -18176 -44089 5633 -2810 -25914 8437 -5187 -32569 -16001 -1905 -45446 -9654 17309
870A7309m3662J0998L1902l9873k9860O6920k1437k9539N0884O881n6791J8146
882a8122M4588o1043L432M7234j0990k1485L4945j3201m0619L9522l627j6687
894a6053K2148J3990l6368K4677K3559o3295Q830M7027j8173k9085N8679j4149
906B1787n3492L9123J3645l9713M098M6115l1885L883K3403l2134r951K3860p472
919A267j7347N2079k1781l5904L9984Q328n4375J3755N1439n0761Q069M9238k8956
932A5035m7920M3157J2865m7416L5318J6270k7360K260L0601l4872j1759K9710
944A5889j9737J0254K6049j4598l1757L6095q748l5525L9253P134l4829J6123
956E603M6214n5060j4343L9930k3139j5118M4256L697n5418L6468J3946m0668
$$ plain form
870 17309 -26353 -15355 16547 -23326 -53186 13734 -7703 -37242 13642 20523 -36268 -18122
882 -18122 26466 -34577 -31145 16089 5099 -16386 18559 5358 -35261 4261 634 -16053
894 -16053 6095 20085 -16283 8394 31953 -31342 -22512 24515 6342 -22743 35936 21787
906 21787 -31705 7418 21063 -18650 -14552 31563 -322 3561 26964 -5170 -15121 8739 1267
919 1267 -16080 35999 14218 -21686 18298 26626 -27749 -13994 37445 -13316 -5247 43991 15035
932 15035 -32885 10272 23137 -24279 11039 27309 -51 2209 32810 -2062 -13821 15889
944 15889 -3848 6406 32455 17857 -13900 22195 13447 -22078 17175 24309 -10520 5603
956 5603 51817 -3243 -17586 22344 -795 -15913 28343 32040 -23378 13090 27036 -13632
968a3632M824K5995k5142j503M9785l5281k1022K1381n002k0673L0161M940l8758
981b3927L5389Q825l5905k451L0432l2362j560N1042k7479k1873K5251N82m1622
994c5658L3778J6001l9911K0093K6426k4644j7641L2881l0552q808M4269p124
1006I110k5891J9285R500m0273L0328Q849l9501J4026M4002k1993k8645L5768
1018A4565k3709j4549L2236N190l3417K2277K1962l8841J4014P192k5252K364
1030a5968M3124k2278k0408L7893j9993k3852K3568J2850l8100K8270K2664l9501
1042a1731Q986K2985k8522k2826N1164q984k4503K7432Jk9335J0553K2767l7770
1055a9783J3822K2177j5739J257J6958k6245k1176M6178j2082k2256K3757J2471
$$ plain form
968 -13632 -8808 17187 -7955 -9458 40327 5046 -15976 5405 403 -20270 9891 14831 -23927
981 -23927 11462 20287 -15618 -18069 12363 -19999 -21559 29483 2004 -19869 5382 5964 -35658
994 -35658 -1880 14121 -25790 -5697 20729 -3915 -21556 11325 -19227 -28035 16234 9110
1006 9110 -16781 2504 12004 -28269 2059 10908 -28593 -14567 29435 7442 -21203 14565
1018 14565 -9144 -23693 8543 13733 -19684 2593 24555 -14286 -272 6920 -18332 -15968
1030 -15968 27156 4878 -15530 22363 2370 -21482 2086 14936 -23164 5106 27770 -11731
1042 -11731 -2745 20240 -8282 -31108 20056 11072 -13431 14001 14002 -15333 -4780 17987 -19783
1055 -19783 -5961 16216 477 1734 18692 -7553 -28729 17449 5367 -16889 6868 19339
1067A9339l0913J1228J7380m3169J4994K7894j7561j1608L5918k1436l1503L9883
1079A0446m247l0767J7636L3393l5723R33K3708k8911m310K1487m902j6444L6057
1092A8356j3403k5415K4167Q33k8636J1781L2391l3654P836K3761k4607j5651
1104b2241K6914m799k5467L9641l065k5567J4686J4817l4019J282L4462k5201
1116h557K888K2343j1700k2700K7807o751k8654L3845O242k2705Q064K5400l7763
1129a2241m939L2183j7181p079K1503qk4401K8300r193l0862K3694J7021k2412
1142e615J889L1503l5451n996K8415j2490k2593K4633J3716k6553K0539m086k4901
1155a6990R481K2795k3060l175L2491k2397o373J7591q132k6450K8563R736k7706
$$ plain form
1067 19339 -11574 -346 17034 -26135 -11141 16753 -808 -12416 23502 2066 -29437 10446
1079 10446 6199 -24568 -6932 26461 -9262 -8329 15379 -13532 -17842 3645 -1257 -17701 18356
1092 18356 4953 -20462 3705 4538 -24098 -12317 20074 -13580 -5744 18017 -6590 -22241
1104 -22241 4673 -126 -25593 14048 10983 -14584 102 14919 -19100 -17818 16644 -8557
1116 -8557 -5669 16674 4974 -17726 10081 3330 -25324 8521 14763 -7942 122 25522 -12241
1129 -12241 -17180 15003 -2178 -9257 12246 12238 -12163 16137 6944 -23918 -224 16797 -5615
1142 -5615 -3726 27777 -7674 -13670 14745 2255 -20338 4295 18011 -8542 11997 7911 -16990
1155 -16990 -7509 15286 -7774 -10949 21542 -855 -7228 10363 2231 -24219 4344 14080 -13626
1168a3626K2468Q289k6347m628K9838k3681o128L2839j3165j4383J9066M906l3976
1181a8528J7963P821j6321K0622J2378l0473q756L9975k2706j8298K4075L002
1193A0754j5995J9086R962l9845R632J4497o634O66J1123j7647J50L0985k9397
1206b663j7292K2532P766k2678K0985J0461l6111J1605J5214j9336q982L2675
1218A4176j5410j4502K7925r418k2232J1607J2037k9541K1911K1612k8017q449
1230a8301J8588n239j4780K3912j4847r433K6014N757k5388j619J1897j5985K1869
1243B445P704k3957l10K8425j2616j9946K2683j3010o062K7820P868l7086J0414
1256e628K3432k7660L489J9761r499j3714L2034q751k4307J9426R23j7566J0035
$$ plain form
1168 -13626 8842 17131 -9216 -13844 15994 -7687 -13815 19024 5859 -8524 10542 15448 -18528
1181 -18528 -565 7256 -9065 11557 23935 -6538 -15294 24681 1975 -16323 7752 10754
1193 10754 -5241 13845 23807 -16038 -6406 8091 1457 2123 13246 -4401 -4251 26734 -2663
1206 -2663 -19955 2577 10343 -12335 8650 19111 -17000 -5395 9819 -9517 -18499 14176
1218 14176 -1234 -15736 12189 2771 -19461 -7854 4183 -25358 -3447 18165 -9852 -18301
1230 -18301 287 -4952 -19732 4180 -10667 -20100 5914 11671 -13717 -15336 -3439 -19424 2445
1243 2445 10149 -13808 -14118 14307 1691 -18255 4428 -8582 -14644 13176 21044 -16042 -5628
1256 -5628 17804 -9856 -6367 13394 3895 -9819 22215 13464 -10843 8583 9506 -8060 1975
1269A975K4909k4071R59J2362j6671q79J7627p499j9702K8305n29j3217N934m361
1283E142j6876J5083K2535k8839K429J4273j0275o640J7200j6545j9771L8339
1295A6055K115k4557L586J4389k3981L753K3845k2712l821K1162j79k2184J5210
1308B681l393j7520J8707O474j2377K256J5356k5450K607J8899j4111o865J7536
1321D800J794j8182K1811p482k3083J4197J7538j5592j339J9968k2615J436J8452
1334A1703j1877k0451K3718J1216k1667J4106M48j7876J997K1477j6214o412K1104
1347A1272r094l910P526l875j8181J8905N340j5343J2603M055j4626k020J7689
1360A0341j9310L70J8969j1008o020J6903k937k8349K2200O674k0459R511K0167
$$ plain form
1269 1975 26884 2813 3772 16134 -537 -1416 16211 8712 -10990 17315 16786 3569 9503 5142
1283 5142 -11734 3349 25884 -2955 -526 13747 3472 -3168 14032 -2513 -22284 16055
1295 16055 18170 -6387 -2801 11588 -12393 -8640 15205 -7507 -11328 9834 9655 -12529 2681
1308 2681 -712 -18232 475 6949 -5428 -3172 12184 -13266 -10659 8240 -5871 -12736 4800
1321 4800 6594 -11588 10223 2741 -20342 -6145 11393 -4199 -5538 14430 -8185 -6749 11703
1334 11703 -174 -20625 3093 14309 -7358 6748 7196 -10680 -8683 12794 -3420 -9832 11272
1347 11272 2178 -1732 5794 1919 -16262 2643 7983 -7360 5243 9298 -5328 -7348 10341
1360 10341 -8969 -8599 10370 -638 -6658 10245 7308 -21041 1159 7833 -12626 -3115 17052
1373A7052k0684j1648K9248j5334j4966J5929Q110j5951J0797R764k4345N698
1385f330R916p230o170J7094o169o658J3177j0641n580O663K716j0074J6860p51
1399F823j8992J3972N523j8564k140K6880j6737p340K2907p942k0031J2677J2726
1412I762k5429J2469J4942j5530l327J6069j1100j6285K3873l365j0326J0457
1424B210O316j6453M057R911j7864P005R937n257m708J4963j1161j2150J7631
1437D437m422p660Q982Q507j6624Q758N831j8472N530J1420p782n667K2897j3328
1451B407j5390J7834J396j7382P848J7273k0905O563J3493j4892j0647J6205Q87
1464D690j3733J7887j943j2937N421R571j4228j442J2713r286O704N667r143p717
$$ plain form
1373 17052 -3632 -15280 13968 -1366 -16332 -403 7707 -8244 2553 12317 -12028 -6330
1385 -6330 3586 -3644 -9814 7280 1111 -5547 7630 -3011 -8591 -1928 788 -9286 7574 6823
1399 6823 -12169 1803 7326 -11238 -13378 13502 -3235 -10575 12332 4390 -15641 -2964 9762
1412 9762 -15667 -3198 11744 -3786 -7113 8956 -2144 -18429 5444 2079 -8247 2210
1424 2210 8526 -7927 -3870 6041 -11823 -4818 5119 -138 -4846 10117 -1044 -13194 4437
1437 4437 15 -7645 1337 9844 -6780 1978 7809 -10663 -5133 6287 -1495 -7162 15735 2407
1451 2407 -12983 4851 6247 -11135 -3287 13986 -6919 -356 13137 -1755 -12402 3803 4690
1464 4690 -9043 8844 6901 -6036 -615 8956 -5272 -6714 5999 -3287 3417 9084 -59 -7776
1478g776J3300n677q732J8623m950j1995J0838J1898k4966K146J8047j4008j403
1491d655J7585k547k2331J6303L920j4059N471P746o990q14J4606j4113k143M824
1505B803m427J721J0965n556j2298J8064n106j2388Q243P434j6270N286K1559
1518B0030j9554p404J3015j821j3984J5953L727j7497J0272O697r945n206J1502
1531E785j2024J204J6947q906q391P140J674j3966J3778J429j3235P143J0998
1544I576q043q516J0492j0194J309J1515l377p674P658J680j2664J2035k591r926
1558h720Q151J2070j2729k882J4180j6065k761J6630r70j7818J5494P950k0800
1571h270O962J0052j2434q503K2841k954j2569P709q38o953L274P680j1813N418
$$ plain form
1478 -7776 5524 -153 -8885 9738 4788 -7207 3631 15529 -9437 -7291 10756 -3252 -4655
1491 -4655 12930 10383 -11948 4355 8275 -5784 -313 7433 443 -371 14235 122 -2021 2803
1505 2803 -1624 97 11062 5506 -6792 11272 6166 -6222 2021 9455 -6815 -1529 20030
1518 20030 476 -6928 6087 4266 -9718 6235 9962 -7535 2737 9434 -511 -5717 5785
1531 5785 -6239 -5035 11912 3006 -5385 1755 3429 -10537 3241 4670 -8565 -1422 9576
1544 9576 1533 -6983 3509 -6685 -5376 6139 2762 -4912 2746 4426 -8238 3797 1206 -8720
1558 -8720 -569 11501 -1228 -4110 10070 -5995 -8756 7874 6904 -10914 4580 12530 -8270
1571 -8270 -1308 8744 -3690 -12193 10648 7694 -4875 2834 1996 -4957 -1683 5997 -5816 -398
1585c98M265m602K777j256q225j335J6025r670k503Q870n713p946J0598K155k0021
1600a6979J3405J0423j1532l583J3057r622j0785J7585l443p511O651O103j2638
1613h869N346O393j4133M851Q313m231m438J4262r023j0158J2912N78p655L777
$$ plain form
1585 -398 3867 -735 2042 786 -7439 -8774 7251 -2419 -4922 3948 -1765 -9711 887 3042 -16979
1600 -16979 -3574 6849 -4683 -8266 4791 -4831 -15616 1969 -1474 -8985 -2334 3769 -8869
1613 -8869 -3523 2870 -11263 -6412 1901 -2330 -6768 7494 -1529 -11687 1225 1803 -5852 -2075
$$ [...]
8191c7
##END NTUPLES=NMR FID
##END=
