##TITLE=1H_TG-2292-C
 CDCl3, 8 sc, 
 26.11.2020
##JCAMPDX= 6.0         $$ Bruker NMR JCAMP-DX V2.0
##DATA TYPE= NMR SPECTRUM
##DATA CLASS= NTUPLES
##ORIGIN= UXNMR, Bruker Analytische Messtechnik GmbH
##OWNER= root
$$ XWIN-NMR		Version 3.5
$$ Thu Nov 26 13:14:39 2020 Russian Standard Time (UT+4h)  she@DPX200
##.OBSERVE FREQUENCY= 200.1315066352
##.OBSERVE NUCLEUS= ^1H
##.ACQUISITION MODE= SIMULTANEOUS
##.ACQUISITION SCHEME= undefined
##.AVERAGES= 8
##.DIGITISER RES= 18
##SPECTROMETER/DATA SYSTEM= spect
##.PULSE SEQUENCE= zg30
##.SOLVENT NAME= CDCl3
##.SHIFT REFERENCE= (INTERNAL, CDCl3, 0, 16.0217)
##AUDIT TRAIL= $$ (NUMBER, WHEN, WHO, WHERE, WHAT)
$$ ##TITLE= Audit trail, XWIN-NMR		Version 3.5
$$ ##JCAMPDX= 5.01
$$ ##ORIGIN= Bruker BioSpin GmbH
$$ ##OWNER= she
$$ F:/spectra/data/she/nmr/H-F/1/pdata/1/auditp.txt
$$ ##AUDIT TRAIL=  $$ (NUMBER, WHEN, WHO, WHERE, WHAT)
(   1,<2020-11-26 13:12:33.60 +0400>,<she>,<DPX200>,
      <created by zg, POWCHK disabled, PULCHK disabled
       configuration hash MD5:
       00 E9 B6 7A A2 85 ED C7 34 08 36 98 17 FE 4E 26
       data hash MD5: 16K
       17 ED B4 CF B9 A5 C7 BB 0B 1A 07 23 C1 DC 62 D1>)
(   2,<2020-11-26 13:12:54.82 +0400>,<she>,<DPX200>,
      <Start of raw data processing
       efp BC_mod = 2 LB = 0.24 FT_mod = 6 PKNL = 1 PHC0 = -11049.11 PHC1 = 10.20088 SI = 16K 
       data hash MD5: 16K
       64 B8 ED B6 FF 47 D3 AA 0A 40 80 15 47 74 CA FF>)
(   3,<2020-11-26 13:13:19.43 +0400>,<she>,<DPX200>,
      <pk PHC0 = 4.011948 PHC1 = -4.2 
       data hash MD5: 16K
       46 71 CD 57 F9 15 97 AD DF C4 C9 ED AF C4 92 86>)
(   4,<2020-11-26 13:13:23.46 +0400>,<she>,<DPX200>,
      <abs ABSG = 5 
       data hash MD5: 16K
       60 28 2D 97 F9 99 44 57 29 C7 1B 68 05 B9 6B DD>)
(   5,<2020-11-26 13:13:45.79 +0400>,<she>,<DPX200>,
      <pk PHC0 = -0.6255063 PHC1 = 2 
       data hash MD5: 16K
       5D 1D 14 C7 CD 0A 6C 7C 8D B0 A9 D9 2F 36 B6 A0>)
(   6,<2020-11-26 13:13:48.87 +0400>,<she>,<DPX200>,
      <abs ABSG = 5 
       data hash MD5: 16K
       3A F8 1A 49 7F D8 72 52 C8 C9 6D 4A FB 24 78 BA>)
$$ ##END=
$$ 
$$ hash MD5
$$ 43 D0 67 E8 B6 19 0B 6F CC 48 00 81 4A 3E 82 F7
##$RELAX= 
##$RELAX= 
##$RELAX= 
##$RELAX= 
##$RELAX= 
##$RELAX= 
$$ Bruker specific parameters
$$ --------------------------
##$DU= <F:/spectra>
##$EXPNO= 1
##$NAME= <H-F>
##$PROCNO= 1
##$TYPE= <nmr>
##$USER= <she>
##$AMP= (0..31)
100 100 100 100 100 100 100 100 100 100 100 100 100 100 100 100 100 100 
100 100 100 100 100 100 100 100 100 100 100 100 100 100 
##$AQSEQ= 0
##$AQ_mod= 1
##$AUNM= <au_zg>
##$AUTOPOS= <>
##$BF1= 200.13
##$BF2= 200.13
##$BF3= 200.13
##$BF4= 200.13
##$BF5= 200.13
##$BF6= 200.13
##$BF7= 200.13
##$BF8= 200.13
##$BYTORDA= 1
##$CFDGTYP= 0
##$CFRGTYP= 5
##$CHEMSTR= <none>
##$CNST= (0..31)
1 1 145 1 1 1 1 1 1 1 1 1 1 1 1 1 1 1 1 1 1 1 1 1 1 1 1 1 1 1 1 1 
##$CPDPRG= <>
##$CPDPRG1= <>
##$CPDPRG2= <>
##$CPDPRG3= <>
##$CPDPRG4= <mlev>
##$CPDPRG5= <mlev>
##$CPDPRG6= <mlev>
##$CPDPRG7= <mlev>
##$CPDPRG8= <mlev>
$$ [...]
##$SUBNAM3= <"">
##$SUBNAM4= <"">
##$SUBNAM5= <"">
##$SUBNAM6= <"">
##$SUBNAM7= <"">
##$SUBNAM8= <"">
##$SUBNAM9= <"">
##$SW= 16.9725356469052
##$SWIBOX= (0..15)
0 0 2 0 0 0 0 0 0 0 0 0 0 0 0 0 
##$SW_h= 3396.73913043478
##$TD= 16384
##$TD0= 1
##$TE= 0
##$TE2= 300
##$TE3= 300
##$TEG= 300
##$TL= (0..7)
0 120 120 120 120 120 120 120 
##$TP= (0..7)
150 150 150 150 150 150 150 150 
##$TP07= 0
##$TPNAME0= <>
##$TPNAME1= <>
##$TPNAME2= <>
##$TPNAME3= <>
##$TPNAME4= <>
##$TPNAME5= <>
##$TPNAME6= <>
##$TPNAME7= <>
##$TPOAL= (0..7)
0.5 0.5 0.5 0.5 0.5 0.5 0.5 0.5 
##$TPOFFS= (0..7)
0 0 0 0 0 0 0 0 
##$TUNHIN= 0
##$TUNHOUT= 0
##$TUNXOUT= 0
##$USERA1= <user>
##$USERA2= <user>
##$USERA3= <user>
##$USERA4= <user>
##$USERA5= <user>
##$V9= 5
##$VALIST= <valist>
##$VCLIST= <CCCCCCCCCCCCCCC>
##$VD= 0
##$VDLIST= <DDDDDDDDDDDDDDD>
##$VPLIST= <PPPPPPPPPPPPPPP>
##$VTLIST= <TTTTTTTTTTTTTTT>
##$WBST= 1024
##$WBSW= 4
##$XGAIN= (0..3)
0 0 0 0 
##$XL= 0
##$YL= 0
##$YMAX_a= 765245
##$YMIN_a= -819052
##$ZGOPTNS= <>
##$ZL1= 120
##$ZL2= 120
##$ZL3= 120
##$ZL4= 120
##$ABSF1= 16.03308
##$ABSF2= -0.9395847
##$ABSG= 5
##$ABSL= 3
##$ALPHA= 0
##$AQORDER= 0
##$ASSFAC= 0
##$ASSFACI= 0
##$ASSFACX= 0
##$ASSWID= 0
##$AUNMP= <proc_1d>
##$AZFE= 0.1
##$AZFW= 0.1
##$BCFW= 0
##$BC_mod= 2
##$BYTORDP= 0
##$COROFFS= 0
##$CY= -3
##$DATMOD= 1
##$DC= 0
##$DFILT= <>
##$DTYPP= 0
##$F1P= 0
##$F2P= 0
##$FCOR= 1
##$FTSIZE= 16384
##$FT_mod= 6
##$GAMMA= 0
##$GB= 0
##$INTBC= 1
##$INTSCL= 2.992141e-10
##$ISEN= 128
##$LB= 0.24
##$LEV0= 0
##$LPBIN= 0
##$MAXI= 10000
##$MC2= 0
##$MEAN= 0
##$ME_mod= 0
##$MI= 1.114404
##$NCOEF= 0
##$NC_proc= -5
##$NLEV= 6
##$NOISF1= 3.799351
##$NOISF2= 2.8
##$NSP= 0
##$NTH_PI= 0
##$NZP= 0
##$OFFSET= 16.02168
##$PC= 1
##$PHC0= -11045.73
##$PHC1= 8.000879
##$PH_mod= 1
##$PKNL= yes
##$PPARMOD= 0
##$PSCAL= 0
##$PSIGN= 0
##$REVERSE= no
##$SF= 200.129998586442
##$SI= 16384
##$SIGF1= 3
##$SIGF2= 2
##$SINO= 5.538805
##$SIOLD= 16384
##$SREGLST= <1H.CDCl3>
##$SSB= 0
##$STSI= 16384
##$STSR= 0
##$SW_p= 3396.73913043478
##$SYMM= 0
##$S_DEV= 0
##$TDeff= 16384
##$TDoff= 0
##$TI= <>
##$TILT= no
##$TM1= 0
##$TM2= 0
##$TOPLEV= 0
##$USERP1= <user>
##$USERP2= <user>
##$USERP3= <user>
##$USERP4= <user>
##$USERP5= <user>
##$WDW= 1
##$XDIM= 16384
##$YMAX_p= 288727485
##$YMIN_p= -612242
$$ End of Bruker specific parameters
$$ ---------------------------------
##NTUPLES= NMR SPECTRUM
##VAR_NAME=  FREQUENCY,     SPECTRUM/REAL,   SPECTRUM/IMAG
##SYMBOL=    X,             R,               I
##VAR_TYPE=  INDEPENDENT,   DEPENDENT,       DEPENDENT
##VAR_FORM=  AFFN,          ASDF,            ASDF
##VAR_DIM=   16384,         16384,           16384
##UNITS=     HZ,            ARBITRARY UNITS, ARBITRARY UNITS
##FACTOR=    0.207333158178281, 1,           1
##FIRST=     3206.41896224241, 0,            0
##LAST=      -190.320168192371, 0,           0
##MIN=       -190.320168192371, -612242,     0
##MAX=       3206.41896224241, 288727485,    0
$$ Real data points
##PAGE= N=1
##DATA TABLE= (X++(R..R)), XYDATA
$$ [...]
8139 8878418 9131193 9543027 9897195 10083355 10379417 10731113 10963008 11319182 11653531 12020297
8129 12020297 12538875 12993392 13462280 13975240 14432566 14993666 15672594 16280977 16805652
8120 16805652 17463473 18076105 18693804 19341878 19949146 20618795 21532712 22639491 23860875
8111 23860875 25085352 26537215 28081998 29788745 31553390 33671874 35748768 37854056
8103 37854056 40067311 42418793 44857602 47020361 48524638 49916545 50918015 51129925
8095 51129925 50759682 49777419 48967828 48460288 48316680 48061168 47915266 47832111 47802476 47754646
8085 47754646 47627964 47644913 47780231 47859089 48054623 48466455 49181653 50149946 51347457 52699934
8075 52699934 54301803 56042340 58072468 60353766 62848789 65985181 69389912 72777039
8067 72777039 76575692 80519449 84510359 88199759 90966567 92651859 93301932 92740972
8059 92740972 91332449 89395208 87266110 85245298 83094422 80559412 77921919 74983860
8051 74983860 72017674 69732256 67468650 65336520 63392352 61452166 59936895 58909578
8043 58909578 57873836 56884290 56054980 55445516 54959665 54790095 54851234 55321372 56030515
8034 56030515 56982885 58027307 59059584 60029577 61157067 61900290 62677942 63993616 65264546
8025 65264546 66261616 67032878 66868403 66259813 64834424 62596791 59900350 56838669 53867563
8016 53867563 51146500 48631877 46411780 44508555 42717137 41127905 39540604 37935466
8008 37935466 36549749 35316779 34234508 33256718 32379499 31512156 30642208 30040572 29233114
7999 29233114 28654663 28098027 27501297 26902924 26336281 25999191 25617815 25075269 24738067
7990 24738067 24356160 23929030 23735582 23525417 23306987 23323132 23401346 23636281 24082596 24703170
7980 24703170 25382064 26483470 27920581 29926832 32663292 36388547 41754104 47444810
7972 47444810 44955224 37257577 31699483 28190456 25907813 23933326 22459704 21220729
7964 21220729 20236343 19421903 18880382 18257028 17760910 17473765 17099351 16858336 16693899
7955 16693899 16635036 16735810 16779185 16849957 17007183 17272869 17604479 18192635 18869734 19565236
7945 19565236 20298801 21258218 22570354 23868749 25364296 26877982 28362580 29899076
7937 29899076 31479485 32978047 34168734 35369159 36397446 37181558 37418590 37177645 36349550
7928 36349550 35575786 34850320 34118295 32981543 31668720 30309153 29107577 28227358 27322072
7919 27322072 26583324 26042460 25449984 25099250 25046192 25038836 25118035 25469766 25858390 26330493
7909 26330493 27132549 27951333 28945020 30035797 30996440 31964518 33180414 34490023 36076361
7900 36076361 37861846 39297342 40698705 41752144 41996533 41654668 40757962 39326953 37653113
7891 37653113 35932969 34521504 33255952 32053576 31129751 30396170 29737031 28929575 28105059
7882 28105059 27346333 26632507 25914338 25355590 25023724 24587499 24200979 23753378 23314184
7873 23314184 22946659 22797835 22620122 22384546 22329038 22328569 22222980 22259353 22273295 22222855 22197782
7862 22197782 22313002 22213541 21854477 21483614 20952224 20547157 20279441 19749184 19355960 18941840
7852 18941840 18396029 17897158 17620453 17359842 16926357 16732440 16632810 16499416 16353732 16334587
7842 16334587 16152758 15906383 15494050 14951082 14412176 13879685 13288756 12705641 11985789
7833 11985789 11362098 10816020 10393108 9899782 9329919 9038758 8706833 8310733 8124364
7824 8124364 7831314 7591196 7470326 7369059 7218499 7038627 7070368 7033177 7010879 6982329
7814 6982329 6969890 7039736 6966162 6986310 6994712 6871200 6792688 6762034 6604366 6457005 6156095
7803 6156095 5908962 5811980 5526020 5299713 5143869 4823812 4670554 4453939 4174208 4017742
7793 4017742 3840853 3649607 3635947 3448549 3306756 3157806 3081820 3029176 3016076 2957017
7783 2957017 2887299 2971816 2765773 2623078 2609288 2549335 2518285 2445411 2331338 2251423 2116092
7772 2116092 2028415 2081281 1867452 1650626 1749386 1716493 1739068 1637736 1529319 1468111 1383107
7761 1383107 1325199 1281012 1260043 1201738 1262768 1341372 1239294 1347547 1299623 1037790 1096196
7750 1096196 1107491 1004495 994410 933762 902640 850696 845495 956588 911034 845241 828537
7739 828537 782322 772559 821259 756238 681426 639960 624855 637058 693950 727650 633844 672785
7727 672785 602577 554390 696495 637993 650652 588483 656984 732518 657932 722461 696232
7716 696232 640037 680025 814933 730768 687713 741015 773391 732029 640118 580057 589669 668271
7704 668271 680843 619164 630399 663092 675192 620842 591935 608081 645639 686798 650178 519777
7692 519777 535083 553758 438434 530909 518780 481675 567194 583123 599457 547624 571011
7681 571011 601196 615867 548649 458241 431025 511991 597234 618953 643002 642035 684922 785082
7669 785082 716660 723529 647791 544109 669205 658669 588619 559742 580912 602893 669621
7658 669621 677556 481513 487976 593487 466388 476764 453655 361781 439059 442204 417612 363835
7646 363835 329504 392452 478387 394494 357412 361661 352042 267472 364183 363952 233338 349194
7634 349194 332370 338450 436567 403893 391299 426721 401528 345292 267124 304912 315523 223172
7622 223172 287023 194237 118396 154078 90539 150164 248686 247528 115407 133362 146699 172093
7610 172093 304670 295853 126668 141709 133130 163903 160936 161130 137243 218354 156681 162493
7598 162493 155809 97288 101009 95744 153251 58263 -19663 -22157 -73974 -64265 -43307 -35851 -62156
7585 -62156 -72025 90549 157727 126484 -24344 -6556 30580 33609 9058 -11362 42895 100866
7573 100866 143027 46228 -51737 23421 2576 28519 122879 -4452 -11192 -59604 -73923 43668
7561 43668 61451 8561 38704 57959 23093 60104 62422 -43138 48102 104508 123963 80806
7549 80806 49729 157822 102591 116508 215914 189793 93707 93931 68705 62747 61774 -42353
7537 -42353 -28637 -24723 -84267 36252 56946 -15304 -16926 6313 -46218 52031 133435 629
7525 629 12073 41827 -20695 73713 30285 -21482 182335 121095 56661 87584 146593 112675
7513 112675 183107 208719 144683 181411 216438 221390 193287 148580 91155 140997 132165 113360
7501 113360 126286 -1718 -4212 66447 56286 115687 80673 73532 109056 -18567 -60470 -95568
7489 -95568 -93619 37245 49022 66479 62599 25597 4046 31440 43742 84833 130555 167236
7477 167236 77208 58575 38110 -11398 112912 121768 28439 24400 -47757 -36467 71813 78178
7465 78178 133543 133794 82263 176278 115403 82341 29489 34101 81789 -1573 55204 87336
7453 87336 48627 64085 36328 70297 -64275 -19903 -65961 -127982 -122662 -218510 -163035 -174313
7441 -174313 -176008 -104412 -75300 -23367 -120494 -133716 -103262 -100502 -149653 -158282 -99053 -192704
7429 -192704 -194305 -104363 -87000 -121846 -89419 -64577 -107042 -60004 -54221 -151229 -74741 -46010
7417 -46010 -66994 -36150 -87684 -186685 -131601 -36049 -46239 -113342 -87913 -84787 -118546 -159141
7405 -159141 -118268 -98003 -123519 -234964 -235723 -202958 -188971 -254725 -182367 -79534 -139321 -151189
7393 -151189 -222017 -216309 -115030 -201931 -242600 -331697 -347004 -174774 -180106 -211167 -235841 -239164
7381 -239164 -113789 -110482 -165393 -272542 -292756 -226817 -162368 -121411 -195489 -278111 -182720
7370 -182720 -187043 -168550 -135549 -212016 -241744 -145337 -128027 -230746 -219247 -151513 -158630 -139093
7358 -139093 -81159 -178520 -216791 -35816 -34598 -103525 -104997 -189526 -148109 -92137 -112492 -200230
7346 -200230 -152251 -182380 -214991 -108505 -116026 -163735 -190542 -192467 -131439 -174904 -151535 -205488
7334 -205488 -308225 -278205 -210915 -199353 -287290 -301654 -275436 -255974 -270704 -362109 -381728
7323 -381728 -287371 -148229 -119843 -167856 -205560 -186228 -164746 -153540 -123941 -148571 -202123
7312 -202123 -173789 -158275 -53271 -93865 -229950 -225504 -204855 -183087 -129437 -170976 -244944
7301 -244944 -293795 -242041 -255939 -236171 -208938 -225359 -127520 -157492 -193488 -125421 -145609 -181799
7289 -181799 -216913 -203446 -93642 -74995 -147877 -161686 -106800 -107472 -248005 -205767 -111233 -208420
7277 -208420 -189296 -223567 -256571 -209199 -210275 -249464 -172791 -239810 -264601 -208599 -210633 -318197
7265 -318197 -189510 -237745 -272946 -261097 -196995 -173144 -140147 -135703 -145475 -135310 -194175 -187839
7253 -187839 -207262 -150880 -180980 -127781 -113558 -188164 -221423 -217452 -179288 -143990 -187090 -187991
7241 -187991 -263211 -241542 -254987 -240618 -247790 -296937 -242432 -180295 -146920 -89097 -119190 -177418
7229 -177418 -183569 -167023 -220598 -239433 -266052 -271320 -234443 -294982 -190343 -156085 -273894 -185138
7217 -185138 -124373 -127740 -198308 -176849 -228575 -355354 -261117 -272292 -272719 -239094 -275305 -183077
7205 -183077 -159843 -205050 -236629 -181023 -156050 -146099 -218846 -206682 -314625 -284173 -234622 -175238
7193 -175238 -173393 -164377 -195487 -253346 -225779 -230131 -170223 -228172 -169295 -117164 -171504 -199799
7181 -199799 -267088 -260321 -212324 -163432 -167723 -233398 -102695 -179784 -219288 -165246 -220173 -280333
7169 -280333 -257709 -284299 -238637 -198433 -272295 -189940 -107833 -167501 -130422 -146610 -191188 -297699
7157 -297699 -200523 -194340 -179250 -182958 -241819 -217499 -176549 -288543 -256165 -163775 -103922 -15471
7145 -15471 -84145 -265388 -250160 -185028 -246776 -247815 -161164 -218798 -269158 -199705 -134843 -136017
7133 -136017 -212784 -189693 -190547 -180311 -259897 -230753 -273290 -377740 -287720 -158259 -191590 -208020
7121 -208020 -73179 -46720 -86404 -100194 -166551 -176976 -215963 -294719 -240757 -192060 -218713
7110 -218713 -157017 -187371 -249275 -257081 -211487 -240007 -300157 -201394 -159257 -109346 -182322 -325956
7098 -325956 -273265 -189306 -167307 -204667 -240285 -247083 -154915 -191205 -273057 -234516 -193873 -226730
7086 -226730 -162278 -154618 -245092 -280538 -227718 -216964 -188410 -162220 -226975 -75554 -102556 -156625
7074 -156625 -64619 -144133 -255678 -270196 -159167 -216311 -245784 -197247 -108884 -81750 -167986
7063 -167986 -237497 -227869 -148731 -265357 -146256 -170160 -341612 -158474 -241945 -279350 -220529
7052 -220529 -182844 -150031 -122593 -103265 -140927 -231636 -203094 -162301 -142704 -80239 -169712 -160921
7040 -160921 -162624 -119685 -132001 -161075 -256416 -179022 -63410 -96898 -154837 -279269 -250910
7029 -250910 -183243 -221124 -241917 -193863 -168927 -204057 -179586 -145362 -129987 -44073 -125209 -166254
7017 -166254 -45254 -122506 -184024 -210017 -195795 -182005 -106285 -67387 -148249 -187613 -91831
7006 -91831 -99689 -178221 -111420 -70497 -186249 -195685 -138298 -189245 -198326 -153697 -51365 21893
6994 21893 -7718 -112888 -200837 -207726 -161353 -59390 7920 -23929 -103990 -176766 -121644 -172149
6982 -172149 -181546 -137375 -96187 -227523 -301266 -235098 -189986 -109081 -155572 -277931 -190508
6971 -190508 -210566 -165339 -108310 -68332 -108044 -201311 -163369 -109374 -136710 -189066 -86734
6960 -86734 -32021 -154035 -112247 -60908 -198711 -162797 -94643 -113726 -144977 -210863 -182190
6949 -182190 -97815 -46609 -105800 -123637 -124373 -112869 -1941 40981 24897 -28538 -28111 -78158
6937 -78158 -118206 -111790 -40995 -48766 -61461 -23442 34583 -14366 -39144 672 102401 125477
6925 125477 47761 107449 96670 272348 373765 394148 344083 439019 585337 498561 441202
6914 441202 366192 215553 120107 109776 12704 77762 27886 60473 57836 -56279 -81157
6903 -81157 -61059 -14790 6281 43328 30418 -8988 -28456 -41665 -80332 -135500 -209534 -310208
6891 -310208 -154007 -68034 -57077 -84505 -123729 -169748 -145332 -67267 -123760 -57606 -12136
6880 -12136 -192979 -154578 -194719 -168565 -134661 -84429 -101943 -155623 -48436 -16159 -58219
6869 -58219 -82634 -59386 19008 -52960 -159605 -189548 -152865 -188286 -226020 -120568 -130711
6858 -130711 -222720 -267345 -183824 -171101 -221039 -180241 -121627 -146275 -152511 -155759 -120878 -208368
6846 -208368 -165946 -78976 -51731 -74400 -16146 30283 -78513 -202662 -131427 -113696 -137009
6835 -137009 -174379 -147294 -122339 -120271 -114402 -124958 -178636 -195597 -175745 -125204 -182407 -163113
6823 -163113 -123419 -116500 -131405 -106514 -117211 -110707 -65061 -84409 -120821 -121501 -69747 -77057 -145895
6810 -145895 -90015 -102796 -73304 -26618 -33166 -45833 -20649 -51166 -90215 -32679 -107990 -153235
6798 -153235 -64293 -70146 -145866 -78080 -137803 -119295 -145658 -137133 -159134 -176520 -133826 -163863
6786 -163863 -84973 -127207 -206799 -97914 -103713 -134298 -127383 -80582 -105157 -94618 -130643 -112634
6774 -112634 -128877 -65152 -258 -85799 -72983 -171976 -171741 -103338 -103669 -83704 -160022 -224458
6762 -224458 -80259 -66362 -42125 -50421 -212721 -217891 -126402 -61519 -31424 -12876 -116862
6751 -116862 -40859 103518 -145596 -188089 -68331 -195744 -94690 -56337 -123715 -96394 -34843
6740 -34843 -26917 -38664 28683 -53007 -49998 -52453 -116981 -65263 -33317 -150454 -162425 -87492
6728 -87492 -111205 -135491 -94162 -48185 -49172 479 24887 -71471 -45891 57623 13144 2811
6716 2811 3964 -15012 15140 -19663 -9308 53065 -182 14437 139901 101159 -109455 -24414
6704 -24414 -33071 -101143 -5737 -58553 159971 164679 28936 138228 177639 80722 14764 68553
6692 68553 -6928 6514 190623 104301 -21616 36859 9683 75514 -26350 -78247 27689
6681 27689 86051 61506 85749 182224 217152 225008 279510 359472 339649 379614 379452 435145
6669 435145 530774 416987 354611 397549 358744 485550 416077 311978 370224 291806 271382
6658 271382 210178 188000 160274 97115 156501 75992 77672 154322 95777 106855 7762 93074
6646 93074 136126 50588 -78032 46001 51072 -7039 -59832 -69235 125871 115506 50427 84635
6634 84635 77979 7620 -55414 52243 94675 -40515 59394 -24580 -126505 -8317 24758
6623 24758 8361 72494 75333 35502 22568 -15141 -128491 -34433 71442 19567 10132 42604
6611 42604 41040 85107 54689 -2689 40146 97722 113797 24375 26836 96734 53554 -3152
6599 -3152 -1726 10869 -79367 -57896 -2560 -43409 -61979 56493 13432 -9189 72721 -17312
6587 -17312 -81388 8872 5904 96101 152324 40277 -44272 19201 -20291 92476 173609 77203
6575 77203 4356 -12071 88910 -12910 19181 70980 -20211 23523 60913 -20016 -49537
6564 -49537 -23603 -120971 -27338 153679 53515 44639 32841 59113 131408 100972 90836 25410
6552 25410 71777 96548 60843 107425 90384 19078 70298 102138 -25312 -75813 2583 15643
6540 15643 -55375 13984 75489 -77179 -140137 25481 19935 40130 30031 -46326 35852 153527
6528 153527 130082 127078 178716 132391 38915 67857 -20761 -102449 51353 120730 -8590
6517 -8590 43177 41834 -59419 -6030 -18268 -48528 42863 47142 24974 -5028 -34029 -25371
6505 -25371 -17454 65164 51030 22070 -7400 -18970 43866 2932 57704 25936 -2417 107576
6493 107576 51873 26091 72940 44307 9969 74712 91465 18408 -6122 133140 134129 -32890
6481 -32890 40851 75106 27568 117659 143071 39388 113668 157886 61018 127921 205203 143761
6469 143761 62171 148216 82411 162931 200689 16973 57917 99476 137959 81430 63966
6458 63966 147075 96486 120320 77851 15822 75157 56222 2766 -8828 62780 14584 17324
6446 17324 38341 44373 96468 135935 109255 121176 183657 235578 298959 173812 113916 147634
6434 147634 185083 296025 303576 266024 388400 396801 229214 269727 203273 155091 222685
6423 222685 158568 136886 267505 336617 153486 213074 284984 224232 249891 338094 292896
6412 292896 240687 289677 216711 128136 251756 256188 251313 307544 326043 312187 363486 395783
6400 395783 248260 332197 372737 344209 299977 393208 495035 393790 411277 414140 476022
6389 476022 476894 443731 403775 466252 529510 491126 573424 595703 508374 427860 501386 561005
6377 561005 490455 562362 569621 524576 520013 580782 519161 501180 550049 558132 607446 532828
6365 532828 531844 492121 487326 447154 487378 664345 718265 772930 702524 686923 646842 731307
6353 731307 789377 715405 730998 746182 904311 913876 840192 767993 862850 927107 939379 900487
6341 900487 930188 1055100 975961 941164 1047390 1042922 1042536 1114546 1156577 1172874 1234737 1314996
6329 1314996 1364611 1407235 1518496 1450197 1423474 1547426 1516043 1645193 1627613 1646056 1804297
6318 1804297 1750832 1869346 1831479 1978190 2116078 2200835 2182484 2110009 2225192 2426449
6308 2426449 2432337 2371948 2515911 2569394 2789622 2810623 2841452 2918547 3000436 3209666 3326254
6297 3326254 3465348 3609290 3652618 3864456 3895338 4045809 4240494 4390573 4685448 4859612
6287 4859612 5046258 5388809 5451120 5601358 5919534 6074109 6300214 6456944 6680138 6937560
6277 6937560 7290106 7600918 7768968 8147580 8613440 9001293 9433232 9869535 10401261 11056465
6267 11056465 11729936 12459085 13244259 14181097 15407266 16531809 17742229 19346167 21110935
6258 21110935 23308756 25976520 29090056 32580414 36469042 40774935 45650920 51469227
6250 51469227 57871901 64366333 70787093 75879429 79034209 79702159 77654005 73853797
6242 73853797 68528191 62673858 56676393 50728375 45121560 40159908 36080782 32844368
6234 32844368 29978167 27572493 25369796 23069216 21106816 19443880 18020684 16855160
6226 16855160 15795232 14879444 14216282 13611264 13060816 12486321 12249127 12072770 11917298
6217 11917298 11916191 11849899 12000042 12135693 12055482 12103397 12009797 11692226 11245292 10805576
6207 10805576 10269313 9656113 9121462 8644376 8162924 7737338 7385579 6923772 6520192
6198 6520192 6123527 5858117 5667957 5350507 5083451 4894017 4657963 4430415 4196915 4008675
6188 4008675 3886391 3800685 3640167 3520701 3397402 3312294 3324721 3278476 3166566 3117634
6178 3117634 3071208 2985507 3024264 2989997 2873070 2929802 2835009 2850365 2882053 2844372 2770129
6167 2770129 2794918 2822753 2847144 2847196 2828137 2786579 2871449 2995659 2970012 3026349 3057869 3203444
6155 3203444 3330500 3506917 3707480 3923348 4192342 4554946 4754143 5064395 5493196 5904595
6145 5904595 6089359 6238281 6297378 6164309 5996442 5597451 5209253 4987838 4666619 4265658
6135 4265658 3980785 3625267 3207267 3064939 2858679 2517509 2355073 2318137 2018597 1845929
6125 1845929 1840120 1765098 1657694 1623901 1471165 1313684 1226348 1025722 954430 944948 894802
6114 894802 841115 790304 788892 757967 776286 681085 563614 683027 651657 597137 542823
6103 542823 495337 596381 674487 572692 638925 606073 536247 605550 512771 399946 473369
6092 473369 581797 539392 448862 518017 471675 321648 361776 430293 348369 352482 375825
6081 375825 418573 306088 268921 286421 178600 223050 287056 304566 306001 223233 265703
6070 265703 269235 220807 217189 210183 315383 364506 298025 278955 302129 303542 336627 314995
6058 314995 246802 300664 337164 247078 125978 221412 153481 150022 265242 136899 111903
6047 111903 109482 54946 92536 180684 126734 224368 183565 161440 112254 181641 209795 207350
6035 207350 310610 286946 210202 115260 144578 296923 166455 118055 171754 32279 7414
6024 7414 2027 -41821 -38949 -39234 -23627 69468 14435 -7412 26470 7559 -134648 -11729
6012 -11729 40051 -58807 33102 35549 -44026 -145593 -67121 88087 88657 124403 237251 133530
6000 133530 109747 81239 13389 40927 102504 123942 74581 93370 6170 -35393 -31175 33656
5988 33656 150533 133915 -15397 14474 76271 42090 -89117 -70623 44966 -45941 -52906
5977 -52906 34846 77388 45338 33571 113901 141103 103932 100284 61599 83422 102596 112182
5965 112182 174689 101592 94713 138306 47796 103579 55637 79351 66873 122402 142567 55596
5953 55596 82934 93486 41740 -20212 -20488 -20165 37482 -9964 90271 25071 -104072 -6565
5941 -6565 33010 109467 54966 -3367 26834 -143820 -93234 7741 -24752 -98203 -54169 -39472
5929 -39472 -4595 -204499 -173799 -99109 -260974 -163992 -1334 -58188 -207641 -105650 -100113
5918 -100113 -84933 -65959 -139687 -114088 -36548 50016 18002 -71952 -36885 90391 108216
5907 108216 93755 45377 4444 45588 118674 131219 25046 -36188 71265 142294 10006
5896 10006 -29172 -111684 -61875 -32130 -61017 -107509 -65043 -92513 -97452 -52031 56390 11783
5884 11783 2302 131663 137594 95674 19263 -148578 -91374 -88032 -16897 28320 -64454 -66100
5872 -66100 -82395 -125992 -221852 -172908 -188234 -112335 -104221 -81609 -45127 -103951 -171743 -47072
5860 -47072 -15735 -22472 -38908 -223908 -197927 -106562 -70312 -72354 -91490 -20621 -121772 -128749
5848 -128749 -133848 -143750 -139890 -146281 -124024 -184893 -174672 -127095 -119612 -114919 -52141 -45980 -33332
5835 -33332 -5444 -32799 -3729 30668 -117705 -151297 -26789 66335 84771 115251 56163
5824 56163 65155 217808 175376 217252 309750 296593 229950 169026 106936 50847 24664 31215
5812 31215 90755 10082 4528 93129 99562 95409 99164 -29382 -28481 -47945 -37448 31597 -56791
5799 -56791 -106964 2799 -24217 -79360 -15892 17092 13707 -7760 -114611 -197585 -174347 -221291
5787 -221291 -191804 -234606 -302871 -299916 -251230 -211445 -231272 -165067 -147888 -124522 -120970 -137189
5775 -137189 -92439 -79497 -105419 -194399 -204474 -210663 -228706 -256617 -245917 -188231 -100223 -112415
5763 -112415 -122884 -203136 -209064 -221313 -248777 -220764 -242662 -217449 -259049 -317884 -125156 -100667
5751 -100667 -200692 -137328 -169689 -140107 -78253 -198199 -333765 -288357 -167660 -274661 -234033
5740 -234033 -165468 -223938 -160861 -133042 -250280 -305784 -250248 -312232 -250877 -246256 -280174 -272652
5728 -272652 -252061 -353987 -308679 -146482 -198608 -106958 -122803 -151341 -189824 -95289 -49897
5717 -49897 -154519 -138032 -145955 -110546 -137790 -96369 -128139 -219920 -186130 -33785 -112600 -217900
5705 -217900 -207487 -291795 -273514 -244594 -301212 -404048 -359923 -234344 -193040 -186695 -246599
5694 -246599 -196014 -69265 -117592 -159847 -137092 -228152 -309020 -192330 -191733 -194157 -115583 -12623
5682 -12623 -161158 -172327 -43130 -163976 -175869 -110478 -148936 -219890 -261201 -305844 -231535
5671 -231535 -209114 -225254 -215688 -77564 -123125 -136065 -146218 -283801 -221372 -121022 -82850
5660 -82850 -135451 -158905 2715 1121 -129136 -69720 -1206 -137979 -84236 4502 11674 47062
5648 47062 65526 34295 32657 125628 72393 118550 190073 232454 366082 451646 383164 479212
5636 479212 501445 490459 508675 422049 495307 348668 381341 306751 183693 251026 300443
5625 300443 202951 130368 153512 99998 75312 61944 12944 -26049 -35124 -92682 -170853 -80599
5613 -80599 -53811 -28216 29047 -67503 -136204 -103662 -121496 -133288 -131675 -79784 -86988 -19283
5601 -19283 10256 -51905 -82697 -109052 -26707 69012 -13609 -108931 -102072 -61512 51621 24879
5589 24879 -9328 43938 51602 87818 36993 -65497 -56702 -923 129047 -12772 12223 236
5577 236 -124119 -103364 -52786 -126629 -74855 22789 34779 -97757 -78996 36111 27717 118569
5565 118569 87459 -10297 98730 120011 47684 66051 95655 77064 223827 207971 66046
5554 66046 86254 49372 -51715 18432 132138 108338 58230 72710 9957 32721 7971
5543 7971 61556 82370 159220 60668 49544 -63989 -20219 83667 58873 164675 123283
5532 123283 128336 62863 77410 118305 186641 237821 212084 187184 245193 119443 105356 136938
5520 136938 163061 253873 209091 219102 226787 130526 174344 160693 163736 104012 144761 273150
5508 273150 255481 206650 187531 271688 337567 275161 347512 323459 321073 368791 360673 319124
5496 319124 440823 431557 292396 252947 360969 323142 304742 316713 384440 348961 372986
5485 372986 370472 319339 296531 221170 286563 423059 331824 244771 420031 406106 426916
5474 426916 448910 402341 307851 286562 360974 400874 405675 398439 397859 402224 268068 335360
5462 335360 473687 325408 345596 489752 388969 432308 550446 503887 452339 406857 513605
5451 513605 504939 436863 433918 496344 584065 569335 600686 539522 407567 423304 448216 334425
5439 334425 351135 377357 458192 420995 502676 504806 524790 585332 609646 642529 680795 671225
5427 671225 682796 726210 536673 514952 685623 730013 717689 692819 700137 595012 588521
5416 588521 525289 512372 641772 507172 447658 589801 534136 494746 591716 581698 636548
5405 636548 704096 708296 593207 611241 705492 698746 733860 799006 741485 756315 743009 764372
5393 764372 768272 776773 921860 998487 915745 925501 912333 882457 804004 850464 865519 766571
5381 766571 722087 841812 845685 855582 806659 888253 912984 828363 934750 915838 800289
5370 800289 870432 997126 987646 926110 959225 908023 956435 1031095 917266 1055796 1190410
5359 1190410 1093682 1034775 1055228 1097352 1118131 1023956 911151 907878 957281 871635 861865 992253
5347 992253 1024365 926499 970529 1076086 1011048 931442 939503 967365 1005956 962440 1032034 974414
5335 974414 968868 983988 1068432 1012893 1017974 1039873 1136284 1123803 1063798 1039387 1013500 932002
5323 932002 962998 1007224 982827 982714 1056982 1036386 972660 1083886 1117639 1039568 1027829 1062095
5311 1062095 1057956 1090038 1145775 1049679 1065875 1083622 1164279 1171809 1071272 1195887 1290375
5300 1290375 1243020 1111309 1130593 1165649 1160255 1150094 1196437 1168901 1108957 1142168 1172119
5289 1172119 1157703 1165156 1292221 1342507 1300416 1246620 1167730 1112905 1063484 1126868 1222574
5278 1222574 1250947 1146076 1201129 1279583 1240623 1214071 1162968 1238267 1381309 1338706 1313959
5267 1313959 1194917 1186405 1287052 1315812 1272144 1427094 1424042 1347762 1378135 1332750 1293679
5256 1293679 1318457 1296676 1328940 1247804 1234157 1326030 1346895 1309335 1444399 1478720 1403242
5245 1403242 1358750 1428500 1459293 1468216 1544671 1584941 1659820 1599014 1449329 1594211 1670478
5234 1670478 1616885 1759345 1753602 1648616 1703349 1790267 1767896 1725418 1923409 1968337 1827480
5223 1827480 2001059 1958444 1947392 2073822 2078558 2079531 2048504 2119632 2308361 2221505 2173813
5212 2173813 2228019 2401583 2262244 2211658 2412404 2443860 2473113 2587945 2515936 2603948 2650007
5201 2650007 2691932 2870298 2823812 2883786 2956270 2938309 2991788 3076752 3160617 3170120 3234572
5190 3234572 3376813 3433897 3550507 3619328 3744859 3875361 3863207 3926839 4076061 4130738
5180 4130738 4274358 4384819 4401004 4527059 4665448 4914172 5001550 5113947 5420050 5489545
5170 5489545 5649927 5954988 6203512 6508286 6829577 7104028 7506322 7946029 8513740 9106779
5160 9106779 9763679 10461423 11399051 12573229 13494656 14620167 16244865 17910471 19649308
5151 19649308 21511611 23208548 24429740 25144041 25405966 25234039 24905051 24703157 24469782
5142 24469782 24297839 24384762 24784624 25458706 26161504 26779988 27122627 26927123 25915479
5133 25915479 24404721 22864251 21324384 19741094 18359566 16986884 15664575 14791371
5125 14791371 14046554 13427531 12963771 12565230 12063566 11521897 11242606 11094529 10860669
5116 10860669 10744533 10752913 10757954 10929856 11115882 11371302 11633952 11952910 12243981 12758018
5106 12758018 13529495 14280128 15357990 16647583 17778375 19085625 20757503 22630324
5098 22630324 24795093 27134649 29332599 31315845 32706769 33651059 33674019 33172978 32722549
5089 32722549 32280464 31848543 31596395 31604212 31980447 32866038 33770658 34380084 34422045 33541391
5079 33541391 31937148 29783089 27533926 25409652 23452781 21323747 19288217 17614388
5071 17614388 16231229 15059222 14036953 13207464 12351408 11514371 10848185 10267290 9666029
5062 9666029 9247672 8847913 8407261 8026647 7715591 7528987 7290531 6998444 6814263 6489699
5052 6489699 6287823 6172638 6109846 5967370 5869331 5845830 5697250 5598855 5660249 5458694
5042 5458694 5429960 5457440 5460357 5460228 5391239 5363702 5454089 5395020 5348453 5433793 5486588 5337377
5030 5337377 5262040 5277151 5153491 5116920 5096547 5012957 5042777 5066068 5131431 5077066 5036707
5019 5036707 4996254 5082875 5131615 5160210 5149208 5192197 5274564 5339318 5431422 5439069 5513091 5511933
5007 5511933 5556168 5672904 5766056 5866302 5972066 5988233 6115952 6272257 6323717 6266012
4997 6266012 6316771 6444782 6543305 6676590 6787161 6746091 6786599 6888886 7001522 7156105
4987 7156105 7262075 7287061 7444251 7626935 7711838 7794458 7890316 7915380 8113382 8420770
4977 8420770 8425762 8504766 8722209 8731729 8838235 9007032 9099099 9247073 9445560 9557258 9673157
4966 9673157 9728441 9975718 10211601 10465923 10612048 10841691 11130760 11405906 11637453 11942855
4956 11942855 12243940 12576901 13037153 13419948 13813527 14232206 14787764 15310983 15670462
4947 15670462 16244920 16858778 17362151 17934382 18579309 19081222 19543968 20022269 20315395
4938 20315395 20649115 20915991 21182464 21245582 21274133 21292706 21211855 21111536 20911449 20907820
4928 20907820 20915509 20701052 20545174 20440182 20356817 20147105 20006062 19910538 19749425 19579105
4918 19579105 19575486 19417364 19368436 19371479 19335367 19463401 19464836 19576828 19718609 19821858 19935547
4907 19935547 19870894 19894962 19757629 19607492 19503898 19327127 19153532 19104848 19194255 19177151
4897 19177151 19194563 19442001 19645231 19847405 20214520 20395210 20665987 20923558 21161582 21484735
4887 21484735 21710150 21740105 21737214 21735328 21710478 21543478 21411893 21217303 21012354 20943354 20866734
4876 20866734 20741496 20624267 20600133 20614259 20596799 20499516 20400059 20420108 20505175 20588561 20621459
4865 20621459 20610841 20490029 20330498 19948569 19403615 18915555 18391638 17883691 17432761 16910201
4855 16910201 16271825 15735797 15366054 14863160 14460072 14098001 13679164 13435960 13163639
4846 13163639 12851472 12565065 12263757 12035868 11850858 11619257 11318201 11154539 11104314 10999805
4836 10999805 10876511 10653589 10531118 10472455 10419796 10209882 10070294 9931222 9833258 9793937
4826 9793937 9707178 9594291 9571628 9560691 9466345 9419217 9459451 9432129 9386318 9397889 9426789
4815 9426789 9531076 9634740 9724844 9889566 10059689 10145053 10337344 10520228 10834848 11168662
4805 11168662 11509265 11850628 12399665 13182070 13822090 14422769 14982569 15719715 16531637
4796 16531637 17413130 18509617 19813401 21264221 22657706 23954626 25090608 25657323
4788 25657323 25981341 26166672 25926545 25164084 24280037 23516615 22868893 22285168 21580789
4779 21580789 20666977 19867723 19203437 18716879 18626824 18710847 18763385 19020431 19181910 19276874
4769 19276874 19651878 20136052 20852849 21855400 23182656 24264043 25479009 26776364 27523508
4760 27523508 27765845 27638556 27405047 26870983 25889887 24737544 23915522 23264265 22565220
4751 22565220 21677978 20675826 19637585 18959831 18756961 18497529 18300811 18258689 18345422
4742 18345422 18311069 18380572 18715692 19293566 19941915 20686277 21295361 21831444 21987374 21887495
4732 21887495 21719399 21226986 20388330 19602168 18798234 18310207 17825459 17116982 16409391
4723 16409391 15697602 15171814 14830696 14674195 14560053 14659078 14867569 14803726 14850091 15142884
4713 15142884 15367697 15968066 16865310 17606074 18409903 19445978 20254767 20588264 20565132
4704 20565132 20372609 20099413 19559406 18616299 17632982 16808750 16089559 15241993 14405649
4695 14405649 13358669 12303024 11547289 10944595 10372489 9941185 9555974 9115206 8558658
4686 8558658 8176304 7847136 7507039 7233317 6988920 6769236 6666006 6452681 6177611 6005069
4676 6005069 5879934 5664811 5527552 5359801 5195962 5130982 4935237 4834721 4759204 4711375
4666 4711375 4662685 4581573 4469681 4421206 4388015 4376749 4255138 4190021 4241997 4234039 4217582
4655 4217582 4193758 4130134 4124621 4110384 3943885 3785720 3864862 3726278 3552544 3557570 3508295
4644 3508295 3491037 3577342 3491951 3331461 3328935 3223725 3172101 3154341 3159684 3221509 3261713
4633 3261713 3257158 3317898 3470027 3570071 3688880 3786344 3862870 4072074 4197211 4213790 4229012
4622 4229012 4197169 4193628 4031322 3878479 3818500 3813788 3690956 3532847 3418609 3347443 3108758
4611 3108758 2990009 2930266 2865335 2861947 2878673 2901444 2852333 2924838 2951373 2988535 3148475
4600 3148475 3177591 3182950 3279907 3263795 3302666 3450560 3451734 3440455 3568846 3613603 3546727
4589 3546727 3504654 3395955 3059150 3093803 3090567 2924021 2954165 2908687 2808377 2758401 2658908
4578 2658908 2561688 2666456 2735181 2713867 2753784 2817787 2837057 2924870 2995929 2975382 3037751
4567 3037751 2931155 2814368 2771213 2706122 2663065 2711750 2742394 2654298 2567802 2603603 2518301
4556 2518301 2479813 2529869 2528442 2519858 2545099 2542466 2590526 2552492 2575609 2670387 2785547 2941085
4544 2941085 3017199 3020397 3153926 3244118 3246490 3346930 3353314 3326396 3238634 3205173 3149562 3135943
4532 3135943 3079024 2976472 3013053 2928141 2830216 2849297 2768531 2720939 2620273 2637566 2678681
4521 2678681 2582464 2451317 2447442 2381307 2315377 2213113 2195338 2127545 1963319 1828942 1782136
4510 1782136 1776999 1751327 1590252 1542752 1594384 1514890 1558914 1612356 1658705 1602754 1669016
4499 1669016 1630402 1587182 1636914 1559984 1593327 1632857 1621378 1681342 1712823 1687290 1610148
4488 1610148 1725215 1793963 1797620 1814135 1742980 1736305 1857197 1934907 1895929 1919834 1925381 1920145
4476 1920145 1915849 1959527 1950468 1945899 2000785 1943530 1911602 1971240 1992725 1990569 2067180 2098024
4464 2098024 2034331 2079985 2161075 2155849 2044385 2024457 1913723 1798369 1928564 1943276 1706267
4453 1706267 1685627 1765987 1798973 1839670 1833328 1811294 1924309 1974419 1865036 1908571 1976337
4442 1976337 2050366 1962425 2004895 2005242 1957119 1997386 2020347 2089253 2202364 2369661 2436111
4431 2436111 2521798 2593789 2605277 2607954 2645736 2659172 2670518 2785195 2775089 2757536 2824926
4420 2824926 2864488 2882409 3096484 3195359 3162217 3358318 3542018 3562485 3634105 3868210 4079092
4409 4079092 4100253 4181552 4165022 4169873 4324561 4366976 4286349 4335746 4276116 4145915 4242880
4398 4242880 4184533 4068806 4191955 4274278 4143212 4161633 4294062 4217309 4239117 4320818 4242801
4387 4242801 4283201 4300881 4343143 4385621 4346461 4159865 4192095 4201395 4186203 4129460 4023656
4376 4023656 4002620 4002413 4019143 4041796 3918139 3835070 3940644 3872085 3700159 3762530 3792333
4365 3792333 3872834 4097143 4152299 4013315 4116287 4227093 4228861 4299709 4355403 4381606 4332889
4354 4332889 4412024 4401788 4377859 4512235 4474412 4532261 4537331 4340744 4274321 4326664 4292531
4343 4292531 4086750 4227549 4264891 4126299 4241816 4245354 4140963 4300113 4409240 4463834
4333 4463834 4596993 4697602 4779413 4825581 4982314 5068414 5031624 5011091 4967302 4926780 4918468
4322 4918468 4815181 4735183 4835132 4877582 4847028 4800386 4897473 4724472 4716282 4916682 4827118
4311 4827118 4741988 4857296 4767387 4716956 4628136 4554136 4643095 4715542 4722336 4653001 4609322
4300 4609322 4606328 4683968 4800625 4855333 4925730 4978377 4960327 4924552 4976073 5001935 4972899
4289 4972899 5058180 5126452 5037733 4981077 5041566 5028564 4963986 4827028 4748384 4720829 4550799
4278 4550799 4607122 4540151 4417254 4357609 4276362 4286673 4194338 4267649 4335045 4319195 4290116
4267 4290116 4232391 4151798 4241317 4225569 4245002 4193474 4046806 3962862 4005792 3985344 3928779
4256 3928779 3877841 3788289 3687606 3720578 3615743 3557754 3524970 3517359 3473772 3451784 3456554
4245 3456554 3455271 3575535 3659949 3666876 3764775 3734815 3580040 3538599 3543456 3589458 3567438 3601108
4233 3601108 3582410 3562197 3526105 3503966 3480635 3491035 3577215 3666929 3617756 3591728 3698489
4222 3698489 3667282 3617797 3634003 3686533 3694256 3619420 3740445 3785169 3776598 3842515 4066325
4211 4066325 4005990 4039105 4090415 4129997 4195376 4257397 4391486 4420719 4518945 4642395 4800948
4200 4800948 4989230 5069487 5252257 5266017 5323815 5425987 5602512 5699845 5761028 5900856
4190 5900856 5918212 6080085 6207590 6384041 6570555 6721477 6905378 7165395 7360488 7586487
4180 7586487 7883293 8261117 8572678 9066479 9501790 9876810 10357624 11000786 11611627 12222186
4170 12222186 12836294 13668087 14495057 15118900 15735393 16350570 16925701 17381480 17816635
4161 17816635 18447568 19153339 20071042 21043972 22110536 23205228 24306486 25213965 26067025
4152 26067025 26907577 27670676 28342675 28932301 29829998 30889661 31763810 32643306 33654052
4143 33654052 34536864 35676552 37111920 38492722 39997789 41240259 42303583 43389577
4135 43389577 44081730 44246594 44216486 44230576 43891163 43387327 42957321 42646477 42536384 42486563
4125 42486563 41993507 41570035 41374676 41145480 40806029 40477550 40346384 40116710 39619043
4116 39619043 39345289 39047431 38850271 38700455 38505574 38465556 38388938 38076155 37815474 37673730
4106 37673730 37302331 36573474 35667120 34628739 33329442 32017599 30861666 29755208 28847968
4097 28847968 28006004 27285869 26622528 26167343 25735811 25288636 25022964 24694263 24214023
4088 24214023 23828948 23634744 23569986 23555729 23725435 23793799 24055750 24276448 24456939 24589554
4078 24589554 24567766 24785195 24891011 24684234 24306869 24157121 24026683 23843643 23503215 23250982
4068 23250982 23227992 23321492 23615265 23943612 24303305 24745917 25336300 26063202 26858437 27874643
4058 27874643 28921829 30102666 31400859 32649050 34100641 35629862 36637118 37598970
4050 37598970 38981821 39968867 40490558 40850985 41256662 41495682 41427049 41343458 40946907 40960054
4040 40960054 41310914 41727973 42347791 43172895 43924393 44967634 46429171 47756917 48672943
4031 48672943 49628086 50676762 51518564 52574757 54043930 55466704 57319277 59153031
4023 59153031 60913067 62176865 62455741 63188269 63951839 63703695 63204703 62880738 62409345
4014 62409345 61523366 59937785 57629606 54877876 52284936 50437396 49187370 48205551
4006 48205551 47150709 45664023 44037349 42624603 41348566 40213459 39303651 38411277
3998 38411277 37581504 36834227 36204959 35368617 34283959 33581950 33028424 32300320 31535075
3989 31535075 30832271 30174102 29521162 28712287 27625323 26413938 25340543 24668612 24148858
3980 24148858 23751740 23216964 22689849 22128375 21422072 20739838 20174279 19337575 18465706
3971 18465706 17641618 16993671 16414109 15668520 14985091 14519229 14050477 13792442 13437459
3962 13437459 13080985 12828158 12511044 12274191 12010843 11903874 11763958 11638802 11593104 11478600
3952 11478600 11487318 11478697 11311483 11311951 11403440 11386254 11352182 11228792 11161920 11332214 11312990
3941 11312990 11355237 11452890 11495472 11572777 11721283 11869016 11948170 12137329 12412918 12653885
3931 12653885 12947725 13336482 13855853 14381572 15063469 15874170 16880294 18180886 19646665
3922 19646665 21230967 22884459 24772409 26794165 28687097 30158914 31267377 31871720
3914 31871720 31421681 29940870 27829829 25817239 23908334 22022654 20353572 19104496
3906 19104496 18037045 17168752 16459792 15812741 15262424 14919886 14560611 14235538 14129902
3897 14129902 14053153 14012717 14105154 14224247 14388588 14644996 14899581 15258876 15646310 16176264
3887 16176264 16791036 17472584 18265081 19156048 20148062 21058335 22114928 23397084 24861730
3878 24861730 26658403 28800322 31335172 33716930 35751626 36815457 36317118 34487812
3870 34487812 32728340 31422601 29931747 28626054 28140756 27915399 27897133 28321196 28988864
3861 28988864 29943930 31279997 32750433 34091633 34736192 33891015 31726433 29317521 27122773
3852 27122773 24781706 22688158 20996594 19885487 19019790 18232987 17327525 16340391 15500919
3843 15500919 14755383 14108607 13642198 13245607 12877172 12667611 12478225 12344078 12281047 12198812
3833 12198812 12115432 12112443 12113741 12133260 12217841 12284864 12390204 12708239 13034741 13324225 13828992
3822 13828992 14201608 14667481 15462612 16186765 17020768 17846464 18531338 18966853 18935365 18736138
3812 18736138 18534345 18158673 17749957 17461531 17411583 17343294 17353833 17647108 17862477 18225643
3802 18225643 18807475 19416494 20110323 20784634 21670144 22587323 23787808 25193803 26557524
3793 26557524 27980610 29451577 30847023 32306330 33399008 34770121 36078702 36757505
3785 36757505 37562694 38243692 38892872 39538543 39974384 40327579 40930622 42087736 43462117
3776 43462117 44699304 46171799 47713636 49323289 51327435 53215967 55055641 56891099
3768 56891099 58403289 59738939 60745579 61742934 62411289 62515955 62776403 63194424 63901336
3759 63901336 64630431 64900469 65262134 65920788 66885703 68161126 69731814 71528093 73535749
3750 73535749 76049421 79021749 82158581 86253938 91244874 97152480 103347799 109541075
3742 109541075 116196015 122641780 129505816 137858936 148455662 161451612 176019146 191925030
3734 191925030 207844025 221962001 230478539 236503380 239198002 234704793 227723586 219292781
3726 219292781 207961596 196742693 187411831 177577377 166268657 154733254 143302933
3719 143302933 133358562 125882273 120159877 115843171 111818156 107701176 103468168 99212960
3711 99212960 94717325 90916407 87678635 84496197 81577738 79187708 77185546 75543979
3703 75543979 74138823 72741423 71951751 71702769 71840772 72574938 73778560 75423285 77420836
3694 77420836 79867301 82676392 85714729 88365169 90835200 93189786 94549308 95490845
3686 95490845 96938215 98254259 99545496 101696151 105019272 109661152 114995432 120528609
3678 120528609 127258495 134961163 143466911 154314230 167725891 182650855 199099841
3671 199099841 216708895 233098164 244019634 251975993 257820499 253703289 243925887 235294128
3663 235294128 223129725 208100908 193511341 178453121 163916498 150069906 136167479
3656 136167479 123654445 113537157 105127944 97535115 90165620 83106254 76602445 70311798
3648 70311798 64521584 59634250 55576048 51880244 48691606 45750553 42962252 40487721
3640 40487721 38156468 36080215 34314059 32746387 31339375 29989867 28793557 27860777
3632 27860777 26980906 26121860 25438430 24728734 24132531 23672042 23197785 22762731 22494591
3623 22494591 22118861 21648930 21445656 21022689 20662521 20393739 19996472 19661684 19575337 19310271
3613 19310271 18926567 18741724 18530895 18316439 18200979 18173311 18072898 17985277 18017319 17872647
3603 17872647 17748093 17734686 17717641 17731347 17721654 17586375 17623256 17532389 17357926 17165897 17079456
3592 17079456 16823259 16443059 16263865 16029919 15822771 15719993 15640670 15681161 15641079 15697056
3582 15697056 15830028 15872019 16023723 16178950 16267319 16385235 16495396 16621891 16696178 16827258
3572 16827258 16920760 16981374 17026150 17093131 17164950 17234612 17140222 17372851 17664688 17806623 18148558
3561 18148558 18603072 18996081 19381800 19847355 20470127 20977634 21682921 22652377 23527891
3552 23527891 24620439 25608785 26723001 28025087 29518781 31252226 33342056 35538447
3544 35538447 37731263 39832254 41800407 43034269 43909874 44504965 44443586 44414408 44625422
3535 44625422 44970121 45581544 46275814 46934755 47549477 48115672 48477638 48334126 47994338
3526 47994338 47340332 46309536 45458282 45079245 45041651 44856724 44601639 44217018 43610354
3517 43610354 43140596 42457013 41465547 40415576 39377232 38594539 38159420 37807569 37400746
3508 37400746 37056712 36854881 36392190 35593409 34570549 33315670 31666521 29855825 28292707
3499 28292707 26770867 25226017 23769119 22255064 20818071 19823523 18983379 18055438 17395159
3490 17395159 16767033 16133875 15560649 15033287 14742051 14402308 14004695 13702951 13558981
3481 13558981 13380213 13168171 13041774 12912003 12764943 12618850 12677508 12668916 12508433 12605478
3471 12605478 12732767 12703732 12738949 12937073 13038105 13199059 13288984 13470681 13695273 13972895
3461 13972895 14340870 14717938 15121641 15560029 16331747 17107621 17946562 18805102 19690567
3452 19690567 20647576 21655161 22925235 24472759 26310629 28342159 30567083 32641396
3444 32641396 34424359 35860778 36642906 36929774 36934752 36983379 37495518 38296372 38995509 39360810
3434 39360810 39753469 39751131 39565122 39376319 38445209 37170924 36347069 35800925 35479223 35238982
3424 35238982 35130452 35344785 35994912 36701350 37204962 37410042 37402804 36881094 36379235 36158181
3414 36158181 36156309 36195446 36070802 35870009 35302798 34412545 33330177 31995852 30308164
3405 30308164 28793438 27397866 25988481 24538155 22962922 21534187 20519783 19654005
3397 19654005 18769650 17910398 17167963 16377564 15674475 14926761 14352270 13974604 13661068
3388 13661068 13330997 13136454 12958187 12784670 12626245 12458554 12374486 12384436 12183379 12099848
3378 12099848 12030944 11881440 11694999 11514535 11319987 11110516 10991732 11038011 11088261 11043781
3368 11043781 11159380 11237120 11207321 11160897 11126806 11092254 10937935 10827973 10757065 10697568 10539127
3357 10539127 10422031 10399448 10264762 10105903 9971744 9785773 9608013 9303603 9217399 9269957
3347 9269957 9129357 9117375 9091434 9052998 9050635 8889895 8732463 8605386 8529528 8385371 8225086
3336 8225086 8172653 7963263 7743204 7618447 7421239 7259014 7071311 6755765 6632418 6493136
3326 6493136 6202123 6034974 5937646 5773879 5541923 5345339 5278884 5086092 4906907 4811879
3316 4811879 4755428 4619276 4495671 4424625 4343046 4339787 4255063 4206197 4128167 4063249 4036663
3305 4036663 4019862 3981397 3907659 3959721 3909372 3911411 3941750 3978385 4110331 4220417 4311171
3294 4311171 4354311 4421463 4538542 4619218 4692066 4728623 4873674 4967088 5075525 5241835 5342574
3283 5342574 5422756 5503763 5537365 5532060 5524881 5560087 5555236 5596401 5556652 5597727 5575364 5606712
3271 5606712 5751136 5884640 5897313 5916439 5949267 6045578 6204639 6278152 6302087 6385028 6397409
3260 6397409 6327314 6344942 6379376 6279153 6231933 6244371 6096747 6093488 6194705 6132866 6141857
3249 6141857 6187537 6115680 6031504 6005491 6073776 5983376 5954421 6002253 5963352 5996660 6122376
3238 6122376 6151703 6175258 6325976 6449788 6458115 6639271 6661940 6656102 6866955 6877458 6823276
3227 6823276 7006722 7042782 7045747 7148112 7184310 7126477 7243472 7405211 7347610 7377349 7359368
3216 7359368 7400161 7453991 7508282 7567681 7584776 7717788 7944582 8038317 8210486 8280937 8287898
3205 8287898 8457112 8584577 8691880 8792356 8902628 9119350 9288424 9379239 9418025 9499904
3195 9499904 9681227 9758521 9821206 9898412 9949516 9966258 10097754 10284474 10273793 10360028 10598752
3184 10598752 10664585 10783093 11178745 11396052 11640352 11933103 12080192 12345809 12567857 12751183
3174 12751183 12976280 13212468 13392150 13636087 14091573 14437758 14606272 14993180 15337960
3165 15337960 15642255 15961242 16247573 16394282 16669962 16946931 17202003 17431322 17729485
3156 17729485 18023101 18349672 18710488 19018989 19330226 19807514 20111073 20653628 21164445
3147 21164445 21639645 22224906 22769780 23351703 24067800 24813202 25641506 26377242 27308057
3138 27308057 28251507 29195571 30206897 31125505 32175210 33123648 34066743 35321958 36583816
3129 36583816 37864517 39247876 40511595 41893852 43429163 44920845 46426838 48103760
3121 48103760 49893962 51841694 53993093 56436703 59093246 62245866 65902593 69926605
3113 69926605 74690150 80328996 87138070 95639502 105720110 117076943 129544644 143067231
3105 143067231 158327138 176599302 197846624 220695116 243737020 264475264 279879132
3098 279879132 288727485 287119846 277940846 263089983 245707549 227512115 207861722
3091 207861722 188637527 170585461 155608473 143426244 133443878 124586517 116146583
3084 116146583 107866352 99578044 91685559 84623570 78279885 72513956 67240402 62224117
3076 62224117 57611202 53578165 49857163 46521782 43550663 40868063 38406776 36241811
3068 36241811 34364536 32596734 31133151 29773319 28613713 27682312 26734175 25820383 25012966
3059 25012966 24328141 23571386 22829005 22145609 21377856 20680129 20230348 19682224 19066044
3050 19066044 18493203 18129607 17632614 17226573 16905954 16659915 16458686 16318825 16018921
3041 16018921 15809303 15588227 15426180 15401370 15240068 15114965 15164158 15121601 15083393 14987146
3031 14987146 14866162 14851668 14835428 14858758 14889532 14886711 14976596 15282161 15693725 16140592 16721383
3020 16721383 17520819 18303218 19197362 20251517 21244278 22620343 24334200 26241054 28329571
3011 28329571 30298165 31900971 32902770 33241065 33142511 32190235 30675438 29112635 27555372
3002 27555372 26165073 24323880 22432875 20823031 19447886 18438625 17661665 16968567
2994 16968567 16269422 15663437 14960339 14264301 13723303 13180343 12640575 12181109 11722091
2985 11722091 11247458 10897725 10478506 10242550 10015920 9617941 9406530 9218814 9046761
2976 9046761 8866487 8605582 8406265 8306121 8171311 7931901 7727254 7619228 7492331 7306765
2966 7306765 7167403 7072565 7022142 6918197 6849862 6870085 6691718 6599061 6513105 6424795 6396033
2955 6396033 6264205 6157378 6138193 6206603 6260971 6261487 6244879 6336576 6324405 6355089 6358996 6386575
2943 6386575 6329650 6430971 6471426 6548935 6685872 6729798 6853462 7044191 7153676 7253827
2933 7253827 7574557 7793000 8061336 8361235 8732280 9186641 9730023 10188238 10731121 11107361
2923 11107361 11121914 11039908 11021205 10693016 9997488 9465254 9020160 8525278 8021966 7573434
2913 7573434 6925956 6367782 5947561 5622623 5376327 5038119 4802877 4588678 4305701 4023419
2903 4023419 3778718 3609421 3378444 3224659 3072133 2847882 2713949 2654047 2642307 2555943
2893 2555943 2410336 2324022 2360879 2213936 2088732 2032617 2008156 1938750 1883915 1767665 1676579
2882 1676579 1671686 1672191 1606812 1547419 1639657 1721596 1747656 1631328 1577007 1593594 1518367 1505188
2870 1505188 1572066 1492361 1449895 1372616 1332095 1259267 1203456 1233127 1213464 1209360 1194217 1108805
2858 1108805 1186107 1117745 1117798 1204674 1161617 1118744 1126358 1154551 1123489 1203923 1279319 1277283
2846 1277283 1286184 1222804 1237460 1244903 1172677 1123034 1225512 1134622 1176868 1238842 1146334 1121617
2834 1121617 1220611 1171625 1250000 1397722 1316721 1321209 1396403 1505592 1527462 1645121 1689951
2823 1689951 1766971 1833225 1820541 2005269 2076514 2043274 2182662 2305345 2371414 2389734 2487277
2812 2487277 2516797 2635544 2842725 2877184 2851249 3038549 3204093 3341689 3403845 3461896
2802 3461896 3601280 3790817 4011605 4189974 4352234 4595700 4682982 5015155 5329559 5607061
2792 5607061 5953372 6327519 6636195 7041277 7386201 7766771 8117228 8533393 9066771 9717472
2782 9717472 10245335 10768843 11452138 12111464 12933998 14002821 15293672 16822009 18589421
2773 18589421 20187572 21687915 23127261 23607048 23513504 23694867 23540619 22613134 21386167
2764 21386167 20458480 19759632 19098178 18200668 17038104 15772425 14475693 13329041 12571429
2755 12571429 11838391 11219984 10609625 9938085 9266521 8491517 7885026 7429815 7034026
2746 7034026 6789793 6480909 6223814 6167301 6085357 5902902 5817519 5603091 5509929 5282870
2736 5282870 5128259 4992210 4789899 4680840 4589889 4485814 4411025 4267578 4139081 4177397
2726 4177397 4135555 4102976 4147788 4141968 4189902 4152466 4165521 4282203 4275732 4301239 4386714 4328930
2714 4328930 4239721 4256238 4173963 4006876 3961748 3895477 3824156 3725983 3638509 3607860 3547652
2703 3547652 3568855 3591998 3620695 3575196 3513831 3590694 3546031 3466662 3466507 3545795 3347574 3228241
2691 3228241 3192438 2968905 2824826 2846801 2840616 2687666 2674162 2523527 2346850 2239459
2681 2239459 2058088 1990728 1954210 1861643 1825219 1684146 1556267 1496463 1495682 1347001 1313418
2670 1313418 1261306 1235152 1160247 1151783 1130146 1107943 1028307 996323 1106434 1029352 972673
2659 972673 1050569 1133226 1017819 1027553 1008137 852715 756645 790459 658764 652894 624465
2648 624465 481411 542808 580454 453646 466562 470414 412035 470072 473744 292108 320852
2637 320852 404311 230937 49384 123880 186965 121946 171675 236821 179300 112324 222858
2626 222858 227795 196882 127463 204563 259128 154147 147251 208812 100521 108943 134036 135842
2614 135842 109031 103557 169382 243375 207453 161967 206205 227833 147532 214182 230425 132498
2602 132498 145028 316354 293545 275352 296883 355886 393158 300884 360001 318086 309585 430597
2590 430597 567126 482942 412431 478967 631812 693384 768731 866439 832020 915868 954085
2579 954085 1015129 880780 807644 833424 845978 775533 698719 729786 686513 598742 664152
2568 664152 639177 612578 663281 688180 711133 617119 678222 783629 826004 823262 942355
2557 942355 905362 835794 780009 813955 717412 725431 763689 711093 728418 688297 681897 805027
2545 805027 838180 866294 882092 889277 917987 857184 910219 825419 745793 786065 748399 707922
2533 707922 593028 535938 478143 558131 637979 535704 518027 611559 648287 665156 610737
2522 610737 617833 641211 642877 581835 527395 541473 547690 541514 448437 279265 276380 314511
2510 314511 260526 219372 177051 204436 141619 113642 201213 100812 126076 227263 148528
2499 148528 85606 97938 152495 117899 175673 239939 150979 90107 98637 82565 145170 -2585
2487 -2585 -61412 65706 91731 123997 75446 31851 48777 30470 47430 -22213 -168383 -126719
2475 -126719 -54378 -12288 -48153 -131116 -87034 -118971 -25333 148041 102151 102078 109692 59029
2463 59029 65995 61144 162200 151724 240519 245189 237974 228009 116560 168904 249097 170825
2451 170825 214912 258101 179978 154190 176226 73478 -41166 42808 123344 155758 114090
2440 114090 114500 174834 197705 21705 -1838 -3466 25377 -9204 -23300 59891 -28552 -555
2428 -555 109214 -11309 -38948 76498 70866 4969 -6262 26343 -31507 -28519 93854 37398
2416 37398 -685 85209 64146 84374 47255 59078 98798 70141 149703 149230 160314 168603
2404 168603 129875 159782 186068 138816 206536 308661 297508 324175 352666 308633 266919
2393 266919 332150 200011 228351 222621 96340 124254 103116 54404 118181 120737 82199 84966
2381 84966 58321 114777 62752 -4830 29385 86764 28472 22765 25041 -86 146389 117856
2369 117856 -19125 118355 173827 130473 215609 228906 134636 154091 246646 236050 113654
2358 113654 207592 255795 161726 183744 214900 179343 141352 117109 214046 324626 233163
2347 233163 210200 166600 219955 164190 233337 305033 205306 319778 361745 164654 205621
2336 205621 196246 122704 167634 67008 155593 227766 237860 306659 308031 316510 307234 301346
2324 301346 288280 316757 392975 377234 391350 356515 314194 414386 296659 226683 421043
2313 421043 434602 356813 402002 357087 453212 433380 498364 446187 431442 449422 410291 468527
2301 468527 492956 450452 443011 584247 666546 662135 677957 660068 617944 612464 653002 701689
2289 701689 783962 838180 739083 775239 728946 710590 680668 748692 709088 693868 620068 655877
2277 655877 601532 675629 768399 711392 707994 795456 814409 763747 708924 763167 794606 954161
2265 954161 883696 781608 885075 851659 925554 1012158 1002509 1143924 1141250 1103609 1032550
2254 1032550 1046683 1063757 1083658 1168842 1197328 1152444 1080435 1074165 1017106 1142744 1194849
2243 1194849 1107614 1047854 1027599 1062440 1169986 1149747 1192717 1215084 1246436 1233077 1241891
2232 1241891 1288845 1245677 1231083 1343971 1389130 1435636 1448613 1528288 1547639 1497487 1568658
2221 1568658 1616920 1684081 1725503 1846669 1942358 1991765 2111954 2100815 2177350 2330887 2452017
2210 2452017 2412236 2455650 2368942 2437390 2534319 2540985 2495570 2408683 2381356 2425058 2507068 2566445
2198 2566445 2562666 2567723 2614608 2693749 2683710 2741767 2870130 2952083 3074939 3164794 3289309
2187 3289309 3422669 3605121 3714329 3753462 3840167 4010067 4183000 4291518 4433474 4418828
2177 4418828 4482240 4516798 4436138 4433819 4440471 4496585 4518380 4632966 4775328 4808593 4778776
2166 4778776 4802432 4877206 4974802 5076513 5088992 5292817 5435214 5554096 5667954 5684618
2156 5684618 5850721 5944136 6114980 6258214 6437503 6567505 6730188 6901927 7108191 7400247
2146 7400247 7601768 7806688 8028812 8239350 8493351 8732087 9082885 9314833 9594090 9902792
2136 9902792 10149356 10511961 10800732 10942056 11149459 11428095 11421824 11339359 11267151 11105147
2126 11105147 10925188 10889702 10666615 10280028 9990585 9518345 9237762 8880836 8305653 7892457
2116 7892457 7680534 7523250 7273489 6953163 6643047 6451974 6333478 6204673 6130419 6109422
2106 6109422 6128271 6082429 6017150 5920900 6000386 6059227 6082376 6223237 6159235 6145686 6203126
2095 6203126 6256698 6278492 6442683 6591195 6636306 6725237 6686177 6597890 6384661 6046484 5882909
2084 5882909 5685778 5471014 5213720 4971358 4766126 4704263 4655451 4618401 4626901 4507269
2074 4507269 4571937 4514887 4454934 4487425 4536912 4622173 4729132 4850536 4918548 5051248 5095642
2063 5095642 5076312 5081294 5067948 4873566 4775956 4752515 4533206 4553046 4401090 4213717 4168524
2052 4168524 4086519 3853552 3543676 3485541 3349206 3171210 3077476 2874022 2795906 2765654
2042 2765654 2776158 2669350 2640713 2589596 2613835 2654995 2581228 2684073 2683016 2752595 2736518
2031 2736518 2726240 2744451 2567420 2399047 2362916 2292658 2285335 2266196 2175228 2038477 1862084
2020 1862084 1888529 1798680 1727867 1799428 1678636 1640273 1505661 1383610 1438225 1288506 1192651
2009 1192651 1207647 1275036 1165015 1152208 1180002 1091231 1043602 1035103 965847 855650 877789
1998 877789 830110 812102 751272 814144 899860 833598 853551 757431 803976 797554 756421 829484
1986 829484 801147 695299 608992 741768 761703 803065 788336 806422 830611 846888 834521
1975 834521 744485 660410 678659 696459 749937 726736 663782 539350 520831 601284 610638 565650
1963 565650 581631 536991 525935 458241 333301 371007 511408 533674 514172 455648 498573
1952 498573 418007 450224 450264 451549 539560 471775 409209 461777 527699 406798 387783 355053
1940 355053 421538 434920 343807 268086 280966 366028 344692 423860 432353 297343 348579 328438
1928 328438 295220 284839 337031 408220 345900 293484 349683 383317 321644 369313 421725 452800
1916 452800 402444 422335 370840 252353 386496 390945 379655 254942 227544 385023 332609
1905 332609 172294 134895 203266 193779 200542 162291 131484 181542 171053 293424 219497 254841
1893 254841 217615 267666 255274 228198 247923 267065 345078 374581 342239 317194 252405 276993
1881 276993 364545 463662 377720 357404 360467 514151 579324 398229 399252 308139 420446
1870 420446 451483 427133 352702 321228 397823 414334 488772 530365 473010 544452 517965 509177
1858 509177 635626 600047 583793 581105 484137 510393 532787 543741 621333 619563 602912 571906
1846 571906 552057 617520 750457 797243 788932 751965 712151 704512 737052 722142 618095 739969
1834 739969 829906 796531 889471 896706 913487 849046 823336 936104 918283 987219 912285 880554
1822 880554 1071688 1040678 1055622 1218056 1108043 1146347 1249854 1195952 1234103 1219457 1208624
1811 1208624 1346236 1463253 1435005 1321330 1436983 1448423 1520650 1644063 1565147 1531159
1801 1531159 1573928 1619117 1678381 1706934 1727740 1794721 1869427 1932383 1869700 1887240 1964625
1790 1964625 2030250 2119269 2182636 2203710 2210649 2199364 2240603 2239267 2295562 2354966 2404491 2539831
1778 2539831 2563713 2627365 2748363 2813836 2869328 3079509 3163387 3226826 3252056 3309876 3396097
1767 3396097 3400140 3445615 3433334 3467730 3384170 3231155 3119542 2996212 3043920 3055668 2975962
1756 2975962 2968637 2957410 2973434 2979335 2968454 2975401 3002587 2997803 3038058 3107125 3010731 2997382
1744 2997382 3143973 3199626 3143171 3211655 3188422 3116548 3122610 3105504 3096413 3030969 2967607 2845501
1732 2845501 2761614 2781680 2781619 2776654 2666291 2541683 2484451 2510814 2334461 2264080 2262630 2189322
1720 2189322 2212925 2169026 2028813 1979941 2000844 1975345 1916826 1822441 1719482 1648280 1658293
1709 1658293 1527688 1415160 1307783 1262050 1374808 1341898 1254918 1176447 1070339 1124467
1699 1124467 1101859 1054889 1012766 951168 923793 957032 916775 797900 758857 789113 817738
1688 817738 775564 764605 814937 812665 721721 768457 731542 574239 578564 525058 494407 479472
1676 479472 523590 511594 521095 386933 372238 309752 321185 289767 293803 377154 372979 296110
1664 296110 290249 328563 276256 294284 354454 233357 211843 199096 130485 236331 247214
1653 247214 131384 145662 216941 162760 97956 91427 3484 -30614 86056 57179 106458
1642 106458 102792 17537 63508 68821 79645 61672 66116 59230 23585 -14892 -76226 -49413
1630 -49413 -69175 4540 -7353 -82660 -130810 -75045 -96383 -57237 -94146 -113174 -117032 -187009
1618 -187009 -183652 -154000 -226476 -143716 -115470 -107203 -181186 -302043 -207464 -215714 -259003 -166854
1606 -166854 -216157 -268775 -261879 -226148 -200625 -204525 -220337 -289069 -225565 -111442 -157670 -223785
1594 -223785 -229078 -168353 -122343 -193043 -131085 -170052 -302903 -296503 -213330 -162916 -87548 -162168
1582 -162168 -302714 -293045 -301021 -281275 -311317 -385069 -346444 -295926 -270069 -217694 -287330 -302124
1570 -302124 -271305 -317748 -359231 -320178 -288309 -467395 -465885 -404387 -477064 -397075 -304285 -316740
1558 -316740 -275656 -294099 -310745 -341384 -284034 -344212 -391464 -347430 -388727 -325116 -335707 -388820
1546 -388820 -420137 -369844 -343204 -412674 -402296 -416431 -527274 -355648 -270540 -350630 -311227
1535 -311227 -363856 -396046 -423379 -424628 -368408 -394011 -412822 -339473 -281127 -288411 -257551 -242886
1523 -242886 -336073 -383025 -418547 -410123 -305042 -379864 -402715 -402512 -585854 -612242 -523426 -519885
1511 -519885 -563492 -505612 -499520 -471068 -486803 -455046 -469481 -500913 -395928 -423389 -398945 -372567
1499 -372567 -396451 -371072 -396554 -386014 -348577 -232637 -238801 -320245 -253063 -355760 -428535
1488 -428535 -371543 -387257 -474728 -418396 -364288 -385858 -447922 -491044 -481228 -456698 -500921 -481865
1476 -481865 -467237 -506884 -516537 -453016 -385089 -303229 -270928 -373670 -388396 -412902 -303416
1465 -303416 -305202 -315163 -306596 -393528 -374074 -363187 -382277 -475889 -381932 -315859 -419903 -418953
1453 -418953 -432352 -465859 -378949 -458865 -525483 -468884 -410630 -444073 -473688 -369212 -397552
1442 -397552 -413457 -314454 -251610 -283366 -209511 -220515 -219214 -261829 -315543 -335629 -385161 -345169
1430 -345169 -336369 -380288 -343061 -458527 -420193 -336022 -373928 -445065 -418264 -359917 -488735
1419 -488735 -528063 -465996 -540893 -519161 -436914 -356010 -379334 -396245 -318186 -240641 -360485
1408 -360485 -401681 -403413 -409869 -392969 -368764 -415349 -431636 -373564 -276040 -262921 -333802 -281540
1396 -281540 -314635 -397537 -463199 -367455 -442643 -487714 -486858 -492519 -505092 -418867 -389966 -428852
1384 -428852 -546470 -531126 -489131 -426177 -437866 -473219 -429373 -457559 -409915 -378025 -487207
1373 -487207 -509327 -447523 -441024 -458102 -391594 -341128 -423335 -493911 -425354 -508600 -536350 -476766
1361 -476766 -484163 -482307 -503394 -399741 -295747 -364906 -326364 -386385 -398086 -368744 -391012 -346050
1349 -346050 -335955 -462868 -407590 -307047 -456839 -488375 -460557 -445781 -376173 -275958 -279436
1338 -279436 -421300 -450834 -330620 -402487 -408342 -392438 -375510 -469687 -428976 -372657 -551504
1327 -551504 -496405 -472314 -507457 -453656 -523998 -544764 -386402 -434216 -546723 -463780 -458675
1316 -458675 -514885 -464395 -306320 -344784 -371987 -302207 -374193 -421365 -431811 -431921 -347395 -391985
1304 -391985 -368076 -382361 -388427 -376079 -461578 -377495 -379031 -511647 -373892 -294191 -440513
1293 -440513 -466008 -430206 -430985 -434740 -330782 -398776 -441437 -252182 -271001 -275912 -245617 -372822
1281 -372822 -393563 -406080 -396127 -423239 -468146 -479552 -520996 -548169 -503995 -547991 -437334 -316000
1269 -316000 -454307 -430242 -358806 -424773 -474868 -356534 -306138 -389520 -348668 -268122 -316874
1258 -316874 -239016 -289041 -365353 -350081 -336695 -269138 -303771 -394443 -374353 -403414 -408872 -371202
1246 -371202 -368478 -356098 -395787 -365932 -378843 -470962 -435545 -402591 -252233 -356932 -380164
1235 -380164 -298775 -346211 -281719 -223351 -293753 -327134 -257320 -235364 -266551 -296487 -203005 -247660
1223 -247660 -292666 -324127 -308664 -301172 -371957 -368265 -413021 -364477 -314782 -362483 -296418 -311120
1211 -311120 -347968 -211032 -169025 -226645 -123491 -146815 -130931 -86464 -41114 -37645 3576
1200 3576 -2505 -19655 -125694 -257524 -293384 -258743 -181237 -136498 -199691 -187473 -214523 -314509
1188 -314509 -282331 -340206 -404748 -357500 -309470 -271940 -295001 -392096 -407395 -344936 -314867 -324238
1176 -324238 -272923 -276127 -325455 -377441 -326033 -231964 -263371 -224114 -231142 -278467 -337169 -230052
1164 -230052 -214779 -277192 -283726 -246505 -243615 -303979 -222237 -295681 -252427 -221145 -307723 -259155
1152 -259155 -249409 -287867 -163874 -188472 -297008 -222108 -166490 -221199 -253198 -268687 -263161 -260333
1140 -260333 -187688 -254802 -184551 -164054 -238022 -261793 -188107 -160165 -160597 -161866 -204860 -235572
1128 -235572 -204519 -305704 -360731 -238515 -257123 -264592 -204770 -104396 -73743 -213652 -188600
1117 -188600 -117413 -153894 -118618 -160024 -195535 -198922 -242511 -205382 -198767 -219825 -212250 -247305
1105 -247305 -145582 -234161 -226024 -253899 -314447 -232471 -155034 -231964 -238062 -171861 -178382 -203733
1093 -203733 -192467 -122413 -169895 -125039 -104064 -78822 -104718 -111835 -99246 -128978 -144110 -193754
1081 -193754 -126762 -191913 -212868 -184890 -83229 -158838 -141885 -74959 -151911 -141340 -65728
1070 -65728 -124603 -154982 -186364 -191422 -136277 -207013 -93548 -38342 -36231 -25510 -67882 -62944
1058 -62944 18932 3678 -66695 -18194 -29355 -83505 -38777 -69846 -86687 70759 126728 1249
1046 1249 85373 169523 62993 113728 135703 29667 16824 26284 72449 71687 159279 247280
1034 247280 249702 275236 219950 219051 163813 60631 96114 128568 170682 258053 289907 285815
1022 285815 224059 224695 373916 483973 538934 526485 492008 489306 452661 489643 500306 509047
1010 509047 448375 464788 557775 445436 481504 408500 310202 406966 464560 500031 483090
999 483090 467216 445845 401906 372648 514105 583028 500624 601041 672264 640186 649228 740413
987 740413 852587 854230 860177 943914 865493 813143 868563 864023 918156 1079678 1133184 1084861
975 1084861 1119686 1233604 1334548 1405203 1413715 1545759 1566470 1617487 1636720 1716392 1835174
964 1835174 1889145 1942879 2002906 1998015 2078641 2308972 2429788 2579599 2738117 2872635 2948065
953 2948065 3040153 3172013 3250310 3377640 3582695 3721138 3833439 4095751 4331905 4572867
943 4572867 4853601 5102066 5465286 5848832 6272382 6761280 7325991 7892524 8548736 9170827
933 9170827 9692852 10305781 11134046 12177294 13355684 15061944 17312193 19865700 22467522
924 22467522 25153751 28320724 32620694 37664665 42016207 45943712 48459751 47344628
916 47344628 42333259 37168391 33264878 28902942 24195832 20634373 18282736 16380519
908 16380519 14867524 13514014 12197233 11116006 10211913 9301253 8708444 8077979 7339364
899 7339364 6781329 6329180 5746734 5241899 4874685 4514712 4055362 3904404 3652113 3357250
889 3357250 3194165 3058323 2892372 2724717 2588765 2384453 2276532 2255055 2194000 2009988
879 2009988 1931623 1738425 1700464 1681997 1642770 1608450 1578295 1562976 1435372 1341676 1323685
868 1323685 1267567 1286841 1205551 1134098 1122765 1115320 1089309 987657 992477 1043864 881699 865476
856 865476 876055 815199 866546 733611 722639 769381 799973 764905 541726 539306 503714 495894
844 495894 611200 498205 461810 520453 487053 423668 335536 366037 459521 414887 405457 413718
832 413718 306925 273683 208992 259447 293937 267439 348711 355423 328939 200419 252970 278590
820 278590 213384 297545 266655 117519 139658 150724 125910 244177 215545 116926 145702
809 145702 115573 75680 4461 31268 7286 43034 61142 7967 113782 61911 46610 94106
797 94106 116505 128254 37237 60252 68620 84870 96419 159885 73458 -2632 -56929 2665
785 2665 -12459 -41734 17128 -106582 -89246 66529 21252 -52165 -21150 -73053 -91752 -37754
773 -37754 75299 -65302 -54011 36349 31710 113698 67724 -70837 -6178 47621 -44362 1795
761 1795 -26470 -8348 -40181 31836 -89003 -111712 37122 -31972 -77226 -101870 -131906 -158348
749 -158348 -145024 -190817 -216881 -205820 -150134 -128165 -167231 -62661 -44800 6725 100516 70091
737 70091 77121 36690 83641 -2599 60866 148851 8821 8643 169666 30138 -38033 143605
725 143605 107144 25216 13542 -53348 -162105 -120054 -94908 -137137 -87360 -117782 -137432 -33854
713 -33854 -30685 -97765 -126547 -45774 -142725 -101301 -40592 -47850 5684 -149995 -98531 -100872
701 -100872 -142532 -131553 -145346 -60308 82701 11221 -42101 59540 20661 -68496 -74151 -61617
689 -61617 -161432 -123449 -38471 -180319 -77975 -17711 -126752 -40210 -82760 -131584 -53379
678 -53379 57362 25793 49313 151358 57842 32517 50321 -2519 -11532 75456 -17639 -53393
666 -53393 -110242 -158863 -104107 -80030 -47074 -116369 -129493 -43958 -74059 -53302 -42429 -82875
654 -82875 -118885 -43227 12029 -28935 -115817 -97065 -13532 48478 49888 -10726 33308 41053
642 41053 37889 58616 131279 132365 -4534 89416 192154 233018 329745 226913 135151 186931
630 186931 172959 167144 154660 117223 181228 142447 74514 130873 146801 125771 44987 8188
618 8188 13315 36732 14622 -27066 -2034 -68807 -8023 47828 -56649 -103339 -106382 -200774
606 -200774 -116067 -22843 -55545 -148243 -155986 -106659 -60043 -12829 79097 77446 95961 90597
594 90597 41539 131250 61004 12851 55049 83166 -45638 -66938 68238 -19185 -32794 -14678
582 -14678 -66542 -63759 -12607 -12607 52706 -44948 -24889 -69942 -88578 -75069 -37337 3771 -156
569 -156 -4220 27536 51477 152789 88019 91795 74748 23538 79410 -1099 -12014 15158 -9100
556 -9100 82398 234883 83981 50443 80082 -454 -94789 -25797 -39997 -134367 -20151 -67066
544 -67066 -74778 18536 -56862 5457 89134 46395 52596 35964 34775 93251 37146 4346 -58799
531 -58799 43932 35949 -32937 50882 118815 169546 172328 245534 130919 -30190 72804 39606
519 39606 40826 8472 -103412 -26958 8980 -82751 -26880 -34686 8528 52629 19870 72441
507 72441 107285 -37539 -86392 16509 -11059 -76353 -13784 26510 46630 170034 91536
496 91536 118516 272272 96409 128043 143258 38373 7225 63675 -156 -22599 8439
485 8439 23554 -9287 21796 53085 92816 203455 163824 117974 130946 124315 161634 142228
473 142228 48445 70439 50955 99199 50583 85707 133886 71689 97102 123868 98453 115397
461 115397 41903 70966 28040 -8252 78522 69602 111871 156596 157262 165321 63969 72538 96474
448 96474 155458 105637 18727 88795 109117 44367 107103 146206 239224 194731 195620 220668
436 220668 136156 175735 148178 56445 124162 95298 123222 177761 124476 110714 52951 189844
424 189844 135110 144942 159756 130108 150642 68918 43307 70279 31514 7610 28484 66772
412 66772 123231 106993 102936 178982 198105 191674 158243 164343 119763 69607 33706 5989 115017
399 115017 129574 84806 122971 182120 296368 283504 301572 262084 266822 331066 238207 90787
387 90787 81349 93161 147495 150427 150508 223989 193676 113743 21661 129534 105705 76178 28406
374 28406 54676 73926 -17978 64654 69967 155434 210250 134935 81843 134633 239169 218191
362 218191 209421 160513 136707 141528 115154 162966 100833 81840 238665 217131 167512 245031
350 245031 270291 279230 147595 127764 216602 128824 113932 89225 64915 123417 255835 278043
338 278043 183348 242791 293154 234260 259212 315988 262207 212595 123195 154960 230546 203191
326 203191 174601 119066 157142 89316 171952 174366 137700 112539 136201 136587 135620 28611 40134
313 40134 3751 -20754 26165 86263 179916 151043 231920 179600 154750 258786 333722 148506
301 148506 171825 177066 88894 56391 89614 222321 230274 245400 238017 273437 366267 258883
289 258883 270520 194816 104505 224977 193944 86379 90846 157317 186052 137754 182112 229823
277 229823 192921 181836 99572 75859 78764 28598 42166 57550 55049 186400 188096 109996
265 109996 186337 236713 236744 306139 363528 270176 215775 153827 31202 91869 116897 93636
253 93636 141055 203735 176297 214773 189387 166474 372777 304987 199206 173130 194722 270934
241 270934 260052 201819 168019 199881 124806 220650 290627 343924 302522 260370 327811 127243
229 127243 114775 122235 201269 159930 134326 191329 185097 186345 227988 206457 203363 308919
217 308919 257888 167488 159691 199590 182622 123328 61157 144905 156646 172189 230297 242815
205 242815 248620 123367 94671 170877 185727 148590 162717 170825 143320 205968 298895 230386
193 230386 202956 196902 265569 266860 169110 196837 186179 146056 219721 184959 115662 162276
181 162276 97380 45419 85412 174497 260056 261074 218126 223924 206106 171357 115610 170486
169 170486 138062 104705 146469 153590 238371 223628 252338 235709 218407 215148 245887 253024
157 253024 134949 158157 175188 154014 207248 233424 222557 151336 128697 191639 240948 212768
145 212768 248646 185741 194911 215926 145451 216801 123432 92474 129760 180093 167320 257189
133 257189 276549 199456 241622 300228 251946 254079 236418 189043 229365 237294 186715 257707
121 257707 299350 248330 297702 223368 212392 282247 255062 267085 198238 174497 165076 171316
109 171316 160077 109547 166716 201778 233279 235195 191206 220800 276441 263518 193033 243772
97 243772 177253 197833 235501 231039 200901 207219 266003 257384 255759 253107 228109 212140 206870
84 206870 207056 268686 223638 145209 177945 223488 216289 206373 234213 198598 191534 229488 251148
71 251148 232919 242071 218082 179699 199962 190432 184403 154121 224755 187102 171519 235758 212431
58 212431 242144 313548 268556 198288 237590 212861 202339 251432 269413 216508 224217 256595
46 256595 250420 206991 180484 183633 179599 212416 222482 275355 215790 231594 197571 227335 199393
33 199393 174257 205316 196532 225414 281963 125118 144339 234131 240766 213112 270350 260089
21 260089 242908 266470 279500 253661 227155 207576 258366 287167 245983 265840 203570 200592
9 200592 214659 229386 229521 199782 212275 254236 279904 236443 223533
0 223533
$$ Imaginary data points
##PAGE= N=2
##DATA TABLE= (X++(I..I)), XYDATA
16383 -2133273 -2162803 -2160498 -2114111 -2100755 -2056471 -2068629 -2094278 -2071108 -2024545 -2006306 -1960062
16372 -1960062 -1961585 -2018589 -1990558 -1901238 -1893571 -1857312 -1793600 -1727597 -1779679 -1673625 -1630199
16361 -1630199 -1636093 -1621614 -1574390 -1536243 -1363705 -1400623 -1421891 -1452060 -1451014 -1362754 -1301989
16350 -1301989 -1297101 -1403889 -1378903 -1330687 -1248159 -1283981 -1275783 -1229869 -1254317 -1177752 -1086621
16339 -1086621 -1138294 -1181129 -1086511 -1089258 -1135520 -988368 -988725 -1009184 -924789 -893545 -908666 -798402
16327 -798402 -749674 -739609 -771888 -731903 -674533 -621865 -549100 -640021 -645233 -593942 -612901 -606540
16315 -606540 -580391 -562909 -560519 -481398 -545571 -509085 -441241 -368187 -454104 -421069 -359807 -345850
16303 -345850 -310050 -268047 -325562 -271291 -170121 -204945 -166676 -181453 -146313 -78727 -8913
16292 -8913 47731 58211 -21733 -20799 -15358 -62198 -21180 3764 45323 136459 114218 109894 87170
16279 87170 66229 79871 233470 307476 238420 186913 235489 298228 313571 221735 201766
16268 201766 297524 304036 344595 445215 450041 388423 406973 495012 528793 463659 436128 452659
16256 452659 431987 519878 528658 555804 608026 667964 665982 704260 695174 606437 639955 674850
16244 674850 683913 631341 671225 726537 732772 801682 813570 915002 907208 921444 962505 889041
16232 889041 903294 856198 824282 918240 939848 839925 892873 833432 887503 997997 1016803
16221 1016803 975512 991095 988295 1030162 1070096 965424 913086 936818 963250 998220 1076041
16210 1076041 1115349 1124284 1204429 1227512 1241174 1131984 1215371 1249252 1199230 1217096 1213455
16199 1213455 1192555 1246159 1227500 1171836 1234939 1213363 1226673 1349333 1457263 1398857 1302497
16188 1302497 1334033 1219368 1233589 1272689 1246084 1212150 1394513 1345326 1278148 1467438 1415699
16177 1415699 1390514 1399288 1392842 1296003 1391067 1367728 1409532 1433844 1432147 1429550 1351692 1387206
16165 1387206 1450272 1433224 1464084 1444816 1373429 1479137 1505985 1469944 1479935 1486053 1490814 1513100
16153 1513100 1551307 1533441 1497413 1592992 1630254 1653499 1674031 1623447 1598070 1527432 1565558
16142 1565558 1448068 1459568 1445023 1544074 1534629 1622048 1662790 1624383 1628492 1636994 1631842 1708828
16130 1708828 1640114 1464251 1613142 1591699 1523545 1541457 1606039 1631860 1627180 1689813 1649581
16119 1649581 1593532 1649903 1690977 1663125 1620863 1563847 1547889 1512690 1598966 1551686 1534781
16108 1534781 1523659 1524653 1665025 1711681 1718018 1680370 1713189 1666485 1626200 1601931 1642366 1633099
16096 1633099 1665871 1743424 1739970 1764280 1733228 1772722 1808950 1821554 1782834 1684186 1737647
16085 1737647 1722622 1634372 1597431 1625348 1567803 1672069 1743690 1774269 1768953 1720736 1716727
16074 1716727 1778372 1725372 1604770 1628465 1734806 1679730 1661227 1673373 1664761 1678333 1683465
16063 1683465 1733430 1837898 1731291 1673378 1658237 1683846 1744193 1721279 1714321 1694903 1667854
16052 1667854 1640659 1607915 1607570 1727015 1756943 1792400 1788774 1778158 1752250 1793054 1809741 1774173
16040 1774173 1833935 1807860 1723288 1643206 1717277 1856720 1780572 1687712 1749165 1824210 1737798
16029 1737798 1758314 1653527 1796193 1763135 1638948 1756881 1675962 1611714 1722480 1859730
16019 1859730 1839776 1833473 1799520 1753159 1741267 1771148 1792469 1759767 1719851 1724778 1694634 1702850
16007 1702850 1705096 1734986 1743203 1829493 1835728 1811324 1763427 1725086 1804935 1811680 1697573 1672080
15995 1672080 1726735 1639314 1670133 1720195 1677648 1676621 1812138 1835639 1776176 1786804 1738483
15984 1738483 1769678 1795344 1721971 1713247 1774040 1691819 1682628 1754281 1765908 1697163 1679610 1833582
15972 1833582 1828540 1812242 1883199 1714983 1602898 1796122 1806022 1706044 1735791 1700188 1739173
15961 1739173 1816474 1721890 1688318 1836879 1852346 1822064 1832145 1760727 1734361 1766171 1795040
15950 1795040 1789930 1761978 1722880 1706129 1709802 1800790 1735327 1663691 1783670 1845117 1789590
15939 1789590 1785688 1720602 1620096 1716095 1790651 1730528 1746015 1785045 1730987 1766826 1838774
15928 1838774 1758232 1740209 1890654 1790294 1708173 1711186 1718759 1618713 1620559 1639755 1639531 1806556
15916 1806556 1920033 1805105 1758983 1915050 1836931 1853428 1901811 1813633 1741110 1838552 1846641
15905 1846641 1755038 1809367 1779182 1811243 1858305 1793426 1735582 1745727 1758813 1742349 1726500
15894 1726500 1712278 1687496 1765087 1851015 1837762 1859376 1907506 1928740 1799758 1795495 1815195
15883 1815195 1791152 1772366 1841805 1800662 1795100 1736537 1805720 1853919 1833763 1814448 1808929 1738894
15871 1738894 1697294 1795482 1785930 1765824 1767956 1793719 1766958 1723551 1713555 1703217 1742756 1756748
15859 1756748 1718273 1784089 1827687 1801333 1835522 1760522 1795533 1803609 1763342 1755170 1761511 1726927
15847 1726927 1699926 1703288 1851908 1902243 1806928 1764130 1765954 1748587 1719191 1729153 1670068 1675393
15835 1675393 1613523 1667772 1701934 1746117 1799226 1835355 1753692 1767276 1856431 1879940 1738601
15824 1738601 1766869 1785942 1883117 1778587 1737387 1929759 1827107 1759243 1844064 1796776 1840835
15813 1840835 1895209 1886809 1831170 1820174 1814079 1799051 1723065 1774037 1846810 1792100 1721821 1700999
15801 1700999 1835420 1844574 1858530 1887540 1897901 1937734 1887669 1915128 1851010 1763916 1851422
15790 1851422 1862150 1765671 1750451 1726088 1772279 1832419 1920690 1902168 1794875 1829900 1834578
15779 1834578 1777783 1772275 1800368 1789603 1735851 1687031 1732004 1742821 1825687 1752073 1826258
15768 1826258 1853453 1839776 1814162 1817538 1798804 1730428 1814058 1799729 1820468 1848272 1774497
15757 1774497 1814575 1845194 1924147 1866695 1798678 1727173 1773989 1793443 1686591 1745767 1815134
15746 1815134 1700626 1767426 1830973 1757350 1720548 1781220 1838856 1804981 1849983 1871566 1794458
15735 1794458 1776351 1741256 1694597 1749306 1626089 1711197 1873683 1732151 1695149 1819250
15725 1819250 1850497 1930192 1882834 1905047 1801093 1770032 1809819 1730340 1698860 1780298 1840172
15714 1840172 1829268 1813436 1846765 1773839 1862054 1904729 1898532 1891299 1842884 1800835 1899202 1896832
15702 1896832 1759042 1906546 1867202 1839286 1872085 1896003 1868647 1856986 1986840 2000858 1849478
15691 1849478 1799125 1798864 1895263 1857618 1866475 1954862 1979959 1931899 1965905 1858412 1738561
15680 1738561 1833482 1843615 1883526 1842991 1775560 1817858 1789437 1850744 1846110 1800446 1867875
15669 1867875 1946039 1928439 1907879 1885612 1839299 1790734 1812723 1815933 1797466 1820358 1769772
15658 1769772 1792513 1816569 1881230 1898758 1828927 1928772 1765944 1800260 1869156 1917153 1982391
15647 1982391 1980962 1978471 1816164 1864894 1854205 1790708 1821844 1849583 1849174 1857425 1826739 1770961
15635 1770961 1816878 1856249 1822647 1863217 1867588 1784976 1797455 1845324 1845168 1912472 1952820 1961888
15623 1961888 1973252 1971183 1972702 1950003 1845235 1862057 1906888 1917297 1900557 1898539 1802861 1806189
15611 1806189 1818513 1748189 1777802 1843345 1805864 1771837 1769088 1827176 1814415 1816434 1777466 1751846
15599 1751846 1749243 1886968 1818754 1912827 1894839 1766808 1912307 1916219 1940864 1861777 1855872
15588 1855872 1852267 1844033 1826625 1866368 1859492 1885381 1879666 1871276 1907907 1826980 1850681 1821600
15576 1821600 1815265 1867577 1823072 1790209 1797852 1819139 1842382 1866867 1851975 1792468 1813393 1887605
15564 1887605 1862714 1959715 1924852 1913008 1905269 1886035 1879597 1880873 1865737 1864740 1852723 1917776
15552 1917776 1892680 1812296 1856383 1881846 1942848 1917313 1853595 1839482 1822217 1845223 1828473
15541 1828473 1825773 1814979 1827828 1890663 1964978 1912078 1828016 1950686 1888332 1923284 1990988
15530 1990988 1953720 1790681 1866824 1895963 1916534 1964037 1834200 1845165 1957358 1962425 1929311
15519 1929311 1891900 1852332 1808427 1786691 1754037 1764485 1808514 1848912 1900072 1946153 1953576
15508 1953576 1835381 1857651 1772955 1832363 1831759 1808413 1859179 1738746 1768919 1829542 1903403
15497 1903403 1901633 1910361 1881963 1870683 1856526 1942803 1982781 1906054 2006223 1917448 1911443 1835031
15485 1835031 1826791 1802753 1773360 1801619 1832757 1941761 1969274 1923219 1886501 1824868 1812268
15474 1812268 1873129 1842677 1850415 1842211 1824762 1807363 1908531 1878712 1954273 1956206 1884472 1876964
15462 1876964 1888360 1932467 1923555 1955819 1914327 1930336 1964455 1833527 1826098 1909335 1984703
15451 1984703 1877482 1894614 1980008 1891740 1943128 1970265 1886469 1887596 2014770 1908647 1965356
15440 1965356 1859565 1809710 1948726 2033459 1901546 1887993 1927977 1909823 1833694 1797387 1779868
15429 1779868 1914406 1958140 1929224 1901122 1925270 1834687 1803819 1895978 1972928 2091304 2066712
15418 2066712 2060504 1983075 1904183 1872958 1972664 1977090 1973583 2008229 2010729 2021121 1985525 2005759
15406 2005759 1985545 1942243 1878701 1900736 1883372 1830539 1907051 1894729 1929437 1900623 1929064
15395 1929064 1937914 1934893 1909567 1858922 1881757 1865611 1848807 1907420 1959654 1971636 1944177 1985389
15383 1985389 1922327 1962910 1989011 1931610 1943136 2051900 1955737 1883166 1872652 1901070 1911454
15372 1911454 1862947 1831827 1891166 1914023 1900341 1968066 2020142 1885342 1774224 1844684 1896850
15361 1896850 1858795 1825334 1924023 1993225 1936460 2012617 1958802 1840090 1926412 2053941 2063529
15350 2063529 1968792 1876077 1943376 1971142 1947007 1909356 1940275 1868871 1795792 1925460 1985185
15339 1985185 1879699 1928852 2045016 1887024 1892413 1921890 1847881 1839392 1929753 1901686 1879328
15328 1879328 1942030 2065378 1934422 1984036 2030498 2003378 2059986 2023443 1982863 1906449 1812334
15317 1812334 1866345 1951343 1915920 1899346 1940496 2041430 1852382 1825808 1886025 1942912 1952367
15306 1952367 1905812 1889068 1935530 1897468 1896490 1870608 1736224 1818302 1974415 2044097 1950118
15295 1950118 1938114 1887772 1868628 1956854 2020668 1926841 1911341 1934485 1934286 1935962 1904454 1826526
15283 1826526 1935257 1984766 2056157 1986746 1924709 1949270 1959329 2034220 1900829 1951724 1883921
15272 1883921 1934470 2017852 1940356 1977318 1983518 1940176 1997533 2082084 1951869 1858468 1951787
15261 1951787 2094657 1944464 1905771 1900664 1867863 1987814 2014887 1964913 1975283 1986948 2036471
15250 2036471 2023748 1943212 1941389 1990634 2055738 2069526 2038805 2007190 1933169 1962159 1939538
15239 1939538 1948136 1966308 1970880 2037768 2014490 2011641 2069460 1971290 1992581 2106293 1979771
15228 1979771 1886052 1989905 2088081 1989418 1971325 1978866 2000564 2043613 2021969 2049534 1997006
15217 1997006 1944130 1956418 2000786 1852289 1802525 1904988 1917167 1946406 1921758 1996526 2021137
15206 2021137 2028031 1964122 1930086 1905372 1907048 1987898 1909060 1935874 1954969 1912784 1988255 1948588
15194 1948588 1958325 2034331 1983304 2001097 2080457 1941725 1959800 2017551 1946938 1945901 1952606 2016767
15182 2016767 1993480 2078768 2048858 1998976 1936226 1793097 1968121 2008213 1973061 1946647 1944672
15171 1944672 1989260 2058932 2012029 1889386 1852381 1945188 2055446 2009590 2029422 1980733 1950571
15160 1950571 1956981 1909795 1957868 1894841 1961438 1961388 2015132 2036377 2014731 2038116 2150083 2061448
15148 2061448 1987798 2014628 2003935 1975107 1994328 2082229 2009915 1968016 2020113 1911012 1877789
15137 1877789 1987512 1940033 2007377 2051880 1965045 1898565 1922009 1994724 1924750 1915884 1945646
15126 1945646 1929532 1974225 1942636 1924512 2037377 2114420 2063346 2086295 2041865 2079949 2052331
15115 2052331 2003177 2008007 1924778 1958202 2018588 2141130 2110266 2023734 2058219 2004466 2006975
15104 2006975 1989493 1902358 1883407 1893930 1896468 2009441 1928563 1877286 1967076 2017257 2109188
15093 2109188 2021950 1978106 2002841 2145027 2171939 1961085 1918683 1983928 1994096 2024953 2137885
15082 2137885 2069566 1974258 2144995 2168064 2066738 2030174 2069222 2032914 2102011 2093864 2053947
15071 2053947 2155674 2039515 2026201 2029395 1994850 1908655 1949921 1998908 1953250 1964170 1983473
15060 1983473 1928048 1946112 1968643 2004580 1964968 2037382 2117366 2044980 2076730 2069519 1971963
15049 1971963 2008952 1961390 1936410 1958768 1987329 1975798 1976684 1974996 2048951 2024765 2046769 2020442
15037 2020442 2061983 2001196 2049170 2105310 2023302 2068374 2050160 2005415 2070143 2059906 2011067
15026 2011067 2065351 1991495 1947111 2001113 2010121 1969652 1975009 2043302 2017370 2002681 1976297 2048439
15014 2048439 2063038 2035197 2047597 2040970 2060197 2122203 2243859 2158077 2079127 2060096 2094964
15003 2094964 2071111 2089268 2095422 2099511 2117694 2090732 2054991 2032027 1986061 2066369 2100427 2128426
14991 2128426 2059950 1999167 2027628 1997929 1933485 2016108 1990322 2072340 2079278 2113999 2052770
14980 2052770 1947172 1997403 2033072 1946262 1936813 1998712 2097144 2107974 2149773 2172199 2021819
14969 2021819 2066558 2147372 2019371 2036820 2022403 2020299 2029257 2025532 2038563 2152647 2149240 2184585
14957 2184585 2142206 2097675 2148886 2097200 2038739 2046445 2149420 2086974 2027932 2119785 2111340
14946 2111340 2131607 2110290 2071783 2156608 2188603 2079520 2052259 2113511 1995958 2081017 2149047
14935 2149047 2149804 2072953 2128595 2115851 2041259 2116605 2090129 2071182 2163870 2048955 2045956 2170942
14923 2170942 2122644 2001441 2061897 2090347 2059133 2128448 2028409 1956676 2079756 2091308 2074752
14912 2074752 2081750 2107447 2092386 2200061 2174338 2095804 2083886 2128991 2071608 2083842 2064911
14901 2064911 2085501 2116928 2083463 2044939 2049599 2045005 2085493 2044772 1999135 2043792 1959506 1943048
14889 1943048 2009127 2041536 2025571 2089655 2067966 2040762 2112661 2165524 2006303 2024415 2055571
14878 2055571 2039522 2150808 2161281 2094883 2154134 2120584 1963101 2051244 2121097 2110316 2119176
14867 2119176 2066294 2048663 2067855 2085140 2010363 1991488 2003588 2048508 2008094 2048661 2075008
14856 2075008 1958014 2040672 2181048 2237426 2123584 2089403 2130602 2124374 2105482 2059556 2089258
14845 2089258 2182656 2171502 2138092 2176131 2011327 1981957 2109230 2126942 2097151 2070400 2139419
14834 2139419 2091280 2076884 2036822 1996156 2065840 2085340 2074893 2125433 2075594 2038439 2110008
14823 2110008 2118211 2101075 2111922 2144846 2095049 2083689 2148692 2058629 2067264 2142136 2060590 2032673
14811 2032673 2065456 1964519 2061253 2153107 2175459 2140127 2114508 2185693 2186861 2220538 2091161
14800 2091161 2062651 2135007 2056754 2058299 2053710 2043303 2103605 2153942 2162394 2095589 2018659 2110415
14788 2110415 2138270 2082526 2079431 2098658 2134517 2059373 2095908 2138504 2066077 2173632 2158004
14777 2158004 2097417 2105685 2129134 2148447 2100688 2115843 2054156 2102653 2153367 2194226 2204471
14766 2204471 2174493 2002064 2155319 2190545 2100097 2129942 2228639 2167041 2126167 2091511 2030576
14755 2030576 2018824 2055178 2157444 2144590 2096597 1985066 2059264 2279112 2182608 2202395 2257784
14744 2257784 2144164 2120116 2177766 2149067 2190703 2165494 2178023 2125209 2196850 2266072 2184134
14733 2184134 2127687 2136979 2099277 2170172 2135089 2056051 2080524 2018532 2086634 2117249 2132544
14722 2132544 2050342 1987033 2130885 2152341 2143273 2241286 2110767 2104348 2143425 2179765 2132926
14711 2132926 2235516 2236280 2183359 2153623 2236143 2118194 2117720 2154405 2189173 2245483 2182016 2067844
14699 2067844 2165552 2116060 2038243 2164101 2126117 2179785 2185967 2053911 2090222 2045640 2116425
14688 2116425 2224290 2162742 2184967 2222596 2218542 2173615 2169900 2260339 2100352 2129222 2252320
14677 2252320 2203795 2175697 2166451 2006571 2073649 2186569 2156999 2178162 2140661 2178289 2181634
14666 2181634 2304909 2202823 2121481 2279307 2259315 2133626 2185256 2218853 2145657 2187389
14656 2187389 2205824 2109565 2130544 2225347 2130853 2140757 2279888 2182568 2180665 2242795 2123823
14645 2123823 2054258 2050817 2078888 2160807 2220039 2322922 2115162 2095517 2121444 2090915 2215681
14634 2215681 2195091 2144668 2217334 2245566 2197286 2118934 2127300 2134524 2107385 2201538 2212169 2168322
14622 2168322 2133659 2038160 2095238 2080215 2104277 2203954 2103397 2062392 2019772 2123581 2257193
14611 2257193 2223186 2251525 2296315 2198143 2156629 2128720 2214283 2193797 2116436 2243988 2241647
14600 2241647 2233628 2255552 2216711 2157788 2217341 2283448 2260664 2153556 2278671 2184075 2099200
14589 2099200 2279276 2241793 2129414 2250128 2247287 2181490 2195500 2225359 2262748 2273746 2292502
14578 2292502 2158982 2156660 2245527 2221163 2291446 2272374 2215128 2260548 2264257 2307165 2214856
14567 2214856 2314675 2369412 2241855 2276530 2292610 2210958 2124426 2169550 2214779 2154313 2197574
14556 2197574 2272098 2175304 2188722 2158897 2236826 2336878 2326809 2234147 2115004 2178233 2152148
14545 2152148 2164045 2284649 2103161 2116516 2313895 2170044 2169442 2282314 2309986 2185716
14535 2185716 2250359 2260065 2149774 2102927 2161760 2147055 2148131 2150817 2196530 2278421 2211593 2264398
14523 2264398 2249336 2116650 2189655 2166544 2229192 2228092 2082592 2136220 2162937 2266133 2267170
14512 2267170 2152361 2162245 2190331 2210994 2222172 2186407 2199855 2210357 2182972 2215685 2151985
14501 2151985 2129440 2216140 2184543 2280131 2237974 2194540 2200543 2199969 2192903 2229265 2302096 2322213
14489 2322213 2188184 2228042 2220675 2196028 2219641 2189481 2315282 2268615 2195354 2179815 2153383
14478 2153383 2143226 2178350 2196171 2300992 2283944 2304964 2277245 2291579 2253349 2270143 2346995
14467 2346995 2306566 2337926 2358153 2298214 2314287 2263608 2225389 2285602 2259627 2194550 2182613
14456 2182613 2200269 2264480 2309667 2271298 2208262 2250774 2219536 2157183 2314087 2274895 2256230
14445 2256230 2250044 2299046 2251678 2147156 2157891 2177059 2139482 2192011 2264232 2146484 2190835
14434 2190835 2226542 2311669 2321589 2333540 2296673 2270101 2302644 2210841 2139299 2168553 2138397
14423 2138397 2304576 2308395 2202055 2216515 2241507 2266280 2251719 2226382 2254191 2283818 2347409
14412 2347409 2242420 2188823 2233774 2164916 2310040 2331094 2318728 2346553 2342903 2288898 2346821
14401 2346821 2365191 2353260 2219990 2259959 2271438 2186734 2241896 2240816 2105777 2232465 2340847
14390 2340847 2337008 2248162 2279411 2283561 2211638 2255203 2267397 2307738 2288418 2210528 2283187 2280000
14378 2280000 2284586 2383021 2374103 2405582 2319528 2255131 2254039 2144939 2219142 2288577 2199658 2174860
14366 2174860 2211599 2186442 2123503 2143058 2294803 2263415 2211082 2262590 2241291 2280022 2252062
14355 2252062 2213935 2192689 2221224 2335815 2307296 2228048 2308151 2298672 2344330 2367035 2310133
14344 2310133 2330095 2281397 2274514 2293976 2240152 2186418 2203786 2318883 2304972 2134867 2256305
14333 2256305 2266558 2212668 2329221 2304882 2295811 2283017 2319869 2293530 2331759 2275577 2256544
14322 2256544 2245548 2345526 2290818 2192685 2269481 2290555 2391253 2352107 2233298 2241994 2286393
14311 2286393 2377061 2305755 2185360 2221883 2282398 2276975 2283828 2319932 2316386 2394096 2476026 2339512
14299 2339512 2331401 2333707 2317807 2330241 2318371 2317641 2356384 2327971 2279766 2279455 2305056 2182944
14287 2182944 2274345 2387647 2411543 2466682 2325667 2319072 2309179 2322938 2430062 2346620 2302054
14276 2302054 2367018 2362350 2423174 2332691 2402648 2352907 2399456 2334813 2272593 2230285 2245168
14265 2245168 2291724 2274046 2242913 2219767 2318088 2265200 2327129 2378161 2365693 2342886 2297535
14254 2297535 2278414 2211774 2197593 2282171 2189649 2200147 2331093 2331480 2373784 2307300 2303620 2343472
14242 2343472 2310770 2402576 2325927 2321525 2321296 2232297 2244382 2238400 2300420 2308076 2306256 2348513
14230 2348513 2442975 2364218 2248495 2245334 2353233 2409936 2373528 2364548 2268719 2372669 2412703
14219 2412703 2349732 2347746 2320698 2269062 2349670 2409487 2353970 2377445 2374702 2384479 2440037 2287436
14207 2287436 2165481 2292458 2322679 2281800 2325581 2238047 2289344 2353227 2329045 2326235 2361947
14196 2361947 2320345 2307099 2358713 2360200 2308980 2392750 2422101 2360232 2410037 2284306 2226171
14185 2226171 2286512 2302338 2270737 2292235 2312257 2311260 2285135 2345060 2333662 2343121 2315501 2226628
14173 2226628 2324811 2411705 2307181 2374377 2347841 2308494 2404955 2393957 2351965 2433320 2479040
14162 2479040 2386711 2303491 2426495 2410365 2447737 2443086 2333035 2355669 2407790 2405991 2380984
14151 2380984 2357106 2319274 2266829 2368824 2354312 2240949 2367667 2329262 2354870 2395534 2380882
14140 2380882 2474071 2457054 2473022 2435149 2331183 2377770 2275162 2353528 2410732 2417433 2427887
14129 2427887 2450315 2410082 2462852 2423238 2454207 2345283 2324266 2445629 2299472 2298394 2362890
14118 2362890 2414494 2418003 2440045 2403737 2337700 2359244 2481490 2400607 2360419 2432973 2443148
14107 2443148 2531635 2450392 2390324 2445896 2369275 2322522 2298015 2317006 2333958 2335362 2402689
$$ [...]
##END NTUPLES=NMR SPECTRUM
##END=
