##TITLE=1H_TG-2292-A4
 CDcl3, 8 sc, 
 25.12.2020
##JCAMPDX= 6.0         $$ Bruker NMR JCAMP-DX V2.0
##DATA TYPE= NMR SPECTRUM
##DATA CLASS= NTUPLES
##ORIGIN= UXNMR, Bruker Analytische Messtechnik GmbH
##OWNER= root
$$ XWIN-NMR		Version 3.5
$$ Fri Dec 25 10:12:09 2020 Russian Standard Time (UT+4h)  she@DPX200
##.OBSERVE FREQUENCY= 200.1315066352
##.OBSERVE NUCLEUS= ^1H
##.ACQUISITION MODE= SIMULTANEOUS
##.ACQUISITION SCHEME= undefined
##.AVERAGES= 8
##.DIGITISER RES= 18
##SPECTROMETER/DATA SYSTEM= spect
##.PULSE SEQUENCE= zg30
##.SOLVENT NAME= CDCl3
##.SHIFT REFERENCE= (INTERNAL, CDCl3, 0, 15.9854)
##AUDIT TRAIL= $$ (NUMBER, WHEN, WHO, WHERE, WHAT)
$$ ##TITLE= Audit trail, XWIN-NMR		Version 3.5
$$ ##JCAMPDX= 5.01
$$ ##ORIGIN= Bruker BioSpin GmbH
$$ ##OWNER= she
$$ F:/spectra/data/she/nmr/H-F/1/pdata/1/auditp.txt
$$ ##AUDIT TRAIL=  $$ (NUMBER, WHEN, WHO, WHERE, WHAT)
(   1,<2020-12-25 10:10:43.54 +0400>,<she>,<DPX200>,
      <created by zg, POWCHK disabled, PULCHK disabled
       configuration hash MD5:
       00 E9 B6 7A A2 85 ED C7 34 08 36 98 17 FE 4E 26
       data hash MD5: 16K
       C8 CB 40 86 D0 63 5A DF 32 DE E2 52 4A 68 09 64>)
(   2,<2020-12-25 10:10:55.92 +0400>,<she>,<DPX200>,
      <Start of raw data processing
       efp BC_mod = 2 LB = 0.24 FT_mod = 6 PKNL = 1 PHC0 = -10756 PHC1 = 1.40095 SI = 16K 
       data hash MD5: 16K
       42 76 07 9E F9 8C 6F 6F DD 15 13 AB 8F 9D 7B 8D>)
(   3,<2020-12-25 10:11:19.84 +0400>,<she>,<DPX200>,
      <pk PHC0 = -8.369409 PHC1 = 12.4 
       data hash MD5: 16K
       BA 4D 1F BB 1B AF 46 C8 34 7E 41 90 08 B5 F5 44>)
(   4,<2020-12-25 10:11:23.14 +0400>,<she>,<DPX200>,
      <abs ABSG = 5 
       data hash MD5: 16K
       FB 32 72 CC 97 A5 82 8B BF F6 90 6F F7 41 EA F3>)
$$ ##END=
$$ 
$$ hash MD5
$$ 90 B3 B9 D3 AC BF A8 68 C7 B2 00 B8 DA 5A AF B2
##$RELAX= 
##$RELAX= 
##$RELAX= 
##$RELAX= 
##$RELAX= 
##$RELAX= 
$$ Bruker specific parameters
$$ --------------------------
##$DU= <F:/spectra>
##$EXPNO= 1
##$NAME= <H-F>
##$PROCNO= 1
##$TYPE= <nmr>
##$USER= <she>
##$AMP= (0..31)
100 100 100 100 100 100 100 100 100 100 100 100 100 100 100 100 100 100 
100 100 100 100 100 100 100 100 100 100 100 100 100 100 
##$AQSEQ= 0
##$AQ_mod= 1
##$AUNM= <au_zg>
##$AUTOPOS= <>
##$BF1= 200.13
##$BF2= 200.13
##$BF3= 200.13
##$BF4= 200.13
##$BF5= 200.13
##$BF6= 200.13
##$BF7= 200.13
##$BF8= 200.13
##$BYTORDA= 1
##$CFDGTYP= 0
##$CFRGTYP= 5
##$CHEMSTR= <none>
##$CNST= (0..31)
1 1 145 1 1 1 1 1 1 1 1 1 1 1 1 1 1 1 1 1 1 1 1 1 1 1 1 1 1 1 1 1 
##$CPDPRG= <>
##$CPDPRG1= <>
##$CPDPRG2= <>
##$CPDPRG3= <>
##$CPDPRG4= <mlev>
##$CPDPRG5= <mlev>
##$CPDPRG6= <mlev>
##$CPDPRG7= <mlev>
##$CPDPRG8= <mlev>
##$CPDPRGB= <>
##$CPDPRGT= <>
##$D= (0..31)
0 1.2 0 0 0 0 0 0 0 0.06 0 0.03 0 0 0 0 0.0002 0 0 0 0 0 0 0 0 0 0 0 0 
0 0 0 
##$DATE= 1608876642
##$DBL= (0..7)
120 120 120 120 120 120 120 120 
##$DBP= (0..7)
150 150 150 150 150 150 150 150 
##$DBP07= 0
##$DBPNAM0= <>
##$DBPNAM1= <>
##$DBPNAM2= <>
##$DBPNAM3= <>
##$DBPNAM4= <>
$$ [...]
##$SUBNAM3= <"">
##$SUBNAM4= <"">
##$SUBNAM5= <"">
##$SUBNAM6= <"">
##$SUBNAM7= <"">
##$SUBNAM8= <"">
##$SUBNAM9= <"">
##$SW= 16.9725356469052
##$SWIBOX= (0..15)
0 0 2 0 0 0 0 0 0 0 0 0 0 0 0 0 
##$SW_h= 3396.73913043478
##$TD= 16384
##$TD0= 1
##$TE= 0
##$TE2= 300
##$TE3= 300
##$TEG= 300
##$TL= (0..7)
0 120 120 120 120 120 120 120 
##$TP= (0..7)
150 150 150 150 150 150 150 150 
##$TP07= 0
##$TPNAME0= <>
##$TPNAME1= <>
##$TPNAME2= <>
##$TPNAME3= <>
##$TPNAME4= <>
##$TPNAME5= <>
##$TPNAME6= <>
##$TPNAME7= <>
##$TPOAL= (0..7)
0.5 0.5 0.5 0.5 0.5 0.5 0.5 0.5 
##$TPOFFS= (0..7)
0 0 0 0 0 0 0 0 
##$TUNHIN= 0
##$TUNHOUT= 0
##$TUNXOUT= 0
##$USERA1= <user>
##$USERA2= <user>
##$USERA3= <user>
##$USERA4= <user>
##$USERA5= <user>
##$V9= 5
##$VALIST= <valist>
##$VCLIST= <CCCCCCCCCCCCCCC>
##$VD= 0
##$VDLIST= <DDDDDDDDDDDDDDD>
##$VPLIST= <PPPPPPPPPPPPPPP>
##$VTLIST= <TTTTTTTTTTTTTTT>
##$WBST= 1024
##$WBSW= 4
##$XGAIN= (0..3)
0 0 0 0 
##$XL= 0
##$YL= 0
##$YMAX_a= 298594
##$YMIN_a= -100406
##$ZGOPTNS= <>
##$ZL1= 120
##$ZL2= 120
##$ZL3= 120
##$ZL4= 120
##$ABSF1= 15.97713
##$ABSF2= -0.995532
##$ABSG= 5
##$ABSL= 3
##$ALPHA= 0
##$AQORDER= 0
##$ASSFAC= 0
##$ASSFACI= 0
##$ASSFACX= 0
##$ASSWID= 0
##$AUNMP= <proc_1d>
##$AZFE= 0.1
##$AZFW= 0.1
##$BCFW= 0
##$BC_mod= 2
##$BYTORDP= 0
##$COROFFS= 0
##$CY= -3
##$DATMOD= 1
##$DC= 0
##$DFILT= <>
##$DTYPP= 0
##$F1P= 0
##$F2P= 0
##$FCOR= 1
##$FTSIZE= 16384
##$FT_mod= 6
##$GAMMA= 0
##$GB= 0
##$INTBC= 1
##$INTSCL= 2.992141e-10
##$ISEN= 128
##$LB= 0.24
##$LEV0= 0
##$LPBIN= 0
##$MAXI= 10000
##$MC2= 0
##$MEAN= 0
##$ME_mod= 0
##$MI= 1.114404
##$NCOEF= 0
##$NC_proc= -8
##$NLEV= 6
##$NOISF1= 3.799351
##$NOISF2= 2.8
##$NSP= 0
##$NTH_PI= 0
##$NZP= 0
##$OFFSET= 15.98542
##$PC= 1
##$PHC0= -10764.37
##$PHC1= 13.80095
##$PH_mod= 1
##$PKNL= yes
##$PPARMOD= 0
##$PSCAL= 0
##$PSIGN= 0
##$REVERSE= no
##$SF= 200.130005842049
##$SI= 16384
##$SIGF1= 3
##$SIGF2= 2
##$SINO= 5.538805
##$SIOLD= 16384
##$SREGLST= <1H.CDCl3>
##$SSB= 0
##$STSI= 16384
##$STSR= 0
##$SW_p= 3396.73913043478
##$SYMM= 0
##$S_DEV= 0
##$TDeff= 16384
##$TDoff= 0
##$TI= <>
##$TILT= no
##$TM1= 0
##$TM2= 0
##$TOPLEV= 0
##$USERP1= <user>
##$USERP2= <user>
##$USERP3= <user>
##$USERP4= <user>
##$USERP5= <user>
##$WDW= 1
##$XDIM= 16384
##$YMAX_p= 420499178
##$YMIN_p= -1419898
$$ End of Bruker specific parameters
$$ ---------------------------------
##NTUPLES= NMR SPECTRUM
##VAR_NAME=  FREQUENCY,     SPECTRUM/REAL,   SPECTRUM/IMAG
##SYMBOL=    X,             R,               I
##VAR_TYPE=  INDEPENDENT,   DEPENDENT,       DEPENDENT
##VAR_FORM=  AFFN,          ASDF,            ASDF
##VAR_DIM=   16384,         16384,           16384
##UNITS=     HZ,            ARBITRARY UNITS, ARBITRARY UNITS
##FACTOR=    0.207333158178281, 1,           1
##FIRST=     3199.16224342728, 0,            0
##LAST=      -197.576887007498, 0,           0
##MIN=       -197.576887007498, -1419898,    0
##MAX=       3199.16224342728, 420499178,    0
$$ Real data points
##PAGE= N=1
##DATA TABLE= (X++(R..R)), XYDATA
$$ [...]
5778A332622k82095L66385K87896o63957j60950N21137j59961l0272L51942m26212
$$ 1332622 1050527 1416912 1704808 1040851 879901 1401038 1241077 1210805 1562747 1136535
5768A136535n6967J53022K9458L41463L6279Q8831m09559M12363L29329k29586
$$ 1136535 1079568 1232590 1262048 1603511 1639790 1728621 1319062 1731425 2060754 1831168
5758A831168j86633k4332O6401l494k36788M5785o3451l38578p9560K4649K1289
$$ 1831168 1644535 1620203 1686604 1683110 1446322 1492107 1428656 1090078 1010518 1035167 1056456
5747A056456N63525k22492j13291J28174k28819j22601K96604J02256l9803J44967
$$ 1056456 1619981 1397489 1284198 1412372 1183553 1060952 1357556 1459812 1420009 1564976
5737A564976L91329k17109n29393L47558K31736J74040M2984q51723k75086L53736
$$ 1564976 1956305 1739196 1209803 1557361 1789097 1963137 2006121 1154398 879312 1233048
5727A233048J09314o7987l3504L02254j18029r8668N12830l19252k60043M6341
$$ 1233048 1342362 1274375 1240871 1543125 1425096 1326428 1839258 1520006 1259963 1306304
5717A306304j39835K47668K31166p2537m68987k99382K15029j80218l20365O05184
$$ 1306304 1166469 1414137 1645303 1572766 1103779 804397 1019426 839208 518843 1124027
5707A124027M36420l24249j80292L81950q8892l72562K25835P0584j70574L53627
$$ 1124027 1560447 1236198 1055906 1437856 1348964 976402 1202237 1272821 1102247 1455874
5697A455874J06702n08423n9817M76639J17211k9917j13687k37561j21795L60900
$$ 1455874 1562576 1054153 994336 1470975 1588186 1558269 1444582 1207021 1085226 1446126
5687A446126J25710l41395Q4221K29147l17598J31099k6518l1492K2530j31347
$$ 1446126 1571836 1230441 1314662 1543809 1226211 1357310 1330792 1299300 1321830 1190483
5677A190483J49577L80263j54576k18809l30747J02937O41244r8879l02709J58370
$$ 1190483 1340060 1720323 1565747 1346938 1016191 1119128 1760372 1661493 1358784 1517154
5667A517154K03473L51889J15294j07832k79009N5570j20994J1019L02827j97794
$$ 1517154 1720627 2072516 2187810 2079978 1800969 1856539 1735545 1746564 2049391 1851597
5657A851597j87376K67417J13046J93839k03809n93118j82192P1779J70110M08839
$$ 1851597 1664221 1931638 2044684 2238523 2034714 1441596 1259404 1331183 1501293 1910132
5647A910132Q9180j31555k40978k59302L4488L68397J9718l69611k52550k22272
$$ 1910132 1999312 1867757 1626779 1367477 1401965 1770362 1790080 1420469 1167919 945647
5637I45647M49680L19176K8733M7860j68516L14734J28088m23653J73803Q5600
$$ 945647 1395327 1714503 1743236 1791096 1622580 1937314 2065402 1641749 1815552 1901152
5627A901152l21957K04482P1067J2795K97899J33300m19440m0928J82553K08085
$$ 1901152 1579195 1783677 1854744 1867539 2165438 2298738 1879298 1838370 2020923 2229008
5617B229008n1999l77219J6975o6782M60338k22641m73067J8001M0287k35864
$$ 2229008 2177009 1799790 1816765 1749983 2210321 1987680 1514613 1532614 1572901 1337037
5607A337037m393L42552r3169n3333K91318J17259m18548j74280j13964J32004
$$ 1337037 1332644 1675196 1582027 1528694 1820012 1937271 1518723 1344443 1230479 1362483
5597A362483J05555J36007r7451j18440L85385r2802M77431P7130q7110l08798
$$ 1362483 1468038 1604045 1506594 1388154 1773539 1680737 2158168 2235298 2148188 1839390
5587A839390j51278P7263n4034J54806j54157R3613n0517l8229j028K25728J41177
$$ 1839390 1688112 1765375 1711341 1866147 1711990 1805603 1755086 1716857 1715829 1941557 2082734
5576B082734K70596J28957k57247k90324k81229L23598m3318j13094j41446m1605
$$ 2082734 2353330 2482287 2225040 1934716 1653487 1977085 1933767 1820673 1679227 1637622
5566A637622K61403L20368k52772O8871k98517j31698l9623l7012K57188L53261
$$ 1637622 1899025 2219393 1966621 2035492 1736975 1605277 1565654 1528642 1785830 2139091
5556B139091j07813R4259J07851m61523M93435j47226p20058K37240J28504M14588
$$ 2139091 2031278 2125537 2233388 1771865 2265300 2118074 1398016 1635256 1763760 2178348
5546B178348j69993m31216J80095j33581l58054J41169O3334n5178J99188o9372
$$ 2178348 2008355 1577139 1757234 1623653 1265599 1406768 1470102 1414924 1614112 1544740
5536A544740L44275J55659J78888n5304p8912J96977j6130m94804n26409k11884
$$ 1544740 1889015 2044674 2223562 2168258 2089346 2286323 2270193 1775389 1248980 1037096
5526A037096N18088J71180L01385K02572k3891l22403m57628L09636M43717o7723
$$ 1037096 1555184 1726364 2027749 2230321 2206430 1884027 1426399 1736035 2179752 2112029
5516B112029J38697L80343l26634k12124K72382k66581J38749M3614k41238R4690
$$ 2112029 2250726 2631069 2304435 2092311 2364693 2098112 2236861 2280475 2039237 2133927
5506B133927k79054L2951L19374K59354L59764k19046l16299J2504k12433k32645
$$ 2133927 1854873 1887824 2207198 2466552 2826316 2607270 2290971 2303475 2091042 1858397
5496A858397K4857K35967q3252J07609J38792k05535k01610j35603j99601M93321
$$ 1858397 1883254 2119221 2035969 2143578 2282370 2076835 1875225 1739622 1540021 2033342
5486B033342R6587J68388l0891J45031j76298n62080p3831J92929P4665L85410
$$ 2033342 2129929 2298317 2267426 2412457 2236159 1674079 1600248 1793177 1867842 2253252
5476B253252N43262l34438n10652N7436M1669l90580J45535k15278l40876J30620
$$ 2253252 2796514 2462076 1951424 2008860 2050529 1659949 1805484 1590206 1249330 1379950
5466A379950j30587L91655M79209l56930l15227L82715k13098r0126P7738K92790
$$ 1379950 1249363 1641018 2120227 1763297 1448070 1830785 1617687 1527561 1605299 1898089
5456A898089K58673j75464K04129K97623m44340o77517L472m6466N22203M6663
$$ 1898089 2156762 1981298 2185427 2483050 2038710 1361193 1364665 1318199 1840402 1887065
5446A887065N7112l68051J02414K43645K65769k21020k68113K50427j64748J65109
$$ 1887065 1944177 1576126 1678540 1922185 2187954 1966934 1698821 1949248 1784500 1949609
5436A949609L48727o61055L23336J79240J52716J12447j7757j65088o8420M3096
$$ 1949609 2298336 1637281 1960617 2139857 2292573 2405020 2387263 2222175 2153755 2196851
5426B196851K44198j84807k61377R0008j14574L99819J61310q7100r7166M7453
$$ 2196851 2441049 2256242 1994865 2084873 1970299 2370118 2531428 2444328 2347162 2394615
5416B394615R3419M35805k98659m60314O7866K23610j7928Q5656Q1077K2252J15659
$$ 2394615 2488034 2923839 2625180 2164866 2232732 2456342 2438414 2524070 2605147 2627399 2743058
5405B743058J42051k49775k72202n77379q729L56375M0025j08633K08902k1820
$$ 2743058 2885109 2635334 2363132 1785753 1777024 2133399 2173424 2064791 2273693 2251873
5395B251873l7000j18770N6561J74977k30953l82252K45308K89004N01708J07057
$$ 2251873 2214873 2096103 2152664 2327641 2096688 1714436 1959744 2248748 2750456 2857513
5385B857513m66234k24144j95389R3799J65006l23485Q4017O14133P74J8565J52147
$$ 2857513 2391279 2167135 1971746 2065545 2230551 1907066 1991083 2605216 2605990 2624555 2776702
5374B776702k83085l2007J12470K45051o6720N9126K05770M923O13271j22209
$$ 2776702 2493617 2461610 2574080 2819131 2752411 2811537 3017307 3022230 3635501 3513292
5364C513292m97599r0751o5877l80137j70645J12648L75130K9580M3177K05999
$$ 3513292 3015693 2924942 2859065 2478928 2308283 2420931 2796061 2825641 2868818 3074817
5354C074817J88278l34809J3475k67466n45621K55890L03476j36742R206N48560
$$ 3074817 3263095 2928286 2941761 2674295 2128674 2384564 2688040 2551298 2560504 3109064
5344C109064j12250M23279n003K3027j75470q3245k09075m55579l9726K23139
$$ 3109064 2996814 3420093 3415090 3438117 3262647 3179402 2970327 2514748 2475022 2698161
5334B698161j23338J69694J67279j64945K65852j550l4419q9173L01126O3624
$$ 2698161 2574823 2744517 2911796 2746851 3012703 3011153 2976734 2887561 3188687 3252311
5324C252311R483M19082k67810l85948K58589K83398j1561l26845k97257J25814
$$ 3252311 3261794 3680876 3413066 3027118 3285707 3569105 3557544 3230699 2933442 3059256
5314C059256K79100j84378J2784K25597L10002k1106M2866J22240o3785l44242
$$ 3059256 3338356 3153978 3166762 3392359 3702361 3681255 3724121 3846361 3782576 3438334
5304C438334l91397L19821K67148k24013N07429k62798k29581J93689k93685j91464
$$ 3438334 3046937 3366758 3633906 3409893 3917322 3654524 3424943 3618632 3324947 3133483
5294C133483J52076M66134Q3725J0401J31889J89359m00653J3821K0302j27191
$$ 3133483 3285559 3751693 3835418 3845819 3977708 4167067 3766414 3780235 3800537 3673346
5284C673346J92583J171k87088k21000O09907R0703J78878J52003j59969j64545
$$ 3673346 3865929 3867100 3580012 3359012 3968919 4059622 4238500 4390503 4230534 4065989
5274D065989j21628K1492M0987K80175K10576L0133j51929K07048L18940o07328
$$ 4065989 3944361 3965853 4006840 4287015 4497591 4527724 4375795 4582843 4901783 4294455
5264D294455N6138L20891K28033K74010L16187R4035l39625k19644l40366m25449
$$ 4294455 4350593 4671484 4899517 5173527 5489714 5583749 5244124 5024480 4684114 4258665
5254D258665J95057Q3548n9457l00888M13669M56371j18463j63338j94541k52788
$$ 4258665 4453722 4537270 4477813 4176925 4590594 5046965 4928502 4765164 4570623 4317835
5244D317835J51042l689l43710L83023J21596K36873j76493j35063j1681M288
$$ 4317835 4468877 4465188 4121478 4504501 4626097 4862970 4686477 4551414 4539733 4544021
5234D544021J64980O6025k57515J71863J3398N3773j95953L26342L95447l89031
$$ 4544021 4709001 4775026 4517511 4689374 4702772 4756545 4560592 4886934 5282381 4893350
5224D893350m05608K71994L6331J18318M0501k75236o532J89938J9494L83706
$$ 4893350 4487742 4759736 4796067 4914385 4954886 4679650 4673118 4863056 4882550 5266256
5214E266256L42106r5333l32851K62879N67557J55275l5610k72955k28653K61310
$$ 5266256 5608362 5513029 5180178 5443057 6010614 6165889 6130279 5857324 5628671 5889981
5204E889981k6420K12368L73407L54041K15972n2288k98826K24880K44869m048
$$ 5889981 5863561 6075929 6449336 6803377 7019349 6967061 6668235 6893115 7137984 7133936
5194G133936J74117N2107O04180M67910M31864J16998P94043O50919J96551P38488
$$ 7133936 7308053 7360160 7964340 8432250 8864114 8981112 9775155 10426074 10622625 11361113
5184A1361113J519293J837213J047099J070521K41348j269472o79359j288671
$$ 11361113 12880406 14717619 15764718 16835239 17076587 15807115 15127756 13839085
5176A3839085q75040N93122L76462O3862L36162Q91163R18622Q47028Q08372n04268
$$ 13839085 12964045 13557167 13933629 13997491 14333653 15224816 16143438 16990466 17798838 17294570
5166A7294570j382819j740378j608329o37264L6358p90325n0035l46882n66752
$$ 17294570 15911751 14171373 12563044 11925780 11962138 11171813 11121778 10774896 10208144
5157A0208144k22987k16873k48817l33304Q738L49764K19608J43169K92597L7687
$$ 10208144 9985157 9768284 9519467 9186163 9194901 9544665 9764273 9907442 10200039 10237726
5147A0237726J49874K48385L88808j53297j80182K14772R65558L95438J66779
$$ 10237726 10387600 10635985 11024793 10871496 10691314 10906086 11871644 12267082 12433861
5138A2433861L63719K31621K6857N45041O69104Q94581J215759P03315J146778
$$ 12433861 12797580 13029201 13056058 13601099 14270203 15164784 16380543 17083858 18230636
5129A8230636J600993K060544J478923Q55565q8675j442433p81851q80442p89703
$$ 18230636 19831629 21892173 23371096 24226661 24137986 22695553 21913702 21033260 20243557
5120B0243557J61568N1662N67037O98424N71132J652618J876799Q49548k45395
$$ 20243557 20405125 20456787 21023824 21722248 22293380 23945998 25822797 26672345 26426950
5111B6426950j532957j773334j776914j020384m92084m63010n06636j017024n39335
$$ 26426950 24893993 23120659 21343745 20323361 19831277 19368267 18861631 17844607 17305272
5102A7305272J25002o31248n87967j31596k09017k50566K23100J96876l70264
$$ 17305272 17430274 16799026 16211059 16079463 15870446 15619880 15842980 16039856 15669592
5093A5669592L26055L32835P6896J48598M02383o767p5968Q65256N68988N51080
$$ 15669592 15995647 16328482 16405378 16553976 16956359 16949592 16873624 17738880 18307868 18858948
5083A8858948L53698P5433M26193K18011L1465J59724m1601j77844m98473m05090
$$ 18858948 19212646 19288079 19714272 19932283 19963748 20123472 20081871 19904027 19405554 19000464
5073A9000464R016J57909J40242j79679L61565K2471L9800J68373k32388L45255
$$ 19000464 19009480 19167389 19307631 19127952 19489517 19511988 19551788 19720161 19487773 19833028
5063A9833028O82522M00844M46150M32203l6567Q55145O28894P15493Q14390K06348
$$ 19833028 20515550 20916394 21362544 21794747 21758180 22613325 23242219 23957712 24772102 24978450
5053B4978450L70789k16542l95680l48576p7966k82046L5868N19648K27870J58038
$$ 24978450 25349239 25132697 24737017 24388441 24310475 24028429 24064297 24583945 24811815 24969853
5043B4969853L74469R24471R91395J060162J266879N58775P71548J312778J681851
$$ 24969853 25344322 26268793 27260188 28320350 29587229 30146004 30917552 32230330 33912181
5034C3912181J227582J258729P23717J04943P1604K15406p42240j538165q70150
$$ 33912181 35139763 36398492 37122209 37227152 37298756 37514162 36771922 35233757 34363607
5025C4363607o03174p86333n93930J03742L7862K2845R36126Q24597P79223J213122
$$ 34363607 33760433 32974100 32380170 32483912 32521774 32544619 33480745 34305342 35084565 36297687
5015C6297687J232363J331569K360882J927574J981268K291512Q90152Q00895
$$ 36297687 37530050 38861619 41222501 43150075 45131343 47422855 48313007 49113902
5007D9113902J66527k85327m0966R89100Q16146J070811J721437J639441J489758
$$ 49113902 49280429 48995102 48954136 49943236 50759382 51830193 53551630 55191071 56680829
4998E6680829J356966R31696J192362J692455R34060J171170J091677J184177
$$ 56680829 58037795 58969491 60161853 61854308 62788368 63959538 65051215 66235392
4990F6235392J037075J646420J393513L31580N78276Q6516n33234q72039n00013
$$ 66235392 67272467 68918887 70312400 70643980 71222256 71308772 70775538 69903499 69403486
4981F9403486J781J405774J759481J681407K319589K464459K298713K139975J424160
$$ 69403486 69405267 70811041 72570522 74251929 76571518 79035977 81334690 83474665 84898825
4972H4898825j063667j192727j966088k429046j911306k630981k898833j908615
$$ 84898825 83835158 82642431 80676343 78247297 76335991 73705010 70806177 68897562
4964F8897562j206025j025197O6787J76728k45173O66081J223318J568893K058556
$$ 68897562 67691537 66666340 66733127 66909855 66664682 67330763 68554081 70122974 72181530
4955G2181530K234674K433582L240632L377841K684581L028432L782400L600247
$$ 72181530 74416204 76849786 80090418 83468259 86152840 89181272 92963672 96563919
4947I6563919M398177N542872M993402N103337M962568M046896L176453K825656
$$ 96563919 100962096 106504968 111498370 116601707 121564275 125611171 128787624 131613280
4939A31613280J099380j13709k046326k337917k350763j433277j396672p02541
$$ 131613280 132712660 132598951 130552625 128214708 125863945 124430668 123033996 122331455
4931A22331455N70583J110471J157215J256019J640245J783901K233731J424919
$$ 122331455 122902038 124012509 125169724 126425743 128065988 129849889 132083620 133508539
4923A33508539O41001K55966l61718j97681O68116L40200K96234j85970m3832
$$ 133508539 134149540 134405506 134043788 133846107 134514223 134854423 135150657 134964687 134920855
4914A34920855l63356n99885j282534j608457j184356j688318j612487j796836
$$ 134920855 134557499 133957614 132675080 131066623 129882267 128193949 126581462 124784626
4906A24784626k092535j511739j723435k541566l483034n396272n852068n473735
$$ 124784626 122692091 121180352 119456917 116915351 113432317 108036045 102183977 96710242
4898I6710242m378662l176581k339025j269095o89290l08479j38334r30256j612252
$$ 96710242 92331580 89154999 86815974 85546879 84857589 84549110 84410776 83480520 81868268
4889H1868268k958751l913950m405771l895945k999859l066311k955928k354848
$$ 81868268 78909517 74995567 70589796 66693851 63693992 60627681 57671753 55316905
4881E5316905j674802j571105j173831r81446j022890p22430l95949K0326Q4252
$$ 55316905 53642103 52070998 50897167 49915721 48892831 48170401 47774452 47794778 47879030
4872D7879030O79951J139023J054280J296552J612374J722429J614525J693309
$$ 47879030 48558981 49698004 50752284 52048836 53661210 55383639 56998164 58691473
4864E8691473J265788P87100m08978j488332k023675k325783k691881k636302
$$ 58691473 59957261 60744361 60335383 58847051 56823376 54497593 51805712 49169410
4856D9169410k654437k201837j954623j918660j237324j308311j717606m57697
$$ 49169410 46514973 44313136 42358513 40439853 39202529 37894218 36176612 35718915
4848C5718915O03l27235l59751J21644n06968L96687R86560O66822J179159K203491
$$ 35718915 35719518 35392283 35032532 35154176 34647208 35043895 36030455 36697277 37876436 40079927
4838D0079927K075283K503427J711671K05808j107840o94374j00194o57799j205546
$$ 40079927 42155210 44658637 46370308 46576116 45468276 44773902 44673708 44015909 42810363
4829D2810363j956956j714180k061255k026476j247098j216746j550151q86099
$$ 42810363 40853407 39139227 37077972 35051496 33804398 32587652 31037501 30151402
4821C0151402m20751n59036j90007j17541l42916N01354O67526M61161J02663
$$ 30151402 29730651 29171615 28981608 28864067 28521151 29022505 29690031 30151192 30253855
4812C0253855J093538J375768J714445K003257J048421l68420j641415j160623
$$ 30253855 31347393 32723161 34437606 36440863 37489284 37120864 35479449 34318826
4804C4318826p41464p93041q11470j254105j259306q59011q46904o42431j068872
$$ 34318826 33577362 32784321 31972851 30718746 29459440 28600429 27753525 27111094 26042222
4795B6042222p08608n3732n11193k08241k1432J9211n12860J74634M02115L1043
$$ 26042222 25333614 25279882 24768689 24560448 24539016 24558227 24045367 24220001 24622116 24653159
4785B4653159O96869J338972J254187R84750K11163j075836j194081j297579j203750
$$ 24653159 25350028 26689000 27943187 28927937 29139100 28063264 26869183 25571604 24367854
4776B4367854n1750p25007n78847K3506p0075j28296j45973j20377m03267J32944
$$ 24367854 24316104 23591097 23012250 23035756 22965681 22837385 22691412 22571035 22167768 22300712
4766B2300712L14487r2155N4828K33430K25607O39712N11772K69169N69989P68879
$$ 22300712 22615199 22523044 22577872 22811302 23036909 23676621 24188393 24457562 25027551 25796430
4756B5796430J259173J537696K225187O71365j225318j309894j096671r41657
$$ 25796430 27055603 28593299 30818486 31489851 30264533 28954639 27857968 26916311
4748B6916311o14272n57873l76717o29902o60856o2679n39538j32094n86718j97428
$$ 26916311 26302039 25744166 25367449 24737547 24076691 24014012 23474474 23342380 22755662 22558234
4738B2558234L89126m31414j19242J9571O53711K49283M25855Q13046j6812J33812
$$ 22558234 22947360 22515946 22396704 22416275 23069986 23319269 23745124 24558170 24541358 24675170
4728B4675170R71503J376782L20093O85512L32378K84974M0672j4189R332j030203
$$ 24675170 25646673 27023455 27343548 28029060 28361438 28646412 28687084 28672895 28682227 27652024
4718B7652024p97548l29664p1460j33679j06716l55951O3658L55703O1300K02922
$$ 27652024 26854476 26524812 26453352 26319673 26212957 25857006 25920664 26276367 26337667 26540589
4708B6540589j76957O87836P46685R57593Q07071N70000O24209Q15852J324640
$$ 26540589 26363632 27051468 27798153 28755746 29562817 30132817 30757026 31572878 32897518
4699C2897518O71603l6866K25495l07138q94994J5768r13368o50014p33773k82285
$$ 32897518 33569121 33532255 33757750 33450612 32555618 32571386 31658018 31008004 30274231 29991946
4689B9991946n73137o22944o7196o62438O0133N88498P9634k70282j39286K38827
$$ 29991946 29418809 28795865 28728669 28066231 28126364 28714862 28794496 28524214 28384928 28623755
4679B8623755L92446J033248P31565K2638M62695N53942M93125Q23082M42640
$$ 28623755 29016201 30049449 30781014 30803652 31266347 31820289 32313414 33136496 33579136
4670C3579136j66390K02691o514k7424p1305M20498L64650O04770N96720N30160
$$ 33579136 33412746 33615437 33608923 33581499 33510194 33930692 34295342 34900112 35496832 36026992
4660C6026992M62540N24486L97243P46157Q67383J307010J434573R37826L60085
$$ 36026992 36489532 37014018 37411261 38157418 39024801 40331811 41766384 42704210 43064295
4651D3064295p96803j570984j282029j145792o36347m34373L5512K45520J48336
$$ 43064295 42267492 40696508 39414479 38268687 37632340 37197967 37233479 37478999 37627335
4642C7627335M74901R29557J541710J437224J440036J136004N02153l67449j423817
$$ 37627335 38102236 39031793 40573503 42010727 43450763 44586767 45088920 44721471 43297654
4633D3297654k388098k177223j465368q56828j072775j119610q50832r84268r92496
$$ 43297654 40909556 38732333 37266965 36410137 35337362 34217752 33366920 32382652 31390156
4624C1390156n3029k71943p53477m92118n67292k34167l070P41106j64532p04241
$$ 31390156 31337127 31065184 30311707 29819589 29252297 29018130 29015060 29756166 29591634 28887393
4614B8887393O72578K61904K09201N02114M96703M43477O46032J104881L02146
$$ 28887393 29559971 29821875 30031076 30533190 31029893 31473370 32119402 33224283 33526429
4605C3526429k34940L16611P13643P52243M83649M85188P78835M53463J051458
$$ 33526429 33291489 33608100 34321743 35073986 35557635 36042823 36821658 37275121 38326579
4596C8326579J846793Q19525P44427J305148Q40684R12819J680803M59508O05220
$$ 38326579 40173372 40992897 41737324 43042472 43883156 44795975 46476778 46936286 47541506
4587D7541506J09830K39598K90274J624637J411623J479991K226531L381787L745296
$$ 47541506 47651336 47890934 48181208 49805845 51217468 52697459 54923990 58305777 62051073
4578F2051073L954781L324684Q48890r32488k266812k909312l731956k347871
$$ 62051073 66005854 69330538 70179428 69246940 66980128 64070816 60338860 57990989
4570E7990989j417208q22451o15496k203k46000N75693J447883J677783K166837
$$ 57990989 56573781 55751330 55135834 55133631 54887631 55463324 56911207 58588990 60755827
4561F0755827K193332P90655j342438l051104l383771k977741k830850k133399
$$ 60755827 62949159 63739814 62397376 59346272 55962501 52984760 50153910 48020511
4553D8020511j481457q74715j4441k05539J23822l10416l14337j491016k074266
$$ 48020511 46539054 45664339 45649898 45444359 45568181 45257765 44943428 43452412 41378146
4544D1378146j651950j739295j331342j180206j126156l81281l76557l66325o72940
$$ 41378146 39726196 37986901 36655559 35475353 34349197 33967916 33591359 33225034 32552094
4535C2552094j99310N5590N8408P3109J66929J06288N24607L93794O328J91654
$$ 32552094 32352784 32408374 32466782 32539891 32706820 32813108 33337715 33731509 33737837 33929491
4525C3929491J14020O43079M86615O52721K06941J31693j53234p89375o79026
$$ 33929491 34043511 34686590 35173205 35825926 36032867 36164560 36011326 35221951 34542925
4516C4542925l52207n17684n85428o15834J39978n10184l37795r49780q27191
$$ 34542925 34190718 33673034 33087606 32471772 32611750 32101566 31763771 30813991 29986800
4507B9986800j27963m25298n51868k71747o5182k59985j53647J56215L56553n43881
$$ 29986800 29858837 29433539 28881671 28609924 28544742 28284757 28131110 28287325 28643878 28099997
4497B8099997J91424K48637M27723J54186K21904j07550L76319M27089N11674
$$ 28099997 28291421 28540058 28967781 29121967 29343871 29236321 29612640 30039729 30551403
4488C0551403M14589K50296N78051N13745K47597O14993L84138L42129K82695
$$ 30551403 30965992 31216288 31794339 32308084 32555681 33170674 33554812 33896941 34179636
4479C4179636N8254L81279l828l25085j215207j106413j80001K22726l49188j3747
$$ 34179636 34237890 34619169 34615341 34290256 33075049 31968636 31788635 32011361 31662173 31648426
4469C1648426k48951p9461J07391K17229j7087R89028P74534J72578R77314J033017
$$ 31648426 31399475 31320014 31427405 31644634 31627547 32616575 33391109 33563687 34541001 35574018
4459C5574018L05569J02159K64335K92767J71717Q50981R41505Q36849M73619
$$ 35574018 35879587 35981746 36246081 36538848 36710565 37561546 38503051 39339900 39813519
4450C9813519N17083N54601q4073p3329j71395J88599K43151L9176l23234N09548
$$ 39813519 40330602 40885203 40801130 40727801 40556406 40745005 40988156 41027332 40704098 41213646
4440D1213646L8978m61491N51535J77314l63528J15863J51922m49700m1077J35336
$$ 41213646 41252624 40791133 41342668 41519982 41156454 41272317 41424239 40974539 40933462 41068798
4430D1068798L20550l83511j03241N61329L16340P11736L46251r3061k65429k66830
$$ 41068798 41389348 41005837 40902596 41463925 41780265 42492001 42838252 42745191 42479762 42212932
4420D2212932m76698j155196j417189j798619j331707r03073m49093n25117p22842
$$ 42212932 41736234 40581038 39163849 37365230 36033523 35130450 34681357 34156240 33433398
4411C3433398o6627J35017R868M26341J87010J51700P57835J344945J299859J069176
$$ 33433398 33366771 33501788 33511656 33937997 34125007 34276707 35034542 36379487 37679346 38748522
4401C8748522J100517J825889K155002K711256L405916K546623J891680M59805
$$ 38748522 39849039 41674928 43829930 46541186 49947102 52493725 54385405 54845210
4393E4845210k314020k658417k562142k587277k073899j385757l06863k4246L6431
$$ 54845210 52531190 49872773 47310631 44723354 42649455 41263698 40956835 40932589 40969020
4384D0969020l78902K9510J234229J815019J313811J293785R07437J125332Q54896
$$ 40969020 40590118 40619628 41853857 43668876 44982687 46276472 47183909 48309241 49164137
4375D9164137N32576j70488j52362N32562J195197K086427K405575L450597L973902
$$ 49164137 49696713 49526225 49373863 49906425 51101622 53188049 55593624 59044221 63018123
4366F3018123L430325K817275L30887k802847m918039m676847l950542l413380
$$ 63018123 66448448 69265723 69596610 66793763 61875724 57198877 53248335 49834955
4358D9834955l019490k352609k693603k307591j134408j465808j545628j027431
$$ 49834955 46815465 44462856 41769253 39461662 38327254 36861446 35315818 34288387
4350C4288387p72959o51725J28147N0361o52094m22839k27755N69255N50997R69568
$$ 34288387 33515428 32863703 32991850 33042211 32390117 31967278 31739523 32308778 32859775 33829343
4340C3829343L89436J67687Q62603J409466J284616R43475J648190N37591j174899
$$ 33829343 34218779 34386466 35249069 36658535 37943151 38886626 40534816 41072407 39897508
4331C9897508j746111n77880p42300o22839k36506P09731Q53904R05088J528922
$$ 39897508 38151397 37573517 36831217 36208378 35971872 36681603 37535507 38440595 39969517
4322C9969517J429193K561878K485684J159667J58578j500572k989537l137602
$$ 39969517 41398710 43960588 46446272 47605939 47764517 46263945 43274408 40136806
4314D0136806k293612j958419j808734j207536p61267o51740K59037j44477o95127
$$ 40136806 37843194 35884775 34076041 32868505 32107238 31455498 31714535 31570058 30874931
4305C0874931L6916O95831P47603k53424m15327o51334m58345n99598k04464N4686
$$ 30874931 30911847 31607678 32355281 32101857 31686530 31035196 30576851 29977253 29772789 29827475
4295B9827475J34478P27059M86029J222507J748133K332188J279847l64008j300867
$$ 29827475 29961953 30689012 31175041 32397548 34145681 36477869 37757716 37393708 36092841
4286C6092841k197351k501824j935177j892663j626998l23440o95132o90259n29631
$$ 36092841 33895490 31393666 29458489 27565826 25938828 25615388 24920256 24229997 23700366
4277B3700366l77353r29216p34882K29948o2513n36530K49915j76885j68913O0046
$$ 23700366 23323013 22393797 21658915 21888863 21826350 21289820 21539735 21362850 21193937 21253983
4267B1253983J13347j65383m98152j42384o4707j61725j39359M88154L56272K06855
$$ 21253983 21367330 21201947 20703795 20561411 20496704 20334979 20195620 20683774 21040046 21246901
4257B1246901M59313O24024J72606Q00263P37908J94355L21175m65934q43624
$$ 21246901 21706214 22330238 22502844 23303107 24041015 24235370 24556545 24090611 23246987
4248B3246987l21834J76670l0449p6302l51086j86032L8991j94301L02864N9709
$$ 23246987 22925153 23101823 23071374 22995072 22643986 22457954 22496945 22302644 22605508 22665217
4238B2665217n44423o60441p3474j11668m28886o54841l58025l08077K99217k2155
$$ 22665217 22120794 21460353 21386879 21275211 20846325 20191484 19833459 19525382 19824599 19802444
4228A9802444J88860l44200r6642M8399L29612K49933m56768j25270J82324K21833
$$ 19802444 19991304 19647104 19550462 19598861 19928473 20178406 19721638 19596368 19778692 20000525
4218B0000525M67472P10410M2931m42839J1374M35211K61019J00659K91773R75982
$$ 20000525 20467997 21178407 21221338 20778499 20789873 21225084 21486103 21586762 21878535 22854517
4208B2854517O94844K5547k5898J81043q8796L21319K42336J34676J005685J436191
$$ 22854517 23549361 23574908 23549010 23730053 23641257 23962576 24204912 24339588 25345273 26781464
4198B6781464J080156J548552J219820L79461m4338n53309m47685j63222m5871
$$ 26781464 27861620 29410172 30629992 31009453 30965115 30411806 29964121 29800899 29755028
4189B9755028N97964L8581l12255M33818N39458J206919R09033N87457L22139
$$ 29755028 30352992 30391573 30079318 30513136 31052594 32259513 33168546 33756003 34078142
4180C4078142l31644k97589j02605M70582P77112l72100m99079j52544n54089
$$ 34078142 33746498 33448909 33346304 33816886 34593998 34221898 33722819 33570275 33016186
4171C3016186j01880R37384Q88111N48360M65822K8160p81567R0742L75969Q232
$$ 33016186 32914306 33851690 34739801 35288161 35753983 35782143 35000576 35091318 35467287 35475519
4161C5475519K33883J4060p57777k58692N12143O24358J000987M73476L57324
$$ 35475519 35709402 35723462 34965685 34706993 35219136 35843494 36844481 37317957 37675281
4152C7675281M60893L41837J360866K220315J829403K191811J481959K91912j76897
$$ 37675281 38136174 38478011 39838877 42059192 43888595 46080406 47562365 47854277 47677380
4143D7677380k90124j699657j434179r99471k23344j21854j90542J142709J589451
$$ 47677380 47387256 45687599 44253420 43253949 43030605 42908751 42718209 43860918 45450369
4134D5450369J661024J521367J262860R38857L00469Q98329K321062K287885J382527
$$ 45450369 47111393 48632760 49895620 50834477 51134946 52033275 54354337 56642222 58024749
4125E8024749P02881O04675J401066J640433Q60246n63289n18666j321771j680884
$$ 58024749 58727630 59332305 60733371 62373804 63234050 62670761 62152095 60830324 59149440
4116E9149440j524809k310968j809748j045850l7888J50560J225375J729898K493186
$$ 59149440 57624631 55313663 53503915 52458065 52420177 52570737 53796112 55526010 58019196
4107E8019196L807711M598432M805430K745130Q78377K45748J531830J131600
$$ 58019196 61826907 66425339 71230769 73975899 74854276 75100024 76631854 77763454
4099G7763454q99665k502953k082839p15735O6244K26034m42707o68753j999947
$$ 77763454 76863789 74360836 72277997 71562262 71628506 71854540 71411833 70743080 68743133
4090F8743133l383346k006070o28966K23651K405360L316490L789065M019097
$$ 68743133 65359787 63353717 62724751 62948402 65353762 68670252 72459317 76478414
4082G6478414K340804J040575L017628N996652P102804N814397L128891K318816
$$ 76478414 78819218 79859793 82877421 88874073 95976877 101791274 104920165 107238981
4074A07238981L432233K163488k621513l065685K21643N91599K63107J151282
$$ 107238981 110671214 112834702 110213189 107147504 107369147 107960746 108223853 109375135
4066A09375135j511639n762535n718005o820156o477018m869483l757352l997492
$$ 109375135 107863496 102100961 96382956 89562800 83085782 78216299 74458947 70461455
4058G0461455m876562m052002k508130j451614j062229N90417J026002K070399
$$ 70461455 65584893 61532891 59024761 57573147 56510918 57101335 58127337 60197736
4050F0197736J673420J954238Q04977k101451k729209l838711l130580j859109
$$ 60197736 61871156 63825394 64630371 62528920 59799711 55961000 52830420 50971311
4042E0971311p64445l82531M1481o59763k360828k571699p09339n73878L67094
$$ 50971311 50206866 49824335 49865816 49206053 46845225 44273526 43564187 42990309 43357403
4033D3357403K14770k190882k592678j624891j042090j901137p75821j82158L81928
$$ 43357403 43572173 41381291 38788613 37163722 36121632 34220495 33444674 33262516 33644444
4024C3644444N86685Q60871Q99287n32097k334524j872959j231704j237562o77986
$$ 33644444 34231129 35092000 35991287 35459190 33124666 31251707 30020003 28782441 28104455
4015B8104455q19056r14697p87372l08817m30031p92084m37855N8497l37779n14471
$$ 28104455 27285399 26370702 25583330 25274513 24844482 24052398 23614543 23673040 23335261 22820790
4005B2820790n73780l39755M2035k37568J05492L52829K23677n9915j02263P672
$$ 22820790 22247010 21907255 21949290 21711722 21817214 22170043 22393720 22333805 22231542 22239214
3995B2239214l10045r8616l79751o02773L34621m5644n98018M96358k33425l3728
$$ 22239214 21929169 21830553 21450802 20848029 21182650 21137006 20538988 21035346 20801921 20768193
3985B0768193J7484L85061r8620O34032J7112k69052J67750J20699k84698J00793
$$ 20768193 20785677 21170738 21072118 21706150 21723262 21454210 21621960 21742659 21457961 21558754
3975B1558754m67894o8811K97369Q731n8289j16326O72248K23131J10399P49310
$$ 21558754 21090860 21022049 21319418 21328149 21269860 21153534 21825782 22048913 22159312 22908622
3965B2908622L7890l58529M98617n5445Q20221L45830M04085O04323N65953P09671
$$ 22908622 22946512 22587983 23086600 23031155 23851376 24197206 24601291 25205614 25771567 26481238
3955B6481238J038627J386168J400551J712775K577530K592433K199888J597314
$$ 26481238 27519865 28906033 30306584 32019359 34596889 37189322 39389210 40986524
3947D0986524J791679L133201L837394J002638j722626l220824m656512m063136
$$ 40986524 42778203 45911404 49748798 50751436 49028810 45807986 41151474 37088338
3939C7088338l157849k323033j846719j270240j103169p78649k4074r35406r94579
$$ 37088338 33930489 31607456 29760737 28490497 27387328 26608679 26584605 25649199 24654620
3930B4654620m18527R2663n8734j59838Q3226L85117J85609K71489J50387O85938
$$ 24654620 24236093 24328756 24270022 24110184 24193410 24578527 24764136 25035625 25186012 25871950
3920B5871950P69080J044490J703146J310850M38725l51776r3425L09973J276559
$$ 25871950 26641030 27685520 29388666 30699516 31138241 30786465 30693040 31003013 32279572
3911C2279572J362450K137650K316157K134502J373426P16607J676233L087879
$$ 32279572 33642022 35779672 38095829 40230331 41603757 42320364 43996597 47084476
3903D7084476N519419O979278L628622l413991o631356n384376l562349k248983
$$ 47084476 52603895 59583173 63211795 59797804 53166448 47782072 44219723 41970740
3895D1970740j315939j026283l83297J59645N53370J483651K783744L221337N041676
$$ 41970740 40654801 39628518 39245221 39404866 39958236 41441887 44225631 47446968 52488644
3886E2488644N762515J239677m780047o002237m787264k723718j441955j282453
$$ 52488644 58251159 59490836 54710789 48708552 43921288 41197570 39755615 38473162
3878C8473162q89620j380863j782877p12667j175421j802254q25767o77117r39954
$$ 38473162 37583542 36202679 34419802 33707135 32531714 30729460 29903693 29226576 28286622
3869B8286622q03874q77360j114826o88626q52246l29518M3773j22090q16784
$$ 28286622 27482748 26605388 25490562 24801936 23949690 23620172 23663945 23541855 22725071
3860B2725071l29109J08051q0970o3681M17756N74558O43423J106161L73294Q17114
$$ 22725071 22395962 22504013 22423043 22359362 22777118 23351676 23995099 25101260 25474554 26291668
3850B6291668J061960P45599Q62950J445311K146653K862513L397598K615151
$$ 26291668 27353628 28099227 28962177 30407488 32554141 35416654 38814252 41429403
3842D1429403J458587J359447J622573K644519L806461L291782J54508k746668
$$ 41429403 42887990 44247437 45870010 48514529 52320990 55612772 55767280 53020612
3834E3020612j648518N29219J475713J51252r67399k210660k164101j811141q59435
$$ 53020612 51372094 51901313 53377026 53528278 52560879 50350219 48186118 46374977 45515542
3825D5515542K52397J521587K709242L018189K926780K094619J664084J860018
$$ 45515542 45767939 47289526 49998768 53016957 55943737 58038356 59702440 61562458
3817F1562458K251826L480871N144147M857011o11161n752050m860241k650455
$$ 61562458 63814284 67295155 72439302 77296313 76685152 70933102 66072861 63422406
3809F3422406j403420j098622j883648j141642q6566o79725q03047o71178P45719
$$ 63422406 62018986 60920364 59036716 57895074 57808508 57128783 56325736 55654558 56400277
3800E6400277R72846n23528p64069J77565J601808J194056O4850N81932J227763
$$ 56400277 57373123 56849595 56085526 56263091 57864899 59058955 59123805 59705737 60933500
3791F0933500J288993j391744m026998l261601j746371J10312M07096N79656J338259
$$ 60933500 62222493 60830749 56803751 53542150 51795779 51906091 52313187 52892843 54231102
3782E4231102J906934K308830L134097M119252M791623N503391P077322Q506641
$$ 54231102 56138036 58446866 61580963 65700215 70491838 75995229 83072551 91579192
3774I1579192J1138382J4911693J9168165K2120632J9355385P108302o123808
$$ 91579192 102717574 117629267 136797432 158918064 178273449 185381751 179257943
3767A79257943j6223016k4335476k2263807j5370672j0109528p723445n811933
$$ 179257943 163034927 138699451 116435644 101064972 90955444 83231999 77420066
3760G7420066l976952k990359l261723m396866m622767l155150k031751j817970
$$ 77420066 73443114 70452755 67191032 62794166 58171399 55016249 52984498 51166528
3752E1166528j330373j080853r83542p46710M50425K60348K72633P72245J201971
$$ 51166528 49836155 48755302 47771760 47025050 47475475 47735823 48008456 48780701 49982672
3743D9982672P43370J111252J486091J273038J693661K069013J379200J472570
$$ 49982672 50726042 51837294 53323385 54596423 56290084 58359097 59738297 61210867
3735F1210867P41632p99140j623633j057340k77235l6306Q053l03296M45420M14988
$$ 61210867 61952499 61153359 59529726 58472386 58195151 58158845 58166898 57863602 58309022 58724010
3725E8724010J111054O83535P53177J32221M96428J840367K612230L814804M675645
$$ 58724010 59835064 60518599 61271776 61403997 61900425 63740792 66353022 70167826 74843471
3716G4843471O112923O324460M975418L461339K716482M252150O524835R876872
$$ 74843471 80956394 87280854 92256272 95717611 98434093 102686243 109211078 119087950
3708A19087950J3048699J6839774J8646877J5146730L294880l585319n629577
$$ 119087950 132136649 148976423 167623300 182770030 186064910 182479591 176850014
3701A76850014j5853444k3179449j9350076j3378895q913737o676692o617264
$$ 176850014 160996570 137817121 118467045 105088150 96174413 89497721 82880457
3694H2880457n383433n313966n487836m774493l756923k700185k090462j466004
$$ 82880457 77497024 72183058 66695222 61920729 58163806 55463621 53373159 51907155
3686E1907155m7179r08303r32447o95030n71397r77695o67766j292322j348627
$$ 51907155 51859976 50951673 50019226 49324196 48752799 47775104 47107338 45815016 44466389
3677D4466389j282936j675292j680464j737436j062519k58448p9191J04392R5331
$$ 44466389 43183453 41508161 39827697 38090261 37027742 36769294 36690103 36794495 36889826
3668C6889826m3293J21946P33613J195745m97740j136999j061001n71091j237678
$$ 36889826 36846533 36968479 37702092 38897837 38400097 37263098 36202097 35631006 34393328
3659C4393328o85839l16340o61784j04655J13372M6006J69990L57677N97087j62573
$$ 34393328 33707489 33391149 32729365 32624710 32738082 32784088 32954078 33311755 33908842 33746269
3649C3746269J17465k82649o7214K22115K61737L59674l14554K09833p6390q1279
$$ 33746269 33863734 33581085 33513871 33735986 33997723 34357397 34042843 34252676 34176286 34095007
3639C4095007J88318N73206P369o64843j085352q51197r25567n51700m67591m12646
$$ 34095007 34283325 34856531 34863900 34199057 33113705 32262508 31336941 30785241 30317650 29905004
3629B9905004q6291q66594l11254j79099m4914j90176N5019m1400K47858K09197
$$ 29905004 29818713 28952119 28640865 28461766 28416852 28226676 28281695 28240295 28488153 28697350
3619B8697350J31996K13169J12565j29006q0076k8966N5753m37792j234467r99112
$$ 28697350 28829346 29042515 29155080 29026074 28945998 28917032 28972785 28534993 27300526 26301414
3609B6301414l63863m55966o14286k24508P366L7154Q1438M15270L20285K09484
$$ 26301414 25937551 25481585 24867299 24642791 24650157 24687311 24768749 25184019 25504304 25713788
3599B5713788N96991J280171J430903J809206J509853K230177J791187J693895
$$ 25713788 26310779 27590950 29021853 30831059 32340912 34571089 36362276 38056171
3591C8056171Q84970O81969R62228J509842K392139K234360Q96025j80246q57498
$$ 38056171 38941141 39623110 40585338 42095180 44487319 46721679 47617704 47437458 46579960
3582D6579960n65986Q0695L51823J281851J298954O69200J371076J920470J344706
$$ 46579960 46013974 46094669 46446492 47728343 49027297 49696497 51067573 52988043 54332749
3573E4332749Q46113L4618j435291j709024p95785q19016o10902l43720J39807
$$ 54332749 55178862 55213480 53778189 52069165 51273380 50454364 49843462 49499742 49639549
3564D9639549N44624Q14338P90765p03584j459031j167363j213095j210804n08778
$$ 49639549 50184173 50998511 51789276 51085692 49626661 48459298 47246203 46035399 45526621
3555D5526621M0468j84865r4491k87645o5353J25085q02025j578243j600974j040251
$$ 45526621 45567089 45382224 45287733 45000088 44934735 45059820 44257795 42679552 41078578 40038327
3545D0038327L55489O9141l58438K87738l7356j19673J89825O47589J327727K005227
$$ 40038327 40393816 40462957 40104519 40392257 40354901 40235228 40425053 41072642 42400369 44405596
3535D4405596K966677K719963K037974j05616l130201l902015k980566j885079
$$ 44405596 47372273 50092236 52130210 52024594 48894393 44992378 42011812 40126733
3527D0126733j283460q43782n77520J35257M07554J158297R32879J404969J482091
$$ 40126733 38843273 37999491 37421971 37557228 37964782 39123079 40055958 41460927 42943018
3518D2943018J957830L041265L662229M597771M881226M416587K640361J215306
$$ 42943018 44900848 47942113 51604342 56202113 61083339 65499926 68140287 69355593
3510F9355593j340875m054773n372435m846019l967804k557864j647865j222068
$$ 69355593 68014718 63959945 58587510 53741491 49773687 47215823 45567958 44345890
3502D4345890m27788K7198K11823J005521J400840J681531K313258L121007M295870
$$ 44345890 43918102 43945300 44157123 45162644 46563484 48245015 50558273 53679280 57975150
3493E7975150N007789N315328N381558L969328K932488K665150J124131p14972
$$ 57975150 62982939 68298267 73679825 77649153 80581641 83246791 84370922 83655950
3485H3655950m401528o182603m820408k927603j175279O22200K567056N072022
$$ 83655950 79254422 73071819 68251411 65323808 64148529 64770729 67337785 72409807
3477G2409807O118985K093458n354651p912359n744750l440094k050744j556535
$$ 72409807 78528792 80622250 75267599 67355240 61610490 58170396 56119652 54563117
3469E4563117n28860P82598J506090K892274M256343L010774K70096j717845k100829
$$ 54563117 54034257 54816855 56322945 59215219 63471562 66482336 66752432 65034587 62933758
3460F2933758j704619j809859j352430j166J070731J980462J694617o1403l150900
$$ 62933758 61229139 59419280 58066850 58065684 59136415 61116877 62811494 62750091 59599191
3451E9599191o192689o809562m341809k715909k274487j528560j012083j139147
$$ 59599191 53406502 46596940 42255131 39539222 37264735 35736175 34724092 33584945
3443C3584945r19065m61787J6340P014J83779k59633r18491r21088q0654m38134
$$ 33584945 32665880 32204093 32220433 32227447 32411226 32151593 31233102 30312014 30231360 29793226
3433B9793226q54133p89308j37308K20556k01365R3809L65873P86619N03163m39013
$$ 29793226 28939093 28149785 28012477 28233033 28031668 28125477 28491350 29277969 29781132 29342119
3423B9342119k00496M34629J32394J11303P82744O75416j37870k75297K34055
$$ 29342119 29141623 29576252 29708646 29819949 30602693 31278109 31140239 30864942 31098997
3414C1098997j7701k73139M05091K10696Q05340J477883J103099P56062K11451
$$ 31098997 31081296 30808157 31213248 31423944 32229284 33707167 34810266 35566328 35777779
3405C5777779k62438k7802k22229j59157O3129p00468l51515J60326L44862N90078
$$ 35777779 35515341 35487539 35265310 35106153 35169282 34468814 34117299 34277625 34622487 35212565
3395C5212565J23482p82491j231099q02114q85020q66489l8825J06270K46334
$$ 35212565 35336047 34553556 33322457 32520343 31635323 30768834 30730009 30836279 31082613
3386C1082613K44022M73758k76106n20262p18512j245304j259225j090466j186569
$$ 31082613 31326635 31800393 31524287 31004025 30285513 29040209 27780984 26690518 25503949
3377B5503949j455719r06642r66886p12800l79979q43253o65596n20164l35127
$$ 25503949 24048230 23141588 22174702 21461902 21081923 20238670 19573074 19052910 18717783
3368A8717783P5291k79987n49572k21233o23462m26293N1057n50578l46175j34158
$$ 18717783 18793074 18513087 17963515 17742282 17118820 16692527 16743584 16193006 15846831 15712673
3358A5712673L29942j46562m92200j66397J53413J36529K22661l14882j71104
$$ 15712673 16042615 15896053 15403853 15237456 15390869 15527398 15750059 15435177 15264073
3349A5264073M94769L71251J13767M28459N07147K39006L55491M59169j00785
$$ 15264073 15758842 16130093 16243860 16672319 17179466 17418472 17773963 18233132 18132347
3340A8132347L77971O23727O33592L56307K05347M54036M76778J24959K92992
$$ 18132347 18510318 19134045 19767637 20123944 20329291 20783327 21260105 21385064 21678056
3331B1678056L72199j26851J71413L29920J026j1478J7948l19981l01239L2944
$$ 21678056 22050255 21923404 22094817 22424737 22425763 22414285 22432233 22112252 21811013 21843957
3321B1843957k30807p4796J12698l30328K96052M44111K20298J140648k44275
$$ 21843957 21613150 21538354 21651052 21320724 21616776 22060887 22281185 23421833 23177558
3312B3177558k24241J08440K26663J4196m59259l12623m10430J29834J43027n05963
$$ 23177558 22953317 23061757 23288420 23302616 22843357 22530734 22120304 22250138 22393165 21887202
3302B1887202m85525m06026n42738j14940m15959o35618j96059K80367Q0717M56910
$$ 21887202 21401677 20995651 20452913 20337973 19922014 19286396 19090337 19370704 19451421 19908331
3292A9908331K80190K32960P0188K59448M50557M67845l72782L72525L60175K77567
$$ 19908331 20188521 20421481 20491669 20751117 21201674 21669519 21296737 21669262 22029437 22307004
3282B2307004J58042N36545J19944K15075Q24115R7602l3680K73597L60874L14716
$$ 22307004 22465046 23001591 23121535 23336610 24160725 24258327 24224647 24498244 24859118 25173834
3272B5173834L70282K76010J48131l46652r6845K71982M39025J92052l1749M93480
$$ 25173834 25544116 25820126 25968257 25621605 25524760 25796742 26235767 26427819 26396070 26889550
3262B6889550O51540P57484O58299L79181q6947J24665M46645K0345Q26229Q34942
$$ 26889550 27541090 28298574 28956873 29336054 29249107 29373772 29820417 29840762 30666991 31501933
3252C1501933O64151J241591J521294J129721J226243P40750Q80026J087753Q90177
$$ 31501933 32166084 33407675 34928969 36058690 37284933 38025683 38905709 39993462 40883639
3243D0883639M09104N66156N88146N00625J114654O89956Q53028O12325K18012
$$ 40883639 41292743 41858899 42447045 42947670 44062324 44752280 45605308 46217633 46435645
3234D6435645M66367R1666M62471J54771M75938m29021l25086N02589K52565j35365
$$ 46435645 46902012 46993678 47456149 47610920 48086858 47657837 47332751 47835340 48087905 47952540
3224D7952540K3401J141050J645113J539483K065444J595704J280165J539954
$$ 47952540 47975941 49116991 50762104 52301587 54367031 55962735 57242900 58782854
3216E8782854J332296J530231J955062K305732L276728L896608M860212N547569
$$ 58782854 60115150 61645381 63600443 65906175 69182903 73079511 77939723 83487292
3208H3487292M531016L425473P14555j486815k120017r52515q03973m503J210460
$$ 83487292 88018308 91443781 92158336 90671521 88551504 87598989 86795016 86790513 88000973
3199H8000973J956884K368726L131589M185805L433054J443774j458541k388766
$$ 88000973 89957857 92326583 95458172 99643977 103077031 104520805 103062264 100673498
3191A00673498j267613m24993Q89337K083508K933217L192716K637136N74682
$$ 100673498 99405885 98980892 99870229 101953737 104886954 108079670 110716806 111291488
3183A11291488j191133j400021j026224j13700J689547K571144L531219N118788
$$ 111291488 110100355 108700334 107674110 107560410 109249957 111821101 115352320 120471108
3175A20471108N349087O241829P654997P052380N334898M952746O362823Q482070
$$ 120471108 125820195 132062024 139717021 146769401 152104299 157057045 163419868 171901938
3167A71901938J1726024J5070626J9187193K4879570K7834780K5777121J3364461
$$ 171901938 183627962 198698588 217885781 242765351 270600131 296377252 309741713
3160C09741713j438141l729451j392865o558838k3225217l0973505k4938761j7774942
$$ 309741713 308303572 304574121 303181256 296622418 273397201 242423696 217484935 199709993
3152A99709993j3069050r944701p175766m669845l355849j436789N58620K387055
$$ 199709993 186640943 176696242 169520476 164850631 161494782 160057993 160616613 163003668
3144A63003668L967802O348761O739193R254210J1865768J4311488J8071846K3288254
$$ 163003668 166971470 173320231 180059424 189313634 201179402 215490890 233562736 256850990
3136B56850990K8929001L4044139L2185451K4328309J6748102J2770440J2082374
$$ 256850990 285779991 319824130 352009581 376337890 393085992 405856432 417938806
3129D17938806K560372j3846939k8961601l1022269k2808884j2589916m390117
$$ 417938806 420499178 406652239 377690638 346668369 323859485 311269569 306879452
3122C06879452J759569P226999J3431295J3479033K747839j2828911k6598381
$$ 306879452 308639021 315866020 329297315 342776348 345524187 332695276 306096895
3115C06096895l1849717k7630820k1442318j6623565j4133921j0907518q831124
$$ 306096895 274247178 246616358 225174040 208550475 194416554 183509036 174677912
3108A74677912p898807n837165l957055l506527j915350k418770l647788m047116
$$ 174677912 166779105 160941940 156984885 153478358 151563008 149144238 145496450 141449334
3100A41449334l499070l155039k368112m75245O39628K386474L668072M773031
$$ 141449334 137950264 134795225 132427113 131951868 132591496 134977970 138646042 143419073
3092A43419073L548966j77473k540202l797359k968684m83459R73939J651034
$$ 143419073 146968039 146790566 144250364 140453005 137484321 137000862 137974801 139625835
3084A39625835K288147J743627K76269l670862n236194o435555p056121o737586
$$ 139625835 141913982 143657609 143933878 140263016 135026822 128591267 121535146 114797560
3076A14797560n953486n523406n086068m239372k946395k441257j417450j584683
$$ 114797560 108844074 103320668 98234600 93995228 91048833 88607576 87190126 85605443
3068H5605443j264190r55733m29271K68044K03018n72539o86796j241678j095866
$$ 85605443 84341253 83385520 82956249 83224293 83427311 82854772 82167976 80926298 79830432
3059G9830432q66875r18314M02278J597577J654607K125851L300660L465865L619761
$$ 79830432 78963557 78045243 78447521 80045098 81699705 83825556 87126216 90592081 94211842
3050I4211842M078070N684685O836004Q928278R787199J2069944J5899892K0499119
$$ 94211842 98289912 103974597 110810601 119738879 129526078 141596022 157495914 177995033
3042A77995033K2900089K0147588Q803985j1719103k7247200k8182648k2521371
$$ 177995033 200895122 221042710 229846695 218127592 190880392 162697744 140176373
3035A40176373j7188189j3513375j0532844r220926p743352n912108m660881m194891
$$ 140176373 122988184 109474809 98941965 89721039 81977687 76065579 71404698 67209807
3027F7209807l846486k930716k509052k328640j622642j898270j153784j018698
$$ 67209807 63363321 60432605 57923553 55594913 53972271 52074001 50920217 49901519
3019D9901519j251004j254512j012379j191005q38992j238377p48987p37407o24562
$$ 49901519 48650515 47396003 46383624 45192619 44353627 43115250 42366263 41628856 41004294
3010D1004294o48673m80670n0191l54543n64185k10731l37538K9274k58362j0458
$$ 41004294 40355621 39874951 39824760 39470217 38906032 38695301 38357763 38387037 38128675 38118217
3000C8118217J72977L55530j96346m11949L2322k76971L23526P67421N462M57223
$$ 38118217 38291194 38646724 38450378 38038429 38070751 37793780 38117306 38884727 38890189 39347412
2990C9347412M03387q2903K69987J53896L57495R7950N37942R97691Q59306J517072
$$ 39347412 39750799 39667896 39937883 40091779 40449274 40547224 41085166 42082857 42942163 44459235
2980D4459235J156095J091512J674750J766910J878390K692172L327997M393018
$$ 44459235 45615330 46706842 48381592 50148502 52026892 54719064 58047061 62440079
2972F2440079N278792N732289O742491Q525733R820145J2839605J6115831J8414621
$$ 62440079 67718871 73451160 80193651 88719384 98539529 111379134 127494965 145909586
2964A45909586J7805500J2766733l204158k1265704k4390332j9247020j3738356
$$ 145909586 163715086 176481819 173277661 152011957 127621625 108374605 94636249
2957I4636249j0195438p952335o502661n388635m945527l631342k823451l080280
$$ 94636249 84440811 76488476 69985815 64597180 59651653 56020311 53196860 50116580
2949E0116580k188095j693995k593945k221605k015584k107977j417130j436499
$$ 50116580 47928485 46234490 43640545 41418940 39403356 37295379 35878249 34441750
2941C4441750j406952r24458m5394O9169p25264o89014r08553l35345l90952k14527
$$ 34441750 33034798 32110340 32064946 32134115 31408851 30719837 29811284 29475939 29084987 28870460
2931B8870460j11539j53880l91478J20739m48248n83767l7019N44839l8253J94021
$$ 28870460 28758921 28605041 28213563 28334302 27886054 27302287 27265268 27810107 27771854 27965875
2921B7965875J81751j87186j225666q73845q85792q54069o18594o84802r92188
$$ 27965875 28147626 27960440 26734774 25860929 24975137 24121068 23502474 22817672 21825484
2912B1825484q70078k99290j04481j19631J181k92124M27131M23377P572j84023
$$ 21825484 20955406 20656116 20551635 20432004 20433185 20141061 20568192 20991569 20999141 20815118
2902B0815118j93026J0910j68255K15392N33533O66632N90061N50010J79686L03929
$$ 20815118 20622092 20633002 20464747 20680139 21213672 21880304 22470365 23020375 23200061 23503990
2892B3503990p9121m04623o44070k09383k71276q45780k76096j30148o65060j1033
$$ 23503990 23424869 23020246 22376176 22166793 21895517 21049737 20773641 20643493 19978433 19967400
2882A9967400j53692l93541k6522N7577K63779R879P2615k94337J71466L38246
$$ 19967400 19813708 19420167 19393645 19451222 19715001 19724880 19797495 19503158 19674624 20012870
2872B0012870L57004O1484j14297n4059M01990M15655P46064Q64194L83804j7172
$$ 20012870 20369874 20431358 20317061 20263002 20664992 21080647 21826711 22690905 23074709 23057537
2862B3057537L05407M82831J80389J6070N2247Q8446M45274J663116O47826M20857
$$ 23057537 23362944 23845775 24026164 24042234 24094481 24182927 24628201 26291317 26939143 27360000
2852B7360000M13967J184038J388130J330571J372060J021813N15272Q31844J239960
$$ 27360000 27773967 28958005 30346135 31676706 33048766 34070579 34585851 35417695 36657655
2843C6657655N89790P64718J247031N81953J344768K271537J995031J967025K094268
$$ 36657655 37247445 38012163 39259194 39841147 41185915 43457452 45452483 47419508 49513776
2834D9513776L073029L103053L167775M448939M705653N438869P245566Q587502
$$ 49513776 52586805 55689858 58857633 63306572 68012225 73451094 80696660 89284162
2826H9284162R643155J1506823J4567212J7783142K3019265L0644562L6090368
$$ 89284162 98927317 110434140 125001352 142784494 165803759 196448321 232538689
2819B32538689L6037470K6401665q419368m5407510m5509181l1460226k1606134
$$ 232538689 268576159 294977824 286558456 241150946 195641765 164181539 142575405
2812A42575405j5324936j2259045r922680p760978n605346l388350k794784l172179
$$ 142575405 127250469 114991424 105068744 97307766 91702420 88314070 85519286 82347107
2804H2347107n735110o752389n423445m001726l411388l111425k927384k543907
$$ 82347107 76611997 69859608 64436163 60434437 57023049 53911624 50984240 48440333
2796D8440333k123443j194300r15404j104344k47500m41101l56988M13820J190713
$$ 48440333 46316890 45122590 44207186 43102842 42855342 42414241 42057253 42471073 43661786
2787D3661786R01944J748513K665194J854965K94488j998774l024681l437607
$$ 43661786 44563730 46312243 48977437 50832402 51126890 49128116 46103435 42665828
2779D2665828j965558j549860j039794m16400J60055J128149O10462J116517J544879
$$ 42665828 40700270 39150410 38110616 37694216 37854271 38982420 39592882 40709399 42254278
2770D2254278J88725j536881m88614k94474L20455J165956J817679J820470J830473
$$ 42254278 42443003 40906122 40417508 40123034 40443489 41609445 43427124 45247594 47078067
2761D7078067P33577j999299l377472k248128j648341n95611k27817N80848J26493
$$ 47078067 47811644 45812345 42434873 40186745 38538404 37942793 37714976 38295824 38422317
2752C8422317K58113J171010J167705n96197j891331j972865j630552m22736N338
$$ 38422317 38680430 39851440 41019145 40422948 38531617 36558752 34928200 34505464 34510802
2743C4510802N43263R10194J506812Q27935R8353j525919k989200k623360j233868
$$ 34510802 35054065 35964259 37471071 38299006 38397359 36871440 33882240 31258880 30025012
2734C0025012r16021p90415j17560j48229k09065j41120k9530o18866j813845
$$ 30025012 29108991 28318576 28201016 28052787 27843722 27702602 27673072 27054206 25240361
2725B5240361j272528j644531j501124o21902m88744j289543m70231N39669k28197
$$ 25240361 23967833 22323302 20822178 20200276 19711532 18421989 17951758 18491427 18263230
2716A8263230j72503M02778N98684L63339K94477J372468J139710R99317P83890
$$ 18263230 18090727 18493505 19092189 19455528 19750005 21122473 22262183 23261500 24045390
2707B4045390K45073j070100j689962j877431k413794j406677m33820l73768j108251
$$ 24045390 24290463 23220363 21530401 19652970 17239176 15832499 15398679 15024911 13916660
2698A3916660m65571n65774o04857m5447n7198j015202j87367J7251m68332k50740
$$ 13916660 13451089 12885315 12280458 12235011 12177813 11162611 10975244 10992495 10524163 10273423
2688A0273423K5274n87494q20554J11453J73154l53430k94914r3803j25895p7389
$$ 10273423 10298697 9711203 8890649 9002102 9175256 8821826 8526912 8433109 8307214 8229825
2678H229825N31587l35268m32604K33864j63827k50000m03122l74531n12985j62622
$$ 8229825 8761412 8426144 7993540 8227404 8063577 7813577 7410455 7035924 6522939 6360317
2668F360317Q68269L92659m88107K2025l66731k77967M44701N28585J42977l18841
$$ 6360317 7228586 7621245 7133138 7155163 6788432 6510465 6955166 7483751 7626728 7307887
2658G307887k19603J0088J6422j63263N69514m08564J09670K67450r7691m94968
$$ 7307887 7088284 7098372 7114794 6951531 7521045 7112481 7222151 7489601 7391910 6896942
2648F896942J93746k4281Q5625L43573M93797j81929m11090m865J23240L31891
$$ 6896942 7090688 7066407 7152032 7495605 7989402 7807473 7396383 7391518 7514758 7846649
2638G846649j54791o78717Q9343O67064m1024J19024K40737L74920m7661O78095
$$ 7846649 7691858 7013141 7102484 7769548 7728524 7847548 8088285 8463205 8415544 9093639
2628I093639N3098L75914L18099J44156O10404P86314R04747O02295O59778J249109
$$ 9093639 9146737 9522651 9840750 9984906 10595310 11381624 12286371 12888666 13548444 14797553
2618A4797553J746646J589600J180263N64558o82530r73914j246007j640060j470409
$$ 14797553 16544199 18133799 19314062 19878620 19196090 18222176 16976169 15336109 13865700
2609A3865700p83847r07876O4079m88760l05096j63316j6732J58028O65865Q54367
$$ 13865700 13081853 12173977 12238056 11749296 11444200 11280884 11264152 11422180 12088045 12942412
2599A2942412N91064J063719J001614J262117J101229j0494m85540j027455j121478
$$ 12942412 13533476 14597195 15598809 16860926 17962155 17951661 17466121 16438666 15317188
2590A5317188r70723p14754l39354l33591l77998p2681N21610K63426L28531N30926
$$ 15317188 14346465 13631711 13292357 12958766 12580768 12508087 13029697 13293123 13621654 14152580
2580A4152580J406862J533355J283660P29163L59754o66483j384287j618080k044075
$$ 14152580 15559442 17092797 18376457 19105620 19465374 18798891 17414604 15796524 13752449
2571A3752449j145041q15608q16042j48860Q2014n72820j96839J23833K51662
$$ 13752449 12607408 11791800 10975758 10826898 10908912 10336092 10139253 10263086 10514748
2562A0514748L38051O08261P90698K08841Q73038P91333P39990J97923j096268
$$ 10514748 10852799 11461060 12251758 12460599 13333637 14124970 14864960 15062883 13966615
2553A3966615j525551j687911j270909j068687l76806l11480j70876r0722o58111
$$ 13966615 12441064 10753153 9482244 8413557 8036751 7725271 7554395 7463673 6805562
2544F805562j94324j45452l86605o32199P8989l66286m80650j01298O0374K14013
$$ 6805562 6611238 6465786 6079181 5446982 5525971 5159685 4679035 4577737 4638111 4852124
2534D852124j96638l18622k30775Q6343L20273j7880n58944k30546J09970L31920
$$ 4852124 4655486 4336864 4106089 4192432 4512705 4494825 3935881 3705335 3815305 4147225
2524D147225r9304Q0389R0027l01812J43458m1819n58805K95902K55369l1175
$$ 4147225 4047921 4128310 4218337 3916525 4059983 4018164 3459359 3755261 4010630 3979455
2514C979455K47326L34043l47604l24843L20693j8994L48408O04241L00115K29234
$$ 3979455 4226781 4560824 4213220 3888377 4209070 4190076 4538484 5142725 5442840 5672074
2504E672074j98167p47339j01964k04232r2320j62083k61610k94400Q2537J57294
$$ 5672074 5473907 4726568 4624604 4420372 4328052 4165969 3904359 3609959 3692496 3849790
2494C849790p98824O1056L53719K17399l6606j68777l64061J83303L76758m37276
$$ 3849790 3050966 3112022 3465741 3683140 3646534 3477757 3113696 3296999 3673757 3236481
2484C236481m46280Q734j29927P2272k4454l61935k9413Q1218K23360p8026J69647
$$ 3236481 2790201 2798935 2669008 2741280 2716826 2354891 2325478 2406696 2630056 2552030 2721677
2473B721677j31060k48521k24593K38536J46395L18968m23908k4401j46425j00775
$$ 2721677 2590617 2342096 2117503 2356039 2502434 2821402 2397494 2373093 2226668 2125893
2463B125893O3756r1624k55281J10344L36425k59621Q21778J79654r29602J17163
$$ 2125893 2189649 2098025 1842744 1953088 2289513 2029892 2851670 3031324 2101722 2218885
2453B218885K13954l86758P9776J37709o2896K86711K11760k1503j87035K52914
$$ 2218885 2432839 2046081 2125857 2263566 2200670 2487381 2699141 2677638 2490603 2743517
2443B743517j49589p62174K22214N44295J64548k45618J05855j393n17413r2852
$$ 2743517 2593928 1831754 2053968 2598263 2762811 2517193 2623048 2621655 2104242 2011390
2433B011390J84211R122l62750J12483j65904J82343L80471j10159m99065K70082
$$ 2011390 2195601 2204723 1841973 1954456 1788552 1970895 2351366 2241207 1742142 2012224
2423B012224K94868o19633K27891J14381o2118J55133N49629l16258j86689j58906
$$ 2012224 2307092 1687459 1915350 2029731 1967613 2122746 2672375 2356117 2169428 2010522
2413B010522Q2557K88550N1604m16198k89125L43726k28011J92902R1599r7680
$$ 2010522 2093079 2381629 2433233 2017035 1727910 2071636 1843625 2036527 2128126 2030446
2403B030446J77746m28009l9870K1390M64332l60394k92729J41318J7731J18277
$$ 2030446 2208192 1780183 1740313 1761703 2226035 1865641 1572912 1714230 1731961 1850238
2393A850238k43547M345L98407L22991m04839m50635L6821J65676p8452K42404
$$ 1850238 1606691 1611036 2009443 2332434 1927595 1476960 1513781 1679457 1601005 1843409
2383A843409M4180o8028l1712M9652J68840r2651J22810k10760O4027j90331K29871
$$ 1843409 1887589 1819561 1787849 1837501 2006341 1913690 2036500 1825740 1889767 1699436 1929307
2372A929307P42719k89001P2143k18478J09928J93861p12606l2969K26729l04997
$$ 1929307 2672026 2383025 2455168 2236690 2346618 2540479 1827873 1794904 2021633 1716636
2362A716636O7104L44153k77796J89936J59571k07987j13592m3995K8900K70530
$$ 1716636 1783740 2127893 1850097 2040033 2199604 1991617 1878025 1834030 1862930 2133460
2352B133460L36614M21916m22135m55645O3115q6614L66651m6451j39781m49465
$$ 2133460 2470074 2891990 2469855 2014210 2077325 1990711 2357362 2310911 2171130 1721665
2342A721665J076M66147K25816Q3868l39230J02031M5343k69720j69130J25865
$$ 1721665 1722741 2188888 2414704 2498572 2159342 2261373 2306716 2036996 1867866 1993731
2332A993731k96926O8893J02941j19817m6295j85815L89298J16855m1695j23246
$$ 1993731 1696805 1765698 1868639 1748822 1702527 1516712 1906010 2022865 1981170 1857924
2322A857924k29832O19413l0769k55064j41328q3319J24572j10762K00380L01998
$$ 1857924 1628092 2247505 2216736 1961672 1820344 1737025 1861597 1750835 1951215 2253213
2312B253213k1488m22224M63174M0907m44962r6638K48469j76874P60582O61761
$$ 2253213 2231725 1809501 2272675 2313582 1868620 1771982 2020451 1843577 2604159 3265920
2302C265920k94669k52651M85242m9754o45723k20855L10252o9534k94104J69909
$$ 3265920 2971251 2718600 3203842 3154088 2508365 2287510 2597762 2528228 2234124 2404033
2292B404033j79807K3367M77300j32068l61683O3402j51434L05076k1426K43909
$$ 2404033 2224226 2247593 2724893 2592825 2231142 2294544 2143110 2448186 2426760 2670669
2282B670669Q1198l06747J93634K439l88946j06393L51109R1854K43298L82518
$$ 2670669 2751867 2445120 2638754 2641193 2252247 2145854 2496963 2588817 2832115 3214633
2272C214633J04686m01420j20888k73654K12158J96262j33119l2883J93565j7176
$$ 3214633 3319319 2917899 2797011 2523357 2735515 2931777 2798658 2765775 2959340 2942164
2262B942164N44350L10727k91529j32933p7754Q2569K25873J48641j33259J49405
$$ 2942164 3486514 3797241 3505712 3372779 3295025 3377594 3603467 3752108 3618849 3768254
2252C768254k26391J95775N3485J35856L32556k01366J5692L15698k32599J06680
$$ 3768254 3541863 3737638 3791123 3926979 4259535 4058169 4073861 4389559 4156960 4263640
2242D263640R1377l38967K30893N43083L76746J06091m45727J45563N18410k27040
$$ 4263640 4355017 4016050 4246943 4790026 5166772 5272863 4827136 4972699 5491109 5264069
2232E264069k80325K35089N9691l3990O86092J3746l39515K1725J87607M63292
$$ 5264069 4983744 5218833 5278524 5244534 5930626 5944372 5604857 5626582 5814189 6277481
2222F277481N92268O3440p6039j5934K18896N02157J14154M81201m20336j01214
$$ 6277481 6869749 6933189 6857150 6841216 7060112 7562269 7676423 8157624 7737288 7636074
2212G636074L09330J58802q2690M49925k20749j45022J31391L90382J55925J15180
$$ 7636074 7945404 8104206 8021516 8471441 8250692 8105670 8237061 8627443 8783368 8898548
2202H898548J18664K71472K35905l73246L87685m6172M14376J062273J06337r8120
$$ 8898548 9017212 9288684 9524589 9151343 9539028 9492856 9907232 10969505 11075842 10977722
2192A0977722k61778Q2419J70550M49487M32886L77194N55408N48305P83340K46545
$$ 10977722 10715944 10798363 10968913 11418400 11851286 12228480 12783888 13332193 14115533 14362078
2182A4362078l25081l9999M68462O03939N84675M2647N97305R39609R41052O93489
$$ 14362078 14036997 13996998 14465460 15069399 15654074 15696721 16294026 17233635 18174687 18868176
2172A8868176P55920P95038J400711J446058J452080J359663J390775J209266
$$ 18868176 19624096 20419134 21819845 23265903 24717983 26077646 27468421 28677687
2164B8677687M18490K00066j94326j004732j388372j297416j190742j828138j103542
$$ 28677687 29096177 29296243 29101917 28097185 26708813 25411397 24220655 22392517 21288975
2155B1288975j187583j143144l42073q80685o58690n11p251n85115K24598r0471
$$ 21288975 20101392 18958248 18616175 17735490 17076800 17076289 17069038 16483923 16708521 16618050
2145A6618050j203473m63302n00205q1337k0494p75562m60197l28037n97710R2944
$$ 16618050 15414577 14951275 14451070 14369733 14349239 13573677 13113480 12785443 12187733 12280677
2135A2280677M18313N3761j94129q84190l39017l12809l92025j45924j83210j38653
$$ 12280677 12698990 12752751 12558622 11674432 11335415 11022606 10630581 10484657 10301447 10162794
2125A0162794l05237K3874J00599J92448n0857M56918L07137O68259N80141P82930
$$ 10162794 9857557 9881431 9982030 10174478 10123621 10580539 10887676 11555935 12136076 12919006
2115A2919006O84974J043817J88564l96653o92503p23436m15016k0612j89740
$$ 12919006 13603980 14647797 14836361 14439708 13747205 13023769 12608753 12588141 12398401
2106A2398401m09947p77237n61838K78680n7928l30448n01834l60624o44485n67809
$$ 12398401 11988454 11211217 10649379 10928059 10870131 10539683 10037849 9677225 9032740 8464931
2096H464931j35330m25776l61000L92063m63895j61000k24353j43566k6889j29460
$$ 8464931 8329601 7903825 7542825 7934888 7470993 7309993 7085640 6942074 6915185 6785725
2086F785725K00023Q4846m47746m006Q86642M77840L71195O8645k717l73301m57261
$$ 6785725 6985748 7070594 6622848 6618842 7505484 7983324 8354519 8423164 8420447 8047146 7589885
2075G589885R8101n19668K39356n52677n26158k53481J89206j1802n73533k76691
$$ 7589885 7687986 7168318 7407674 6854997 6328839 6075358 6264564 6252762 5679229 5402538
2065E402538j78644k17700r8512Q3933L4892j84420j73916k83744l21585j1900
$$ 5402538 5223894 5006194 4907682 4991615 5026507 4842087 4668171 4384427 4062842 4050942
2055D050942J22295m15701M46843j6220m82725n3838J16670J14215N1428J97863
$$ 4050942 4173237 3757536 4204379 4188159 3705434 3651596 3768266 3882481 3933909 4131772
2045D131772l78996o69427O8255M06514m69345J81439M16101p25126r942P0866
$$ 4131772 3752776 3083349 3151604 3558118 3088773 3270212 3686313 2961187 2951245 3022111
2035C022111o45431j10583K16949J70735J96956K68000l48466R2803k08214j62190
$$ 3022111 2376680 2266097 2483046 2653781 2850737 3118737 2770271 2863074 2654860 2492670
2025B492670Q805n62541J46032M02906l94127N95758j38295m09968P8886j04800
$$ 2492670 2501475 1938934 2084966 2487872 2093745 2689503 2551208 2141240 2220126 2115326
2015B115326L34615N3060L93904m02814r5156K17272j24228q9935J41952M4128
$$ 2115326 2449941 2503001 2896905 2494091 2398935 2616207 2491979 2402044 2543996 2588124
2005B588124n52898R6953N84134k93164p38816l1478J79172l9524K31179o0757
$$ 2588124 2035226 2132179 2716313 2423149 1684333 1652855 1832027 1792503 2023682 1962925
1995A962925k32531K32753J34496m2025L23023j86321j00167Q4112j20243o3379
$$ 1962925 1730394 1963147 2097643 2055618 2378641 2192320 2092153 2176265 2056022 1992643
1985A992643n47970l41122N58947K21872p80182K16844O74831J78844l5062j3487
$$ 1992643 1444673 1103551 1662498 1884370 1104188 1321032 1995863 2174707 2139645 2126158
1975B126158l68083m97049K70604K51468l34933J48882J44380k84734J54774J67690
$$ 2126158 1758075 1261026 1531630 1783098 1448165 1597047 1741427 1456693 1611467 1779157
1965A779157m57297j29867L10878L40841n92526q7744k63013p8745O34822J27749
$$ 1779157 1321860 1191993 1502871 1843712 1251186 1163442 900429 821684 1456506 1584255
1955A584255m20499n87289N55230J73309j56482k43902J5912j68162K07658N39738
$$ 1584255 1163756 576467 1131697 1305006 1148524 904622 920534 752372 960030 1499768
1945A499768k39190m60679K87468J65227m58133R9350J47041n97526M76524O93084
$$ 1499768 1260578 799899 1087367 1252594 794461 893811 1040852 443326 919850 1612934
1935A612934j64415j09828l76335k33120l53278O26929M3416P6938l26530k2345
$$ 1612934 1448519 1338691 962356 729236 375958 1002887 1046303 1123241 796711 774366
1925G74366K233K75604N19052K2752m18348O9676j19351j26706L66738J50309
$$ 774366 776599 1052203 1571255 1594007 1175659 1245335 1125984 999278 1366016 1516325
1915A516325R3681k66761K25048K29786l76398Q7678O7261r8497q526l0746l6175
$$ 1516325 1610006 1343245 1568293 1798079 1421681 1509359 1576620 1478123 1469597 1438851 1402676
1904A402676k03172J20573j28360j40857L74826m71081l91456N05080K84207j55112
$$ 1402676 1199504 1320077 1191717 1050860 1425686 954605 563149 1068229 1352436 1197324
1894A197324n535o8696k72241K51470L83697O048k41827P6830o3114J4140j82824
$$ 1197324 1191789 1123093 850852 1102322 1486019 1492067 1250240 1327070 1263956 1278096 1095272
1883A095272J31677k14909K5567M65581M06028l96262j19102j92502m5017L08549
$$ 1095272 1226949 1012040 1037607 1503188 1909216 1512954 1393852 1201350 1156333 1464882
1873A464882L95037K59937m62956K07087L68750L4979k91867o97966m39471N66813
$$ 1464882 1859919 2119856 1656900 1863987 2232737 2267716 1975849 1277883 838412 1405225
1863A405225O87169L803l62100j80656k54014P6060O80610q7958o89185o7891
$$ 1405225 2092394 2096197 1734097 1553441 1299427 1375487 2056097 1968139 1278954 1211063
1853A211063J73356j7262r4388K79197j53380j57666K39043K06620n8082l61038
$$ 1211063 1384419 1367157 1272769 1551966 1398586 1240920 1479963 1686583 1628501 1267463
1843A267463K70335q7827P29300Q4516p7141J15260k94504K60747L97113l98983
$$ 1267463 1537798 1449971 2179271 2263787 2186646 2301906 2007402 2268149 2665262 2266279
1833B266279J68037j20091M6924L92919N46982m82538j13618l17590j70775K67001
$$ 2266279 2434316 2314225 2361149 2754068 3301050 2818512 2704894 2387304 2216529 2483530
1823B483530l14373M70894o0393l05760L81414l01514j16400P4312J68906k3706
$$ 2483530 2169157 2640051 2579658 2273898 2655312 2353798 2237398 2311710 2480616 2456910
1813B456910m6964P52892j88227M1939K0590J47727Q5514l48157K77615J9607
$$ 2456910 2409946 3162838 2974611 3016550 3037140 3184867 3270381 2922224 3199839 3219446
1803C219446J66634L61480J87412K31310m42417k96021k30677j78970k06464J1243
$$ 3219446 3386080 3747560 3934972 4166282 3723865 3427844 3197167 3018197 2811733 2822976
1793B822976l40307k25272K51255j07453r7677J33806j41686K39519L97490k71518
$$ 2822976 2482669 2257397 2508652 2401199 2303522 2437328 2295642 2535161 2932651 2661133
1783B661133K09331K41644o12116L01281j23515l10194J66483J17846m76136K05214
$$ 2661133 2870464 3112108 2499992 2801273 2677758 2367564 2534047 2651893 2175757 2380971
1773B380971N02879N0721j36834j57844k44734K42573M0327j58614J90401l23876
$$ 2380971 2883850 2934571 2797737 2639893 2395159 2637732 2678059 2519445 2709846 2385970
1763B385970k17400J21901l18191L68095j53036m24497l75005J55005O4235l13952
$$ 2385970 2168570 2290471 1972280 2340375 2187339 1762842 1387837 1542842 1607077 1293125
1753A293125N8857K43842Q2433l5772L50656n20709k99148j56042k78960J11209
$$ 1293125 1351982 1595824 1678257 1642485 1993141 1472432 1173284 1017242 738282 849491
1743H49491K19640j77476l48682J41098o3603L56279j94062k67081k32590p684
$$ 849491 1069131 891655 542973 684071 620468 976747 782685 515604 283014 275330
1733B75330K50465K46614R154n34596M68362j11240j37251N43389M2185l94226
$$ 275330 525795 772409 781563 246967 715329 604089 466838 1010227 1052412 658186
1723F58186K63873L68287k19425j34597r7441j36089J01856L49942K39766O049
$$ 658186 922059 1290346 1070921 936324 838883 702794 804650 1154592 1394358 1400407
1713A400407m21387k54123K44840J72988O621m38391Q2596j04800L22187K81237
$$ 1400407 979020 724897 969737 1142725 1149346 710955 793551 688751 1010938 1292175
1703A292175l06188o1805m51005l03967L94269L87466k56825j25024L30950p1668
$$ 1292175 985987 924182 473177 169210 563479 950945 694120 569096 900046 828378
1693H28378n49367n7574q596j99263M23556K22171K82307l61847K82863J84980
$$ 828378 279011 221437 212841 13578 437134 659305 941612 579765 862628 1047608
1683A047608l87726M6021j78237k27288k26815L37887J73897j51072J33489P1597
$$ 1047608 659882 705903 527666 300378 73563 411450 585347 434275 567764 639361
1673F39361r3924j34322J03377j13479l25053L1385K43361K4412p6909J0519P6603
$$ 639361 545437 411115 514492 401013 75960 107345 350706 375118 298209 308728 385331
1662C85331l79237J2274K23992m50454P7355n3196L25967K48666L89215j3148
$$ 385331 6094 18368 242360 -208094 -130739 -183935 142032 390698 779913 766765
1652G66765m53957k03179j77777L6591m941O16531j07309K94634K84388q42028
$$ 766765 312808 109629 -68148 -31557 -36498 580033 472724 767358 1051746 209718
1642B09718j32754O58598k00798k56971m231M2010p9601j72496K6534J81696J34694
$$ 209718 76964 735562 534764 277793 273562 315572 235971 63475 90009 271705 406399
1631D06399r5750R4868n5700j80727K21376J46709K06023L00600o18310m26507
$$ 406399 310649 405517 349817 169090 390466 537175 743198 1043798 425488 -1019
1621a019k42478J57311k04543N46395M54518m67220O7080j12769J18700j12344
$$ -1019 -243497 -86186 -290729 255666 710184 242964 310044 197275 315975 203631
1611B03631m8209l52886Q107J94856J50864J67929j24150j69913l06187K09183
$$ 203631 155422 -197464 -189357 5499 156363 324292 200142 30229 -275958 -66775
1601f6775j73743k03980P8191N49765M05227q7297k12390R4266l59766k39005
$$ -66775 -240518 -444498 -366307 183458 588685 501388 288998 383264 23498 -215507
1591b15507L42487l76539l8414k3490k024J56070M33115j45354n26132k6132K80573
$$ -215507 126980 -249559 -287973 -311463 -313487 -157417 275698 130344 -395788 -421920 -141347
1580a41347l3800m4484M40035P6497N5526J72771M7246N9926K5288L5555j84022
$$ -141347 -175147 -219631 220404 296901 352427 525198 572444 632370 657658 693213 509191
1569E09191k9229k5168J46737K2441j97874N46791J03241k86965k65123N7896
$$ 509191 479962 454794 601531 623972 426098 972889 1076130 789165 524042 581938
1559E81938m75982J45122L34170J06790K69437j60572l12509l14994R3065m48777
$$ 581938 105956 251078 585248 692038 961475 800903 488394 173400 266465 -182312
1549a82312k22783k076O79971O2203j55467K58282k02914K30975K50552j50757
$$ -182312 -405095 -407171 272800 335003 179536 437818 234904 465879 716431 565674
1539E65674o8783j25998m69091j62301k40065L72499k30166M9392N91719r1942
$$ 565674 496891 370893 -98198 -260499 -500564 -128065 -358231 -308839 282880 190938
1529A90938k19093j77066k67083n69983K98407O00020k3764j89034K32596l72269
$$ 190938 -28155 -205221 -472304 -1042287 -743880 -143860 -167624 -356658 -124062 -496331
1519d96331j32514K10215M5157L14150l14043K23233L59085L84261k08125n54475
$$ -496331 -628845 -418630 -373473 -59323 -373366 -150133 208952 593213 385088 -169387
1509a69387q8412l06124J26453L12764o49m3386M6095L26037l1955j22987L18881
$$ -169387 -257799 -563923 -437470 -124706 -125355 -168741 -122646 203391 171436 48449 367330
1498C67330m09117k28838N6611j23391k96294m9597N62005N15265L769k68062
$$ 367330 -41787 -270625 -214014 -337405 -633699 -683296 -121291 393974 397743 129681
1488A29681K81286o4756r2501p281l50161q5759J54905M15321m6408j7157K34686
$$ 129681 410967 346211 253710 246429 -103732 -189491 -34586 380735 334327 317170 551856
1477E51856R297l51549k24765K08603M39953K18311r3434k52710N2625k68022
$$ 551856 561153 209604 -15161 193442 633395 851706 758272 505562 558187 290165
1467B90165l23601Q9709K08324k0555r526M28193m06521m46811j44855J46397
$$ 290165 -33436 56273 264597 244042 234516 662709 256188 -190623 -335478 -189081
1457a89081l9718J4619k44786J3167J46150j15565l93363n0691l54572K70977
$$ -189081 -228799 -214180 -458966 -445799 -299649 -415214 -808577 -859268 -1213840 -942863
1447i42863N64993m6129j97742J97800j26716j78307N89288j11968k83004r1795
$$ -942863 -377870 -423999 -621741 -423941 -550657 -728964 -139676 -251644 -534648 -626443
1437f26443J8371R2321L72182K99827o6081m30984L25286L97630j11873l52000
$$ -626443 -608072 -515751 -143569 156258 90177 -340807 -15521 382109 270236 -81764
1427h1764j23466M20083M68960J67490M96866m74183n22260M04453k20760n56343
$$ -81764 -205230 214853 683813 851303 1348169 873986 351726 756179 535419 -20924
1417b0924j55007l1535K35602K40614J44444L3837o36800j86333K30917L74531
$$ -20924 -175931 -207466 28136 268750 413194 447031 -189769 -376102 -145185 229346
1407B29346K0629p6572j8898L35086K91707m46261l39678o2733p2531k15818K58524
$$ 229346 249975 173403 154505 489591 781298 335037 -4641 -67374 -139905 -355723 -97199
1396i7199j18828r5166k85625K43755M24194l00051J68843R3883l61764R5486
$$ -97199 -216027 -311193 -596818 -353063 71131 -228920 -60077 33806 -327958 -232472
1386b32472P34189j91178n66729k33227l19015L21479Q657m06095P6288K84282
$$ -232472 501717 310539 -256190 -489417 -808432 -486953 -478296 -884391 -808103 -523821
1376e23821N11602K84905k44014j05861J90961k14950K53606J48038j92369k26104
$$ -523821 -12219 272686 28672 -77189 113772 -101178 152428 300466 108097 -118007
1366a18007k90872P1095K32118Q3361J17614k34062k93580L13512J15964j66396
$$ -118007 -408879 -337784 -105666 -22305 95309 -138753 -432333 -118821 -2857 -169253
1356a69253n4958Q2893n0970O37700m5838n25973l20981J9259M15491J74603O0574
$$ -169253 -224211 -141318 -192288 445412 399574 -126399 -447380 -428121 -12630 161973 222547
1345B22547R5548j09514j6293l68397M06965j16614l1038L4941j85383N50302
$$ 222547 318095 208581 192288 -176109 230856 114242 83204 118145 -67238 483064
1335D83064j4005q5128k40427k9609L24843K73390o19300Q8123J23086r9870M78543
$$ 483064 469059 383931 143504 113895 438738 712128 92828 180951 304037 204167 682710
1324F82710k93406k19954j75256Q9230J67640k43489M60883K09091l68530j31494
$$ 682710 389304 169350 -5906 83324 250964 7475 468358 677449 308919 177425
1314A77425L6789j15382j08545J24990j87372J26614O4790j76709k76595k10919
$$ 177425 214214 98832 -9713 115277 -72095 54519 119309 -57400 -333995 -544914
1304e44914J05238M45711l8048L399k34264n2946K0905j61906L52085m91794k9726
$$ -544914 -439676 6035 -32013 -28614 -262878 -315824 -294919 -456825 -104740 -596534 -626260
1293f26260l53774Q8730K93504J80767J45216L00534J03746l07249j02265j87560
$$ -626260 -980034 -891304 -597800 -417033 -271817 28717 132463 -174786 -277051 -464611
1283d64611P0652J94349J70663J4978J82073K23537l30647n3567O6363k88732
$$ -464611 -393959 -199610 -28947 -13969 168104 391641 60994 7427 73790 -214942
1273b14942K45400K23070K21169K72219j65235p608R3480k48516p7670r1214l63820
$$ -214942 30458 253528 474697 746916 581681 574073 667553 419037 341367 250153 -113667
1262a13667L15248N1331N650n9684o0214k59416K46978L77222n25831n62261P18801
$$ -113667 201581 252912 258562 198878 138664 -120752 126226 503448 -22383 -584644 134157
1251A34157K09593l03555N22181j72583n32234l94642j05928J30756K71553O10643
$$ 134157 343750 40195 562376 389793 -142441 -537083 -643011 -512255 -240702 369941
1241C69941L02418K58899K7142N61224K37524p69450p9759R0622l34097M9935
$$ 369941 672359 931258 958400 1519624 1757148 987698 907939 998561 664464 714399
1231G14399K94195j81244R4012k1446n79886l7208Q82k59351L41516O57933l4354
$$ 714399 1008594 827350 921362 899916 320030 282822 283704 24353 365869 1023802 989448
1220I89448m28235J2862j69373J58996L77051m95719l11513l07118J23825K39022
$$ 989448 561213 574075 404702 563698 940749 445030 133517 -173601 -49776 189246
1210A89246n0163r9131k94343k5166L6063J49753K0825n9075K33950O15313J54037
$$ 189246 139083 39952 -254391 -279557 -243494 -93741 -72916 -131991 101959 717272 871309
1199H71309m7888k50901p67559k27581M76194K77591o8928j91782j62977l58574
$$ 871309 823421 572520 -195039 -422620 53574 331165 262237 70455 -92522 -451096
1189d51096K37516J98513j88086J07747O9796o3236L57226J72693k80101N1808
$$ -451096 -213580 -15067 -203153 -95406 -25610 -88846 268380 441073 160972 212780
1179B12780K5197K33009P7734q82224l72223Q0373K19566J25072L60148K60977
$$ 212780 237977 470986 548720 -333504 -705727 -625354 -405788 -280716 79432 340409
1169C40409m11312k62344K26562L0554J9972N2603j73046L33441J43055j77616
$$ 340409 -70903 -333247 -106685 -76131 -56159 -3556 -176602 156839 299894 122278
1159A22278K4263k65932l05633K09184M19036j96476j85499Q5528K5725N47645
$$ 122278 146541 -119391 -425024 -215840 203196 6720 -178779 -93251 -67526 480119
1149D80119O2575m25533N2036K91049Q6234N9623j29481k25361J214l28093M6309
$$ 480119 542694 117161 169197 460246 546480 606103 476622 251261 252475 -75618 -29309
1138b9309n3935j08051j69841J34163K26771J87094n01M73669P6668J76614j32888
$$ -29309 -83244 -191295 -361136 -226973 -202 186892 186391 660060 736728 913342 780454
1127G80454k77748k06256J85468L20997J57879j677K6217k43603J78718K4898
$$ 780454 502706 296450 481918 802915 960794 959117 985334 741731 920449 945347
1117I45347K18196O6814j14534N3421K8816J86737k60671k5695m27768k73467
$$ 945347 1163543 1230357 1115823 1169244 1198060 1384797 1124126 1098431 670663 397196
1107C97196j65319Q0629k3943K93954N9343k62527J48870K52775j89566l3374
$$ 397196 231877 312506 288563 582517 641860 379333 528203 780978 591412 558038
1097E58038k47166m64578M88327P07655k26941j20819J68862L6347l49992R1624
$$ 558038 310872 -153706 334621 1042276 815335 694516 863378 899725 549733 641357
1087F41357p5186j99698J97249M48905L11238q9566k54606J99J32709M67453O9519
$$ 641357 566171 366473 563722 1012627 1323865 1234299 979693 979892 1112601 1580054 1649573
1076A649573J34459j26231j86851M44717L14725J56895L69699K01906j59757M97520
$$ 1649573 1784032 1657801 1470950 1915667 2230392 2387287 2756986 2958892 2799135 3296655
1066C296655M4394m02727P9768o66994m21361O78155L7904n37775K67293j10916
$$ 3296655 3341049 2938322 3018090 2351096 1929735 2607890 2645794 2108019 2375312 2264396
1056B264396n13971J96555M1550L2230n2486K35243J85598J56896j86035J35529
$$ 2264396 1750425 1946980 1988530 2020760 1968274 2203517 2389115 2546011 2359976 2495505
1046B495505J49953l63376J6170M11534l33792j9373L30129J33122O34427l40471
$$ 2495505 2645458 2282082 2298252 2709786 2375994 2356621 2686750 2819872 3454299 3113828
1036C113828j83781j88733K80124L4695K81190O76329R4171j40617L26322J28427
$$ 3113828 2930047 2741314 3021438 3056133 3337323 4013652 4107823 3967206 4293528 4421955
1026D421955j29719L29505J89375n66358K9859L9418K34915L20157K49195m02056
$$ 4421955 4292236 4621741 4811116 4244758 4274617 4314035 4548950 4869107 5118302 4716246
1016D716246N24667L91311r4315j19975Q0732l86569L52879O06339L93943m73767
$$ 4716246 5240913 5632224 5537909 5417934 5498666 5112097 5464976 6071315 6465258 5991491
1006E991491L18769J97660k5361R727j42688N73639M17141M62847J72258J95615
$$ 5991491 6310260 6507920 6482559 6492286 6349598 6923237 7340378 7803225 7975483 8171098
996H171098j95286L6061O75848M63162N30743L28935R2841J042429R15179n5158
$$ 8171098 7975812 8011873 8687721 9150883 9681626 10010561 10103402 11145831 12061010 12005852
986A2005852Q34114N66781M83407N09341O23273J085834O67529P34054J326909
$$ 12005852 12839966 13406747 13890154 14399495 15022768 16108602 16776131 17510185 18837094
977A8837094J671504J342002P78780J288274J807806J780761K115425K693893
$$ 18837094 20508598 21850600 22629380 23917654 25725460 27506221 29621646 32315539
969C2315539L776035K658657J761232J994147L048783L945190N938195O258050
$$ 32315539 36091574 38750231 40511463 42505610 45554393 49499583 55437778 61695828
961F1695828P248670R354986J1268970J2621481J7086692K2641937L2724278M8228411
$$ 61695828 68944498 78299484 89568454 102189935 119276627 141918564 174642842 222871253
953B22871253N1329206q600503n2436880m6997805l2147809k0073177j6503511
$$ 222871253 274200459 265599956 213163076 166165271 134017462 113944285 97440774
946I7440774j3455647j1093213q848596p461098o142133n010771l456530k738391
$$ 97440774 83985127 72891914 64043318 56582220 50440087 45429316 41972786 39234395
938C9234395j561451o81920j756617l594803k806453k260973j534587j900056
$$ 39234395 37672944 36991024 35234407 31639604 28833151 26572178 25037591 23137535
930B3137535q41882j310584j275690j047167p30160j421319p68879q14519j004246
$$ 23137535 22295653 20985069 19709379 18662212 17932052 16510733 15741854 14927335 13923089
921A3923089n07124k21316n13688j52989j54440m18635m88925j13099k63164l76876
$$ 13923089 13415965 13194649 12680961 12527972 12373532 11954897 11465972 11352873 11089709 10712833
911A0712833m56546L3540o63966l99496l38987o92459O4629j41410o75975k03160
$$ 10712833 10256287 10289827 9625861 9226365 8887378 8194919 8259548 8118138 7442163 7239003
901G239003l74592k05465k72435k12526m88706k43361n27315K76037K07630R2462
$$ 7239003 6864411 6658946 6386511 6173985 5685279 5441918 4914603 5190640 5398270 5490732
891E490732n00822M31172j58085n35053j26474j04447p7742J35234l42866k70822
$$ 5490732 4989910 5421082 5262997 4727944 4601470 4497023 4419281 4554515 4211649 3940827
881C940827r1050J26987j67586r9564j97039j79004L3698q9638j66063R9476J0104
$$ 3940827 3849777 3976764 3809178 3709614 3512575 3333571 3367269 3277631 3111568 3211044 3221148
870C221148m91422R569m03862M31007M32615m4554l94519M36038l79151l05409
$$ 3221148 2729726 2739295 2335433 2766440 3199055 3154501 2759982 3196020 2816869 2511460
860B511460M8537p5064m31678K877M9051l98807K41990l44192K46062L7779Q2151
$$ 2511460 2559997 2484933 2053255 2056132 2105183 1706376 1948366 1604174 1850236 1888015 1970166
849A970166o6354K1158j99644J65897j00483k8741j36893K06399k17327r32J93913
$$ 1970166 1903812 1924970 1725326 1891223 1790740 1761999 1625106 1831505 1614178 1613246 1807159
838A807159K699j56916l76512J27419j7413J81250q4625l45783J79887K96284
$$ 1807159 1809858 1652942 1276430 1403849 1386436 1567686 1483061 1137278 1317165 1613449
828A613449J72037p2776k09387o245R1726J27206n94185L40628K1373P3881l9129
$$ 1613449 1785486 1712710 1503323 1497078 1588804 1716010 1121825 1462453 1483826 1557707 1518578
817A518578m99273k25401j03477j82067K00289N76624J28295j44820O043k57824
$$ 1518578 1019305 793904 690427 508360 708649 1285273 1413568 1268748 1274791 1016967
807A016967j27793l36590Q9096K2379r1067K16376L4120J94823p5763n25458O4967
$$ 1016967 889174 552584 641680 664059 572992 789368 823488 1018311 942548 417090 482057
796D82057M15281J48108K23473l85703l67841L17393k58431j75869K887O76713
$$ 482057 897338 1045446 1268919 883216 515375 832768 574337 398468 401355 1078068
786A078068M5446k03878j88046O356l36605j3495J50028J90857j28194N50060
$$ 1078068 1123514 919636 731590 737946 401341 387846 537874 728731 600537 1150597
776A150597m0812q20323M23850J15191j95270J07809o3691J54999K13840J86620
$$ 1150597 1109785 289462 713312 828503 633233 741042 677351 832350 1046190 1232810
766A232810l12220o1764J12306j44302m43279M54510k84558o7210L90564r4812
$$ 1232810 920590 858826 971132 826830 383551 838061 553503 486293 876857 782045
756G82045j54905j34800J33215n32112k19378J79504P5564m9826k6678P54905
$$ 782045 627140 492340 625555 93443 -125935 53569 129133 79307 52629 807534
746H07534K46046m37997k16716k0239l88718L593J65846m04483L52127R5371j69754
$$ 807534 1053580 615583 398867 378628 -10090 -6497 159349 -245134 106993 202364 32610
735C2610K61207k79057l05645j88571J92281J95392j68560N87956Q3703J79726
$$ 32610 293817 14760 -290885 -479456 -287175 -91783 -260343 327613 411316 591042
725E91042k50681k52355m9606N0096J35399L10624R9615J51654l22982n86091
$$ 591042 340361 88006 38400 88496 223895 534519 634134 785788 462806 -123285
715a23285p4801L19330j02265J02508j67991n0884p9285j01042L45169j52287
$$ -123285 -198086 121244 18979 121487 -46504 -97388 -176673 -277715 67454 -84833
705h4833K01604Q6841n65180K3130l95009L506M30807P66716k13108K40295j11662
$$ -84833 116771 203612 -361568 -338438 -733447 -729941 -299134 467582 254474 494769 383107
694C83107k06294j26513N5494R3145j13803K85551j37366K26587L18948l03527
$$ 383107 176813 50300 105794 198939 85136 370687 233321 459908 778856 475329
684D75329p51657n0725M44058J24697k84636K16336J16085n7621P1011J59632
$$ 475329 -276328 -327053 117005 241702 -42934 173402 289487 231866 302877 462509
674D62509l69647m37316L7781P6876L40408O51497M22713q4694n185L25477m48129
$$ 462509 92862 -344454 -306673 -229797 110611 762108 1184821 1100127 1094942 1420419 972290
663I72290l15912L60679m44878j21429L77230p954m39418Q4380o40357l48843
$$ 972290 656378 1017057 572179 450750 827980 820026 380608 464988 -175369 -524212
653e24212J68062J36452K7375j88461K58810n6656J93198k31248j55634j40808
$$ -524212 -356150 -219698 -192323 -380784 -121974 -178630 14568 -216680 -372314 -513122
643e13122J982J34587m51827j22794N01577J06152K08090R9632k75466l16499
$$ -513122 -511140 -376553 -828380 -951174 -449597 -343445 -135355 -35723 -311189 -627688
633f27688M4126j20323J21873N97210l4947j74179L71210M54560l69049m92162
$$ -627688 -583562 -703885 -582012 15198 -19749 -193928 177282 631842 262793 -229369
623b29369k01829q3370M69177M95583j53264l75120J45155j77834l81919J49612
$$ -229369 -431198 -514568 -45391 450192 296928 -78192 66963 -110871 -492790 -343178
613c43178L81100j59238j97660L21319n6040l7149l9608K22923k59017k46890
$$ -343178 37922 -121316 -318976 2343 -53697 -90846 -130454 92469 -166548 -413438
603d13438q3562j33960j33121l3553Q1980l2558J94012L1260J07676l01380M19478
$$ -413438 -497000 -630960 -764081 -797634 -715654 -748212 -554200 -522940 -415264 -716644 -297166
592b97166k49748j57153j31713K02502K367M84574K50806k36434j61500l93069
$$ -297166 -546914 -704067 -835780 -633278 -630911 -146337 104469 -131965 -293465 -686534
582f86534J3443J81719R0613k24439P3202L8246K16470k09852p6957O08937j20957
$$ -686534 -673091 -491372 -400759 -625198 -551996 -513750 -297280 -507132 -584089 24848 -96109
571i6109q6626n0967J30088m7793j12208n10524L85693M61027l80186K73381j15135
$$ -96109 -182735 -233702 -103614 -151407 -263615 -774139 -388446 72581 -307605 -34224 -149359
560a49359l1038l51199k10456P5537K38152M94290j52849k95321J60682L54174
$$ -149359 -180397 -531596 -742052 -666515 -428363 65927 -86922 -382243 -221561 132613
550A32613n15178K5323M55543n02392j54743K71275K27631k66875K59752L34177
$$ 132613 -382565 -357242 98301 -404091 -558834 -287559 -59928 -326803 -67051 267126
540B67126j68818n57008r110L2664K18658m4343J20494k5435o7835J43738o1628
$$ 267126 98308 -458700 -467810 -435146 -216488 -260831 -140337 -165772 -233607 -89869 -151497
529a51497l80527M25278k99703m91838M64761P4252J48938L54995J2801o19111
$$ -151497 -532024 -106746 -406449 -898287 -433526 -359274 -210336 144659 157460 -461651
519d61651K29735o0966p16673j88094M75256r8747L05558J75731k03448Q3846
$$ -461651 -231916 -292882 -1009555 -1197649 -722393 -821140 -515582 -339851 -543299 -459453
509d59453j28795l90428j05623L71678K80383q9297M03216R4090l77641Q4001
$$ -459453 -588248 -978676 -1084299 -712621 -432238 -521535 -118319 -24229 -401870 -317869
499c17869j83404K23740l64928q1210r8418j22827K78860K97937N0293K76948
$$ -317869 -501273 -277533 -642461 -723671 -822089 -944916 -666056 -368119 -317826 -40878
489d0878J94735k50306l00890q9618k02905j96814L11881L04381k46220j31298
$$ -40878 153857 -96449 -397339 -486957 -689862 -886676 -574795 -270414 -516634 -647932
479f47932Q20841k32281n38405L28657J5803j78708K44871p3834k43355L08720
$$ -647932 172909 -59372 -597777 -269120 -253317 -432025 -187154 -260988 -504343 -195623
469a95623N51000j17020m05412n09799p2209N99031r5432j79576k45085l1145
$$ -195623 355377 238357 -167055 -676854 -749063 -150032 -245464 -425040 -670125 -701270
459g01270L01469j4887N6662J28929j745l2545M9620N0279l33469j03202M65598
$$ -701270 -399801 -414688 -358026 -229097 -230842 -263387 -213767 -163488 -496957 -600159 -134561
448a34561m5326p343l15056j42389J55207R3710J0689L2026L24079n66957O8787
$$ -134561 -179887 -187230 -502286 -644675 -489468 -395758 -385069 -353043 -28964 -595921 -527134
437e27134L41885j08222K68677l81792l68011J22492J49763L6955K27307R3810
$$ -527134 -185249 -293471 -24794 -406586 -774597 -652105 -502342 -465387 -238080 -144270
427a44270p096m22415R702j66522o3715L24127l00021Q2349K58826J45028l05007
$$ -144270 -151366 -573781 -564079 -730601 -794316 -470189 -770210 -687861 -429035 -284007 -589014
416e89014l92237n2002L12708l76562K03549L62449J9628P7025j39544m9406k1343
$$ -589014 -981251 -1033253 -720545 -1097107 -893558 -531109 -511481 -434456 -574000 -623406 -644749
405f44749K41423K82564n3612m25774J89443k82619j79393O38531k72028J21373
$$ -644749 -403326 -120762 -174374 -600148 -410705 -693324 -872717 -234186 -506214 -384841
395c84841N10353O1938l51093j64980j83828L6349L1903J94467L76023k61173
$$ -384841 125512 187450 -163643 -328623 -512451 -476102 -444199 -249732 126291 -134882
385a34882k35791m79990j69332J15070Q3230K51896r6195q9647Q8219p0093O6481
$$ -134882 -370673 -850663 -1019995 -904925 -821695 -569799 -665994 -755641 -667422 -737515 -671034
374f71034J3987q1588l43811J39616j73821M36820J15313j16498J45512j25094
$$ -671034 -657047 -738635 -1082446 -942830 -1116651 -679831 -564518 -681016 -535504 -660598
364f60598O76186j88103m23183l28643l6203l5644M32993L94759j09993l21191
$$ -660598 15588 -172515 -595698 -924341 -960544 -996188 -563195 -168436 -278429 -599620
354e99620J15656J9498j17778n1204J7805N3571O7136M6664k71122J77137l27170
$$ -599620 -483964 -464466 -582244 -633448 -615643 -562072 -494936 -448272 -719394 -542257 -869427
343h69427O3434K26832J6940l5315K3786l50064l23346N17717O52452n523k13969
$$ -869427 -805993 -579161 -562221 -597536 -573750 -923814 -1247160 -729443 -76991 -82514 -296483
332b96483k37221p67k12034J35288L30141Q3396l70495J5727n36273Q4029L39799
$$ -296483 -533704 -534471 -746505 -611217 -281076 -197680 -568175 -552448 -1088721 -1004692 -664893
321f64893M25882j9421j08616N8733j26274n34904L05560J3497j51244M1449L19949
$$ -664893 -239011 -258432 -367048 -308315 -434589 -969493 -663933 -650436 -801680 -760231 -440282
310d40282l62702K3822K0460m54651K4453L64836N46675k42871M41667k09753
$$ -440282 -802984 -779162 -758702 -1213353 -1188900 -824064 -277389 -520260 -78593 -288346
300b88346l56643n47199R3600L59822L95025o28508L78820M21553k76522j71759
$$ -288346 -644989 -1192188 -1098588 -738766 -343741 -972249 -593429 -171876 -448398 -620157
$$ [...]
##END NTUPLES=NMR SPECTRUM
##END=
