##TITLE=1H_TG-2292-A2
 CDCl3, 8 sc, 
 17.12.2020
##JCAMPDX= 6.0         $$ Bruker NMR JCAMP-DX V2.0
##DATA TYPE= NMR SPECTRUM
##DATA CLASS= NTUPLES
##ORIGIN= UXNMR, Bruker Analytische Messtechnik GmbH
##OWNER= root
$$ XWIN-NMR		Version 3.5
$$ Thu Dec 17 11:36:13 2020 Russian Standard Time (UT+4h)  she@DPX200
##.OBSERVE FREQUENCY= 200.1315066352
##.OBSERVE NUCLEUS= ^1H
##.ACQUISITION MODE= SIMULTANEOUS
##.ACQUISITION SCHEME= undefined
##.AVERAGES= 8
##.DIGITISER RES= 18
##SPECTROMETER/DATA SYSTEM= spect
##.PULSE SEQUENCE= zg30
##.SOLVENT NAME= CDCl3
##.SHIFT REFERENCE= (INTERNAL, CDCl3, 0, 15.9844)
##AUDIT TRAIL= $$ (NUMBER, WHEN, WHO, WHERE, WHAT)
$$ ##TITLE= Audit trail, XWIN-NMR		Version 3.5
$$ ##JCAMPDX= 5.01
$$ ##ORIGIN= Bruker BioSpin GmbH
$$ ##OWNER= she
$$ F:/spectra/data/she/nmr/H-F/1/pdata/1/auditp.txt
$$ ##AUDIT TRAIL=  $$ (NUMBER, WHEN, WHO, WHERE, WHAT)
(   1,<2020-12-17 11:35:11.62 +0400>,<she>,<DPX200>,
      <created by zg, POWCHK disabled, PULCHK disabled
       configuration hash MD5:
       00 E9 B6 7A A2 85 ED C7 34 08 36 98 17 FE 4E 26
       data hash MD5: 16K
       1A D9 19 77 63 BD F1 EA 7F 61 FE CD 9B FC 38 A0>)
(   2,<2020-12-17 11:35:13.93 +0400>,<she>,<DPX200>,
      <Start of raw data processing
       efp BC_mod = 2 LB = 0.24 FT_mod = 6 PKNL = 1 PHC0 = -10760.83 PHC1 = 11.60094 SI = 16K 
       data hash MD5: 16K
       DB CA C7 16 7C F7 5E 1A B5 EF 01 F2 F7 A4 11 22>)
(   3,<2020-12-17 11:35:31.50 +0400>,<she>,<DPX200>,
      <pk PHC0 = 2.450928 PHC1 = -3.8 
       data hash MD5: 16K
       C1 49 6A 5A 06 4E 4E 15 33 59 04 61 C0 FD BC 1A>)
(   4,<2020-12-17 11:35:34.50 +0400>,<she>,<DPX200>,
      <abs ABSG = 5 
       data hash MD5: 16K
       7D 5D D8 6A A9 77 F1 63 E4 4A CD 42 40 EE B5 57>)
$$ ##END=
$$ 
$$ hash MD5
$$ 30 17 A8 18 A8 00 39 DD 64 32 50 62 80 D6 15 86
##$RELAX= 
##$RELAX= 
##$RELAX= 
##$RELAX= 
##$RELAX= 
##$RELAX= 
$$ Bruker specific parameters
$$ --------------------------
##$DU= <F:/spectra>
##$EXPNO= 1
##$NAME= <H-F>
##$PROCNO= 1
##$TYPE= <nmr>
##$USER= <she>
##$AMP= (0..31)
100 100 100 100 100 100 100 100 100 100 100 100 100 100 100 100 100 100 
100 100 100 100 100 100 100 100 100 100 100 100 100 100 
##$AQSEQ= 0
##$AQ_mod= 1
##$AUNM= <au_zg>
##$AUTOPOS= <>
##$BF1= 200.13
##$BF2= 200.13
##$BF3= 200.13
##$BF4= 200.13
##$BF5= 200.13
##$BF6= 200.13
##$BF7= 200.13
##$BF8= 200.13
##$BYTORDA= 1
##$CFDGTYP= 0
##$CFRGTYP= 5
##$CHEMSTR= <none>
##$CNST= (0..31)
1 1 145 1 1 1 1 1 1 1 1 1 1 1 1 1 1 1 1 1 1 1 1 1 1 1 1 1 1 1 1 1 
##$CPDPRG= <>
##$CPDPRG1= <>
##$CPDPRG2= <>
##$CPDPRG3= <>
##$CPDPRG4= <mlev>
##$CPDPRG5= <mlev>
##$CPDPRG6= <mlev>
##$CPDPRG7= <mlev>
##$CPDPRG8= <mlev>
##$CPDPRGB= <>
##$CPDPRGT= <>
##$D= (0..31)
0 1.2 0 0 0 0 0 0 0 0.06 0 0.03 0 0 0 0 0.0002 0 0 0 0 0 0 0 0 0 0 0 0 
0 0 0 
##$DATE= 1608190511
##$DBL= (0..7)
120 120 120 120 120 120 120 120 
##$DBP= (0..7)
150 150 150 150 150 150 150 150 
##$DBP07= 0
##$DBPNAM0= <>
##$DBPNAM1= <>
##$DBPNAM2= <>
##$DBPNAM3= <>
##$DBPNAM4= <>
$$ [...]
##$SUBNAM3= <"">
##$SUBNAM4= <"">
##$SUBNAM5= <"">
##$SUBNAM6= <"">
##$SUBNAM7= <"">
##$SUBNAM8= <"">
##$SUBNAM9= <"">
##$SW= 16.9725356469052
##$SWIBOX= (0..15)
0 0 2 0 0 0 0 0 0 0 0 0 0 0 0 0 
##$SW_h= 3396.73913043478
##$TD= 16384
##$TD0= 1
##$TE= 0
##$TE2= 300
##$TE3= 300
##$TEG= 300
##$TL= (0..7)
0 120 120 120 120 120 120 120 
##$TP= (0..7)
150 150 150 150 150 150 150 150 
##$TP07= 0
##$TPNAME0= <>
##$TPNAME1= <>
##$TPNAME2= <>
##$TPNAME3= <>
##$TPNAME4= <>
##$TPNAME5= <>
##$TPNAME6= <>
##$TPNAME7= <>
##$TPOAL= (0..7)
0.5 0.5 0.5 0.5 0.5 0.5 0.5 0.5 
##$TPOFFS= (0..7)
0 0 0 0 0 0 0 0 
##$TUNHIN= 0
##$TUNHOUT= 0
##$TUNXOUT= 0
##$USERA1= <user>
##$USERA2= <user>
##$USERA3= <user>
##$USERA4= <user>
##$USERA5= <user>
##$V9= 5
##$VALIST= <valist>
##$VCLIST= <CCCCCCCCCCCCCCC>
##$VD= 0
##$VDLIST= <DDDDDDDDDDDDDDD>
##$VPLIST= <PPPPPPPPPPPPPPP>
##$VTLIST= <TTTTTTTTTTTTTTT>
##$WBST= 1024
##$WBSW= 4
##$XGAIN= (0..3)
0 0 0 0 
##$XL= 0
##$YL= 0
##$YMAX_a= 668749
##$YMIN_a= -317622
##$ZGOPTNS= <>
##$ZL1= 120
##$ZL2= 120
##$ZL3= 120
##$ZL4= 120
##$ABSF1= 15.98438
##$ABSF2= -0.9882822
##$ABSG= 5
##$ABSL= 3
##$ALPHA= 0
##$AQORDER= 0
##$ASSFAC= 0
##$ASSFACI= 0
##$ASSFACX= 0
##$ASSWID= 0
##$AUNMP= <proc_1d>
##$AZFE= 0.1
##$AZFW= 0.1
##$BCFW= 0
##$BC_mod= 2
##$BYTORDP= 0
##$COROFFS= 0
##$CY= -3
##$DATMOD= 1
##$DC= 0
##$DFILT= <>
##$DTYPP= 0
##$F1P= 0
##$F2P= 0
##$FCOR= 1
##$FTSIZE= 16384
##$FT_mod= 6
##$GAMMA= 0
##$GB= 0
##$INTBC= 1
##$INTSCL= 2.992141e-10
##$ISEN= 128
##$LB= 0.24
##$LEV0= 0
##$LPBIN= 0
##$MAXI= 10000
##$MC2= 0
##$MEAN= 0
##$ME_mod= 0
##$MI= 1.114404
##$NCOEF= 0
##$NC_proc= -5
##$NLEV= 6
##$NOISF1= 3.799351
##$NOISF2= 2.8
##$NSP= 0
##$NTH_PI= 0
##$NZP= 0
##$OFFSET= 15.98438
##$PC= 1
##$PHC0= -10758.38
##$PHC1= 7.80094
##$PH_mod= 1
##$PKNL= yes
##$PPARMOD= 0
##$PSCAL= 0
##$PSIGN= 0
##$REVERSE= no
##$SF= 200.130006049974
##$SI= 16384
##$SIGF1= 3
##$SIGF2= 2
##$SINO= 5.538805
##$SIOLD= 16384
##$SREGLST= <1H.CDCl3>
##$SSB= 0
##$STSI= 16384
##$STSR= 0
##$SW_p= 3396.73913043478
##$SYMM= 0
##$S_DEV= 0
##$TDeff= 16384
##$TDoff= 0
##$TI= <>
##$TILT= no
##$TM1= 0
##$TM2= 0
##$TOPLEV= 0
##$USERP1= <user>
##$USERP2= <user>
##$USERP3= <user>
##$USERP4= <user>
##$USERP5= <user>
##$WDW= 1
##$XDIM= 16384
##$YMAX_p= 495772656
##$YMIN_p= -308159
$$ End of Bruker specific parameters
$$ ---------------------------------
##NTUPLES= NMR SPECTRUM
##VAR_NAME=  FREQUENCY,     SPECTRUM/REAL,   SPECTRUM/IMAG
##SYMBOL=    X,             R,               I
##VAR_TYPE=  INDEPENDENT,   DEPENDENT,       DEPENDENT
##VAR_FORM=  AFFN,          ASDF,            ASDF
##VAR_DIM=   16384,         16384,           16384
##UNITS=     HZ,            ARBITRARY UNITS, ARBITRARY UNITS
##FACTOR=    0.207333158178281, 1,           1
##FIRST=     3198.95401974929, 0,            0
##LAST=      -197.785110685493, 0,           0
##MIN=       -197.785110685493, -308159,     0
##MAX=       3198.95401974929, 495772656,    0
$$ Real data points
##PAGE= N=1
##DATA TABLE= (X++(R..R)), XYDATA
$$ [...]
6131E23543J7398q9369J1402k5531m753Q7656j8433p4650K2955k6466j27512J24567
6119D20807l6597p140J24749J11291j14208j08343l5632M0204J7626j21835J5299
6108C06221N0557J4992N7596j19484K4980j03079P5326J8524n3107p9044J06234
6097B99716j2364L3136M7493r2386J1970q3139Q0335k0289p4389l4744m8493P0369
6085A77215K5088o8559m5996P4064R8504n988L49j0330m7160K243N2371n7811
6073A93990O6264N2823o2512n8927o4648P2604m4723j5237p5044M0379n312J5023
6061A14680n6112J9064J55826j06472J65528n1492o4655N8540j36682m3082J25654
6050A80797o1433n4420k9015n370N5923L212j1743j14869K4228J32972j49976
$$ y = [523543, 540941, 451572, 462974, 437443, 432690, 520346, 501913, 427263, 450218, 423752, 296240, 420807, 384210, 377070, 501819, 613110, 498902, 390559, 354927, 395131, 412757, 290922, 306221, 356778, 371770, 429366, 309882, 334862, 231783, 307109, 325633, 272526, 193482, 299716, 287352, 320488, 367981, 275595, 287565, 204426, 284761, 264472, 190083, 155339, 106846, 177215, 202303, 133744, 87748, 161812, 260316, 254328, 254677, 244347, 197187, 199430, 251801, 193990, 260254, 313077, 250565, 191638, 126990, 199594, 154871, 139634, 64590, 104969, 99657, 114680, 58568, 77632, 233458, 126986, 292514, 241022, 176367, 234907, 98225, 55143, 180797, 119364, 64944, 35929, 30559, 86482, 89694, 77951, -36918, -12690, 120282, -29694]
6039b9694P1295M8147M8841p3707N8224l2960r198R9131k5807q181Q4999l1444
6027A99646j44099P2069M8220p2797p5688n3052J35892l7364n0193M3082N6693
6016A22409P977O1363o4403o1571J79751N5527l4704j85013J538M241m3407J15638
6004A59346P477j7101K6859q8524J4676N4738J691m4988J4406j7424O0334n570
5992A65920M76r7023N5950P9395j21705O7885k1371j8372M1201k4364r4350K3110
5980E6752Q367l1523Q4280m9022r5333q0910J58740M306m0867J2023o1228J07034
5968G2619Q9635k5957j18256N7145K5729J1227N6291o4074O257j984k2319k0373
5956F5940K4624M9131r4500k7665J16676m8881k4121P8294m8176L9443P3124m6933
$$ y = [-29694, 41601, 89748, 138589, 64882, 123106, 90146, 80948, 180079, 154272, 146091, 231090, 199646, 55547, 127616, 175836, 103039, 27351, -25701, 110191, 72827, 22634, 65716, 122409, 130386, 191749, 127346, 65775, 245526, 301053, 266349, 81336, 82874, 87115, 43708, 159346, 166823, 149722, 176581, 88057, 102733, 157471, 159162, 114174, 128580, 111156, 171490, 165920, 166396, 69373, 125323, 204718, 83013, 150898, 129527, 111155, 152356, 127992, 33642, 56752, 65119, 33596, 117876, 68854, -26479, -107389, 51351, 55657, 14790, 26813, -34415, 72619, 162254, 136297, 18041, 75186, 100915, 112142, 168433, 104359, 110616, 108632, 86313, 65940, 90564, 139695, 45195, 17530, 134206, 85325, 61204, 139498, 91322, 130765, 203889, 156956]
5944A56956M341j5813O0907m9955p7803K495l9234J24074K803l8908J43962n4443
5932B19382l039p2798j44647J3604K6958j6274p5925J7756O0442q8349l8812K8618
5920g3084O337J71008J15074j03678k7638N5983l3761J7380N265k3832J9735o8426
5908F0363P6260l3251l2542l0202j22912Q4782m6274R561k7961m971J02803O938
5896D2594K2348n5983M72M8675J39262o4102n5348M3750k1674O0969K7715p1000
5884A17678p5783M5407k5265K3853j4192j23953p4711J33596N0477n7834P4429
5873G3702Q190L2484R962m9109q840J42826P034j22416O8500P8999k8753J291
5861B13870Q9911R512P673Q5341l8019O149K77362n4650P4092J51001p962j27381
$$ y = [156956, 161297, 145484, 206391, 156436, 78633, 81128, 41894, 165968, 168771, 129863, 273825, 219382, 216343, 143545, -1102, 12502, 39460, 23186, -52739, -34983, 25459, -62890, -101702, -73084, -66747, 104261, 219335, 115657, 88019, 144002, 110241, 127621, 132886, 109054, 128789, 60363, 136623, 103372, 70830, 40628, -82284, 2498, -43776, -34215, -62176, -67147, 35656, 42594, 64942, 8959, 9431, 58106, 197368, 133266, 77918, 121668, 99994, 160963, 188678, 117678, 41895, 87302, 62037, 85890, 71698, -52255, -126966, 6630, 57107, -727, 73702, 81892, 114376, 124338, 75229, 66389, 209215, 216249, 93833, 162333, 241332, 212579, 213870, 303781, 313293, 320966, 406307, 368288, 374437, 651799, 597149, 671241, 822242, 814280, 686899]
5849F86899r950j24604p3118j2933j9902m9995l2134L8024q6978j07374j7533
5838A90402k9820K4005k6735k4035m7855p1294p908L1687M8646n3621j6228o395
5826A0849k9532J00133P5187j09815P4842m471j18648m7914j9081R2420K5021
5815D8991J6491l5521p7601M5792O1764J3437j39097k2740P1583N3312n8295K6522
5803D638m5623m9243J15099P9941j29559O1621P7582n5999M4297n6054j45633
5792i8933L8299O4822J1733N7597K8552j51711N9609J28674m1138p7602J376Q7147
5780A08425m3586j5059j01362Q109Q5248p5472P1425N6552l1231k0151M0234p1348
5768A1784k1025R934m2471J993J52514j2525j03974O2668k7787m2314Q1706n7724
$$ y = [686899, 676949, 552345, 479227, 466294, 446392, 396397, 364263, 402287, 315309, 207935, 190402, 160582, 184587, 157852, 133817, 85962, 14668, 6760, 38447, 87093, 33472, 17244, 10849, -18683, 81450, 156637, 46822, 121664, 117193, -1455, -49369, -68450, 23970, 48991, 65482, 29961, -47640, -1848, 59916, 73353, -65744, -88484, -16901, 36411, -21884, 4638, -40985, -90228, 24871, 104812, -24747, 36874, 114456, 58457, 102754, 46700, -98933, -60634, 4188, 15921, 73518, 102070, -49641, 9968, 138642, 97504, 19902, 21278, 108425, 64839, 49780, -51582, -43473, 41775, -33697, 37728, 94280, 63049, 42898, 83132, 11784, -9241, 693, -41778, -39785, 112729, 100204, -3770, 58898, 31111, -11203, 70503, 12779]
5756A2779j4453J28876j25789q0763J07887R5692L2232o5855n9007K3801k1368
5745C4032P5373m4365l5379K1152j0016N6913m1193r3489K2591R8186m5256q902
5733B9647j1857p0903o5214J89836l3527k6287J7466j2101P2177l8849R742k3205
5721C6925P8203j7329l4768j745j1770n0214J32026n9813j14729K3005m1563J511
5709f0261J17117j5266Q9602L81m3231J33398J4004j06150q5118k5898L4416J8900
5697G1894J0679K6113p2935Q3008l853o1375K4353j17160j442N2525R9353l006
5685A08154J4040k2983r674N9903R5694j9376o4492L7385n0230m2347n7019j5673
5673C3382J9186M0065P4341o7165k6745O403L2682k5579K5921J173r0781Q0646
$$ y = [12779, -1674, 127202, 1413, -79350, 28537, 124229, 156461, 90606, 31599, 55400, 34032, 109405, 65040, 29661, 50813, 40797, 97710, 56517, -36972, -14381, 83805, 38549, 29647, 17790, -53113, -118327, 71509, 37982, 11695, 29161, 17060, 89237, 50388, 60130, 36925, 115128, 97799, 63031, 61286, 49516, -698, 131328, 71515, -43214, -20209, -61772, -60261, 56856, 41590, 131192, 131573, 88342, 221740, 235744, 129594, 44476, 18578, 52994, 71894, 82573, 108686, 35751, 118759, 114906, 53531, 77884, -39276, -40718, 11807, 111160, 108154, 122194, 99211, 89537, 149440, 245134, 225758, 161266, 198651, 148421, 106074, 49055, 33382, 52568, 92633, 166974, 99809, 73064, 79467, 112149, 86570, 112491, 113664, 22883, 103529]
5661A03529j55P6740R3164P074N7064o4698j49279Q4860n8448j8769J00178r1775
5649A39485j3754l4348o7924M2464j5967N7778J3544n3533j7406l1778L0461J79388
5637B28410p4220p3917J25111m7686k5424k1559j33767O9585O2429l5168n5689
5626A8105K8788m1550m1290M4443n8093j3602P534K9134j03683J28301P537o114
5614d90Q8774P9080k4338o8306L3246k2762l1198m402N2453p1443O189L6651j7605
5601E5849N1051m3716j9160j1571L6573R404L6108N2739j57310N588P8353L6859
5589A30767j49523L3676R7306q4933L4751m3770p28R9691j08750L063J25566n208
5577A31908k9653K8301k6547q9651L1365J82683j70101j06954J54599o1666p782
$$ y = [103529, 103374, 180114, 273278, 280352, 337416, 272718, 123439, 208299, 149851, 131082, 231260, 139485, 125731, 91383, 23459, 65923, 49956, 107734, 121278, 67745, 50339, 18561, 49022, 228410, 154190, 80273, 205384, 157698, 132274, 110715, -23052, 46533, 108962, 73794, 18105, 46893, 5343, -35947, 8496, -49597, -63199, -55665, -26531, -130214, -1913, 5624, -490, 88284, 167364, 143026, 74720, 107966, 85204, 54006, 49604, 102057, 30614, 36803, 73454, 55849, 106900, 63184, 44024, 32453, 69026, 78430, 114538, 167277, 9967, 15555, 93908, 130767, -18756, 14920, 112226, 27293, 62044, 18274, 17546, 117237, 8487, 11550, 137116, 131908, 102255, 130556, 104009, 14358, 45723, 228406, 58305, -48649, 105950, 44284, 36502]
5566C6502O6760r6822Q2741J26354j05138q127M7874k382m1977L4000Q1372r5246
5554A25911Q2964k5299j90621j00683J31378Q4255j35412j5417J26412J5377O44
5543I9509O8327q8631M0902k4192N514J30200r2276L2581J51645m3848j35711
5532A44020J9330Q5461k9197o5167N3480Q3356m5703J21229m8622j12839M0280
5521B45628P2712J621k5754k7788j4654M4358m9809M9156O2397k1746M1040j19354
5509B57807O5770o9849j9544J5187j7484m7070n7018K5490J6877o3186p5479J22688
5497A54189P7492q2303K252J9858j3600J5170N6685n5677K2677L0896m044M6947
5485B70542j2218K9442m3334N0698l6450P2520p6161j4051J44565J1759j3833
$$ y = [36502, 103262, 6440, 89181, 215535, 110397, 102270, 150144, 147762, 105785, 139785, 221157, 125911, 208875, 183576, -7045, -107728, 23650, 107905, -27507, -42924, 83488, 98865, 99509, 167836, 79205, 120107, 95915, 101429, 231629, 139353, 171934, 323579, 279731, 144020, 163350, 248811, 219614, 154447, 207927, 291283, 245580, 366809, 318187, 205348, 245628, 318340, 319961, 294207, 266419, 251765, 296123, 246314, 295470, 357867, 336121, 377161, 257807, 323577, 253728, 234184, 249371, 231887, 184817, 127799, 153289, 170166, 106980, 31501, 154189, 231681, 149378, 151630, 171488, 157888, 173058, 229743, 174066, 196743, 227639, 223595, 270542, 258324, 287766, 244432, 295130, 258680, 331200, 255039, 240988, 385553, 397312, 383479]
5474C83479q1322N85L3190N8704K6092j8689P0511N2142m5464m0127K1654o3667
5462C97088J2162N0555k8400q5714j2854J59379j3451p3983Q829K7502l0818j00304
5450C09991N1602p299m4225J3505k180o625N4801q6640O467Q0150p2718K148l3463
5437B65514N1925K2677K16J26015l2674l0143n3793J0743j912M9986l2733P8932
5425D54753K4074j02911J17300r0750r6700P8248Q4498J087J7836Q4005r6057
5414D75383l140l149p0753l2020O9077J2039q2219J39726q636j07429P773j9873
5402C76779q0688J35288L7167l3726j2712J8825m2078K4389j9889j1698L1738
5391D23395M295p4988Q3377l9788J558J52738o8343l221m7539N7386p8173o0712
$$ y = [383479, 302157, 302742, 335932, 394636, 420728, 402039, 472550, 524692, 479228, 439101, 460755, 397088, 409250, 459805, 431405, 345691, 332837, 492216, 478765, 404782, 413611, 441113, 410295, 309991, 361593, 354294, 310069, 323574, 321394, 314769, 369570, 282930, 289397, 369547, 296829, 298977, 265514, 317439, 340116, 340332, 466347, 433673, 403530, 349737, 360480, 358568, 408554, 375821, 454753, 478827, 375916, 493216, 402466, 305766, 384014, 468512, 469599, 487435, 571440, 475383, 472243, 469094, 398341, 366321, 435398, 447437, 365218, 504944, 496308, 388879, 396652, 376779, 296091, 431379, 468546, 434820, 422108, 440933, 398855, 423244, 403355, 391657, 423395, 427690, 352702, 436079, 396291, 397849, 550587, 482244, 479023, 431484, 488870, 410697, 349985]
5379C49985J13667p0274o6367J00628Q844k9721J12354j7167J8544m5822m1400
5368D33271J17341j5929m12R5173l1853n6070L9425j9009L1281l5009P6000l5426
5356E98783j1307P9442j23721L1063L397m5829J22875L9784n9221J4742L451o4794
5344E88665m3767O7723J8581o0317L2790J3655j1522J37959j15582p9224N1718
5333F00679j14063J7980J08922J03528p8912P292N5094n5081n584J18488j00401
5322F57942l1219J11362k343l1114m1256k8889R2093O0934K4323r0286J32548
5311H54095P397j69040N2185J08914j09733L5721Q1995q4549R1464l9088n7445
5300G71916p4245J45802O7435n0709O8607j27223P964J77890j16382l2450J36727
$$ y = [349985, 463652, 393378, 327011, 427639, 436483, 406762, 519116, 501949, 520493, 474671, 433271, 550612, 534683, 534271, 629444, 597591, 541521, 580946, 561937, 593218, 558209, 634209, 598783, 587476, 666918, 543197, 574260, 577657, 531828, 654703, 694487, 635266, 650008, 653459, 588665, 544898, 612621, 631202, 570885, 603675, 617330, 605808, 743767, 628185, 548961, 600679, 486616, 504596, 613518, 717046, 638134, 645426, 700520, 645439, 639855, 758343, 657942, 626723, 738085, 735742, 704628, 663372, 634483, 726576, 787510, 811833, 721547, 854095, 861492, 692452, 744637, 853551, 743818, 779539, 861534, 776985, 868449, 829361, 771916, 697671, 843473, 910908, 860199, 928806, 801583, 809547, 987437, 871055, 838605, 975332]
5289I75332p6739m8097K7486n369j4599N2038K66352q6101j38317R2921k7849
5278A017058M2600J8879m1905O1893q625L9796N7886j7430r8417O3321O8246P3173
5266A276475q3547M7621P8653K0757O4511p4333K5427Q7149M5979j1776l3561
5255A443355M7649J1485L3705j3353P0900R0713L3688k5325m664J14429j0616
5244A791966L5059Q6366M4939J5602P1297Q5235R8976J18675J22158J8456j6855
5233B471874J37363k1609n3221J435P6059K13921N5339Q8340r167J0155J05933
5222C076422K2853P0477L9896L4800R1262Q1403J79543J03065r052J74396J94427
5211D059492K8467R2475N9988J39817J72590K32392J69148J39463Q8101K19071
$$ y = [975332, 898593, 850496, 877982, 872613, 858014, 910052, 1176404, 1090303, 951986, 1044907, 1017058, 1059658, 1078537, 1036632, 1098525, 1089900, 1129696, 1187582, 1170152, 1071735, 1135056, 1203302, 1276475, 1192928, 1240549, 1319202, 1339959, 1404470, 1330137, 1355564, 1442713, 1488692, 1476916, 1443355, 1491004, 1502489, 1536194, 1522841, 1593741, 1684454, 1718142, 1692817, 1688153, 1802582, 1791966, 1827025, 1913391, 1958330, 1973932, 2045229, 2130464, 2229440, 2348115, 2470273, 2488729, 2471874, 2609237, 2587628, 2534407, 2535842, 2611901, 2825822, 2881161, 2969501, 2960334, 2970489, 3076422, 3099275, 3169752, 3209648, 3244448, 3335710, 3417113, 3596656, 3699721, 3690669, 3865065, 4059492, 4087959, 4180434, 4240422, 4380239, 4552829, 4785221, 4954369, 5093832, 5181933, 5401004]
5201E401004Q8749J50665L37928L02682K73928L43791L14872M41661M21040M37732
5191H514052L22299M49900O98888P16195Q09410Q86335J063498J382904J504987
5182A6348468J634827J981835K421211L124794M074084M891218N053897L605850
5174D3136184L09555k866507m166054l388242k153715r25568j03380O57220J436384
5165C1935877K461681L521403M003096K525350o47604m053263n686738n085181
5157B8974621l721780k524413k020239j767027j360884j285753j042923q64231
5149A4387371p37294l41940l11565l26299j75707k15509p9093R4648K08083J67457
5139A2670152J33891M06320M65622K95469M43231N98559P88136R57363J117713
$$ y = [5401004, 5489753, 5640418, 5978346, 6281028, 6554956, 6898747, 7213619, 7655280, 8076320, 8514052, 8836351, 9286251, 9985139, 10701334, 11510744, 12397079, 13460577, 14843481, 16348468, 17983295, 19965130, 22386341, 25511135, 29585219, 34476437, 39530334, 43136184, 43445739, 40579232, 36413178, 33024936, 30871221, 29945653, 29842273, 30499493, 31935877, 34397558, 37918961, 41922057, 44447407, 43799803, 39746540, 34059802, 28974621, 25252841, 22728428, 20708189, 18941162, 17580278, 16294525, 15251602, 14387371, 13650077, 13308137, 12996572, 12670273, 12494566, 12279057, 12199964, 12294612, 12502695, 12670152, 12804043, 13210363, 13675985, 13971454, 14414685, 15013244, 15801380, 16758743, 17876456]
5130A7876456J320785J636092J949478K202172K633140L384441M436220N521442
5122D0960226O533912O400440L656652q64462m732710n669405m134943k494134
5114C9655576j078293j76113R35707K148900L559386M868414M896758K341013
5106E7151348k378973o378957p816769o610324m754299l476665k915953k491878
5098B0327530k056859j833318j664984j299344r62588q96365q44680p37012o77305
5089I355075m72518n02563m35658l61684l67964k41777k61732k78080l15454k38606
5079E879039j56936k18896k11002j74135k62946o4076q8258j12271o7539j33874
5069D389106q9076j5637k02529j50000r1696m3330k01672j94251R710p7637j14923
$$ y = [17876456, 19197241, 20833333, 22782811, 24984983, 27618123, 31002564, 35438784, 40960226, 47494138, 53894578, 57551230, 56686768, 51954058, 46284653, 42149710, 39655576, 38577283, 38401170, 39336877, 41485777, 45045163, 49913577, 54810335, 57151348, 54772375, 48393418, 40576649, 33966325, 29212026, 25735361, 22819408, 20327530, 18270671, 16437353, 14772369, 13473025, 12510437, 11614072, 10769392, 10032380, 9355075, 8882557, 8379994, 7944336, 7582652, 7214688, 6972911, 6711179, 6433099, 6117645, 5879039, 5722103, 5503207, 5292205, 5118070, 4855124, 4791048, 4702790, 4590519, 4522980, 4389106, 4300030, 4284393, 4081864, 3931864, 3840168, 3796838, 3595166, 3400915, 3410625, 3332988, 3218065]
5058C218065K0798p1959j27204m3703K0462n2791j63365m0882J08654j1761o1184
5047B795130k3690N9175M9587k5648o5427P5274j22526j9908J06339L9337r575
5036B858068K4729J12684j0227j43957j28585n2855m2761p4015r5613L5176r2050
5025B390594o9541j354L3929j08755k398M1002K6407L7459r23l7436q3495m388
5013B221101Q1290P5171k3113n7472N1857j1919J6469j4340l4190q7300N4076
5002B271630J75181q5103r6969L8552J83169r7154q9896P4857j8460j1355q9967
4991B254485O8725K776p015k6313O3287Q35M6929Q8200J70J10092K1673K28747
4979B852591J00217p0732r9277j62378J60140J45124L9323L6786J01039K0235
$$ y = [3218065, 3238863, 3166904, 3039700, 2995997, 3016459, 2963668, 2800303, 2759421, 2868075, 2856314, 2795130, 2771440, 2830615, 2880202, 2854554, 2789127, 2864401, 2741875, 2721967, 2828306, 2867643, 2858068, 2882797, 2995481, 2985254, 2841297, 2712712, 2659857, 2617096, 2543081, 2447468, 2482644, 2390594, 2321053, 2319699, 2353628, 2244873, 2242475, 2283477, 2309884, 2347343, 2346420, 2308984, 2225489, 2221101, 2302391, 2377562, 2354449, 2296977, 2348834, 2336915, 2353384, 2339044, 2304854, 2217554, 2271630, 2446811, 2361708, 2264739, 2303291, 2486460, 2389306, 2299410, 2374267, 2355807, 2344452, 2254485, 2323210, 2325986, 2318971, 2292658, 2355945, 2356780, 2403709, 2491909, 2492079, 2602171, 2623844, 2852591, 2952808, 2882076, 2782799, 2620421, 2780561, 2925685, 2965008, 3001794, 3102833, 3123068]
4969C123068n748M7154k7455K9695P976o3438j32895p6180j09135p7343J32972
4958B848671J9767R9836k1768n5461j46525r0691n5520j79886J571K3165L5077
4947B478236J7908R0884o5051N8864K0945k2154M7169m1793l46L8416J09156j09485
4935B622749j5901N8257r9130J00065J50509J07776R3215K17334J88832R1130
4925C514836L5098j13572O2802j5290M6520J2992J76280K55199J67695J04448
4915D247008q7350N6012J99024J26367n1823J5879j69078o2119J3259l0625Q2059
4904D338613J18906K57050K6120k71413j38233j36444k23553j6337o3904j75659
4894C715146l0491P6773L0024o6147K758J3151J34326J75198N3418N1139P923
$$ y = [3123068, 3117320, 3164474, 3137019, 3166714, 3174690, 3111252, 2978357, 2902177, 2793042, 2715699, 2848671, 2868438, 2968274, 2946506, 2891045, 2744520, 2653829, 2598309, 2418423, 2419994, 2443159, 2478236, 2496144, 2587028, 2521977, 2580841, 2601786, 2579632, 2626801, 2585008, 2584662, 2623078, 2732234, 2622749, 2606848, 2665105, 2565975, 2666040, 2816549, 2924325, 3017540, 3234874, 3423706, 3514836, 3549934, 3436362, 3499164, 3483874, 3530394, 3543386, 3719666, 3974865, 4142560, 4247008, 4159658, 4215670, 4414694, 4541061, 4489238, 4505117, 4336039, 4273920, 4287179, 4256554, 4338613, 4457519, 4714569, 4740689, 4469276, 4331043, 4194599, 3971046, 3954709, 3890805, 3715146, 3684655, 3761428, 3791452, 3725305, 3728063, 3741214, 3875540, 4050738, 4104156, 4155295, 4163218]
4883D163218J8186P7510L6230n2721p3080J78340K1300J9214P4562J15008N7728
4872D635495K6945J06797J16260J32399J11580R202J90061J88491J04427K30401
4862E852058J72467J51993K36223K23418P8430J64622R7067N5476N4995K01021
4852G287770L13315R5211K01374L42973L70211L65476L60385N27693M21775N41220
4842A0827403N86314P33084Q58454J031072J373167J443204J671201J993900K447652
4833B2965451L030410L894303M816482N433308N085752L328579J21342l537160
4825D5138467n564243n500567m238706k913968k161099j806449j378928j053007
4817B0521500q30563o08036m16380j85841o5426K76394N46694P05709J081201
$$ y = [4163218, 4181404, 4258914, 4295144, 4242423, 4169343, 4347683, 4368983, 4388197, 4462759, 4577767, 4635495, 4662440, 4769237, 4885497, 5017896, 5129476, 5138678, 5328739, 5517230, 5621657, 5852058, 6024525, 6176518, 6412741, 6636159, 6714589, 6879211, 6976278, 7031754, 7086749, 7287770, 7601085, 7696296, 7897670, 8240643, 8610854, 8976330, 9336715, 9864408, 10286183, 10827403, 11413717, 12146801, 13005255, 14036327, 15409494, 16852698, 18523899, 20517799, 22965451, 25995861, 29890164, 34706646, 40139954, 45225706, 48554285, 48675627, 45138467, 39574224, 34073657, 29834951, 26920983, 24759884, 22953435, 21574507, 20521500, 19690937, 19082901, 18666521, 18480680, 18415254, 18691648, 19238342, 19944051, 21025252]
4808B1025252J422983J713264K136959K712862L660878M563955N176649N469337
4800D7882139M334450J166230k852732n696618o144768n317375l907218k765137
4792B6698971k151953j687849j486418j196355r67507o71772l90004j67912Q5783
4783A8064984L14867N60057P92752R96616J409612K081544K644341L199137L648396
4774C3712306L275058J859175r27134l350351m340982l910904l010249k090110
4766B1216809j553089j272289r95998q94921q22710n97267l38974j22089o7290
4757A4552182K07492M13052O52893P95432Q05382J126051J502526J980680K614978
4748B4650668L426977L944961L861324K718193L11420l047966m869632m878657
$$ y = [21025252, 22448235, 24161499, 26298458, 29011320, 32672198, 37236153, 42412802, 47882139, 52216589, 53382819, 50530087, 44833469, 38688701, 33371326, 29464108, 26698971, 24547018, 22859169, 21372751, 20176396, 19208889, 18537117, 18147113, 17979201, 18064984, 18379851, 18939908, 19732660, 20729276, 22138888, 24220432, 26864773, 30063910, 33712306, 36987364, 38846539, 37919405, 34569054, 30228072, 26317168, 23306919, 21216809, 19663720, 18391431, 17395433, 16500512, 15677802, 15080535, 14741561, 14619472, 14552182, 14759674, 15172726, 15825619, 16621051, 17426433, 18552484, 20055010, 22035690, 24650668, 28077645, 32022606, 35883930, 38602123, 38913543, 35865577, 30995945, 26117288]
4740B6117288l923557k775433k222522j715562j463971j353817j102543j064780
4732A0495103q45923o59482n78554m66625n33326m39705l59796m03191l43380
4723E865121k67889k47158q4083j65666k26369k19518n9328j31696j68891j8038
4713D276485o8635p6847j89238r5694R997k12016j86066n4083o0453j44225O5386
4702C264611L6468j35331l8668n8600l6842j80150M2737k5725l8557J6462j19849
4691B726556p6376K8600J15827L1634K639j30720r5849Q4321L9630M3092r3541
4680B675813k6653n577j2889l2890p8247M483P8919Q6842N0476o1970p0318J25180
4668B733169N6048P3837K20929J66076K04859O2527Q6320J2132n9320l319j46180
$$ y = [26117288, 22193731, 19418298, 17195776, 15480214, 14016243, 12662426, 11559883, 10495103, 9649180, 8989698, 8411144, 7944519, 7411193, 6971488, 6611692, 6208501, 5865121, 5597232, 5350074, 5265991, 5100325, 4873956, 4654438, 4595110, 4463414, 4294523, 4276485, 4207850, 4131003, 3941765, 3846071, 3856068, 3644052, 3457986, 3403903, 3343450, 3199225, 3264611, 3301079, 3165748, 3127080, 3068480, 3031638, 2851488, 2894225, 2868500, 2829943, 2846405, 2726556, 2650180, 2678780, 2794607, 2826241, 2828880, 2698160, 2602311, 2686632, 2726262, 2769354, 2675813, 2649160, 2643583, 2630694, 2597804, 2519557, 2524040, 2602959, 2689801, 2740277, 2678307, 2607989, 2733169, 2789217, 2863054, 3083983, 3250059, 3454918, 3517445, 3603765, 3615897, 3556577, 3553258, 3407078]
4657C407078j58955j98107j67936j12946o8908r4931n0561q3335r6682j8845N6090
4646B411962O9079q5894n4910J2324N975N6917J17451J48800L1843L1580J48848
4635B893975J97259J95097J51288N4205j03074O9401o6542p0387j57068j68950
4625B995204j17500j98184M1199j66057j15133L1079N4399K4625k993p9459Q1285
4614B548465P7036R2589J30913K8994J21625J33359j7948J9092Q267p1364j59050
4603B911978j70989m6130k37614o8500k6784r5902N3709J27442o9469j71274J06763
4592B313230O4071r8689j2394P891r291O5419P5714N0111L1477J6301M7939N7925
4580B609704J16149J33614j10163L594j00110L7116j0676j79160l8720j14496
$$ y = [3407078, 3248123, 3050016, 2882080, 2769134, 2700226, 2605295, 2554734, 2471399, 2374717, 2355872, 2411962, 2481041, 2395147, 2340237, 2352561, 2358536, 2415453, 2532904, 2681704, 2713547, 2745127, 2893975, 3091234, 3286331, 3437619, 3491824, 3388750, 3458151, 3391609, 3321222, 3164154, 2995204, 2877704, 2679520, 2720719, 2554662, 2439529, 2470608, 2525007, 2549632, 2546639, 2467180, 2548465, 2625501, 2718090, 2849003, 2877997, 2999622, 3132981, 3115033, 3134125, 3142392, 3071028, 2911978, 2740989, 2694859, 2457245, 2388745, 2361961, 2266059, 2319768, 2447210, 2377741, 2206467, 2313230, 2377301, 2278612, 2266218, 2274109, 2264818, 2330237, 2405951, 2456062, 2487539, 2503840, 2551779, 2609704, 2725853, 2859467, 2749304, 2752898, 2652788, 2689904, 2679228, 2500068, 2461348, 2346852]
4570B346852r2452k3454r5327q2504R1759p6192j07964k6334p0122o7626j27432
4559A669204M9918J2699j47844J63372O7899m1443L9572J4977j34504M027o1891
4548A635986r865P0476q2421k8877M7800N4096p7235L1095N1367j09191N5355
4537A638586L5514J3123l5553q1398j8856R5346K0733k8044Q7557N802j00424
4526A632386P4305J76905j09593p0222L5376K1391O7829O0451m4678p8741M9032
4515A814441J06995R9159N182j43343j3498O1166o431q7110k5559l6079M851J25580
4503A905354N1311p9278m5762J69555O1203J3993j3099q9134O6477q1351m8358
4492A910911K2449J21034o9425r2295J80356P6382j16661J3114M5491o7719j8360
$$ y = [2346852, 2254400, 2230946, 2135619, 2053115, 2144874, 2068682, 1960718, 1934384, 1864262, 1796636, 1669204, 1719122, 1731821, 1583977, 1747349, 1815248, 1773805, 1813377, 1828354, 1693850, 1697877, 1635986, 1626121, 1696597, 1614176, 1585299, 1633099, 1687195, 1609960, 1641055, 1692422, 1583231, 1638586, 1674100, 1687223, 1651670, 1570272, 1551416, 1646762, 1667495, 1639451, 1727008, 1732810, 1632386, 1706691, 1883596, 1774003, 1703781, 1739157, 1760548, 1828377, 1888828, 1844150, 1765409, 1814441, 1921436, 2020595, 2025777, 1882434, 1868936, 1930102, 1923671, 1836561, 1811002, 1774923, 1779774, 1905354, 1956665, 1877387, 1831625, 2001180, 2062383, 2076376, 2063277, 1974143, 2040620, 1959269, 1910911, 1933360, 2054394, 1984969, 1892674, 2073030, 2149412, 2032751, 2045865, 2091356, 2023637, 2005277]
4481B005277q9140M8093K8950l8321J13776J1205P3755n6932J34935J0955j45563
4470B096990L0946J26060p766j63331l0567j04933M764M2495l859l5761L5923
4459A990961P0872Q6507p1800j20700P6508J7368Q655N3264K8852r056J13139
4448B244570J15084N0725p2603L4801J33594O9926J7799r2015O0642J27364p6060
4437B613827o0381J27530m9091M96R023K8438j38629o0403M9104O3902p3108N2313
4425B563021J67856R8275Q5031J23758J26110Q2811J77443J86347J65679K03784
4415C980115j45275j37583K3996j37477j64355k29703j92506M9738k071L5860
4405C080739l0453q619N8545n7920R6380O1154J9098o0626m5650j2879Q0324p3007
$$ y = [2005277, 1916137, 1964230, 1993180, 1954859, 2068635, 2079840, 2153595, 2096663, 2231598, 2242553, 2096990, 2127936, 2253996, 2246230, 2082899, 2052332, 1947399, 1952163, 1994658, 1990799, 1955038, 1990961, 2061833, 2148340, 2076540, 1955840, 2032348, 2049716, 2058371, 2111635, 2140487, 2131431, 2244570, 2359654, 2410379, 2337776, 2372577, 2506171, 2576097, 2593896, 2501881, 2562523, 2689887, 2613827, 2553446, 2680976, 2631885, 2632381, 2641404, 2669842, 2531213, 2470810, 2519914, 2583816, 2510708, 2563021, 2730877, 2829152, 2914183, 3037941, 3164051, 3246862, 3424305, 3610652, 3776331, 3980115, 3834840, 3697257, 3721253, 3583776, 3419421, 3189718, 2997212, 3046950, 3044879, 3080739, 3050286, 3041667, 3100212, 3042292, 3138672, 3199826, 3218924, 3158298, 3112648, 3099769, 3180093, 3107086]
4393C107086M2315Q5607m5519q2550J9019R1911j76039j50757r6026j00730J4412
4382B708729o6236m1346q7717p6342j8786N7075l8850q6190L870q850K1521n4335
4370B312543L6685M5112O6455J76868O1800Q5784r4801n4534J56363p3164r5339
4359B623772j53841m9294M597L8351j2975n2654r3931J24023l7898j30444Q7547
4348B347253o2665J62794N3765o113J45711j4563J65807R6880k9788j36413r0210
4337B632458O0077J246p9377j82J17324N464J36932m0774N7977R0438r7655O4012
4325B947940N4163j16902P219M0010m8271l8492P6937M2438N0712J1187P5505
4314C102446j25214n1078m6792o486M9116p5003m2799M4457L9042m744O6028K2666
$$ y = [3107086, 3149401, 3235008, 3189489, 3106939, 3125958, 3217869, 3041830, 2891073, 2795047, 2694317, 2708729, 2642493, 2601147, 2513430, 2437088, 2418302, 2475377, 2436527, 2350337, 2354207, 2345357, 2366878, 2312543, 2349228, 2394340, 2460795, 2637663, 2699463, 2785247, 2690446, 2635912, 2792275, 2719111, 2623772, 2469931, 2420637, 2425234, 2463585, 2450610, 2397956, 2304025, 2428048, 2390150, 2259706, 2347253, 2284588, 2447382, 2501147, 2495034, 2640745, 2626182, 2791989, 2888869, 2859081, 2722668, 2632458, 2692535, 2693781, 2614404, 2614222, 2731546, 2737010, 2873942, 2833168, 2891145, 2981583, 2883928, 2947940, 3002103, 2885201, 2892420, 2932430, 2884159, 2845667, 2922604, 2965042, 3015754, 3026941, 3102446, 2977232, 2926154, 2879362, 2872876, 2921992, 2846989, 2804190, 2848647, 2887689, 2882945, 2948973, 2971639]
4302B971639Q8345P8512M0388Q9277j767N3342J01892O2866M8466j82960j16683
4291C233317o2067Q1727M5111K7945n8573J30691J28239p4578l983R1963J51180
4280C690972j1527R0326J42470K1689L9607J05555J91032J3713J1354O5698J54509
4269D515398R8795j14204J51929M1883M1126m276J00199j1136K5209K9048n7580
4258D816391l7022q6194K35788j545J1443J0622R7920K19482N8655J71868Q3194
4247E580602J69762K05992K83971J38406o5859J75154N0172K07137l2595p7745
4237F634997m9879M235m6348l9461J37062m3919M4862J19117L4982j06740K28842
4226F917750K19636K0990J41681J13507L08320J12434J58984K27233J50941J47576
$$ y = [2971639, 3059984, 3138496, 3178884, 3268161, 3266394, 3319736, 3421628, 3484494, 3532960, 3350000, 3233317, 3171250, 3252977, 3298088, 3326033, 3267460, 3398151, 3526390, 3451812, 3447829, 3539792, 3690972, 3679445, 3769771, 3912241, 3933930, 3973537, 4079092, 4270124, 4283837, 4295191, 4360889, 4515398, 4614193, 4499989, 4651918, 4693801, 4734927, 4730651, 4830850, 4819714, 4844923, 4873971, 4816391, 4779369, 4693175, 4928963, 4927418, 4938861, 4949483, 5047403, 5266885, 5325540, 5497408, 5580602, 5750364, 5956356, 6240327, 6378733, 6312874, 6488028, 6538200, 6745337, 6712742, 6634997, 6585118, 6589353, 6543005, 6503544, 6640606, 6596687, 6641549, 6760666, 6795648, 6688908, 6917750, 7137386, 7158376, 7300057, 7413564, 7721884, 7834318, 7993302, 8220535, 8371476, 8519052]
4216H519052R4415L91906K94634K87521L73274L96889L46926M97951O14804N99375
4206A2416747Q04421Q81722J135945J418748J617895J723804J375033O36947l94936
4197B1616326n84981k00683K53592O21296J009452J241874J866225K595309K973977
4188C1392387K959552K117537M30317j231673j259210m76537M96431J189659J360470
4179C6978933Q99538N5037K16349J025756J733531J857315J323521O49950N58172
4170D5298102N43160P15319J218329R95517m67894k188241k351799j237192J3012
4161D2538313J050873J921849J870225Q43965n93912q84336k58062L92542J02109
4152D6983566p07130j194590j529696j652057p45929L48343N75565M04052P6286
$$ y = [8519052, 8613467, 9005373, 9300007, 9587528, 9960802, 10357691, 10704617, 11202568, 11817372, 12416747, 13221168, 14102890, 15238835, 16657583, 18275478, 19999282, 21374315, 22011262, 21616326, 21031345, 20830662, 21084254, 21705550, 22715002, 23956876, 25823101, 28418410, 31392387, 34351939, 36469476, 36899793, 35668120, 34408910, 33932373, 34428804, 35618463, 36978933, 37878471, 37933508, 38149857, 39175613, 40909144, 42766459, 44089980, 44739930, 45298102, 45841262, 46556581, 47774910, 48770427, 48302533, 46114292, 43762493, 42525301, 42538313, 43589186, 45511035, 47381260, 48225225, 47631313, 46746977, 46488915, 46881457, 46983566, 46276436, 45081846, 43552150, 41900093, 41154164, 41502507, 42078072, 42482124, 42558410]
4143D2558410M18584J179969J882933K280089J711399k18020k911730m361451
4135D2540183m233497l568794k532410j781704j237429q13546k28017K57059N12385
4126B8914230L98269k64006j042224j350661r21870n47750j5311q1398j19925
4117B4969354J71215P2985j04226m98899r06716j072705j120426j030531r81086
4108A9498965q83872q01620n91128n66705m97337k20900o6776o6654p6775K34637
4098A5961835M03603P00684R08803J020119J135223J065605N45366l2660j50465
4089B1558113j18993k30551n59680q73315p64290j50956K79222K10938P0930k16395
4079A9205023n18863m06374J78738M67118O17619J003881J202834J124984P10376
$$ y = [42558410, 42976994, 44156963, 46039896, 48319985, 50031384, 49813364, 46901634, 42540183, 38306686, 34737892, 32205482, 30423778, 29186349, 28372803, 28144786, 28401845, 28914230, 29312499, 29048493, 28006269, 26655608, 25733738, 25185988, 25170677, 25089279, 24969354, 25140569, 25213554, 25109328, 24610429, 23703713, 22631008, 21510582, 20480051, 19498965, 18615093, 17813473, 17222345, 16655640, 16158303, 15937403, 15870627, 15803973, 15727198, 15961835, 16365438, 17066122, 17974925, 18995044, 20130267, 21195872, 21741238, 21708578, 21558113, 21439120, 21208569, 20648889, 19775574, 19011284, 18860328, 19139550, 19350488, 19421418, 19205023, 18686160, 18279786, 18458524, 18925642, 19543261, 20547142, 21749976, 22874960, 23585336]
4070B3585336O98882J183664J664679J606286J113515Q12330P11869J060111J176291
4061C3612963N14933k84977q6123j9822j6668P7044m35674j422588j542697j620829
4051B8775562j848443j644328j722719j906380j806966j187804r06792n85790
4043A7166340j76186J63962L32947M66555K82529J5085l96338p51452p57737p33828
4033A5611877n30351l82005j30939r964j54887l37665n80427n18435l42435j57724
4023A2467045j2316k73036n80025q32601n63105k73723j69030L6900P6566J10500
4013I987175K31488J77826K8104n86825r31792n77966m75692k84391k09934k60106
4003G097887j18678j07624k6089o4061j41062j17841m0809k27300k07848l1948
$$ y = [23585336, 24284218, 25467882, 27132561, 28738847, 29852362, 30664692, 31376561, 32436672, 33612963, 34127896, 33842919, 33756796, 33736974, 33720306, 33797350, 33361676, 31939088, 30396391, 28775562, 26927119, 25282791, 23560072, 21653692, 19846726, 18658922, 17752130, 17166340, 16990154, 17154116, 17487063, 17953618, 18236147, 18251232, 17854894, 17103442, 16345705, 15611877, 15081526, 14699521, 14568582, 14558618, 14403731, 14066066, 13485639, 12967204, 12624769, 12467045, 12454729, 12181693, 11601668, 10769067, 10205962, 9932239, 9763209, 9800109, 9876675, 9987175, 10218663, 10396489, 10424593, 9837768, 8905976, 8328010, 7852318, 7567927, 7357993, 7097887, 6979209, 6871585, 6845496, 6781435, 6640373, 6522532, 6481723, 6254423, 6046575, 6014627]
3993F014627p1370j42j61017p1154L9736r8010L0266p4838R195R8357j08117L275
3981E610808J41699O369J5802k6261p7318P6316j94441j41189k5452J7101L3605
3970E437039K9924K6343L4927Q2806N6723l3425p7462J05695O7782R2611J13838
3959E936801L3532J55379J9909J8564J25314J23326J65848J64999K33891K40181
3949G217744K93335M20529N41710O68443P84880R51976Q12711P87247O95882R21461
3939A4095918J015764K71520o37530j266036j658112j377487r09235o91609n60117
3930H283076n99142m70682m00237k35045K3902j37401p0944j471k536L332j06163
3919F286689j7124J31326R4616Q2307K05835L14054L88836N61394N22857L09657
$$ y = [6014627, 5943257, 5943115, 5782098, 5710944, 5750680, 5652670, 5682936, 5608098, 5617293, 5715650, 5607533, 5610808, 5752507, 5758876, 5774678, 5748417, 5671099, 5747415, 5552974, 5411785, 5386333, 5403434, 5437039, 5466963, 5493306, 5528233, 5611039, 5667762, 5634337, 5556875, 5662570, 5730352, 5822963, 5936801, 5970333, 6125712, 6145621, 6164185, 6289499, 6412825, 6578673, 6743672, 6977563, 7217744, 7511079, 7931608, 8473318, 9141761, 9926641, 10878617, 11691328, 12478575, 13174457, 14095918, 15111682, 15383202, 14745672, 13479636, 11821524, 10444037, 9534802, 8843193, 8283076, 7683934, 7213252, 6813015, 6577970, 6601872, 6464471, 6393527, 6392056, 6389520, 6392852, 6286689, 6269565, 6400891, 6495507, 6577814, 6783649, 7097703, 7486539, 8047933, 8570790, 8880447]
3909H880447j91332j21011J18455L92526L54097N65259Q03892Q17006Q76492O06299
3899A3102130O90260J339779J937474J867754L22901j858725k231448j482763
3891A3687362q21756m66944l27499l70962j19802Q2544M16087N97733Q59275J237728
3881A4773766J663048J471953l07119j974785j924737j297891q19193o11651p12619
3872A0260772q04062p24845m84186l45449k94283L1296k11970j84325l03441l05354
3862F634153j86968k15448k14853n7243n8197o3492p0090K8200L1527j56146P5836
3851E747279P7692o8349K1882P8775J36413K37908J93563K56808K94529M07189
3841G383689M46498N52479O52322O43153L80108J61855j34032j55516R3004M652
$$ y = [8880447, 8689115, 8568104, 8686559, 9079085, 9433182, 9998441, 10802333, 11619339, 12495831, 13102130, 13792390, 15132169, 17069643, 18937397, 19260298, 17401573, 15170125, 13687362, 12865606, 12398662, 12071163, 11700201, 11580399, 11662943, 12079030, 12676763, 13536038, 14773766, 16436814, 17908767, 17601648, 15626863, 13702126, 12404235, 11585042, 10973391, 10260772, 9456710, 8731865, 8247679, 7902230, 7607947, 7639243, 7427273, 7242948, 6939507, 6634153, 6447185, 6231737, 6016884, 5959641, 5901444, 5837952, 5767862, 5796062, 5827589, 5671443, 5747279, 5824971, 5756622, 5778504, 5857279, 5993692, 6231600, 6425163, 6681971, 6976500, 7383689, 7830187, 8382666, 9034988, 9678141, 10058249, 10220104, 10086072, 9930556, 10023560, 10028212]
3831A0028212J43280L25142M41532O17797J176953J245902J137418P12499j49164
3822A5679571l63892K3331L57391J18607j19564l84302o48972n02620l42970P176
3812A3823756N86767P71346Q95455Q50076Q46877P82713P69696P15254J037820
3803B1079760J416378J391682K78163j111877j558412j183112n92516k74102k70779
3794A9175185m84922k50929k59034m29260k52679o741P3231K77879k7394j17138
3784A7698198K31472M32003K82649M9591M31558M04019j94302r09099q57678m42491
3774A7125920p6376K94054M96787O99990N58940Q0913j75439o66315q95702p19698
3764A6723074m26653j79039j2536M5309J38912L63071M25835O94482Q29350J144945
$$ y = [10028212, 10171492, 10496634, 10938166, 11555963, 12732916, 13978818, 15116236, 15828735, 15679571, 15315679, 15339010, 15696401, 15815008, 15695444, 15311142, 14662170, 14159550, 13816580, 13823756, 14410523, 15181869, 16077324, 16927400, 17774277, 18556990, 19326686, 20041940, 21079760, 22496138, 23887820, 24165983, 23054106, 21495694, 20312582, 19720066, 19445964, 19175185, 18690263, 18439334, 18180300, 17751040, 17498361, 17491620, 17564851, 17842730, 17815336, 17698198, 17929670, 18361673, 18644322, 18693913, 19125471, 19529490, 19335188, 18426089, 17568411, 17125920, 17049544, 17343598, 17840385, 18540375, 19099315, 19180228, 19004789, 18338474, 17442772, 16723074, 16296421, 16117382, 16104846, 16150155, 16289067, 16652138, 17077973, 17772455, 18601805, 19746750]
3754A9746750J235793J498769J811662K164386K984756L753721M682052N371881
3746D3249770M908164K588141j624228m712262m908681l760400k417140j487784
3738C1835580q16726l56442J29278N26724J030829J456363K209149K822501L660177
3729D2497433M804078O150882P417903Q097969P514366M875681J678408r31499
3721H2105221m308380q062193q970857p552984n390651l493115k409645j599914
3713D0317482r21259o72905o26132m26056j25616K44295P53362K008721L373668
3704D3925560M597274M716093L231716p36345n583583p560848o653891m886279
3696C1049697l614578k758455k414098j951410j776765j475835j160141j116799
$$ y = [19746750, 20982543, 22481312, 24292974, 26457360, 29442116, 33195837, 37877889, 43249770, 48157934, 50746075, 49121847, 44409585, 39500904, 35740504, 33323364, 31835580, 31018854, 30662412, 30791690, 31318414, 32349243, 33805606, 36014755, 38837256, 42497433, 47301511, 53452393, 60870296, 68968265, 76482631, 81358312, 83036720, 82105221, 77796841, 69734648, 60763791, 53210807, 47820156, 44327041, 41917396, 40317482, 39396223, 38723318, 38097186, 37671130, 37545514, 37789809, 38543171, 40551892, 43925560, 48522834, 53238927, 56470643, 55734298, 50150715, 42589867, 35935976, 31049697, 27435119, 24676664, 22262566, 20311156, 18534391, 17058556, 15898415, 14781616]
3688A4781616r10665o99268p15538o52586o60614m82584l97180m29328k51313
3679I582540l76039k91830k12156j33495j14736j61468m8532l1335j73552q2485
3669G956912j5346L7750r0438k63989o4969P4131j39711o9364J25011N3463K04291
3658G807741P1220o2097k53409k72949j42928o3239l9177r0565P503J39564J20177
3647G221841O9420R9639R2624J40927K30310J35236K55812J93927J77587R1427
3637H708750K740K67068P0335R7254O6091m9223l4711k9085N7619n0510k30321
3626H876007k13267j7294k052L7499M6376J47164K82364J49114J44569L45053
3616I795533L35602K19408J87087O0603Q4334K62907L11338K53789K89659K69321
$$ y = [14781616, 13870951, 13171683, 12456145, 11803559, 11142945, 10660361, 10263181, 9833853, 9582540, 9206501, 8914671, 8702515, 8569020, 8454284, 8292816, 8244284, 8212949, 8039397, 7956912, 7941566, 7979316, 7888878, 7624889, 7559920, 7634051, 7494340, 7424976, 7549987, 7603450, 7807741, 7878961, 7816864, 7563455, 7290506, 7147578, 7084339, 7045162, 6954597, 6962100, 7101664, 7221841, 7291261, 7390900, 7483524, 7624451, 7854761, 7989997, 8245809, 8439736, 8617323, 8708750, 8711490, 8978558, 9048893, 9146147, 9212238, 9163015, 9128304, 9099219, 9156838, 9106328, 8876007, 8662740, 8645446, 8643394, 8680893, 8727269, 8874433, 9156797, 9305911, 9450480, 9795533, 10131135, 10350543, 10537630, 10598233, 10682567, 10945474, 11256812, 11510601, 11800260, 12069581]
3606A2069581L00949K34842J19816j9088J05693R5475L22748L49227M54136L95707
3596A4429086L66995N30114M36966M42079M44024N46592M82214P63496R67544
3587A9409110J247056J321929J490812J564673J807945K227056K718682L469039
3579C5256302M457150N574357O736697O875108N349223J932547k203727m778261
3571E9199396m825499l395740j812390n14790Q79775K231174L592878M727465
3563F0082269M669000K880325o80711m314683n529763m610051k811259q28735
3555D8856392Q95833K321590L019812K599697Q32759k016783m345818m788302
3547D7375180l814400k442260j413708m24653N34856J338290K283758K907761
$$ y = [12069581, 12370530, 12605372, 12725188, 12706100, 12811793, 12907268, 13230016, 13579243, 14033379, 14429086, 14796081, 15326195, 15763161, 16205240, 16649264, 17195856, 17678070, 18441566, 19409110, 20656166, 21978095, 23468907, 25033580, 26841525, 29068581, 31787263, 35256302, 39713452, 45287809, 52024506, 58899614, 64248837, 66181384, 63977657, 59199396, 54373897, 50978157, 49165767, 48650977, 49530752, 51761926, 55354804, 60082269, 64751269, 67631594, 66950883, 62636200, 57106437, 52496386, 49685127, 48856392, 49752225, 52073815, 55093627, 57693324, 58526083, 56509300, 52163482, 47375180, 43560780, 41118520, 39704812, 39280159, 39815015, 41153305, 43437063, 46344824]
3539D6344824J897565o15608l485898n460460n489123m107393l229417k571669
3531B3282821k072834j866040j571976j413908j026759q78740p25631p36010q30072
3522A2160851m82361m60504n50402l67912l19129m05869k38941j34460k31474
3513H969799j54841o5273j88557k9746n3480j38405j19903J29674k23587j56265
3503G969416k6950p2652j18835j6893R8180q336m5763K8458O5296o3913O1837
3492G869845L2378R8087J51944J17823K23089L04091L75424M41781N32608N61304
3482A0708374P08274Q44018Q75583J207290J871892K049038J853850J276405J35611
3473B1530335j042289j390405j140991m60198K46276Q53083J357276J471653J218002
$$ y = [46344824, 48242389, 47626781, 44140883, 38680423, 33191300, 29083907, 25854490, 23282821, 21209987, 19343947, 17771971, 16358063, 15331304, 14452564, 13726933, 12990923, 12160851, 11678490, 11217986, 10667584, 10299672, 9980543, 9574674, 9335733, 9201273, 8969799, 8814958, 8749685, 8561128, 8531382, 8477902, 8339497, 8219594, 8349268, 8125681, 7969416, 7942466, 7869814, 7750979, 7734086, 7832266, 7823930, 7778167, 7806625, 7871921, 7808008, 7869845, 7902223, 8000310, 8152254, 8270077, 8493166, 8797257, 9172681, 9614462, 10147070, 10708374, 11416648, 12260666, 13136249, 14343539, 16215431, 18264469, 20118319, 21394724, 21530335, 20488046, 19097641, 17956650, 17496452, 17742728, 18595811, 19953087, 21424740, 22642742]
3464B2642742j54319j801680k210328j778890j056882m10934m5767L40169L99054
3455A5923165P62466J082153J297743R90790J57017m75351m28446j48607M9035
3446A9209965J09581N29371N99825M67037o1191p75585j545994k157846j871256
3437A4503907j292400j021012r18913p54597o95762p05000o59902l10152k41570
3428G904599k34633j9262j12523j72769O1952q8799k21272k70326j79826q181
3418F658960k4647R5475J92523K99277K22117J10428j60392k75075l16797m10266
3408F391603k59323j50186Q7752N0095Q4208K41449K71699R2207j17204l38650
3398F353650l54158l68485k38014j61903j32689k4776l8790J58338Q3033k57095
$$ y = [22642742, 22488423, 20686743, 18476415, 16697525, 15640643, 15229709, 15183942, 15524111, 15923165, 16685631, 17767784, 19065527, 20056317, 20213334, 19737983, 19309537, 19160930, 19209965, 19319546, 19848917, 20448742, 20915779, 20854588, 20079003, 18533009, 16375163, 14503907, 13211507, 12190495, 11271582, 10516985, 9821223, 9116223, 8456321, 8146169, 7904599, 7669966, 7650704, 7538181, 7365412, 7427364, 7338565, 7117293, 6846967, 6667141, 6658960, 6634313, 6729788, 6922311, 7221588, 7443705, 7554133, 7393741, 7118666, 6801869, 6391603, 6132280, 5982094, 6069846, 6119941, 6204149, 6445598, 6717297, 6809504, 6692300, 6353650, 5999492, 5631007, 5392993, 5231090, 5098401, 5073625, 5034835, 5193173, 5276206, 5019111]
3388E019111k29747j44879j82669j10139j46129k0147R103O0398j0462J18170
3378D362610J81276q8709j66070l43383k48104j72300j16832j51050o9428P799
3368C195809m6456p5699r3424j4601r3035J9054O360j23264q9492O4508m7061
3357B702699q7991o1125k9789k2307J11747j4945o8676K181L10k7569q2618L06
3345B422223P4370K2446M2463m6451O8833L9657K0609q361j5221R3403N7664j28288
3333B643347j06614N6040j6488N8265L2867P5807R0856o532J12296N4923K5933
3322C020700J02938J37947J2259L1061R5814R1036M3454n9505n2265m5531j6505
3311C361403j08975m4963J23703J16338j5747k4378j8632l2877J0559K8163N1142
$$ y = [5019111, 4789364, 4644485, 4461816, 4351677, 4205548, 4185401, 4194504, 4254902, 4244440, 4362610, 4543886, 4455177, 4289107, 3945724, 3697620, 3525320, 3408488, 3257438, 3188010, 3195809, 3149353, 3073654, 2980230, 2965629, 2872594, 2891648, 2898008, 2774744, 2685252, 2749760, 2702699, 2614708, 2553583, 2523794, 2501487, 2613234, 2598289, 2529613, 2531794, 2532104, 2504535, 2421917, 2422223, 2496593, 2519039, 2561502, 2515051, 2583884, 2623541, 2644150, 2635789, 2620568, 2713971, 2771635, 2643347, 2536733, 2592773, 2576285, 2634550, 2667417, 2743224, 2834080, 2827548, 2939844, 2994767, 3020700, 3123638, 3261585, 3273844, 3304905, 3400719, 3491755, 3535209, 3475704, 3423439, 3377908, 3361403, 3252428, 3207465, 3331168, 3447506, 3431759, 3407381, 3388749, 3355872, 3366431, 3394594, 3445736]
3300C445736R4264K17195J68588R3678J26143N2224k9759o2840p4214o6173k15060
3289C749782j28248r0926j34821N1561O4789N6485O5441N511M436Q6974o3806
3278C667178m0190p635P1074Q5208P8380J95932J67310o239M3984J11708K52024
3267D618734N5936m8719o3309J0843j26974M1948j02543K2348R9974P9248P0619
3256D658105J79598M2894Q3089K80576K16055O712N6605J72945J03177o5367j15021
3245E619368O3826O0346J53149P1105j0212L2023J15229K24022L1799J66840J88777
3234F716272L06160K14342K05284L02965J77421J58844J4401M5084M7296J89056
3224H377125J12568P2588J41586N0359K49653K77365K56557K50374L10371K53774
$$ y = [3445736, 3540000, 3757195, 3925783, 4019461, 4145604, 4197828, 4168069, 4105229, 4031015, 3964842, 3749782, 3621534, 3530608, 3395787, 3447348, 3512137, 3568622, 3634063, 3639574, 3644010, 3730984, 3667178, 3626988, 3619353, 3690427, 3775635, 3854015, 4049947, 4217257, 4211018, 4255002, 4366710, 4618734, 4674670, 4625951, 4562642, 4573485, 4446511, 4488459, 4385916, 4408264, 4508238, 4587486, 4658105, 4837703, 4880597, 4963686, 5244262, 5460317, 5467029, 5523634, 5696579, 5799756, 5734389, 5619368, 5683194, 5743540, 5896689, 5967794, 5957582, 5989605, 6104834, 6328856, 6360655, 6527495, 6716272, 7022432, 7236774, 7442058, 7745023, 7922444, 8081288, 8095689, 8140773, 8188069, 8377125, 8489693, 8562281, 8703867, 8754226, 9003879, 9281244, 9537801, 9788175, 10098546, 10352320]
3214A0352320K14462K44264J32964K75413J96556L43540K95015L28984L52415
3205A2735933M00581M96877L63013L42330K92843N10300L66074L96884M98100
3196A6402935K55629M79797L32734K83295K77687L06200K49018L42970M66778
3187A9397043M25847M84706L48674L15519M91954P58668O80524N85542Q95707
3178B4384184O14375P46358Q89843J086250J159359J397364J469236J454672J596408
3169C4798049J664647J672037J793868J932876K166131K332889K546493K575587
3161E1482577L042383L286191L751456L846723M446719M740271N123750N804558
3153H5524628P017601Q395183J0417051J2374082J4648281J6241144J8888203
$$ y = [10352320, 10566782, 10811046, 10944010, 11219423, 11415979, 11759519, 12054534, 12383518, 12735933, 13136514, 13633391, 13996404, 14338734, 14631577, 15141877, 15507951, 15904835, 16402935, 16658564, 17138361, 17471095, 17754390, 18032077, 18338277, 18587295, 18930265, 19397043, 19822890, 20307596, 20656270, 20971789, 21463743, 22222411, 22902935, 23488477, 24384184, 24998559, 25744917, 26634760, 27721010, 28880369, 30277733, 31746969, 33201641, 34798049, 36462696, 38134733, 39928601, 41861477, 44027608, 46360497, 48906990, 51482577, 54524960, 57811151, 61562607, 65409330, 69856049, 74596320, 79720070, 85524628, 92542229, 100937412, 111354463, 123728545, 138376826, 154617970, 173506173]
3146A73506173K2371529K8970269L8419251N1874845O4847112P0039017M5744460
3139D95772656j421618m5313980p1537440o4827019m9114349l8043631l0742350
3132A94772269k5040285k1034145j7762837j4714067j1953395j0247755q662237
3125H5357548p559780o533824n601655m906270m527491l964861l606637l109256
3117D5547774k844377k483689k330791k117282j659518j525648j505708j341513
3109B9739248j224522j221317r43728p95719q36658q19630o61467q02783q75707
3100B1557717p45243r00267p15354n77945n13904l71328m48164o97418o07262
3091A5980832o07251o48393n41486n49450m87562m79179l03907l55820l50240
$$ y = [173506173, 195877702, 224847971, 263267222, 315142067, 379989179, 450028196, 495772656, 494351038, 449037058, 377499618, 312672599, 263558250, 225514619, 194772269, 169731984, 148697839, 130935002, 116220935, 104267540, 94019785, 85357548, 77797768, 71263944, 65662289, 60756019, 56228528, 52263667, 48657030, 45547774, 42703397, 40219708, 37888917, 35771635, 34112117, 32586469, 31080761, 29739248, 28514726, 27293409, 26349681, 25553962, 24717304, 23897674, 23236207, 22433424, 21557717, 20812474, 19912207, 19196853, 18618908, 18105004, 17733676, 17285512, 16588094, 15980832, 15373581, 14725188, 14183702, 13634252, 13146690, 12667511, 12363604, 12007784, 11657544]
3082A1657544k39065l38976k21819r8603k45722k00002j12590k58234l76289j14213
3072I452031k09747k32877p4983p1970j08314j24977m2768k15128k05782l31927
3062G833558j79130l3107j83027j76595j29906q9901j39288M9496j22416k11853
3052F617831o9411O05k07825j49549l6924m5727J0216l5533n4962N5677J29057
3041F213455n6531j51066j23260l77624j98748k06019k32468k68602j50765j29791
3031D318581j62175j09704j36048j31200j46709k3140K6146j06979j57107m2181
3021C329484J44594o5526q033m6392o4335q0996k4220M2495L2080m59m056J24343
3009C378979p3386n7675O1206r569r6639j28737l0351j59082n5765p2334n6317
$$ y = [11657544, 11418479, 11079503, 10857684, 10759081, 10513359, 10313357, 10200767, 9942533, 9566244, 9452031, 9242284, 9009407, 8934424, 8862454, 8754140, 8629163, 8586395, 8371267, 8165485, 7833558, 7654428, 7621321, 7438294, 7261699, 7131793, 7041892, 6902604, 6952100, 6829684, 6617831, 6548420, 6549025, 6341200, 6191651, 6154727, 6109000, 6119216, 6083683, 6028721, 6084398, 6213455, 6156924, 6005858, 5882598, 5504974, 5306226, 5100207, 4867739, 4599137, 4448372, 4318581, 4156406, 4046702, 3910654, 3779454, 3632745, 3609605, 3635751, 3528772, 3371665, 3329484, 3474078, 3408552, 3400519, 3354127, 3289792, 3208796, 3184576, 3227071, 3259151, 3258692, 3254636, 3378979, 3305593, 3247918, 3309124, 3299555, 3202916, 3074179, 3043828, 2884746, 2828981, 2756647, 2700330]
2998B700330q0670k64363j8903N0466j43989k02401Q0820J12568k3496l9862R808
2987B180308k4603o9849K8711q2877l2010L3072j2856M1239o8726j74568J9219
2976A837060j7776q4759P6698o6599L3024j49687k3191k3460k36702q6114k7910
2965A230584r1188m5434N9037L2203R0257m0849k7147o595k1403M1700L7490n1673
2953A206982q9765J29977R50j76784n0714J9200Q7996o238k986m1282o1307o8612
2941I47417l7544l6943O4906L2419l2715O2589K9566j945J4866l1625l4187K6233
2929A003037l3966j12976L3872M4220j5812J09525L6800P2460J97154L3247J30475
2918A498036K98403J39576J84104M3729k91022k75205k40670j65223j60616j40582
$$ y = [2700330, 2619660, 2355297, 2336394, 2386860, 2242871, 2040470, 2121290, 2233858, 2210362, 2170500, 2180308, 2155705, 2085856, 2114567, 2031690, 1999680, 2032752, 2019896, 2061135, 1992409, 1817841, 1837060, 1819284, 1734525, 1811223, 1744624, 1777648, 1627961, 1604770, 1581310, 1344608, 1258494, 1230584, 1139396, 1093962, 1152999, 1185202, 1275459, 1234610, 1207463, 1200868, 1179465, 1221165, 1258655, 1206982, 1117217, 1247194, 1248144, 1071360, 1020646, 1039846, 1127842, 1121604, 1118618, 1077336, 1016029, 947417, 909873, 872930, 937836, 970255, 937540, 1000129, 1029695, 1027750, 1042616, 1010991, 976804, 1003037, 969071, 856095, 889967, 934187, 918375, 1027900, 1064700, 1137160, 1334314, 1367561, 1498036, 1796439, 1936015, 2120119, 2163848, 1872826, 1597621, 1356951, 1191728, 1031112, 890530]
2908H90530O028k4555K0881l9793j27747r9635K9220j01067n3903O1185j32877
2897D28267J4443J16424k660m594l738j07474R91N9178j3669p9038o763O2018
2885D63385j8687j7520k2191p015L2108K5264l8434l2262L9526m0869p670P7584
2873D53219q2327l3071k0775K7517j596Q0757J6658J7934m1549N5960j9446q5049
2861C68232l5371R2496k4308o8398R6948J92367k1857p7053Q4876K18037J30417
2850I56386j171m9794q3687p964k1442K7629o6925n8244J91247J59009m9597L5341
2838A030788J76327J94219J92205N4690K58573M49267L57501K21317P1352k29976
2828B776263n42543k46789j94973j88506l13105j89700l6928j59225q5139j90838
$$ y = [890530, 896558, 872003, 892884, 853091, 725344, 625709, 654929, 553862, 499959, 561144, 428267, 442710, 559134, 556474, 551880, 548142, 440668, 441659, 500837, 487168, 408130, 401367, 463385, 444698, 427178, 404987, 397972, 430080, 455344, 416910, 384648, 424174, 383305, 375635, 453219, 370892, 337821, 317046, 344563, 342967, 423724, 440382, 458316, 416767, 472727, 453281, 368232, 332861, 425357, 401049, 332651, 429599, 621966, 600109, 523056, 607932, 825969, 956386, 955215, 905421, 821734, 813770, 792328, 819957, 753032, 694788, 886035, 1045044, 995447, 1030788, 1207115, 1401334, 1593539, 1648229, 1906802, 2356069, 2713570, 2934887, 3006239, 2776263, 2233720, 1986931, 1791958, 1603452, 1290347, 1100647, 1063719, 904494, 819355, 628517]
2818F28517r8586m4091p100L6308Q678n6751p6009K0464j30327J05943O7781q3904
2806C70923q5964N5991J02989k3051o6018k2526M0057j5852q1553R439j618m2155
2794B40662l8806N741r9592k2331O5591M6305q7285k5201J94729o5107j83134
2783C1572n5179J48202J46725n6303q3776j5759Q242k6779p137J7449m8704q2733
2771b4180J25486M8166k32981l0201l8711p353J02918N6671J3477j0747O6031
2760F8576J2255Q7240l1233m7588Q9406m460r2517l0888Q7367J047J1630N7630
2748B08465N4840J6624N3862j34499n0679J5396o2757J9436r6326L7146P9310
2737A40818Q7494j0485O8688l0602M6500M341R47K8326J1557p3362j99308J14825
$$ y = [628517, 529931, 485840, 478740, 515048, 523726, 466975, 390966, 411430, 281103, 387046, 454827, 370923, 284959, 340950, 443939, 420888, 354870, 332344, 372401, 356549, 274996, 284435, 282817, 240662, 201856, 207597, 108005, 85674, 151265, 197570, 110285, 85084, 279813, 214706, 31572, -23607, 124595, 271320, 215017, 131241, 115482, 123724, 96945, 89808, 107257, 58553, -24180, 101306, 149472, -83509, -113710, -152421, -159774, -56856, -185, 13292, 2545, 68576, 80831, 168071, 136838, 89250, 178656, 174196, 81679, 50791, 138158, 139205, 150835, 208465, 263305, 279929, 333791, 199292, 148613, 164009, 101252, 120688, 24362, 61508, 140818, 228312, 217827, 286515, 255913, 302413, 306754, 307701, 336027, 347584, 274222, 74914, 189739]
2725A89739P8859j00726N014j3170O6311k3814m9825j937N151N2065P4249n0150
2713B31766j72406O7480K9057N2735m8709o6248Q6663J7912R059K3022M7839j17019
2701A61151k6619K1287o0706q5208r9140J8716j3875M5729k5012K5900Q0639k4109
2689A8753k1170j4511J15387J9779L8162j09611j67903J80207J51887r6349j07148
2678G483R4983L2199N1970j56773j00643n1753K5415J01770j4200m8340J6446
2667d1443Q1222M6621j246q9987l2838k7625J7574J98101o7589j59611J3830J14074
2655E1083J01682N7198j9338j58181K120J56342j31261n5714r282O0498j6397
2644C8750n0880M364k6388L312k7847L8269J43386L2947q2942K6274K260K374
$$ y = [189739, 268598, 167872, 172886, 159716, 226027, 202213, 152388, 150451, 155602, 207667, 281916, 231766, 59360, 126840, 155897, 208632, 159923, 93675, 180338, 198250, 207309, 230331, 278170, 161151, 134532, 155819, 95113, 9905, -89235, -70519, -84394, -38665, -63677, -37777, 42862, 18753, -2417, -16928, 98459, 118238, 156400, 46789, -121114, 59093, 210980, 114631, 7483, 102466, 134665, 186635, 29862, -70781, -122534, -97119, 4651, -9549, -57889, -41443, 39779, 86400, 85154, -4833, -37671, -65296, -47722, 150379, 82790, -76821, -62991, 51083, 152765, 209963, 190625, 32444, 34564, 190906, 59645, 3931, -5351, 55147, 38750, -12130, -7766, -34154, -30842, -58689, -20420, 122966, 155913, 72971, 99245, 101505, 103879]
2632A03879L0396r5117r6786Q2095r2870M6744J32039L4983j27579p4929N0164
2621f981J6199L1163j42534r8244P1311K40031p6366j33436L5113K8771L010M7884
2609A5921k744k7260K2328J4533o0726K5766n4851K5328Q3463l3205j1367o9628
2597g2442n4115J6460M5915j40707J3128l3495J58055J48351j8706K0069k5646
2586E6867K4852N8921j10905o9680O2435n0613o7544J5047J5426M9544n0467J1343
2574e4774M408l8904Q6638q805n3854M6560N2121m8339L9830O9766o5786O935
2562C5796k157j0281m101j0325n7142J25425L0211k9600j36540j17267J02310
2551g3671M5556o8061r9260K6009M3771J33948l6509m9291j0965O2416R1010l4704
$$ y = [103879, 134275, 39158, -57628, 24467, -68403, -21659, 110380, 145363, 17784, -57145, -6981, 9218, 40381, -102153, -200397, -129086, 110945, 34579, -98857, -63744, -34973, -31963, 15921, 13177, -14083, 8245, 22778, -37948, -12182, -67033, -41705, 41758, 8553, -2814, -72442, -126557, -110097, -64182, -204889, -191761, -225256, -67201, 81150, 62444, 82513, 56867, 81719, 140640, 29735, -39945, 22490, -28123, -95667, -80620, -65194, -15650, -66117, -54774, -50366, -89270, -2632, -11437, -65291, -18731, 33390, -14949, 24881, 94647, 28861, 35796, 33639, 23358, 19257, 8932, -48210, 77215, 107426, 77826, -58714, -175981, -73671, -28115, -96176, -195436, -169427, -125656, 8292, -28217, -77508, -88473, -26057, 64953, 30249]
2539C0249r4613k7290j9039j0003O7698N8931Q401n0633l6594K7999J10558m8126
2527A7538j32091L5508R2956m0958K9443o5177Q3522j2825j7724J7078M8934N7080
2515A13284j88860p9903J4599O4538N5456K1970j11093Q2290N9286O236n2668
2504a4865m365j0768l1758N1275k5818Q9917l6590k6353j088K1728P9132n6050
2492C4397n8993J5804q6006N816Q8916j05087P729J13185j7832p5546j50870J40437
2480h8050P3721j47911J31850J49913n7465j66922M1601K4350Q4149q0120n5517
2469i0401N8178k9967N7051L2476P8425j38532m482M1245k9704k3519j579r343
2457f0152M9772N2529j04042M2424O6774p8077J03007R9553o1622o0885J7727
$$ y = [30249, -64364, -91654, -110693, -120696, -52998, 5933, 14334, -36299, -72893, -44894, 65664, 17538, -114553, -79045, 13911, -27047, 2396, -62781, 20741, 7916, -9808, 7270, 56204, 113284, -75576, -155479, -140880, -76342, -20886, 1084, -110009, -27719, 31567, 37803, -14865, -19230, -29998, -61756, -10481, -36299, 53618, 17028, -9325, -10413, 11315, 90447, 34397, -24596, -8792, -94798, -88982, -66, -105153, -97424, 15761, -2071, -77617, -228487, -88050, -14329, -162240, -30390, 119523, 62058, -104864, -63263, -38913, 45236, -34884, -90401, -32223, -62190, -5139, 27337, 105762, -32770, -37252, 3993, -25711, -49230, -50809, -60152, -10380, 42149, -61893, -19469, 47305, -30772, 72235, 171788, 110166, 49281, 67008]
2446F7008l9452j41915J33085L3467J5630j8647K5399o2015M1310Q0653J22577
2435B57100N094k3923K6599k3755q3919j0677N5328q514m5742r406Q2943m8708
2423A72420m3881N7668K8414o8175p9387n9962L5330j8856o753O6164O4685q6649
2411F1018n5640M9607R434L341Q1832K1225j29183n174J04463N2064o4838K9754
2399A57903N2638K7214l7924M5128j3430j25823l5541q320Q8314j93618J9186
2388b4273L5319N5820Q4221m4097L2550P456n2095Q5831J1376j98315J31130J16492
2376B41415p3553q4241k9991L4157L1781l2497J2292Q1342Q8856n3662k8122P2976
2364B60753M9929L4855P6382o6714L5532J75956O288k3543r5388m0368k7078o3261
$$ y = [67008, 27556, -114359, 18726, 52193, 67823, 49176, 74575, 12560, 53870, 134523, 257100, 262194, 238271, 264870, 241115, 157196, 146519, 201847, 193333, 147591, 138185, 221128, 172420, 128539, 186207, 214621, 146446, 67059, 7097, 42427, 23571, 16818, 82982, 147667, 61018, 5378, 54985, 64419, 67760, 149592, 170817, 41634, 36460, 140923, 192987, 128149, 157903, 210541, 237755, 199831, 244959, 231529, 105706, 70165, 61845, 150159, -43459, -24273, 11046, 66866, 151087, 106990, 139540, 146996, 94901, 180732, 192108, -6207, 124923, 241415, 167862, 83621, 53630, 87787, 119568, 87071, 99363, 180705, 269561, 215899, 187777, 260753, 310682, 345537, 421919, 355205, 390737, 566693, 572981, 549438, 454050, 413682, 386604, 323343]
2352C23343m1570M6029J5927r3290q0027J32316o801j12631M0953q404J4258R3828
2340C23931j07532k5758R2906n152Q0801O407J8447K2206M3644K08048J01383
2329G59331O6998R8440J23622J63708M3430j62172j32818k04596r1627J2330k1109
2318F55537j10090R1232N7305q2743j09373l0645Q465r4642P6610L7878p9221
2307D20313k6930j01553j823J91774l5720P3049J3620k6525p6842Q8500k1735
2296D96128l1938R6915Q9802l2022M8359J19899k9266k9234n8601P832n6772l4944
2284E86158o4860l58J01548R34p5989J02110j0340j04213Q357k5558o5337P399
2272D59851L4686K9373Q9352j30810R4154O1416n6169O3305J29384l9642p5805
$$ y = [323343, 281773, 327802, 343729, 250439, 170412, 302728, 295927, 183296, 224249, 215845, 230103, 323931, 216399, 190641, 283547, 278395, 359196, 365603, 384050, 406256, 449900, 657948, 759331, 826329, 924769, 1048391, 1212099, 1255529, 1093357, 960539, 755943, 664316, 676646, 655537, 545447, 636679, 693984, 611241, 501868, 471223, 479688, 385046, 461656, 499534, 420313, 393383, 291830, 290007, 481781, 446061, 519110, 532730, 506205, 429363, 517863, 496128, 464190, 561105, 650907, 618885, 667244, 787143, 757877, 728643, 670042, 677874, 621102, 586158, 521298, 520940, 622488, 623422, 547433, 649543, 639203, 534990, 543347, 517789, 452452, 459851, 494537, 523910, 613262, 482452, 576606, 638022, 581853, 645158, 774542, 734900, 659095]
2261F59095L2250N7584K3164o9799J29529K0723K7231J47786R7163K5648J4067
2250A164441O0104L0042m5168o7974k8789j4573L2004M7104R466o1899j00319
2239A024439M1758J78235K6946o5540L643N3874O89J060N6015L0823J925J47315
2227A501182J53762J01800J51378J0485J47122j818R8068O8683J20666L1877J04012
2216B487217J88746J02801j58228p9638j15464j07577N6352j03010l2489j05482
2206B133228p5473J00887O3708J0213Q2722r700Q2959P1815J78501J77446Q8334
2195B904640N6690K32079J11508p3039l7959l0043J33855K7593O2133Q1223R7275
2184C565955O5836K30004J21217J01408j23q3763k7603n0322J19682j13935M5447
$$ y = [659095, 691345, 748929, 772093, 702294, 831823, 852546, 879777, 1027563, 1124726, 1150374, 1164441, 1224545, 1254587, 1209419, 1141445, 1112656, 1098083, 1130087, 1177191, 1186657, 1124758, 1024439, 1066197, 1244432, 1271378, 1205838, 1209481, 1263355, 1264044, 1265104, 1321119, 1351942, 1353867, 1501182, 1654944, 1756744, 1908122, 1918607, 2065729, 2063911, 2161979, 2230662, 2351328, 2383205, 2487217, 2675963, 2778764, 2620536, 2540898, 2425434, 2317857, 2374209, 2271199, 2238710, 2133228, 2057755, 2158642, 2222350, 2232563, 2315285, 2305585, 2388544, 2460359, 2638860, 2816306, 2904640, 2961330, 3193409, 3304917, 3231878, 3193919, 3163876, 3297731, 3325324, 3387457, 3468680, 3565955, 3631791, 3861795, 3983012, 4084420, 4084297, 4000534, 3972931, 3922609, 4042291, 3928356, 3973803]
2173C973803M9795m9651q33M7534J3179P4882K7564K5887M9690J40254o1983k5429
2161D264692J4621M9472n6930q1579j09544j99652k47803l09432j05276j97107
2151C021462j36126j16491K2521j68388r7333R5239q3028r2207L0156M0771r6554
2140B420022j1468k0555Q002J2068N7595m7143J29323R5973O857p2998J5203O7791
2128B660670K22442J34590j04829j62125j80957r5127j16666j36965k66127j23145
2118A831761o2015p1331K2113l7984j17395l4982q2669J6515J14040Q2626L8301
2107A698980p570J53194k4473L843P2529J67514K56077K6208q6253j96591j75197
2096A888261j15789m7581J3477j36194m4055l9331j58554q7739r8228m7657r3183
$$ y = [3973803, 4023598, 3973947, 3973114, 4020648, 4033827, 4108709, 4136273, 4162160, 4211850, 4352104, 4290121, 4264692, 4279313, 4328785, 4271855, 4190276, 4080732, 3881080, 3633277, 3323845, 3218569, 3021462, 2885336, 2768845, 2791366, 2622978, 2525645, 2620884, 2537856, 2445649, 2475805, 2516576, 2420022, 2408554, 2387999, 2396001, 2408069, 2465664, 2418521, 2547844, 2643817, 2650674, 2577676, 2592879, 2660670, 2883112, 3017702, 2912873, 2750748, 2569791, 2474664, 2357998, 2221033, 1954906, 1831761, 1769746, 1698415, 1720528, 1682544, 1565149, 1530167, 1447498, 1464013, 1578053, 1660679, 1698980, 1691410, 1844604, 1820131, 1823974, 1896503, 2064017, 2320094, 2346302, 2260049, 2063458, 1888261, 1772472, 1724891, 1738368, 1602174, 1558119, 1518788, 1360234, 1272495, 1174267, 1126610, 1033427]
2085A033427P0695l7957j02161j80799L3595J6078J61999l8148n1633O089M2659
2074I53844n7177O1842J17281p6800k2369P7675M2401L8855R1226j19635r4514
2063A012629o1814O2606j25192j84274j05516J2079N7937j14841j31683Q2739
2053E04670o593j12821J51876M5854r8949j04791M8109o3799K4557K6176n9364
2042C54925n8167J4083L985Q4439m7152q0950P8724l4916J3951r1470M3740p1008
2030B10184n794n047J14250j52075k5491J21960M0058m6297j09375Q4286l9108
2019A87551m4494R9354P6997j49044q0648N3556o6269L405L0936N5480J8131p6636
2007A08319M2443N933k7856M5815O3689m8617p4653O4641j2314m543m4836Q9916
$$ y = [1033427, 1104122, 1066165, 964004, 783205, 816800, 832878, 994877, 956729, 905096, 911185, 953844, 896667, 958509, 1075790, 998990, 976621, 1054296, 1096697, 1135552, 1226778, 1107143, 1012629, 950815, 1013421, 888229, 703955, 598439, 610518, 668455, 553614, 421931, 504670, 498077, 385256, 537132, 582986, 484037, 379246, 427355, 363556, 388113, 414289, 354925, 296758, 310841, 314826, 399265, 352113, 271163, 349887, 314971, 328922, 237452, 281192, 210184, 204390, 199343, 313593, 161518, 136027, 257987, 298045, 251748, 142373, 226659, 187551, 143057, 242411, 319408, 170364, 89716, 143272, 77003, 80408, 111344, 166824, 184955, 108319, 150762, 156695, 128839, 174654, 238343, 189726, 115073, 179714, 167400, 162857, 118021, 207937]
1995B07937l900m2263l9419p4428K1076R279j0255L7198Q0268n0114k2270Q3490
1983A96599q0310j00840O6926R7681P1j27103N1943j1558m1675K5195K4631j05356
1971c796J6892L8259L3860k906j25017K0625J23966n2976l2027J30628m2691o2973
1959D1844L0202M0746M9468l0381p7395o587Q7267O437k5160k6805j16196Q3917
1947E7357J27492q1130p9470l5312J01167N0947p5626l2285j6969M8637K4793
1936H9601k247l4413K5717O308L4796n1463n2430L0743k7539P237J06779n7977
1924G5112l3162M2986j25752P4289J34720p742k8127j13062J3619K1673J69997
1913B24551L7930k04413k1444N7805M8262K1208J01698o6388j29664n0096L1829
$$ y = [207937, 204037, 161774, 122355, 47927, 69003, 78282, 68027, 105225, 185493, 135379, 113109, 196599, 116289, 15449, 82375, 180056, 180127, 53024, 104967, 93409, 51734, 76929, 101560, -3796, 13096, 51355, 85215, 82309, -42708, -22083, 101883, 48907, 16880, 147508, 104817, 41844, 72046, 112792, 162260, 131879, 54484, 47897, 135164, 141601, 116441, 89636, -26560, 57357, 184849, 103719, 24249, -11063, 90104, 141051, 65425, 33140, 16171, 64808, 89601, 87354, 52941, 78658, 84966, 119762, 68299, 15869, 46612, 19073, 26310, 133089, 75112, 41950, 84936, -40816, 33473, 168193, 160451, 132324, 19262, 32881, 54554, 224551, 262481, 58068, 36624, 94429, 142691, 163899, 265597, 199209, 69545, 19449, 51278]
1902E1278L7716j778J07156k429q297K8254J6756r4289j12705J71559j078j7848
1890A74295J8677P9742o8784m2844Q8088n2607r8824l944J03677l093R5904j1206
1878B79081l7840L9467n521k9680N4551K5041j30551M0533l1128m9908L0870J02079
1866B86994l0017q4604J51768L9809q8089L4497Q3294j26883J6474K3729n57K5348
1854C31763m1317L1231J6813n7782J03538J06771n3390q4537J49279M9306p3718
1843D77957J18061K6634M3103q4313L2485J21852m784r0913j256N3008j6311J13425
1831G88948M2733j0792j56485j8649J16481j6846j27173m4521J81455J07251n7004
1820H05398o6488K3179n3170J9170J40777K4212p6295k3684J17403J1422k3272
$$ y = [51278, 88994, 87216, 194372, 191943, 183646, 211900, 228656, 134367, 21662, 193221, 192143, 174295, 192972, 272714, 203930, 161086, 249174, 196567, 97743, 93799, 197476, 194383, 290287, 279081, 241241, 280708, 275187, 245507, 300058, 325099, 194548, 235081, 203953, 154045, 184915, 286994, 256977, 172373, 324141, 363950, 275861, 310358, 393652, 266769, 283243, 306972, 306415, 331763, 290446, 321677, 338490, 280708, 384246, 491017, 437627, 353090, 502369, 551675, 477957, 596018, 622652, 665755, 581442, 613927, 735779, 730995, 640082, 638826, 691834, 675523, 788948, 831681, 820889, 664404, 645755, 762236, 745390, 618217, 573696, 755151, 862402, 805398, 738910, 762089, 708919, 728089, 868866, 893078, 816783, 793099, 910502, 921924, 898652]
1809H98652J38648N2804Q1782O6608J05012J43562k5995j35986q5691p8055m9723
1798A111618j78664K4544o4927j24249K44134k3311j00504k3137J9269m8396J4938
1787H51315m1435O6215P4358o0661j0518O937j7611j10283J07202n3208n3367
1776G58944Q2546J31411r7074q4851O5981J29713q720j14265j08438n3812J43914
1765H45349j20825m3962K547r3522J07763l5767r9460j18978N5830J19258m4225
1754E74008j45482O112N9578j41961J2536j4434k111j3559m7093j8045l7751J58255
1742C90053Q6474q2143j50234J7821K634N5951K7593j29432k0791K8428J2685
1731B39039n1737K909j0072P0651j9059p330O4059m0902n9982o0767o9532J01423
$$ y = [898652, 1037300, 1090104, 1171886, 1238494, 1343506, 1487068, 1461073, 1325087, 1239396, 1161341, 1111618, 932954, 957498, 892571, 768322, 1012456, 989145, 888641, 865504, 884773, 836377, 851315, 809880, 876095, 950453, 889792, 879274, 886211, 868600, 758317, 865519, 812311, 758944, 841490, 972901, 875827, 790976, 856957, 986670, 977950, 863685, 755247, 701435, 845349, 724524, 680562, 683109, 589587, 697350, 661583, 562123, 443145, 498975, 618233, 574008, 428526, 434638, 494216, 352255, 364791, 350357, 348246, 334687, 287594, 269549, 231798, 390053, 476527, 394384, 244150, 261971, 264605, 320556, 348149, 218717, 197926, 226354, 239039, 187302, 190211, 180139, 250790, 231731, 224401, 288460, 247558, 187576, 126809, 57277, 158700]
1719A58700Q8892j5549p3157k5865J2497O7445r6093n1578K2418N116K2250j5274
1707I9802m1566m8657J0526k214q4276N8394P2638j9708o4370M4038k5522N182
1695D267R3237n5734m9242Q1321N2664n6783n8633M4331K0346p6386r1681O0187
1683c2106L9877P4130j05262l7840N248O142J57121j11255o804j1840J50905n812
1671A22504j82089J5478J05426m7645L4924m7913j22333J00127j2638M6776j7994
1660e377j01023j9807Q5340N5385j05949J144N2078j17361o5628J30967R7354
1649G123L251K0851q1381L5724k7536N7580p3111k1550M0644L2423J05068j50060
1637e0974o3290l4813p4020L078J35562J4500q8468o4156R8877Q5726K4919J4456
$$ y = [158700, 247592, 232043, 158886, 133021, 145518, 212963, 116870, 65292, 87710, 92826, 115076, 99802, 58236, 9579, 20105, 17891, -66385, -7991, 64647, 44939, -19431, 24607, -915, 4267, 97504, 41770, -7472, 73849, 126513, 69730, 11097, 55428, 75774, -612, -92293, -32106, 7771, 81901, -23361, -61201, -55953, -49811, 107310, -3945, -10749, -22589, 128316, 122504, -59585, -44107, 61319, 13674, 48598, 685, -121648, -21521, -34159, 12617, -5377, -106400, -126207, -40867, 14518, -91431, -90287, -38209, -155570, -221198, -90231, 7123, 10374, 31225, -50156, -14432, -41968, 15612, -57499, -79049, -38405, -5982, 99086, -50974, -114264, -149077, -223097, -220019, -84457, -69957, -158425, -222581, -123704, -37978, -13059, 1397]
1625A397k583j77813M6618J56728L9308j44824j15334J02154J44799k7823j15595
1614i2968n7498J29788K582j17400L4821j3332L6742J8033O7855n7685j53340
1603b02402O5227j7035p1589j0280J04392N2647J0587q9949Q8759K0180p1576
1592a21039P8715q5098k1395k0934J32814O5160k20284O7629N8925j30897M4158
1581a52246O8839l6655K9852o6429m4391Q8384m4678L6697l4234m620K1395J7384
1569a20702Q8868j38756r060J44150J5127j01163L1888N7641m9939j09723k6101
1558b17770P9314k3560P553o5879L7024O2209P7k379p2765j03285L9379K09981
1546e0101n2075n9810J8568O0180j6789r9216Q3195n3929K7385K6029l710J7758
$$ y = [1397, -1186, -178999, -132381, 24347, 63655, -81169, -196503, -94349, 50450, 22627, -92968, -150466, -20678, -18096, -135496, -100675, -114007, -77265, -59232, 8623, -49062, -202402, -137175, -154210, -225799, -236079, -131687, -79040, -68453, -158402, -69643, -49463, -121039, -42324, -127422, -148817, -169751, -36937, 28223, -192061, -124432, -65507, -196404, -152246, -83407, -120062, -90210, -156639, -201030, -112646, -157324, -120627, -154861, -159481, -138086, -120702, -31834, -170590, -179650, -35500, -20373, -121536, -89648, -32007, -81946, -191669, -217770, -138456, -162016, -154463, -220342, -183318, -121109, -121032, -123411, -196176, -299461, -260082, -50101, -102176, -161986, -143418, -83238, -100027, -199243, -116048, -169977, -142592, -116563, -120273, -102515]
1534a02515k7872p3069M2782Q0367o6977L1314J28464o7461o0963O9447R624j32360
1522a69219Q5195n1760m2305Q0488J25873o7333j35488m6239R5885J36674n9574
1511d7803q3873O3385R5392r2573k2407P6186j02801o3301J02190L3189J367M3798
1499B749l8252m2481J9758n2169J3274n6894p5041M7960J48242j2179l8899J8283
1487f5649L4002q3703O2958K6516j36697L6371N4368j3780j13m159L3426l7449
1475i3909k4896K6680P4115o1644r0617N7406n997L5527j1214P417K6782j14848
1463a75198K1667N7090N7434r3847q099q918l140j0560j3967Q6700K1895M3869
1451b5074j08911N799r1229M6163Q6552k1578n4412L567Q0077N1674k7095p242
$$ y = [-102515, -130387, -203456, -160674, -80307, -147284, -115970, 12494, -54967, -115930, -46483, -36859, -169219, -84024, -135784, -178089, -97601, 28272, -39061, -174549, -220788, -124903, 11771, -47803, -131676, -68291, 27101, -65472, -87879, -11693, -114494, -177795, -75605, -42416, -41049, 2749, -35503, -77984, -58226, -110395, -97121, -154015, -229056, -181096, -32854, -45033, -83932, -65649, -31647, -115350, -52392, -25876, -162573, -126202, -71834, -85614, -85727, -89886, -56460, -93909, -118805, -92125, -18010, -79654, -170271, -112865, -118862, -83335, -94549, -87132, -60350, -175198, -153531, -96441, -39007, -132854, -140953, -149871, -153011, -163571, -177538, -90838, -68943, -25074, -133985, -128186, -219415, -173252, -86700, -108278, -162690, -159123, -79046, -27372, -54467, -61709]
1439f1709K2632p4282J20738P2703q9392j3179j7319P4538j45940o6298P1982
1428a05526k8207J03826q43m9218m8618J2469k9147J92975j16225q2674M5717
1417a05471l0026O9702m0066J23596p985l290j14635L3528P5113m4061k4356N761
1405f2190K6499r4984j9909K5849k9409o37k6098J8547l8583Q0229K9465L6097
1393e5124L5187o1986L3993n8602J3260K2075P5507o0528L5057l5475n8150J10202
1381d584r026L4607j69139j60017J43934J05129q896r830k5600K2945J0565L4124
1369c5788K2159k8601o2280L5176P0932o0134r1057P2306n1380p8401R1253J5828
1357i9987K1379n9873N07k0702K2538J1302M680n5446P6363L0850p6916N4829
$$ y = [-61709, -39077, -113359, 7379, 80082, -9310, -22489, -39808, 34730, -111210, -177508, -105526, -133733, -29907, -30750, -79968, -128586, -116117, -145264, 47711, -68514, -151188, -105471, -135497, -65795, -105861, 17735, 9750, 6460, -108175, -74647, 466, -43595, -67951, -62190, -35691, -130675, -150584, -124735, -154144, -154781, -180879, -162332, -200915, -120686, -91221, -55124, -19937, -81923, -47930, -106532, -93272, -71197, 4310, -56218, -21161, -56636, -114786, -4584, -13610, 20997, -148142, -308159, -164225, -59096, -67992, -77822, -103422, -80477, -69912, -35788, -13629, -42230, -104510, -69334, 1598, -58536, -149593, -77287, -128667, -207068, -115815, -99987, -78608, -138481, -137974, -158676, -136138, -124836, -120156, -175602, -99239, -68389, -145305, -90476]
1345i0476M872n712P256L337l0493L9801P669Q3274Q285o1721J5031j09758j2799
1332a41434P162o2998L4839M5266j0645J848J4416O7946j8820p5681P7234J07332
1320D6465j14838M5420K4122K8941q1686L9956J7234o9289p605J3524k2157j9223
1308i9136L4291J0872L391j1885k0645m5733O1721j07699p888Q5296O6802j9981
1296e0594j0233O2575J437j1642K1772Q4805j0763j04783J0143o948m8474L8691
1284b4014M6581p6746k3957q2033k0364j3459J14523K3386o328O6656j9083j7045
1272c1883l0739N2447l230K9186P051l860K137k3870L1715o3120p529O1123j081
1259A8347j06143M9041O5120j04160Q2286m2836K813k4843P6209Q6579r150M328
$$ y = [-90476, -85604, -91316, -84060, -80723, -111216, -71415, -63746, 19528, 27813, -33908, -18877, -128635, -141434, -134272, -197270, -162431, -117165, -127810, -125962, -111546, -43600, -62420, -138101, -60867, 46465, -68373, -22953, 1169, 30110, -51576, -11620, 5614, -63675, -71280, -57756, -79913, -99136, -64845, -53973, -50582, -62467, -83112, -128845, -67124, -174823, -182711, -97415, -30613, -50594, -60827, 1748, 3185, -8457, 13315, 98120, 87357, -17426, -7283, -14231, -62705, -24014, 22567, -54179, -78136, -160169, -180533, -193992, -79469, -56083, -62411, 4245, -14838, -31883, -62622, -10175, -13405, 15781, 22832, 18972, 21109, -2761, 28954, -34166, -41695, 19428, 18347, -87796, -38755, 26365, -77795, 4491, -38345, -35532, -60375, 15834, 102413, 93263, 97591]
1247I7591k36M9309r533O7807m0626K352p232O7626P7697L5061n3312r7741j4438
1234A74325J4489m1383p203o8796j3381p7082J51701L6612k2858n2307k2399j9613
1222E2105r4428Q6526K0465q76K7616Q4316n0957r2838L1137n3846o0011J8564
1210c2227R0503q5796p298L5821j0085Q0289o1637k5666O3387j2896l9710J40009
1198A34694l9013n1880J9098L7151L0434r079M3898K3200r2184m7315m4435N7038
1186F1607N2368l1352q2583K2619n4646J33465o425j39181M6299L184J36200j1862
1174A29693p3954m4386Q2441q631m1584O226l4761m347L1307R6187m7230O701
1162I7662m51O6862L932m4433M8305J2800o5962o4322m5219P7497N2114K772n4571
$$ y = [97591, 97355, 146664, 137131, 204938, 164312, 166664, 159432, 227058, 304755, 339816, 286504, 188763, 174325, 188814, 147431, 140228, 71432, 58051, -19031, 132670, 169282, 146424, 94117, 71718, 52105, -42323, 44203, 64668, 63792, 91408, 175724, 124767, 31929, 63066, 9220, -50791, -32227, 58276, -27520, -34818, 1003, -9082, 71207, 9570, -16096, 47291, 34395, -5315, 134694, 95681, 43801, 62899, 100050, 130484, 121405, 165303, 188503, 96319, 49004, 4569, 61607, 113975, 82623, 40, 22659, -31987, 101478, 95053, -44128, 2171, 5355, 141555, 129693, 55739, 11353, 93794, 85163, 43579, 49805, 15044, 10697, 42004, 138191, 90961, 97662, 97211, 164073, 168005, 123572, 171877, 184677, 118715, 54393, 9174, 86671, 138785, 141557, 86986]
1149H6986P136k0847M1828k3537r52L2277j8969M4707l0443m4988M0963q1351
1137C2810q6394J48564L0408m3526l0284O9707N6237n7707n7814P9216O4575m2776
1125A63016l4186n9812J06066m7698j8927J8681l1272J40165P723p2184l4838
1114A36734K290o5129Q6666j1422p2641Q0092P6958k8861j2352K7978j23041n0849
1102D6423J26095K4655o3821o8730N2602L6772L9740J5500m4791p914N1033n9536
1090A48028Q2767R578j51430J69007N6391n0888Q155n693K357Q1799K7057n6312
1078C20816K1665N7688o565K1512j3412m6221P6057P6058j05564m0527J38414
1067D99921p181j11440K8043J9992k9599J12517M6170n8211M326k8390k5022Q4111
$$ y = [86986, 94122, 73275, 115103, 91566, 90614, 122891, 103922, 148629, 118186, 73198, 114161, 32810, -53584, 94980, 125388, 81862, 51578, 121285, 177522, 119815, 62001, 141217, 205792, 163016, 128830, 69018, 175084, 127386, 108459, 127140, 95868, 236033, 243756, 171572, 136734, 139024, 73895, 160561, 149139, 76498, 156590, 233548, 204687, 192335, 220313, 97272, 46423, 172518, 197173, 133352, 64622, 117224, 153996, 193736, 209236, 164445, 156531, 207564, 148028, 230795, 240373, 88943, 257950, 314341, 263453, 271608, 265915, 268272, 350071, 377128, 320816, 342481, 400169, 393604, 415116, 401704, 355483, 431540, 507598, 402034, 361507, 499921, 492740, 381300, 409343, 429335, 399736, 512253, 558423, 500212, 504538, 476148, 451126, 535237]
1055E35237m1987q7641J83903R1032k5247O418Q1320q1473L5723J70999L3867
1044I02151j55298m5370J52360P4692K1245q4176j7815M3983J5900q9581q341
1033H09750o3133O2421J48504k7223n8753k1372J58532N8479m9629M4702J8477
1022A080755K7941Q489R2918M0570N5658L5068N2635J7484r0470K0790J53266
1011A495104J49473j11053O6967q159n6139J95335l5574K2603j04361J08270Q6267
1000A808733P0009l0263Q8548Q6706N2064R1465L6090R7368n630R7515J36048
989B528653l6953K45815K28152K78709K05897J12707O9197K12970K47818J72678
979D265643K54275K90734K07016L51278M54033K96910L73179N75127P09271Q03052
$$ y = [535237, 493250, 405609, 589512, 680544, 655297, 661715, 743035, 661562, 697285, 868284, 902151, 746853, 701483, 853843, 928535, 949780, 865604, 847789, 891772, 907672, 818091, 809750, 746617, 809038, 957542, 930319, 871566, 850194, 1008726, 1067205, 1017576, 1062278, 1080755, 1108696, 1117185, 1210103, 1250673, 1306331, 1341399, 1394034, 1411518, 1321048, 1341838, 1495104, 1644577, 1533524, 1600491, 1592332, 1536193, 1731528, 1695954, 1718557, 1614196, 1722466, 1808733, 1878742, 1848479, 1937027, 2023733, 2075797, 2167262, 2203352, 2300720, 2295090, 2392605, 2528653, 2491700, 2737515, 2965667, 3244376, 3450273, 3562980, 3632177, 3845147, 4092965, 4265643, 4519918, 4810652, 5017668, 5368946, 5822979, 6119889, 6493068, 7068195, 7777466, 8580518]
969H580518O15268M16601K74910P17228R59732J152318J380108J631399J754263
960A7482345K273652K690094L538870N016046P223862R500686J1275346O633454
952F5634355q735104j3223494r166938n915351m055192l334860l028243k659441
944A5515732j948921j559381j079122p94539p83104p32054l67349l67039p40809
935G143414p42066n91754n19993k74279l07710l85672l53387j95348j94297j05616
925C473292j51896j97731k28797j67338j9988r5323j51711Q3299r5069j57448
915B291290r8161j12619q9767q6114n7008k4201j60638l3441n1512l3514K7976
904A572291n7863j95054J0903k6089l6849n7872p2720r8830K494p934m7202J848
$$ y = [8580518, 9195786, 9612387, 9887297, 10604525, 11564257, 12716575, 14096683, 15728082, 17482345, 19755997, 22446091, 25984961, 31001007, 38224869, 47725555, 59000901, 65634355, 56899251, 43675757, 34508819, 28593468, 24538276, 21203416, 18175173, 15515732, 13566811, 12007430, 10928308, 10133769, 9350665, 8618611, 8251262, 7884223, 7143414, 6401348, 5809594, 5289601, 5015322, 4707612, 4321940, 3968553, 3773205, 3578908, 3473292, 3321396, 3123665, 2894868, 2727530, 2707542, 2612219, 2460508, 2543807, 2448738, 2291290, 2193129, 2080510, 1990743, 1904629, 1847621, 1823420, 1662782, 1629341, 1577829, 1544315, 1572291, 1514428, 1319374, 1330277, 1304188, 1267339, 1209467, 1136747, 1037917, 1040411, 1032477, 985275, 987123]
892I87123K2662p1771o503r6980o4686M0395J5050m3212L2895k8231m2382O0557
880H04917o425l8523j09087J14099k701j23650p336M0128R3341l0516j09485j05485
868E19277K2462k6986j670n8823K4447N392N1756P9391m5423r3467m3093j50679
856B82584P2462J26343p8982j0580P9516L1319q1618j19049l033J7649K5602N0896
844C93109m1515j3144r3922l9220N8351r205J8592l866n889p0301o0832l400n316
831A23442R6848L4877r759n1278K3899j4180L0456l7581l7305J3325Q4960K5436
819B83140j54583m1640J68868M8545p0534j03799p1916Q413J48284j0571m6725
808A57482k6421O0005K8411o4970M037j3274j7034j827j21953Q1972J9878L3914
$$ y = [987123, 1009785, 938014, 931511, 834531, 769845, 810240, 825290, 782078, 814973, 786742, 744360, 804917, 798492, 759969, 650882, 764981, 762280, 638630, 631294, 671422, 764763, 734247, 624762, 519277, 541739, 514753, 513083, 454260, 478707, 484099, 535855, 615246, 569823, 476356, 433263, 282584, 355046, 481389, 402407, 391827, 471343, 502662, 421044, 301995, 298962, 316611, 342213, 393109, 351594, 338450, 244528, 205308, 263659, 254454, 273046, 269180, 263291, 192990, 132158, 128758, 123442, 220290, 255167, 245408, 194130, 218029, 203849, 234305, 196724, 159419, 172744, 257704, 283140, 128557, 86917, 255785, 304330, 233796, 129997, 58081, 66494, 214778, 204207, 157482, 131061, 191066, 219477, 154507, 158544, 145270, 128236, 126409, 4456, 86428, 106306, 140220]
796A40220R5875j35192k180L3534o0746j665O4095k9994M6673p1247M5156j4991
784A09538o2490P6837j08531L2020L9820o6360J3726N0605n5146O4804J7262j01417
772A0668m8294l0384J47453K2397n1318K4832j6850P3364j9071j15481N3241n1848
760a291L4926o198r4019j5307J80617k9543p3087j8749J2771P6313m3259l495
748A9679n6300K5150L4154Q598q802p1256o5331J38399q846k1379l7933L5581
736h286L1811n7801J0660J0341p577M7417k3555q3326P0180m5544j4391p5234
724a45305L0092N0008M7854O902n9199Q6281O5251r6296k3575R991o3898O8732
712b3162m0203k1191L2598K9139N6024l4863j7645L8610m3788J7415M461k9801
$$ y = [140220, 236095, 100903, 98723, 132257, 71511, 69846, 133941, 103947, 150620, 79373, 124529, 109538, 47048, 123885, 15354, 47374, 87194, 20834, 34560, 85165, 30019, 94823, 112085, 10668, -37626, -68010, 79443, 101840, 50522, 75354, 58504, 131868, 112797, -2684, 50557, -1291, 33635, 27437, -66582, -81889, 98728, 69185, -3902, -22651, -9880, 66433, 23174, 19679, -36621, -11471, 22683, 31281, 22479, -48777, -114108, 24291, 15445, -5934, -43867, -8286, 23525, -34276, -23616, -13275, -20852, 26565, 3010, -80316, -10136, -55680, -70071, -145305, -115213, -65205, -17351, -10449, -69648, 16633, 81884, -14412, -37987, -27996, -91894, -23162, -63365, -84556, -51958, -22819, 33205, -1658, -19303, 19307, -24481, -7066, -2605, -32406]
700c2406K1445N8959r4345J08729l8157j17203n8640M2636J83049n0371N9256
689H2952J2664m1240r786P0222q0143l4398o0705O1166O3O711L1180r89M1212
676G8909q0498K4993R5682j2137j4181m474r2288M8749J20740J57140p2954p1501
664A78180k9535q1724M3779M5052n9874n1620M8961j3074R8878P1999j44204p1585
652C5233j094L7983m0822N336m3043o6905J40148R321j0608M876J0303J9833m3517
639E7044l1256Q033N3199p9666n2913n9452R1665K8415P883l4426m4695l0633
627h6802O5377N0993j9620n5601j23189J40051K9820J9819m4840j6873O9460J9714
615D8309r0750n4616O7267J45822j5233j09120r5338M7919J8699J6910O3743L1380
$$ y = [-32406, -10961, 47998, -46347, 62382, 24225, -92978, -151618, -108982, 74067, 23696, 82952, 95616, 54376, 44590, 114812, 34669, 271, -60434, 732, 795, 7506, 38686, 37697, 78909, -1589, 23404, 119086, 106949, 92768, 88294, -3994, 44755, 165495, 322635, 249681, 178180, 148645, 66921, 110700, 155752, 95878, 44258, 93219, 80145, 179023, 251022, 106818, 35233, 34139, 72122, 31300, 36636, -6407, -73312, 66836, 76157, 65549, 70425, 80728, 100561, 57044, 25788, 33821, 87020, 7354, -45559, -105011, -13346, 15069, 22952, -11474, -56169, -86802, -21425, 29568, 9948, -45653, -168842, -28791, 1029, 20848, -23992, -40865, 28595, 48309, -42441, -97057, -29790, 116032, 100799, -8321, -103659, -55740, -37041, -20131, 43612, 74992]
603G4992n1512q0112L5126O358k8056j1123Q8959m8131K7970J4152j07207P6843
591a741l8650j026J3996q7349n6886J04494N0661m2279m283J05497K3384o6700
579h82P7684j25823k0306O6020M0945N99j3050j5358l5545J717K380j145n0735
566g3499O2581M7962j03730J14789K7038r0852J7751L1344k2156j7339k2719K772
554b6058j2858j7815P2211J4879M0804m2128K504J1759j28943N0099J8932p7256
542i3870p279m3874N3711J2840J2701L7558k6604M2173K9547r2902J1974Q1786
530A7761p2681J00584l7278n7439L0462P0193r0920o7143J32371l4140p7034Q1690
518c574R8839j17776Q2848k8147r2369m4806M2553R410j1579j4988o0988L3495
$$ y = [74992, 23480, -56632, -21506, -15148, -43204, -54327, 34632, -13499, 14471, 28623, -78584, -1741, -40391, -41417, -27421, -114770, -171656, -67162, -16501, -58780, -63063, 42434, 65818, -882, 76802, -49021, -69327, -3307, 37638, 38237, 25187, 9829, -25716, -23999, -21619, -22764, -73499, -10918, 37044, -66686, 48103, 75141, -15711, 2040, 33384, 11228, -6111, -28830, -26058, -38916, -56731, 15480, 30359, 71163, 29035, 31539, 43298, -85645, -35546, -16614, -93870, -101149, -145023, -91312, -78472, -65771, -28213, -54817, -12644, 16903, -75999, -64025, 17761, -54920, 45664, 8386, -49053, -18591, 51602, -39318, -106461, 25910, -8230, -85264, -3574, 95265, -22511, 60337, 32190, -60179, -104985, -62432, -53022, -64601, -79589, -140577, -107082]
506a07082J24240l1489j5128M3857q9538j763M6233L1991L4053P5821p7850K408
494C5753n5044o824Q1359m2524n4169o8992L9464O5447m2336n045K5863J1811
482a5237L1566r6855k9243J01406K9707j1656j02954k4613Q8002O5228J1844o7405
470b0210k3098O3042Q0040m4054j8783M9385l2983O045l9583r0917r2559L211
458a60464Q7592l4325N0631P201q064J983k5016O2457M2173m1242j103q172o3330
445h9679n653N4623J009J9056O6069J7341p9547L9942K6114n7341k2700k2866
433e3632R505o264L5274o6586J19508J9732j29772O8782O7186r87o6372o1829
421f5455L2854K3099k2599Q630L91P0050n2481l5753N7481l124l1489k367n4567
$$ y = [-107082, 17158, -14331, -29459, 14398, -75140, -76903, -30670, 1321, 35374, 111195, 33345, 35753, -19291, -26115, 55244, 12720, -41449, -110441, -70977, -5530, -47866, -52911, -27048, -15237, 16329, -80526, -109769, -8363, 21344, 9688, -93266, -117879, -29877, 35351, 47195, -20210, -43308, 19734, 99774, 55720, 36937, 86322, 53339, 59384, 19801, -71116, -163675, -160464, -72872, -107197, -56566, -49365, -57429, -55446, -80462, -18005, 24168, -17074, -18177, -26349, -89679, -95332, -40709, -39700, -20644, 45425, 62766, -16781, 23161, 49275, -8066, -30766, -53632, -44127, -50391, -15117, -81703, 37805, 57537, -72235, -3453, 63733, 62746, -3626, -65455, -32601, -9502, -32101, -23471, -23080, 46970, -5511, -41264, 16217, 13093, -18396, -20763, -75330]
408g5330K8431L2242j7344k7549P246R8550M1893q9744j84517M6800J31657L2806
396B5141m7860R113k1170O3247J00735p1922k06725N3740J06667l0579j45198
385a64811J10964K6862q7707J07124M8054q5484m20K3655k2775P3682K5817m0559
373A4402j5824J175K9853j2207O6891q2900j18263j6069k0613O06M2320N6160
361e4469j3512O429P8328j9626q0458M2235N6057q954n2392K1288L6485L7073
349D8484n3109L9610q9904o7611M432J09134n2642N5332K2974k6723j9482N0820
337B1315o0450l9735Q1566r1357N3306L8782P383l5789l1639L0607j9299P504
325c7806M2527l5411o6997J9134j8848k16Q9958J2296m8898m5385l4810O3322
$$ y = [-75330, -46899, -14657, -32001, -59550, -52304, 46246, 88139, -1605, -186122, -139322, -7665, 25141, -22719, -13606, -34776, 28471, 129206, 57284, -149441, -95701, 10966, -19613, -164811, -53847, -26985, -114692, -7568, 40486, -44998, -45418, -21763, -44538, 29144, 54961, 14402, -1422, -247, 29606, 17399, 84290, 1390, -116873, -132942, -153555, -152949, -110629, -54469, -67981, -61552, 16776, -2850, -83308, -41073, 14984, 6030, -46362, -25074, 11411, 48484, -4625, 34985, -54919, -122530, -118098, -8964, -61606, -6274, 16700, -10023, -29505, 21315, -39135, -78870, 2696, -88661, -35355, 3427, 10810, -24979, -56618, -26011, -45310, -37806, 4721, -30690, -97687, -78553, -97401, -97617, -7659, 4637, -44261, -89646, -124456, -61134]
313f1134n8401j088J1803l217K1296Q1759j8587m1107K7190J9348M6961m8256
301b3433N4511r6455p832N1842q633j5926j4824R8286k0822n2372n7258j1279
289a04195N3151L8562k7077p2495J01717J5613n3654k5951K9611K6786j9662M1527
277C933J5864J7537j9449j1533q4647M1690L7081q0673n6262J6905P2190j4707
265f2071N7531k3112L5438k6843j565l9710k1569M5434K7305J690O886K5650K7658
252E2722l7710l3496J9199P1261n6557j05666l561r7404m5994J24060Q9615o9521
240i3052j868q512Q1583n9052l8488p805R0006k9932m7324N8240j750L6176l732
227b5510O1821k7591p7486o5364J15884N4528q2258L015J7097l3420k5151K8133
$$ y = [-61134, -119535, -120623, -108820, -112037, -90741, -8982, -27569, -68676, -41486, -22138, 24823, -23433, 31078, -65377, -73209, -21367, -30000, -45926, -60750, 37536, 16714, -35658, -92916, -104195, -51044, -12482, -39559, -112054, -10337, 5276, -48378, -74329, -44718, -17932, -37594, 3933, 19797, 37334, 17885, 6352, -78295, -36605, 476, -80197, -136459, -119554, -47364, -62071, -4540, -27652, 7786, -19057, -20622, -60332, -81901, -36467, -9162, -7472, -586, 25064, 52722, 15012, -18484, 715, 71976, 15419, -90247, -93808, -191212, -237206, -113146, -23531, -93052, -94920, -103432, -21849, -80901, -119389, -127194, -37188, -67120, -114444, -56204, -57954, -21778, -25510, 36311, 8720, -68766, -134130, -18246, 36282, -45976, -42961, -25864, -59284, -84435, -56302]
215e6302J7026q2355K2701j5039M1694j0782l3252L5373J9J5016J3300j9249j9793
202i1643J25972M2757n0101q9704M4738L4807p6421K7790m0287M6043p4803L6339
190f4513J3836o297Q1936k3242j2643q0655l6703p280R0251Q051n3567M5618J757
177d3451J0319J7872J0656q2340K4770P1535r9986k4600m1898N7251P798l3183
165a25257k4117J3080J02813j3773Q7851k3541M664k2912K2526l5182q4038p370
153a05256J1871M4380k7378J992J3243M2347m4331r1214J25458l1992p4333J4887
141a20326j607j791J127P6566n8095M6556o3692N5762J554P3661P4o8410J8447
128d0174J7764J0093n1850K2764l6700J5696m587o8811N934n082Q5968Q360q768
$$ y = [-56302, -39276, -121631, -98930, -113969, -72275, -83057, -116309, -80936, -80917, -65901, -52601, -71850, -91643, 34329, 77086, 26985, -62719, -17981, 16826, -59595, -31805, -72092, -26049, -100852, -64513, -50677, -56974, 24962, 1720, -10923, -91578, -128281, -135561, -45310, -37259, -90826, -45208, -43451, -33132, -15260, -4604, -86944, -62174, 9361, -90625, -115225, -157123, -99872, -92074, -125257, -149374, -136294, -33481, -47254, 40597, 17056, 21720, -1192, 21334, -13848, -97886, -105256, -93385, -49005, -76383, -74391, -61148, -18801, -63132, -154346, -28888, -60880, -135213, -120326, -121933, -123724, -122597, -46031, -104126, -57570, -121262, -65500, -63946, 9715, 9789, -58621, -40174, -22410, -12317, -64167, -41403, -78103, -62407, -66994, -135805, -129871, -134953, -48985, -40625, -49393]
115d9393q0820J6269l0258L619P1574j9237o8119M5620N0113M3402q1445N40N6426
102d1709q919J7784n4581l312M4528N7516R1691k6827o2360j6529M733M7162j71694
89a22517M5402K856j8974K5567L1679J793m1170L8794j5784L9817m0559n8024
77a11120M2678J4519l9485l5061Q5889l9412j1393K4951n321m9844K1108N6512
65d5979k6476n3802K0727J16702k0067p7266O161M9346j0276o2829o650m4008
53a54417k527K2718J31346m0013n8447N3947m6462M2724K1767k1410l8806j919
41i1499J8763J5924q083j5745K4144L3134M413o4688m8644J3139M5480O4987m2830
28e1505l0637l9439l0686Q55M3269J4868l9175J2409R82k910N8J26398j28174
$$ y = [-49393, -130213, -113944, -144202, -140583, -69009, -88246, -156365, -110745, -60632, -17230, -98675, -98135, -41709, -50628, -32844, -87425, -90737, -46209, 11307, 102998, 76171, 13811, -2718, 2015, 49177, -122517, -77115, -74259, -93233, -67666, -35987, -34194, -75364, -36570, -52354, -12537, -53096, -111120, -68442, -53923, -93408, -128469, -42580, -81992, -93385, -68434, -73755, -123599, -102491, -45979, -72455, -126257, -105530, 11172, -8895, -86161, -80000, -30654, -40930, -103759, -110409, -154417, -156944, -134226, -2880, -42893, -101340, -47393, -93855, -51131, -29364, -50774, -89580, -91499, -72736, -56812, -64895, -80640, -56496, -23362, -18949, -83637, -132281, -119142, -73662, -8675, -51505, -82142, -121581, -152267, -151412, -108143, -93275, -132450, -120041, -119059, -121969, -121911, 4487, -123687]
15a23687J3126Q3472n1152m9141n5194R7199M3692o823l752K669n2888O6783j5681
2e1377l743K4555
0c0565
$$ y = [-123687, -110561, -27089, -78241, -127382, -182576, -85377, -41685, -48508, -52260, -49591, -102479, -35696, -51377, -55120, -30565]
$$ Imaginary data points
##PAGE= N=2
##DATA TABLE= (X++(I..I)), XYDATA
16383a192614m9898o867J10153Q060k8269L0990O427m1380R9737P0429p1396J7869
16371a046759P8341r58L2729M4533m2004q22Q2336o0341K457O5574N9001l8281
16359h24194N9287N6537K557J7101M4733o147l0938Q5765p5787J8494J6057J2504
16347f24031J12926J1432m3212O3277L7976j5034N4453K0233l415J8593M3750
16336c23052k0189L3529R1287k9240q504M808j7616R9499L0020L8129n1365J7671
16324a35023J964L3207M3602m6963J5342J1459M0766K7677q149J5123l786j8023
16312b2804O9588j405L8419L3484P7247N280k80l5042N0162j8200J5771O7492
16300B79712M0502M1164r802q120p672L216K339l4339M8915L5054j5689N2784
$$ y = [-1192614, -1242512, -1249379, -1139226, -1131166, -1159435, -1128445, -1122018, -1163398, -1063661, -993232, -1064628, -1046759, -968418, -969376, -936647, -892114, -934118, -934940, -852604, -912945, -910488, -844914, -785913, -824194, -764907, -708370, -705813, -688712, -643979, -650126, -681064, -595299, -671086, -652592, -636535, -624031, -511105, -499673, -542885, -479608, -441632, -456666, -402213, -381980, -385395, -366802, -323052, -343241, -309712, -218425, -247665, -256169, -251361, -268977, -169478, -139458, -101329, -152694, -135023, -133059, -99852, -56250, -103213, -87871, -76412, -35646, -7969, -16118, -995, -4781, -22804, 46784, 45379, 83798, 117282, 194529, 199809, 199529, 164487, 214649, 196449, 212220, 279712, 320214, 361378, 351576, 343456, 335784, 339000, 341339, 307000, 355915, 390969, 375280, 428064]
16288D28064O3855O0437l0085N1178K477K8892M2231k7484J6295j779K9722r91
16276F62812K807K8609L1834k3288n3192r283Q5370j3988k2238R9082q98r7493
16264F90134N2415J48372j0781J0296M0373n1569o9868J33345m5834j6681L1926
16253I12128L7627m2392j8869O2295O696k1522l2503K7875R7449K7956j13543
16242I43197k4125J19383O3573n1255J9396K4681k2978J38065p0161J6884P7765
$$ y = [428064, 491919, 552356, 522271, 573449, 575926, 604818, 647049, 619565, 635860, 634081, 663803, 662812, 665619, 694228, 726062, 702774, 649582, 640299, 725669, 711681, 689443, 788525, 787627, 690134, 742549, 890921, 880140, 890436, 930809, 879240, 809372, 942717, 896883, 880202, 912128, 949755, 907363, 888494, 950789, 957485, 935963, 903460, 931335, 1028784, 1056740, 943197, 919072, 1038455, 1102028, 1050773, 1070169, 1094850, 1071872, 1209937, 1139776, 1156660, 1234425]
$$ [...]
##END NTUPLES=NMR SPECTRUM
##END=
