##TITLE=1H_TG-2292-A-3
 CDCl3, 8 sc, 
 24.12.2020
##JCAMPDX= 6.0         $$ Bruker NMR JCAMP-DX V2.0
##DATA TYPE= NMR SPECTRUM
##DATA CLASS= NTUPLES
##ORIGIN= UXNMR, Bruker Analytische Messtechnik GmbH
##OWNER= root
$$ XWIN-NMR		Version 3.5
$$ Thu Dec 24 11:00:23 2020 Russian Standard Time (UT+4h)  she@DPX200
##.OBSERVE FREQUENCY= 200.1315066352
##.OBSERVE NUCLEUS= ^1H
##.ACQUISITION MODE= SIMULTANEOUS
##.ACQUISITION SCHEME= undefined
##.AVERAGES= 8
##.DIGITISER RES= 18
##SPECTROMETER/DATA SYSTEM= spect
##.PULSE SEQUENCE= zg30
##.SOLVENT NAME= CDCl3
##.SHIFT REFERENCE= (INTERNAL, CDCl3, 0, 15.9844)
##AUDIT TRAIL= $$ (NUMBER, WHEN, WHO, WHERE, WHAT)
$$ ##TITLE= Audit trail, XWIN-NMR		Version 3.5
$$ ##JCAMPDX= 5.01
$$ ##ORIGIN= Bruker BioSpin GmbH
$$ ##OWNER= she
$$ F:/spectra/data/she/nmr/H-F/1/pdata/1/auditp.txt
$$ ##AUDIT TRAIL=  $$ (NUMBER, WHEN, WHO, WHERE, WHAT)
(   1,<2020-12-24 10:58:59.73 +0400>,<she>,<DPX200>,
      <created by zg, POWCHK disabled, PULCHK disabled
       configuration hash MD5:
       00 E9 B6 7A A2 85 ED C7 34 08 36 98 17 FE 4E 26
       data hash MD5: 16K
       A3 5E 98 12 8A 9B C5 AF DD 7E DF 6C 7C ED AB 7C>)
(   2,<2020-12-24 10:59:16.96 +0400>,<she>,<DPX200>,
      <Start of raw data processing
       efp BC_mod = 2 LB = 0.24 FT_mod = 6 PKNL = 1 PHC0 = -10767.89 PHC1 = 20.40095 SI = 16K 
       data hash MD5: 16K
       EA 94 8C C2 89 51 B2 03 1F F5 3A C0 C5 0C 71 A5>)
(   3,<2020-12-24 10:59:34.59 +0400>,<she>,<DPX200>,
      <pk PHC0 = 6.015179 PHC1 = -7.2 
       data hash MD5: 16K
       B2 57 8B 59 F8 8F 7C 63 36 B9 FD BB 88 C5 0B B7>)
(   4,<2020-12-24 10:59:38.15 +0400>,<she>,<DPX200>,
      <abs ABSG = 5 
       data hash MD5: 16K
       A2 5E 36 4A BA 54 AA 36 DB B7 81 A1 6F 09 1B 92>)
$$ ##END=
$$ 
$$ hash MD5
$$ CD A1 CA D4 FF 22 77 E1 58 D0 66 67 12 42 19 C9
##$RELAX= 
##$RELAX= 
##$RELAX= 
##$RELAX= 
##$RELAX= 
##$RELAX= 
$$ Bruker specific parameters
$$ --------------------------
##$DU= <F:/spectra>
##$EXPNO= 1
##$NAME= <H-F>
##$PROCNO= 1
##$TYPE= <nmr>
##$USER= <she>
##$AMP= (0..31)
100 100 100 100 100 100 100 100 100 100 100 100 100 100 100 100 100 100 
100 100 100 100 100 100 100 100 100 100 100 100 100 100 
##$AQSEQ= 0
##$AQ_mod= 1
##$AUNM= <au_zg>
##$AUTOPOS= <>
##$BF1= 200.13
##$BF2= 200.13
##$BF3= 200.13
##$BF4= 200.13
##$BF5= 200.13
##$BF6= 200.13
##$BF7= 200.13
##$BF8= 200.13
##$BYTORDA= 1
##$CFDGTYP= 0
##$CFRGTYP= 5
##$CHEMSTR= <none>
##$CNST= (0..31)
1 1 145 1 1 1 1 1 1 1 1 1 1 1 1 1 1 1 1 1 1 1 1 1 1 1 1 1 1 1 1 1 
##$CPDPRG= <>
##$CPDPRG1= <>
##$CPDPRG2= <>
##$CPDPRG3= <>
##$CPDPRG4= <mlev>
##$CPDPRG5= <mlev>
##$CPDPRG6= <mlev>
##$CPDPRG7= <mlev>
##$CPDPRG8= <mlev>
##$CPDPRGB= <>
##$CPDPRGT= <>
##$D= (0..31)
0 1.2 0 0 0 0 0 0 0 0.06 0 0.03 0 0 0 0 0.0002 0 0 0 0 0 0 0 0 0 0 0 0 
0 0 0 
##$DATE= 1608793139
##$DBL= (0..7)
120 120 120 120 120 120 120 120 
##$DBP= (0..7)
150 150 150 150 150 150 150 150 
##$DBP07= 0
##$DBPNAM0= <>
##$DBPNAM1= <>
##$DBPNAM2= <>
##$DBPNAM3= <>
##$DBPNAM4= <>
$$ [...]
##$SUBNAM3= <"">
##$SUBNAM4= <"">
##$SUBNAM5= <"">
##$SUBNAM6= <"">
##$SUBNAM7= <"">
##$SUBNAM8= <"">
##$SUBNAM9= <"">
##$SW= 16.9725356469052
##$SWIBOX= (0..15)
0 0 2 0 0 0 0 0 0 0 0 0 0 0 0 0 
##$SW_h= 3396.73913043478
##$TD= 16384
##$TD0= 1
##$TE= 0
##$TE2= 300
##$TE3= 300
##$TEG= 300
##$TL= (0..7)
0 120 120 120 120 120 120 120 
##$TP= (0..7)
150 150 150 150 150 150 150 150 
##$TP07= 0
##$TPNAME0= <>
##$TPNAME1= <>
##$TPNAME2= <>
##$TPNAME3= <>
##$TPNAME4= <>
##$TPNAME5= <>
##$TPNAME6= <>
##$TPNAME7= <>
##$TPOAL= (0..7)
0.5 0.5 0.5 0.5 0.5 0.5 0.5 0.5 
##$TPOFFS= (0..7)
0 0 0 0 0 0 0 0 
##$TUNHIN= 0
##$TUNHOUT= 0
##$TUNXOUT= 0
##$USERA1= <user>
##$USERA2= <user>
##$USERA3= <user>
##$USERA4= <user>
##$USERA5= <user>
##$V9= 5
##$VALIST= <valist>
##$VCLIST= <CCCCCCCCCCCCCCC>
##$VD= 0
##$VDLIST= <DDDDDDDDDDDDDDD>
##$VPLIST= <PPPPPPPPPPPPPPP>
##$VTLIST= <TTTTTTTTTTTTTTT>
##$WBST= 1024
##$WBSW= 4
##$XGAIN= (0..3)
0 0 0 0 
##$XL= 0
##$YL= 0
##$YMAX_a= 503234
##$YMIN_a= -254666
##$ZGOPTNS= <>
##$ZL1= 120
##$ZL2= 120
##$ZL3= 120
##$ZL4= 120
##$ABSF1= 16.01132
##$ABSF2= -0.9613438
##$ABSG= 5
##$ABSL= 3
##$ALPHA= 0
##$AQORDER= 0
##$ASSFAC= 0
##$ASSFACI= 0
##$ASSFACX= 0
##$ASSWID= 0
##$AUNMP= <proc_1d>
##$AZFE= 0.1
##$AZFW= 0.1
##$BCFW= 0
##$BC_mod= 2
##$BYTORDP= 0
##$COROFFS= 0
##$CY= -3
##$DATMOD= 1
##$DC= 0
##$DFILT= <>
##$DTYPP= 0
##$F1P= 0
##$F2P= 0
##$FCOR= 1
##$FTSIZE= 16384
##$FT_mod= 6
##$GAMMA= 0
##$GB= 0
##$INTBC= 1
##$INTSCL= 2.992141e-10
##$ISEN= 128
##$LB= 0.24
##$LEV0= 0
##$LPBIN= 0
##$MAXI= 10000
##$MC2= 0
##$MEAN= 0
##$ME_mod= 0
##$MI= 1.114404
##$NCOEF= 0
##$NC_proc= -5
##$NLEV= 6
##$NOISF1= 3.799351
##$NOISF2= 2.8
##$NSP= 0
##$NTH_PI= 0
##$NZP= 0
##$OFFSET= 15.98439
##$PC= 1
##$PHC0= -10761.87
##$PHC1= 13.20095
##$PH_mod= 1
##$PKNL= yes
##$PPARMOD= 0
##$PSCAL= 0
##$PSIGN= 0
##$REVERSE= no
##$SF= 200.130006049635
##$SI= 16384
##$SIGF1= 3
##$SIGF2= 2
##$SINO= 5.538805
##$SIOLD= 16384
##$SREGLST= <1H.CDCl3>
##$SSB= 0
##$STSI= 16384
##$STSR= 0
##$SW_p= 3396.73913043478
##$SYMM= 0
##$S_DEV= 0
##$TDeff= 16384
##$TDoff= 0
##$TI= <>
##$TILT= no
##$TM1= 0
##$TM2= 0
##$TOPLEV= 0
##$USERP1= <user>
##$USERP2= <user>
##$USERP3= <user>
##$USERP4= <user>
##$USERP5= <user>
##$WDW= 1
##$XDIM= 16384
##$YMAX_p= 358629186
##$YMIN_p= -170842
$$ End of Bruker specific parameters
$$ ---------------------------------
##NTUPLES= NMR SPECTRUM
##VAR_NAME=  FREQUENCY,     SPECTRUM/REAL,   SPECTRUM/IMAG
##SYMBOL=    X,             R,               I
##VAR_TYPE=  INDEPENDENT,   DEPENDENT,       DEPENDENT
##VAR_FORM=  AFFN,          ASDF,            ASDF
##VAR_DIM=   16384,         16384,           16384
##UNITS=     HZ,            ARBITRARY UNITS, ARBITRARY UNITS
##FACTOR=    0.207333158178281, 1,           1
##FIRST=     3198.95611919118, 0,            0
##LAST=      -197.783011243598, 0,           0
##MIN=       -197.783011243598, -170842,     0
##MAX=       3198.95611919118, 358629186,    0
$$ Real data points
##PAGE= N=1
##DATA TABLE= (X++(R..R)), XYDATA
$$ [...]
6206B010587l9377n3168j4821l9907k9717p6023o6098k4011l3912m6617j8736
$$ 2010587 1971210 1918042 1903221 1863314 1833597 1757574 1691476 1667465 1633553 1586936 1568200
6195A568200M941k7323p3889m3633j6648N5046q3640q8377J1469K0129j9720r262
$$ 1568200 1573141 1545818 1471929 1428296 1411648 1466694 1383054 1294677 1306146 1326275 1306555 1297293
6183A297293J7123l571m5065j9308L3095L7683M219n1577K1236K3309p6181o9104
$$ 1297293 1314416 1310845 1265780 1246472 1279567 1317250 1321469 1269892 1291128 1314437 1238256 1169152
6171A169152J7961l2422j5565l3691m4889n4016l0926Q539K113o9375k529j0703
$$ 1169152 1187113 1154691 1139126 1105435 1060546 1006530 975604 984143 986256 916881 914352 903649
6159I03649m3318p4060l9220k5481L0943j7612o2430j479k8273m4010j1828j1379
$$ 903649 860331 786271 747051 721570 752513 734901 672471 670992 642719 598709 586881 575502
6147E75502M458l7680j6580n0002m8169k6006K8441Q4611j3476J606p770J4889
$$ 575502 579960 542280 525700 475698 427529 401523 429964 514575 501099 502705 494935 509824
6135E09824p403j0937K4720K2204q248l3012r881l4452l3319K3451j3630n4469
$$ 509824 502421 491484 516204 538408 530160 497148 487267 452815 419496 442947 429317 374848
6123C74848M8566Q017p6742r960K6890j7925n318L8302K4251P317j6413J093k3062
$$ 374848 423414 431431 354689 344729 371619 353694 348376 386678 410929 418246 401833 402926 379864
6110C79864N7973k5259L383p868k2008J540l0979R059k2690n7355N9065K5927
$$ 379864 437837 412578 415961 408093 386085 387625 356646 365705 343015 285660 344725 370652
6098C70652j5011o2592r4299L9334j2059k4395k2092N8584L08m9595J5989J2667
$$ 370652 355641 293049 198750 238084 226025 201630 179538 238122 238430 188835 204824 217491
6086B17491N7692L1321l9512K6450L6594n880q279L5344Q905m3891K8200k8186
$$ 217491 275183 306504 266992 293442 330036 324156 315877 351221 360126 316235 344435 316249
6074C16249p5861J8296N447m7796j8432k0808k0686j5439n6618r264K7290l8607
$$ 316249 240388 258684 264131 216335 197903 177095 156409 140970 84352 75088 102378 63771
6062F3771M0259M9970n032r523J6639o694j3261O500K2268J3336l3365r336j2475
$$ 63771 104030 154000 148968 139445 156084 149390 136129 142629 164897 178233 144868 135532 123057
6049A23057P085O7001L1158q5607O166J0189k097J5179J7539K5984M9686O1974
$$ 123057 130142 197143 228301 142694 148860 159049 156952 172131 189670 215654 265340 327314
6037C27314k8508N2142L9457K6714M7525p4854j03209p677n7670j2693j3293j1482
$$ 327314 298806 350948 390405 417119 464644 389790 286581 278904 221234 208541 195248 183766
6025A83766p4623k2889R946P1992K5839j05970n1338M8229L6705k7328L7374J182
$$ 183766 109143 86254 96200 168192 194031 88061 36723 84952 121657 94329 131703 132885
6013A32885p671l1012J0238l9297j7999K2354K8276q258L8653j1781n9338J5069
$$ 132885 125214 94202 104440 65143 47144 69498 97774 89516 128169 116388 57050 72119
6001G2119N175l944J3962J3897N4267J7005K9230k2225J4673J1272j500M0772
$$ 72119 77294 73350 87312 101209 155476 172481 201711 179486 194159 205431 203931 244703
5989B44703m6632j5837K2890M4403r67J3499j8121l0139L6366R581n7769K8423
$$ 244703 198071 182234 205124 249527 248560 262059 243938 213799 250165 259746 201977 230400
5977B30400J5492j2513o2542O202n5190p1618o992j9521m8707K8729L4786m2749
$$ 230400 245892 233379 170837 177039 121849 50231 43239 23718 -24989 3740 38526 -4223
5965d223J8042K0253M8560l92k7942O262K4531M4434l5603K113j3132L096m3541
$$ -4223 13819 34072 82632 82240 54298 60560 85091 129525 93922 96035 82903 85999 42458
5952D2458l8317K5568K9556N7270q9436M9223O9230j4417n5210P803q468K4704
$$ 42458 4141 29709 59265 116535 27099 76322 145552 131135 75925 83728 75260 99964
5940I9964J2155j763j0439L3584j4753k8596r661J3112p2724k6959N1253k812
$$ 99964 112119 110356 99917 133501 118748 90152 80491 93603 20879 -6080 45173 42361
5928D2361j0202j0513Q054K8491L8863m9857k1601L1259K0344k3851j379P063
$$ 42361 32159 21646 29700 58191 97054 47197 25596 56855 77199 53348 51969 59032
5916E9032j444j1890n4505J0846J0490K5516J465M615K9543q611l1192J4142O1815
$$ 59032 57588 45698 -8807 2039 12529 38045 39510 44125 73668 65057 33865 48007 109822
5903A09822J549J654o699M8690K8269k7378l3568P659j7579r101L6842m5195n0466
$$ 109822 111371 113025 106326 155016 183285 155907 122339 129998 112419 103318 140160 94965 44499
5890D4499L584k4040m581k9873k7351L4734K441p6443Q872O5990k26j9368K0400
$$ 44499 48083 24043 19462 -10411 -37762 -3028 -587 -77030 -68158 -2168 -2394 -21762 -1362
5877a362L4750N5958j9605l2081J2441L5182n8366J5071Q125m2610K3559J9242
$$ -1362 33388 89346 69741 37660 50101 85283 26917 41988 50113 7503 31062 50304
5865E0304P0316J6334m5538l597j0572M2766J7020K4294M4158K4217M2644L2935
$$ 50304 120620 136954 91416 87819 77247 120013 137033 161327 205485 229702 272346 305281
5853C05281P3345O5710K6002N6564L8894L9004J8554k3228J3469J6218r2704j20647
$$ 305281 378626 444336 470338 526902 565796 604800 623354 600126 613595 629813 537109 416462
5841D16462k6745o1004n8403m2670l6124m2604L4709k8265p2523M0641m3072k0656
$$ 416462 389717 328713 270310 227640 191516 148912 183621 155356 82833 123474 80402 59746
5829E9746K0814J2354L7180r069j572m6351k5300K5178j9163K3985K1978n7271
$$ 59746 80560 92914 130094 121025 119453 73102 47802 72980 53817 77802 99780 42509
5817D2509k6522j3959j4661j2051K5161J1553m0977k1477j0813N5365L6365k762
$$ 42509 15987 2028 -12633 -24684 477 12030 -28947 -50424 -61237 -5872 30493 27731
5805B7731R730K4758o751q9117Q2608L8485j3089J1805l5459Q692k9607k5238
$$ 27731 37461 62219 55468 -33649 48959 87444 74355 86160 50701 59393 29786 4548
5793D548J2426O91r477m5001k5949L5760m0898K9432L5483l1034n4547Q1104L4673
$$ 4548 16974 17665 8188 -36813 -62762 -27002 -67900 -38468 -2985 -34019 -88566 -7462 27211
5780B7211m9256j2936k966J8273J8962K3518n1050p840K5201k163J8238M3064
$$ 27211 -22045 -34981 -37947 -19674 -712 22806 -28244 -36084 -10883 -13046 5192 48256
5768D8256J1246Q914K8602q927o7492J2128J156O337j7514Q231q760M2842J5899
$$ 48256 59502 68416 97018 88091 20599 32727 33883 40220 22706 30937 22177 65019 80918
5755H0918q0765J8584O3057m9901J8548K1613J1900k2874L5410j9703p3666M2791
$$ 80918 153 18737 81794 31893 50441 72054 83954 61080 96490 76787 3121 45912
5743D5912K9718j9493k3414j3089q4035m2395J6306K5504Q0651J1058k0450J5768
$$ 45912 75630 56137 32723 19634 -64401 -106796 -90490 -64986 15665 26723 6273 22041
5731B2041l7601l8140J096P9327k1801l2975J03159j4153k0099L0876M982K9630
$$ 22041 -15560 -53700 -52604 26723 4922 -28053 75106 60953 40854 71730 76712 106342
5719A06342j6392J1682j0356L9755j6606l2510q335J4581k0178J0707J2958m9041
$$ 106342 89950 101632 91276 131031 114425 81915 73580 88161 67983 78690 91648 42607
5707D2607k6988K985J3023J3827K176m5693m4845J1586L5570N647L4377n3407
$$ 42607 15619 18604 31627 45454 47630 1937 -42908 -31322 4248 9895 44272 -9135
5695i135n3367P9648P36O286O0738q12o7548J7703l0273N8910L524L6412M548
$$ -9135 -62502 17146 17882 24168 84906 84094 16546 34249 3976 62886 66410 102822 107370
5682A07370l4856R9611L8127k9150k2604L3020j7855k9958j6677l0434P1043O8914
$$ 107370 72514 172125 210252 181102 158498 191518 173663 143705 127028 96594 167637 236551
5670B36551n7919j4028l85J3484J2140K0366J9743j6933j0090j0014m1026K4568
$$ 236551 178632 164604 164219 177703 189843 210209 229952 213019 202929 192915 151889 176457
5658A76457P876J0711N5849N5736J9039l9255N0652N4121j2848J198P0372l1108
$$ 176457 184333 195044 250893 306629 325668 286413 337065 391186 378338 379536 449908 418800
5646D18800j33019l3393m0418m6018j7269j7890J207J1871j0724K8928k5627J2696
$$ 418800 285781 252388 211970 165952 148683 130793 132000 143871 133147 162075 136448 149144
5634A49144k4737j8864R437L8305l006m5178k9956J3933j8804K3224M7441l4380
$$ 149144 124407 105543 114980 153285 150279 105101 75145 89078 70274 93498 140939 106559
5622A06559J0401k1498k1240K6190M9651j7693m4083j954L5071k8436m9823k323
$$ 106559 116960 95462 74222 100412 150063 132370 88287 86333 121404 92968 43145 40822
5610D0822M2196j2115l9317j6136N949k2241j6265P235J0014P493j3354N1093
$$ 40822 83018 70903 31586 15450 21399 -842 -17107 -9872 142 7635 -5719 45374
5598D5374J683p3750J290L7874L3645o406K0307M3099k4691j5509n2217N2045
$$ 45374 47057 -26693 -25403 12471 46116 39710 60017 103116 78425 62916 10699 62744
5586F2744J4243k5657L1182j1431j7358o0433j0083R837j8536L4912J3396k6449
$$ 62744 76987 51330 82512 71081 53723 -6710 -16793 -6956 -25492 9420 22816 -3633
5574c633J0436l533J4122k8297k1429K0750j554J1808J7307M2955j8273m29N2495
$$ -3633 6803 3270 17392 -10905 -32334 -11584 -13138 -1330 15977 58932 40659 40230 92725
5561I2725M2835m3545r3330N0984J4930o7532j5642M1093q10K4198k7505k7953
$$ 92725 135560 92015 -1315 49669 64599 -2933 -18575 22518 21708 45906 18401 -9552
5549i552P1832m7180K138K8137K5630N59L0159P525k0560M6460L8681O417M4857
$$ -9552 62280 15100 17238 45375 71005 71564 101723 109248 88688 135148 173829 180246 225103
5536B25103N1227m7658k6446L8148q0344n4981J3224l2795j2995L8538N1387l10
$$ 225103 276330 228672 202226 240374 160030 105049 118273 85478 72483 111021 162408 162098
5524A62098k6381J0597J9973j8303n729j0017J9416K5891R492k6456k1591L5480
$$ 162098 135717 146314 166287 147984 142255 132238 151654 177545 187037 160581 138990 174470
5512A74470q834J3875M6653k4136Q029J0802J9358k7988N5544K3576r958n3895
$$ 174470 165636 179511 226164 202028 210057 220859 240217 212229 267773 291349 281391 227496
5500B27496L4735J0117o3840r719M2754k594m1332k3772m1799Q340j798K1122
$$ 227496 262231 272348 208508 198789 241543 238949 197617 173845 132046 140386 138588 159710
5488A59710j544L5659K7515l7841J723M984k5063K1394K5638J7176l1709r952
$$ 159710 158166 193825 221340 183499 185222 190206 165143 186537 212175 229351 197642 187690
5476A87690N1049k2777j70L8326n2281m9548L4901K5135L7814J8222n30L0618
$$ 187690 238739 215962 215792 254118 201837 152289 187190 212325 250139 268361 267831 298449
5464B98449J6008L7752q947k5926j584Q843M1974m052L22M660l6537j2113K9611
$$ 298449 314457 352209 343262 317336 315752 324595 366569 362517 362839 367499 330962 318849 348460
5451C48460K3613J0928K8669J7624M157n4862o9693K454K5232l3908n2549o1646
$$ 348460 372073 383001 411670 429294 433451 378589 308896 311350 336582 302674 250125 188479
5439A88479J1165L1090m6426k0281M3372l5780o3567K5683O5671o847k9855K8351
$$ 188479 199644 230734 184308 164027 207399 171619 108052 133735 199406 192559 162704 191055
5427A91055J7254k2352p110M0758j6972K9947L4979k4398j028J1583N6892L0482
$$ 191055 208309 185957 178847 219605 202633 232580 267559 243161 242133 253716 310608 341090
5415C41090l821n0931M4124M1278m8327r94r772k866O531J8186M6982k6427j8934
$$ 341090 337269 286338 330462 371740 323413 322419 312647 309781 316312 334498 381480 355053 336119
5402C36119l1769m2694j8283K9445N3057J9930l9272L5461q39J1895P289L8316
$$ 336119 304350 261656 243373 272818 325875 345805 306533 341994 341155 353050 360339 398655
5390C98655p5684m4593J4599Q575k2780j5998Q1981m584m0808K3084K3949m4437
$$ 398655 322971 278378 292977 301552 278772 262774 344755 340171 299363 322447 346396 301959
5378C01959l4488q046K4407J9802M0862p590O2892l9541n9652J8538k193l4831
$$ 301959 267471 259425 283832 303634 344496 336906 399798 360257 300605 319143 316950 282119
5366B82119L595L2509J7150J543M1742k5087Q2988P1716J0401K1173L9662M6362
$$ 282119 285714 318223 335373 336916 378658 353571 436559 508275 518676 539849 579511 625873
5354F25873K7186M5927j3568m3314O652n1581l6521J8383L1194n6580j7661M6556
$$ 625873 653059 698986 685418 642104 648756 597175 560654 579037 610231 553651 535990 582546
5342E82546J282n6691m2803M628l835L510J2576k0029J8279O954k8105N4322j9217
$$ 582546 583828 527137 484334 488962 485127 488637 501213 481184 499463 506417 478312 532634 513417
5329E13417l623K2466L6862O148j8508L8838k731K2814k5063j6584J6085n7453
$$ 513417 509794 532260 569122 575270 556762 595600 592869 615683 590620 574036 590121 532668
5317E32668K0777Q452m7620J6061M1147k6611r716N2173R89m6856P6621J9335
$$ 532668 553445 561897 514277 530338 571485 544874 535158 587331 588320 541464 618085 637420
5305F37420l8414j1324K0573M5722o530k8737M4285L3255K9363J7601L659L5772
$$ 637420 599006 587682 608255 653977 647447 618710 662995 696250 725613 743214 746873 782645
5293G82645L4790n3088J5457R4628Q283k0291N7362N0527j1476o1617L3197L6671
$$ 782645 817435 764347 779804 874432 882715 862424 919786 970313 958837 897220 930417 967088
5281I67088K0365k4279N584P9699j0772K5186N6785P3412Q1778l4408O101O4596
$$ 967088 987453 963174 968758 1048457 1037685 1062871 1119656 1193068 1274846 1240438 1246539 1311135
5269A311135p53J2480N8318R6168M5572L2330P6158J05658J7445L9295J01895
$$ 1311135 1310382 1322862 1381180 1477348 1522920 1555250 1631408 1737066 1754511 1793806 1895701
5258A895701L7153P7387l486N255L2306k8998M3213l6408k3977P2239n3438p841
$$ 1895701 1932854 2010241 2006755 2012010 2044316 2015318 2058531 2022123 1998146 2070385 2016947 2009106
5246B009106J42465P7154N7355M6483R6528N0060J21268R1617J38049Q8416P2488
$$ 2009106 2151571 2228725 2286080 2332563 2429091 2479151 2600419 2692036 2830085 2918501 2990989
5235B990989N9047M5983J12183l364J1341m7013j8787K5459j784O1150k5944n633
$$ 2990989 3050036 3096019 3208202 3204838 3216179 3169166 3150379 3175838 3174054 3235204 3209260 3203627
5223C203627m3801p70P8919J6873M3948J01692L6387O9404L8551N4936M7282O7431
$$ 3203627 3159826 3159056 3237975 3254848 3298796 3400488 3436875 3506279 3544830 3599766 3647048 3714479
5211C714479Q1747L7630J04996J7326k0859P795K4383K8370K6409N5712N4859
$$ 3714479 3796226 3833856 3938852 3956178 3935319 3943114 3967497 3995867 4022276 4077988 4132847
5200D132847Q1497J40281J43652J56905P9094J82681J75212K19653K63436J90402
$$ 4132847 4214344 4354625 4498277 4655182 4734276 4916957 5092169 5311822 5575258 5765660
5190E765660K28312L14520K99382K95188L38709L99989L66192M34080N07306O20811
$$ 5765660 5993972 6308492 6607874 6903062 7241771 7641760 8007952 8442032 8949338 9570149
5180I570149O49477P49139Q99683J087601J303535J544265J825694K071732K088166
$$ 9570149 10219626 10968765 11868448 12956049 14259584 15803849 17629543 19701275 21789441
5171B1789441K111229J897940J776630J774819J603753J093258J8675r72150j621006
$$ 21789441 23900670 25798610 27575240 29350059 30953812 32047070 32065745 31093595 29472589
5162B9472589j394864o80250k6083N42097O69886P74168Q11568P19833O89156
$$ 29472589 28077725 27397475 27371392 27913489 28583375 29357543 30169111 30888944 31578100
5153C1578100J55182q61874k083631k863478k862816k341770j756623j457231
$$ 31578100 31733282 30871408 28787777 25924299 23061483 20719713 18963090 17505859
5145A7505859j030865p33506n75796m64504l23755l12150m97764m61749m79688
$$ 17505859 16474994 15741488 15165692 14701188 14377433 14065283 13567519 13105770 12626082
5136A2626082l48407k39018j55977o0578M785J63193K26076K52886L59060L92686
$$ 12626082 12277675 12038657 11882680 11822102 11826887 11990080 12216156 12469042 12828102 13220788
5126A3220788N41240O78071R55399J127859J311770J733469K118552K342251K646759
$$ 13220788 13762028 14440099 15395498 16523357 17835127 19568596 21687148 24029399 26676158
5117B6676158K757425K640640K390107K311939K157384J857535J020745l66257
$$ 26676158 29433583 32074223 34464330 36776269 38933653 40791188 41811933 41445676
5109D1445676j697550k268053j762044r22009N5555N68160O98573P57150Q16067
$$ 41445676 39748126 37480073 35718029 34796020 34851575 35419735 36118308 36875458 37691525
5100C7691525P51735M41354l92303j946413l585762m304565m163487l465751k780552
$$ 37691525 38443260 38884614 38492311 36545898 32960136 28655571 24492084 21026333 18245781
5091A8245781k226422j752989j419803j124666r92431q44136o83346n74437n12307
$$ 18245781 16019359 14266370 12846567 11721901 10729470 9885334 9201988 8627551 8115244
5082H115244m79868m11910l20342k87120k93945k76872j90218k54861k27655j55606
$$ 8115244 7635376 7223466 6903124 6616004 6322059 6045187 5854969 5600108 5372453 5216847
5072E216847j82639j77614j20527j14393j22754j62177q3392j20744j71064p5346
$$ 5216847 5034208 4856594 4736067 4621674 4498920 4336743 4253351 4132607 3961543 3886197
5062C886197p7999n8994r6228j21151p0331n0691m4058j25911j14582l7644r2092
$$ 3886197 3808198 3749204 3652976 3531825 3461494 3410803 3366745 3240834 3126252 3088608 2996516
5051B996516j58494k850J4981o0035j38002j5473L52l4775O757k8741J043o1557
$$ 2996516 2838022 2835172 2850153 2790118 2652116 2636643 2636995 2602220 2608977 2580236 2581279 2519722
5039B519722k5625j1889j3546L0718j5028j8467J9225n8472M583n9514n8946p2969
$$ 2519722 2494097 2482208 2468662 2499380 2484352 2465885 2485110 2426638 2431221 2371707 2312761 2239792
5027B239792j07334k5987n677p6761J6138M0807r4700K472O5464J9262l2791n8229
$$ 2239792 2132458 2106471 2100794 2024033 2040171 2080978 1986278 1988750 2054214 2073476 2040685 1982456
5015A982456k0968m3565L1143j2901R909k0086m1268O5617K1540n2856j4713L7710
$$ 1982456 1961488 1917923 1949066 1936165 1946074 1925988 1884720 1950337 1971877 1919021 1904308 1942018
5003A942018M5701j6357J3137M3225m1392m8665l2521J3361j6619l1433o0598
$$ 1942018 1987719 1971362 1984499 2027724 1986332 1937667 1905146 1918507 1901888 1870455 1809857
4992A809857o8641m5052m0854r688o4389k0696k2797O11O739L139J3543J0230
$$ 1809857 1741216 1696164 1655310 1645622 1581233 1560537 1537740 1538351 1545090 1548229 1561772 1572002
4980A572002j0244J3124j1167L9377J9390R790n1901j4987O9223K5651k106Q390
$$ 1572002 1561758 1574882 1563715 1603092 1622482 1632272 1580371 1565384 1634607 1660258 1658152 1666542
4968A666542K7199K4265K4046o319j3484M2081j5916j0538O7595r6560m2430p593
$$ 1666542 1693741 1718006 1742052 1735733 1722249 1764330 1748414 1737876 1805471 1708911 1666481 1658888
4956A658888K5031n2623n0060L6792n9382l161L3054l6324k674r985N4146j2502
$$ 1658888 1683919 1631296 1581236 1618028 1558646 1555485 1588539 1552215 1549541 1539556 1593702 1581200
4944A581200N8609P9215k969J5375n30J469L5634j3170j6271L1598L051r7292
$$ 1581200 1639809 1719024 1716055 1731430 1730900 1732369 1768003 1754833 1738562 1770160 1773211 1675919
4932A675919k7099N4889l4831n8941N0852O5661n3211J2318M13k7217J071L1113
$$ 1675919 1648820 1703709 1668878 1609937 1660789 1726450 1673239 1685557 1685970 1658753 1659824 1690937
4920A690937R478j6454r590P4864j3624J7682M2051O854K8879Q6452K0254K5165
$$ 1690937 1700415 1683961 1674371 1749235 1735611 1753293 1795344 1802198 1831077 1917529 1937783 1962948
4908A962948J05842N939M4982K5553K6939K3727N1141R657M5715m4918k1926r477
$$ 1962948 2068790 2074729 2119711 2145264 2172203 2195930 2247071 2256728 2302443 2257525 2235599 2226122
4896B226122o992P923K7558L3725l321q533J2351P3793O9782q909l800O9118N1840
$$ 2226122 2219130 2227053 2254611 2288336 2285015 2276482 2288833 2362626 2432408 2423499 2419699 2488817 2540657
4883B540657N9105Q0339N0813j497K1392Q1405L5975J8634R7981L2013j1183M1523
$$ 2540657 2599762 2680101 2730914 2729417 2750809 2832214 2868189 2886823 2984804 3016817 3005634 3047157
4871C047157Q3880N0712K6899O8727K0309R366L7422K9789N9237P0970N9367R0145
$$ 3047157 3131037 3181749 3208648 3277375 3297684 3307050 3344472 3374261 3433498 3504468 3563835 3653980
4859C653980J12402J01693O1394J36091J21695O4592J09178J85814J34248Q1629
$$ 3653980 3766382 3868075 3929469 4065560 4187255 4251847 4361025 4546839 4681087 4762716
4849D762716J59680J78111P8078J52312K50981K38513K17339J67072J77097K66318
$$ 4762716 4922396 5100507 5178585 5330897 5581878 5820391 6037730 6204802 6381899 6648217
4839F648217K83140K89017K84758L20268L92123L90239N59138N75463O25660Q02133
$$ 6648217 6931357 7220374 7505132 7825400 8217523 8607762 9166900 9742363 10368023 11170156
4829A1170156J048624J324966J583776J682726J837605J919001J957500J729110
$$ 11170156 12218780 13543746 15127522 16810248 18647853 20566854 22524354 24253464
4821B4253464J585324J603955J529158J091129P04514P72417K91638q12788j866111
$$ 24253464 25838788 27442743 28971901 30063030 30767544 31539961 31831599 31018811 29152700
4812B9152700k455620k644994k425507j901552j401904r84793o95129m20638j98817
$$ 29152700 26697080 24052086 21626579 19725027 18323123 17338330 16643201 16222563 16023746
4803A6023746M5140K96971M79044Q31062J143202J362487J537934J716583J844787
$$ 16023746 16068886 16365857 16844901 17675963 18819165 20181652 21719586 23436169 25280956
4794B5280956J676681J494505J490962J487202J202040O37125N82138M84492m51604
$$ 25280956 26957637 28452142 29943104 31430306 32632346 33269471 33851609 34336101 33884497
4785C3884497j711782k648415l032076k972428k449084j832675j393623j053279
$$ 33884497 32172715 29524300 26492224 23519796 21070712 19238037 17844414 16791135
4777A6791135p33981m50990j29961J04577L61320O51451Q57173R51046J029016
$$ 16791135 16057154 15606164 15476203 15580780 15942100 16593551 17450724 18401770 19430786
4768A9430786J054373R87587R06897Q90789R07234N38736L00713L70976q5528
$$ 19430786 20485159 21472746 22379643 23270432 24177666 24716402 25017115 25388091 25302563
4759B5302563r29513j631003k013602k136347j774731j373920j097819p88738
$$ 25302563 24373050 22742047 20728445 18592098 16817367 15443447 14345628 13556890
4751A3556890n60808l67320k06123P430J91409K78726N14870Q53161R59851J049831
$$ 13556890 12996082 12628762 12422639 12430069 12621478 12900204 13415074 14268235 15228086 16277917
4741A6277917J252779J315585J103139R66433R99687R91490O98638L12388K22969
$$ 16277917 17530696 18846281 19949420 20915853 21915540 22907030 23605668 23918056 24141025
4732B4141025P9038n89274j570443k291542k505282k322385j913682j580883j230291
$$ 24141025 24220063 23630789 22060346 19768804 17263522 14941137 13027455 11446572 10216281
4723A0216281j011607q27135o80116n47139m96355m38027l07969l81487k95586
$$ 10216281 9204674 8377539 7697423 7150284 6653929 6215902 5907933 5526446 5230860
4714E230860k36921k79818k43266j50370j17521k49204j39474j26499q5783j73955
$$ 5230860 4993939 4714121 4470855 4320485 4202964 3953760 3814286 3687787 3602004 3428049
4704C428049j40689j11353p9745l4591l5547j04431q8457J6565j26261n1388l2302
$$ 3428049 3287360 3176007 3096262 3061671 3026124 2921693 2833236 2849801 2723540 2672152 2639850
4693B639850n1773r3284m1950o6288m7910j28l2805l6080k2797m6026m9193M351
$$ 2639850 2588077 2494793 2452843 2386555 2338645 2338517 2305712 2269632 2246835 2200809 2151616 2155967
4681B155967n4126l8157l8750j9270l5331j9090M0678P0053m0892q3211m903K0632
$$ 2155967 2101841 2063684 2024934 2005664 1970333 1951243 1991921 2061974 2021082 1937871 1932968 1953600
4669A953600l831l8263R105o999K7771k8269J8203L1485M7335Q1785K6226O7715
$$ 1953600 1949769 1911506 1920611 1913612 1941383 1913114 1931317 1962802 2010137 2091922 2118148 2185863
4657B185863N1775O0925j7323J3842O6326L3747J2587K6699L6391J057m3340n9414
$$ 2185863 2237638 2298563 2281240 2295082 2361408 2395155 2407742 2434441 2470832 2471889 2428549 2369135
4645B369135k9586n6359j21192j0435J5898J9883M1590R8867N6790j1878J1469
$$ 2369135 2339549 2283190 2161998 2151563 2167461 2187344 2228934 2327801 2384591 2372713 2384182
4634B384182P872L5172K3280K7204P5377Q456p8997N5410o16K6779q5805j07496
$$ 2384182 2392054 2427226 2450506 2477710 2553087 2561543 2482546 2537956 2537340 2564119 2478314 2370818
4622B370818j05995m5682m1906r5184l3188m1768J3688l208l4387K4644q306m1139
$$ 2370818 2264823 2219141 2177235 2082051 2048863 2007095 2020783 2017575 1983188 2007832 1999526 1958387
4610A958387j2163K2818J3290j6435L2177o042j994m306j6964o5168o8500o7714
$$ 1958387 1946224 1969042 1982332 1965897 1998074 1992032 1990038 1985732 1968768 1903600 1835100 1767386
4598A767386m4454o9789n770K3553m4189l8273n3345k3495j3008J5783l0324l1432
$$ 1767386 1722932 1653143 1647373 1670926 1626737 1588464 1535119 1511624 1498616 1514399 1484075 1452643
4586A452643k1400o4760R569M4907k7881K6046m697q246N1898j2071K1871O5031
$$ 1452643 1431243 1366483 1376052 1420959 1393078 1419124 1414427 1406181 1458079 1446008 1467879 1532910
4574A532910o5614j8936l311l5815m1550J0472m460j11408j0216K9627k1146n0146
$$ 1532910 1467296 1448360 1445049 1409234 1367684 1378156 1373696 1262288 1252072 1281699 1260553 1210407
4562A210407l2505J3887m4483j1193j8470p910M1230Q158k0591o723J5573k4948
$$ 1210407 1177902 1191789 1147306 1136113 1117643 1109733 1150963 1159121 1138530 1131807 1147380 1122432
4550A122432l9683n345P093M4197L975j5389l7214o5181r964M6394J0812L494
$$ 1122432 1082749 1077404 1084497 1128694 1132669 1117280 1080066 1014885 1004921 1051315 1062127 1065621
4538A065621L6810L0054o0491o5168O5307j3460k3122k183L2748K2740L7724l4874
$$ 1065621 1102431 1132485 1071994 1006826 1072133 1058673 1035551 1033368 1066116 1088856 1126580 1091706
4526A091706o2347M3174M5123m6077L9528R193Q621L6611m98j4321J3191Q388
$$ 1091706 1029359 1072533 1117656 1071579 1111107 1120300 1128921 1165532 1165034 1150713 1163904 1172292
4514A172292P078K6430Q175N123m3424K3248K4689k9299q716j8972k5425l1391
$$ 1172292 1179370 1205800 1213975 1219098 1175674 1198922 1223611 1194312 1185596 1166624 1141199 1109808
4502A109808J3707R4733M9631L4635j0615k9686m9139J8613N7689r759j6514l3661
$$ 1109808 1123515 1218248 1267879 1302514 1291899 1262213 1213074 1231687 1289376 1279617 1263103 1229442
4490A229442J864l7803N9141M5077j8556k3525l6479m8063j1583K9689k1461l011
$$ 1229442 1231306 1193503 1252644 1297721 1279165 1255640 1219161 1171098 1159515 1189204 1167743 1164732
4478A164732O5102j2107l7620o395J8340O6858l871k5500M7965l590J8879P7052
$$ 1164732 1229834 1217727 1180107 1173712 1192052 1258910 1255039 1229539 1277504 1273914 1292793 1369845
4466A369845k8107M0828K0802L3197N757n93k6871r2648j3671J2979L5705K05
$$ 1369845 1341738 1382566 1403368 1436565 1442322 1441729 1414858 1322210 1308539 1321518 1357223 1357428
4454A357428l7472j3507m51m5541Q569j1119L438J5552n5445j6550L4532K9653
$$ 1357428 1319956 1306449 1305998 1260457 1269026 1257907 1261345 1276897 1221452 1204902 1239434 1269087
4442A269087K9889J8708k9446K6810J9511L978L0619M5410l5128K7809P0184p085
$$ 1269087 1298976 1317684 1288238 1315048 1334559 1338537 1369156 1414566 1379438 1407247 1477431 1470346
4430A470346j9953P6577M36o0815l315k402K4829M0665M7710j1933J05735M0811
$$ 1470346 1450393 1526970 1527406 1466591 1463276 1460874 1485703 1526368 1574078 1562145 1667880 1708691
4418A708691p2817o183P0241L8848l8911o17J8718j2540O7987M3338m184q456
$$ 1708691 1635874 1629691 1699932 1738780 1699869 1699252 1717970 1705430 1773417 1816755 1812571 1804115
4406A804115j1185Q924O7262Q9686J711k4445O0174M1532P830K8443K4697K4688
$$ 1804115 1792930 1801854 1869116 1958802 1960513 1936068 1996242 2037774 2045604 2074047 2098744 2123432
4394B123432m8284l6614J547n2795n4095l8266m5314m4678p4101p571N0375j7534
$$ 2123432 2075148 2038534 2040081 1987286 1933191 1894925 1849611 1804933 1730832 1723261 1773636 1756102
4382A756102j5111j6012n9746N9980j3613o449p2023l3886r209j8281j8279k8216
$$ 1756102 1740991 1724979 1665233 1725213 1711600 1705151 1633128 1599242 1590033 1571752 1553473 1525257
4370A525257J3356o0560n1944J2557L009J5954k0441k2847j5836K30K0334N1375
$$ 1525257 1538613 1478053 1426109 1438666 1441675 1457629 1437188 1414341 1398505 1398735 1419069 1470444
4358A470444P156m2987l3192q621J3915k2941k7514N0855L2166p3192K005J8710
$$ 1470444 1477600 1434613 1401421 1392800 1406715 1383774 1356260 1407115 1439281 1366089 1368094 1386804
4346A386804J8703r1191j7364R423l8472L9511l4625K9457L1779j5437L3654K902
$$ 1386804 1405507 1314316 1296952 1306375 1267903 1307414 1272789 1302246 1334025 1318588 1352242 1355144
4334A355144k119l486M5318L7877J4170L4128K566M5328M9869j5791M9288M8124
$$ 1355144 1353025 1349539 1394857 1432734 1446904 1481032 1483598 1528926 1578795 1563004 1612292 1660416
4322A660416m465K280K3033l4560Q3631l7895j3027k3364K214Q979n7268r35J5835
$$ 1660416 1655951 1658231 1681264 1646704 1730335 1692440 1679413 1656049 1658263 1667242 1609974 1609039 1624874
4309A624874O906j318n42j2041K8341j4289J7760K6510m2886m6223j5081k5855
$$ 1624874 1631780 1630462 1629920 1617879 1646220 1631931 1649691 1676201 1633315 1587092 1572011 1546156
4297A546156N9714j882j9837K0588L9008l7217P125O8699P4441K9835L4774Q7637
$$ 1546156 1605870 1603988 1584151 1604739 1643747 1606530 1613655 1682354 1756795 1786630 1821404 1909041
4285A909041q396K3320N0160O787N4993P9585O6035N2363Q657J669j887K4104
$$ 1909041 1900645 1923965 1974125 1980912 2035905 2115490 2181525 2233888 2242545 2244214 2242327 2266431
4273B266431N1639P823M2514P458J1590L2061n101M8768P0765L4239J11029M1111
$$ 2266431 2318070 2325893 2368407 2375865 2387455 2419516 2414415 2463183 2533948 2568187 2679216 2720327
4261B720327M7751Q196N3029P9045O129R169o0059J6248K6418P5835K5707R3759
$$ 2720327 2768078 2776274 2829303 2908348 2914477 2923646 2863587 2879835 2906253 2982088 3007795 3101554
4249C101554Q3257n4628P5929O1082j4638K2966J6385P5378k9006P2768J47926
$$ 3101554 3184811 3130183 3206112 3267194 3252556 3275522 3291907 3367285 3338279 3411047 3558973
4238C558973o99J7600M1399P0806N1903P6552R8252Q3662O1756J9734Q4095J03023
$$ 3558973 3558274 3575874 3617273 3688079 3739982 3816534 3914786 3998448 4060204 4079938 4164033 4267056
4226D267056J05358J06269J18589P3893Q3264J31559N6011N9092J09035M2567
$$ 4267056 4372414 4478683 4597272 4671165 4754429 4885988 4941999 5001091 5110126 5152693
4216E152693J24279J45471J29017J27286R9928J56486J68109K06577J57326K08804
$$ 5152693 5276972 5422443 5551460 5678746 5778674 5935160 6103269 6309846 6467172 6675976
4206F675976L07921K55015L17273L98915M27312M55548N25222O04152O79925O90936
$$ 6675976 6983897 7238912 7556185 7955100 8382412 8837960 9363182 9967334 10647259 11338195
4196A1338195P33450P51454O94900P08457P85580O35645P42056Q01067M91198
$$ 11338195 12071645 12823099 13517999 14226456 15012036 15647681 16389737 17190804 17682002
4187A7682002L54734M33146O04581P48732R89173J013173J038132J139237J188043
$$ 17682002 18036736 18469882 19074463 19823195 20812368 21825541 22863673 24002910 25190953
4178B5190953J155358J234517Q73632K70366j13026j55684J40979M45869P30949
$$ 25190953 26346311 27580828 28454460 28724826 28611800 28456116 28597095 29042964 29773913
4169B9773913Q99064P38674O21899O10053P46076R60205Q03526L68844K92795
$$ 29773913 30672977 31411651 32033550 32643603 33389679 34349884 35153410 35522254 35815049
4160C5815049J40126L7475L3287K04378K00379k59996o44727o68865k79127J08108
$$ 35815049 35955175 35992650 36025937 36230315 36430694 36170698 35525971 34857106 34577979 34686087
4150C4686087K79045M31506M46542l677m57027o56093n53840o39969p76870p13484
$$ 34686087 34965132 35396638 35843180 35839503 35382476 34726383 34172543 33532574 32755704 32042220
4140C2042220r30806r64154o52083n16396k83641n60j62814l79251k95699j53066
$$ 32042220 31111414 30147260 29495177 28978781 28695140 28694580 28531766 28152515 27856816 27703750
4130B7703750j74247j36830o9147o09359r77194j133765j146782q20888m90252
$$ 27703750 27529503 27392673 27323526 26714167 25736973 24603208 23456426 22635538 22145286
4121B2145286m09100k60512j85906j15911j80624k05237l42561p41472j079419
$$ 22145286 21736186 21475674 21289768 21173857 20993233 20787996 20445435 19703963 18624544
4112A8624544j303694j350912j223208r80381p18397o53208n20703k85934k87448
$$ 18624544 17320850 15969938 14746730 13766349 13047952 12394744 11874041 11588107 11300659
4103A1300659k72938j83742j11707j22864j54284n6747J9389o0803n5454M4399
$$ 11300659 11027721 10843979 10732272 10609408 10455124 10398377 10417766 10356963 10301509 10345908
4093A0345908L5486l2861l1842m3875l2079q6246k03209k43500j70606j09916
$$ 10345908 10381394 10348533 10316691 10272816 10240737 10154491 9951282 9707782 9537176 9427260
4083I427260j66326j23558O815l6049j92528k47922j72473j73829j45295j87333
$$ 9427260 9260934 9137376 9144191 9108142 8915614 8667692 8495219 8321390 8176095 7988762
4073G988762j70154j48011j90898q4418m5028J6646N0546J27455K09184J99756
$$ 7988762 7818608 7670597 7479699 7395281 7350253 7366899 7417445 7544900 7754084 7953840
4063G953840J93546K39882K40909K30710J84706K24883K23566K03535J22261J07516
$$ 7953840 8147386 8387268 8628177 8858887 9043593 9268476 9492042 9695577 9817838 9925354
4053I925354J27793O9182K14749J45069O7516p9817j86751m45349m44298k90696
$$ 9925354 10053147 10122329 10337078 10482147 10549663 10469846 10283095 9837746 9393448 9102752
4043I102752l44651l30157l43890m20245m93723m70574l44062k67961j69421j90062
$$ 9102752 8758101 8427944 8084054 7663809 7170086 6699512 6355450 6087489 5918068 5728006
4033E728006j15907J302K3021m160o6947j51981j35515j53865j60343o9317o401
$$ 5728006 5612099 5613401 5636422 5632262 5565315 5413334 5277819 5123954 4963611 4894294 4887893
4022D887893q3168r6289k9850p0204j60885j33750r9174j08121j14703K749j17894
$$ 4887893 4804725 4708436 4678586 4608382 4447497 4313747 4214573 4106452 3991749 3994498 3876604
4011C876604j56486p1859j02679r4162n1988l1155o9143m3910K8897n2353j30315
$$ 3876604 3720118 3648259 3545580 3451418 3399430 3368275 3299132 3255222 3284119 3231766 3101451
4000C101451j37876j53196j25710j14773n0444q5567l8185n0003M6370p2820l2294
$$ 3101451 2963575 2810379 2684669 2569896 2519452 2433885 2395700 2345697 2392067 2319247 2286953
3989B286953j5958R185k0191q0051j3646m7288r1765j9450n8771o85o2051P404
$$ 2286953 2270995 2280180 2259989 2179938 2166292 2119004 2027239 2007789 1949018 1948333 1886282 1893686
3977A893686O534l0521M513n1738L3511O2994N500K4035J8659l382p519K3380
$$ 1893686 1900220 1869699 1874212 1822474 1855985 1918979 1924479 1948514 1967173 1963791 1956272 1979652
3965A979652k8607l4605M7363J3593K0888N2768J3807o9553J8603M8980j4667
$$ 1979652 1951045 1916440 1963803 1977396 1998284 2051052 2064859 1995306 2013909 2062889 2048222
3954B048222m87Q481O1608J0546N2475Q8454l0648J15786J24626P5734Q2868J76832
$$ 2048222 2047735 2056216 2117824 2128370 2180845 2269299 2238651 2354437 2479063 2554797 2637665 2814497
3942B814497K34213K01032K63115K52157L02133K98153J25314O4410L2402o8800
$$ 2814497 3048710 3249742 3512857 3765014 4067147 4365300 4490614 4555024 4587426 4518626
3932D518626k50062l59412l71669l58320l05086k44968j76726q8245n8856n3137
$$ 4518626 4268564 3909152 3537483 3179163 2874077 2629109 2452383 2364138 2305282 2252145
3922B252145n2805j8669J2219m536M8096M1876O1408P8917J8617K1393L9304N1451
$$ 2252145 2199340 2180671 2192890 2188354 2236450 2278326 2339734 2418651 2437268 2458661 2497965 2549416
3910B549416R6915J16391O2489N1623R2473L4276l379N1321L5590O1595J74130
$$ 2549416 2646331 2762722 2825211 2876834 2969307 3003583 3000204 3051525 3087115 3148710 3322840
3899C322840K03969K16198K63118L40169M01401K37187K43541J76972P5319k09445
$$ 3322840 3526809 3743007 4006125 4346294 4747695 4984882 5228423 5405395 5480714 5271269
3889E271269m26629l80994k89889j27897k0771l2153J56711J25890J31695J57686
$$ 5271269 4844640 4463646 4173757 4045860 4025089 3992936 4149647 4275537 4407232 4564918
3879D564918J61451J72401J28954K02194J7574k14722m35382m33450l14511l06732
$$ 4564918 4726369 4898770 5027724 5229918 5247492 5032770 4597388 4163938 3849427 3542695
3869C542695k52971j91206j07132r0713j21776r02K7856p0825j54832l3638o6491
$$ 3542695 3289724 3098518 2991386 2900673 2778897 2777995 2805851 2735026 2580194 2546556 2480065
3858B480065m9731K9950n2341q748P981j1841L1652K5026K6767O258O2964K0509
$$ 2480065 2430334 2460284 2407943 2399195 2407176 2395335 2426987 2452013 2478780 2485038 2548002 2568511
3846B568511J106J30946m662p2051L2898Q2973N6224Q3215J38702M4094J11427
$$ 2568511 2569617 2700563 2695901 2623850 2656748 2739721 2795945 2879160 3017862 3061956 3173383
3835C173383J19501J72473R0655p3555k3407n3534m325n1413k0332R9553M191
$$ 3173383 3292884 3465357 3556012 3482457 3459050 3405516 3401191 3349778 3329446 3428999 3433190
3824C433190J19972J93708J78131K02883J75958K52017K45002K42228J77133K07388
$$ 3433190 3553162 3746870 3925001 4127884 4303842 4555859 4800861 5043089 5220222 5427610
3814E427610K19219L8396M099k6240j5439K6185R333n4475p3769O475M5634Q9246
$$ 5427610 5646829 5685225 5689324 5663084 5647645 5673830 5683163 5628688 5554919 5561394 5607028 5696274
3802E696274K06643K38965K55437K97505L60649J92209J15222J97192J36132O3299
$$ 5696274 5902917 6141882 6397319 6694824 7055473 7247682 7362904 7560096 7696228 7759527
3792G759527J54086J08680j36320j60359k14182k30919q9986q3468j2486n1789
$$ 7759527 7913613 8022293 7885973 7725614 7511432 7280513 7190527 7107059 7094573 7042784
3782G042784j7176N4500k195R5487M5560J15711J35819Q3072N2893O0060L6488
$$ 7042784 7025608 7080108 7077913 7173400 7218960 7334671 7470490 7553562 7606455 7666515 7703003
3771G703003n5696o1451j2566l5171p1444r4560n8200n3734l3232J25315J66616
$$ 7703003 7647307 7585856 7573290 7538119 7466675 7372115 7313915 7260181 7226949 7352264 7518880
3760G518880J68666J58437K23207K88444K59266K85929L30986M14660L97113M84151
$$ 7518880 7687546 7845983 8069190 8357634 8616900 8902829 9233815 9648475 10045588 10529739
3750A0529739N24026N63586P49088R18791J197014J452461J758408J840852J855196
$$ 10529739 11053765 11617351 12366439 13285230 14482244 15934705 17693113 19533965 21389161
3741B1389161K001018J823327J586510J682078J683265J225222R76572J018007
$$ 21389161 23390179 25213506 26800016 28482094 30165359 31390581 32367153 33385160
3733C3385160q107j246194j898217k066694j656717r80925l23787K15162R02030
$$ 33385160 33377053 32130859 30232642 28165948 26509231 25528306 25204519 25419681 26321711
3724B6321711J533977K075688K552445K965239L077226L069794L357419L158144
$$ 26321711 27855688 29931376 32483821 35449060 38526286 41596080 44953499 48111643
3716D8111643K378175K166089K233543R97367p83323j362585k301158l836906
$$ 48111643 50489818 52655907 54889450 55886817 55103494 53740909 51439751 47602845
3708D7602845m542627m626929m151168l238921k249633j342064o30343R500N65909
$$ 47602845 43060218 38433289 34282121 31043200 28793567 27451503 26821160 26830660 27396569
3699B7396569R04673J151034J124811Q42870Q82867J106891P08394R5628K80325
$$ 27396569 28301242 29452276 30577087 31419957 32302824 33409715 34118109 34213737 34494062
3690C4494062j21288j811194l065247l604042l553453k956123k339462j822404
$$ 34494062 34372774 32561580 29496333 25892291 22338838 19382715 17043253 15220849
3682A5220849j515502j201193r28620q19459o44271n84228n84957m12990m05935
$$ 15220849 13705347 12504154 11575534 10756075 10111804 9527576 8942619 8529629 8123694
3673H123694m26761l55228k68317j99393k20222k69538j85438j62257k12206j17746
$$ 8123694 7696933 7341705 7073388 6873995 6653773 6384235 6198797 6036540 5824334 5706588
3663E706588p2705j12224r7757o0870m3884q2553r9877j26349j28020r6833m4182
$$ 5706588 5633883 5521659 5423902 5363032 5319148 5236595 5136718 5010369 4882349 4785516 4741334
3652D741334k8248p0984j10054n6860j2002o5183o1064p2625j6958J8817N3797
$$ 4741334 4713086 4642102 4532048 4475188 4463186 4398003 4336939 4264314 4247356 4266173 4319970
3641D319970k7216K367O4393J2751M0701K0286j2843J8472k2962j4050j3889O5630
$$ 4319970 4292754 4295121 4359514 4372265 4412966 4433252 4420409 4438881 4415919 4401869 4387980 4453610
3629D453610l4249J9347J9790K7123J9309k0056P1724L7717J01065R2553R1147
$$ 4453610 4419361 4438708 4458498 4485621 4504930 4484874 4556598 4594315 4695380 4787933 4879080
3618D879080P0518M3313J36152R4405M3718P2048N9184J13396K8336N1620R0719
$$ 4879080 4949598 4992911 5129063 5223468 5267186 5339234 5398418 5511814 5540150 5591770 5682489
3607E682489O7763J10647J11237P3192Q0853J72421K16367J36463J70915J73400
$$ 5682489 5750252 5860899 5972136 6045328 6126181 6298602 6514969 6651432 6822347 6995747
3597F995747J53647J35225J76527K12330J89394J80634J77479K49867K83341L61876
$$ 6995747 7149394 7284619 7461146 7673476 7862870 8043504 8220983 8470850 8754191 9116067
3587I116067L74858L49061M16990M47991N36910N98611O44332P92873Q55674J032008
$$ 9116067 9490925 9839986 10256976 10704967 11241877 11840488 12484820 13277693 14133367 15165375
3577A5165375J268344J467083J845459K092734K397348K545027K624069K480655
$$ 15165375 16433719 17900802 19746261 21838995 24236343 26781370 29405439 31886094
3569C1886094K304582K326309K219737K020766J843423J568169P51037l51759
$$ 31886094 34190676 36516985 38736722 40757488 42600911 44169080 44920117 44568358
3561D4568358j112784j230270p12483o0738K44339N34249R79151J143917J075914
$$ 44568358 43455574 42225304 41512821 41452083 41696422 42230671 43209822 44353739 45429653
3552D5429653J091122Q22510k57868j195965j708776j835437j409986q67451m87898
$$ 45429653 46520775 47343285 47085417 45889452 44180676 42345239 40935253 40067802 39579904
3543C9579904k10845M4836O3128k66682q73644j499352j762488j455660r61366
$$ 39579904 39369059 39413895 39477023 39210341 38336697 36837345 35074857 33619197 32657831
3534C2657831n36027l71523j33940j7457m9566j49969m71764j117378k051959
$$ 32657831 32121804 31750281 31616341 31598884 31549318 31399349 30927585 29810207 27758248
3525B7758248k778914k975389k664285k164548j819689j508728j153259r02767
$$ 27758248 24979334 22003945 19339660 17175112 15355423 13846695 12693436 11790669
3517A1790669p87507o94618n83965m96171m49868m35295l53901k89255k32813
$$ 11790669 11003162 10308544 9724579 9228408 8778540 8343245 7989344 7700089 7467276
3508G467276k45830k50433j94641j94298k28198j61587r9401j54903j40049k21909
$$ 7467276 7221446 6971013 6776372 6582074 6353876 6192289 6092888 5937985 5797936 5576027
3498E576027j67501j01233j16385j30274p1602r5691q5058k6529q143Q314m9171
$$ 5576027 5408526 5307293 5190908 5060634 4989032 4893341 4808283 4781754 4773611 4781925 4732754
3487D732754r6843m4657j6882j0891R65K5161M5121L2816Q5528J31472J24572
$$ 4732754 4635911 4591254 4574372 4563481 4564446 4589607 4634728 4667544 4753072 4884544 5009116
3476E009116J48614J31806K21425K73019K75860K27759K10026K17598K73172J82313
$$ 5009116 5157730 5289536 5510961 5783980 6059840 6287599 6497625 6715223 6988395 7170708
3466G170708J64110K04663m2858j28208p9705p6134n5719K1957O6729J05320J22725
$$ 7170708 7334818 7539481 7496623 7368415 7288710 7212576 7156857 7178814 7245543 7350863 7473588
3455G473588K2691j36554j43326j97354j09767Q9563J33990K89210L28213L57979
$$ 7473588 7496279 7359725 7216399 7019045 6909278 6998841 7132831 7422041 7750254 8108233
3445H108233K97674K60993J16171j17617k40148l52145l33434l15401k29782j82879
$$ 8108233 8405907 8666900 8783071 8665454 8425306 8073161 7739727 7424326 7194544 7011665
3435G011665k21385j31787j03948k49120l18266m34881m62661l92020l40110l07091
$$ 7011665 6790280 6658493 6554545 6305425 5987159 5552278 5089617 4697597 4357487 4050396
3425D050396k06775j50122j74992j53318r6501r8602j12220p4925n9412q4499
$$ 4050396 3843621 3693499 3518507 3365189 3268688 3170086 3057866 2982941 2923529 2839030
3415B839030k7196j27535p0113K618j6355p6350O333l7783n5095l9648l6917m1763
$$ 2839030 2811834 2684299 2614186 2616804 2600449 2524099 2530432 2492649 2437554 2397906 2360989 2319226
3403B319226M510k6107L318O273n9467J3990M8048l9890l9612L3963l5340j4358
$$ 2319226 2323736 2297629 2300947 2307220 2247753 2261743 2309791 2269901 2230289 2264252 2228912 2214554
3391B214554K2731l4915N213P0638J7189q472K2050R0078L2999J7034L2087m9602
$$ 2214554 2237285 2202370 2207583 2278221 2295410 2286938 2308988 2399066 2432065 2449099 2481186 2431584
3379B431584p3532l8294m2046k1458k1628m111J427J3172K6936J8524K347Q698
$$ 2431584 2358052 2319758 2277712 2256254 2234626 2230515 2231942 2245114 2272050 2290574 2292921 2301619
3367B301619L8532l2410k2426J7431R35k9062k6451j8717o0061l2344n1483n8403
$$ 2301619 2340151 2307741 2285315 2302746 2303681 2274619 2248168 2229451 2169390 2137046 2085563 2027160
3355B027160k4121j6587m0814J6335l9395o0768K5366L5019l2021P9158J11689
$$ 2027160 2003039 1986452 1945638 1961973 1922578 1861810 1887176 1922195 1890174 1969332 2081021
3344B081021J5070n2644J7024R1601K9103K9203O559o2923l7933l2607l5888P1585
$$ 2081021 2096091 2043447 2060471 2152072 2181175 2210378 2216937 2154014 2116081 2083474 2047586 2119171
3332B119171l0927k8396m0559M8052K8098q1916L401J9299n936l0318r933K4479
$$ 2119171 2088244 2059848 2019289 2067341 2095439 2013523 2016924 2036223 2030287 1999969 1990036 2014515
3320B014515j952L7783r744J4094N3775O8236K7716K0633J03077J9706N1129J10972
$$ 2014515 2012563 2050346 2040602 2054696 2108471 2176707 2204423 2225056 2328133 2347839 2398968 2509940
3308B509940R0975L7076j2488K7579P1933k5415k770l765K849l1713k0017L8210
$$ 2509940 2600915 2637991 2625503 2653082 2725015 2699600 2696830 2693065 2695914 2664201 2644184 2682394
3296B682394O4983N7359L0330O8311Q7288J6295R5986L2136M6205K2110J8914
$$ 2682394 2747377 2804736 2835066 2903377 2990665 3006960 3102946 3135082 3181287 3203397 3222311
3285C222311k735m0962J3699r2378o8433o9677k1973o4655n6438j1877n1231L0423
$$ 3222311 3219576 3178614 3192313 3099935 3031502 2961825 2939852 2875197 2818759 2806882 2755651 2786074
3273B786074Q9236J40987J22486J54505J99789J22741J03354O3610J6430R4219
$$ 2786074 2875310 3016297 3138783 3293288 3493077 3615818 3719172 3782782 3799212 3893431
3263C893431k50J8726N4545M4995J4600N63M2977J63048J07070J8882L8723J14457
$$ 3893431 3893181 3911907 3966452 4011447 4026047 4026610 4069587 4232635 4339705 4358587 4397310 4511767
3251D511767P2016P4825M1935L2850L243M930N2596k2089k4307p9897r9604K6389
$$ 4511767 4583783 4658608 4700543 4733393 4736636 4741566 4794162 4772073 4747766 4667869 4568265 4594654
3239D594654j655m3518J2722O4457J10553J11366J31223J84394K76460K16583
$$ 4594654 4592999 4549481 4562203 4626660 4737213 4848579 4979802 5164196 5440656 5657239
3229E657239K53577L17929L34007L08654K56459L08437K52080K16418K33104K06455
$$ 5657239 5910816 6228745 6562752 6871406 7127865 7436302 7688382 7904800 8137904 8344359
3219H344359J30856J48200R8809O0059J61330J12073J30193J78785K16598K28373
$$ 8344359 8475215 8623415 8722224 8782283 8943613 9055686 9185879 9364664 9581262 9809635
3209I809635K62670K77405K83860K60383K14046J41845J12976P1409M1285J8288
$$ 9809635 10072305 10349710 10633570 10893953 11107999 11249844 11362820 11434229 11475514 11493802
3199A1493802O8599J41926J36449J47487J88977J30796J61155K44709K42244K08585
$$ 11493802 11562401 11704327 11840776 11988263 12177240 12308036 12469191 12713900 12956144 13164729
3189A3164729K76841L19190L50865L99444M77967M78339N12864N47461O92551
$$ 13164729 13441570 13760760 14111625 14511069 14989036 15467375 15980239 16527700 17220251
3180A7220251O22472O30479P77436P66329P70017R07027R91073J188826J256314
$$ 17220251 17842723 18473202 19250638 20016967 20786984 21694011 22685084 23873910 25130224
3171B5130224J358043J387887J411766J544049J588013J542727J630856J640570
$$ 25130224 26488267 27876154 29287920 30831969 32419982 33962709 35593565 37234135
3163C7234135J735606J743640J864798K069988K423755K668053L043046L491719
$$ 37234135 38969741 40713381 42578179 44648167 47071922 49739975 52783021 56274740
3155E6274740M070131M619772N157618N889316O997252Q394577J0414411J2726516
$$ 56274740 60344871 64964643 70122261 76011577 83008829 91403406 101817817 114544333
3147A14544333J5651852J8669497K3158145K8004990L2378275L4036460L2079133
$$ 114544333 130196185 148865682 172023827 200028817 232407092 266443552 298522685
3140B98522685K9731287K3584300O790914j7121878l9370069n0518197m5498447
$$ 298522685 328253972 351838272 358629186 341507308 302137239 251619042 206120595
3133B06120595l5743381k6956383k0494618j5818092j2367255r843416q077532
$$ 206120595 170377214 143420831 122926213 107108121 94740866 84897450 76819918
3126G6819918o690991n594706m768823m230455l759580l431711l167182k971145
$$ 76819918 70128927 64534221 59765398 55534943 51775363 48343652 45176470 42205325
3118D2205325k744162k578560k419364k237091j875547j626894j423144j180025
$$ 42205325 39461163 36882603 34463239 32226148 30350601 28723707 27300563 26120538
3110B6120538j094839q86219q01627p31180o50832o91342o72844p15287o97062
$$ 26120538 25025699 24139480 23337853 22606673 21955841 21264499 20591655 19876368 19179306
3101A9179306p39603p83192o09008n60432o20816m87588m25920m07947l64495
$$ 19179306 18439703 17656511 17047503 16487071 15866255 15378667 14952747 14544800 14180305
3092A4180305m00764m23396l39719l76627l51786l12511l04311l00718k68408
$$ 14180305 13779541 13356145 13016426 12639799 12288013 11975502 11671191 11370473 11102065
3083A1102065k63024j88749j98444j97510k89054l10014k46123l33410l17321
$$ 11102065 10839041 10650292 10451848 10254338 9965284 9655270 9409147 9075737 8758416
3074H758416k99168k54623k75069k27014j42190q5830j71072j60554r5551r3338
$$ 8758416 8459248 8204625 7929556 7702542 7560352 7474522 7303450 7142896 7047345 6954007
3064F954007j18987j46016j85581j78584j42532m7028j07038j29824q3046j47195
$$ 6954007 6835020 6689004 6503423 6324839 6182307 6135279 6028241 5898417 5815371 5668176
3054E668176r2798n2955p4739n2420j7063l1543l6014L7930J4849j772j10794
$$ 5668176 5575378 5522423 5447684 5395264 5378201 5346658 5310644 5348574 5363423 5361651 5250857
3043E250857n6820n5490o6570l7516r4432j59460r4594j50369r3881j04672j25817
$$ 5250857 5194037 5138547 5071977 5034461 4940029 4780569 4685975 4535606 4441725 4337053 4211236
3032D211236j42436j69791p4461l0844j02333o7097k2458n7504j66679o2954l1612
$$ 4211236 4068800 3899009 3824548 3793704 3691371 3624274 3601816 3544312 3377633 3314679 3283067
3021C283067r2743j09067q0399r6155o7039o3866l8444n1679q5370j17889n1920
$$ 3283067 3190324 3081257 3000858 2904703 2837664 2773798 2735354 2683675 2598305 2480416 2428496
3010B428496j8240N6943n48l7720l183j8096L8229N6928P1041J8682q987J3374
$$ 2428496 2410256 2467199 2466651 2428931 2425748 2407652 2445881 2502809 2573850 2592532 2583545 2596919
2998B596919m1652M1404p317r5781j4654j2602q621L3495m8461q0040q6029m0702
$$ 2596919 2555267 2596671 2589354 2493573 2478919 2466317 2457696 2491191 2442730 2362690 2276661 2235959
2986B235959j7467k0028r155q3925q4127n8048M2494J1814j0841l2884k357J5521
$$ 2235959 2218492 2198464 2189309 2105384 2021257 1963209 2005703 2017517 2006676 1973792 1971435 1986956
2974A986956l198o719k4712j4374k8783J7574m4340p1624r6521k5451n9076r0921
$$ 1986956 1983758 1977039 1952327 1937953 1909170 1926744 1882404 1810780 1714259 1688808 1629732 1538811
2962A538811q7656m8530k5509j14496l4506K113o273n2163Q3564N2781N096J13586
$$ 1538811 1451155 1402625 1377116 1262620 1228114 1230227 1223954 1171791 1255355 1308136 1313232 1426818
2950A426818O4046O598M1655O8512J5236J9279N0541K6764K0573J8502q6362l1499
$$ 1426818 1490864 1497462 1539117 1607629 1622865 1642144 1692685 1719449 1740022 1758524 1672162 1640663
2938A640663j8038l4708p936q9709l8226o2929M454j05604q8320o8514j1419o410
$$ 1640663 1622625 1587917 1579981 1490272 1452046 1389117 1393571 1287967 1199647 1131133 1119714 1113304
2926A113304l5170j7599N8209m7668J218M9135M9016R5609J5339j8838p195j3200
$$ 1113304 1078134 1060535 1118744 1071076 1072294 1121429 1170445 1266054 1281393 1262555 1255360 1242160
2914A242160j8002k6486l8217j12295k1180p282m7249n6451J3706K7436J0477
$$ 1242160 1224158 1197672 1159455 1047160 1025980 1018698 971449 914998 928704 956140 966617
2903I66617M3262j0266O6405K4459Q507K4948l5388J9724J5291k0725j4500j6681
$$ 966617 1009879 999613 1066018 1090477 1098984 1123932 1088544 1108268 1123559 1102834 1088334 1071653
2891A071653l344j04234l1174M267q3316K2956k3494r3717r902K99j7968n0542
$$ 1071653 1068309 964075 932901 937168 853852 876808 853314 759597 749695 749994 732026 681484
2879F81484J2575M7434o81K0778N721O1804N1366M896J1459Q200M89K2449N8707
$$ 681484 694059 741493 740812 761590 767311 829115 880481 885377 896836 905036 905525 927974 986681
2866I86681P0944J5978N1378K9248P212M8631L8786K0579K0910q918J1471O0645
$$ 986681 1057625 1073603 1124981 1154229 1161441 1210072 1248858 1269437 1290347 1281429 1292900 1353545
2854A353545K0252L714Q831M17Q643O0771L0820K6376M7563R935j12256P142L7430
$$ 1353545 1373797 1377511 1386342 1386759 1395402 1456173 1486993 1513369 1560932 1570867 1458611 1465753 1503183
2841A503183P474M4598K2091L355N6740J36934J31830J30723K01949J75758J54836
$$ 1503183 1510657 1555255 1577346 1580701 1637441 1774375 1906205 2036928 2238877 2414635 2569471
2830B569471J49700M1081j23608k28378k32775k66507j99093j14624j48893j06100
$$ 2569471 2719171 2760252 2636644 2408266 2175491 1908984 1709891 1595267 1446374 1340274
2820A340274o4420o039p7489m9197m8075j02316n9699m0890J6200K5601k3096
$$ 1340274 1275854 1269815 1192326 1143129 1095054 992738 933039 892149 908349 933950 910854
2809I10854M4746l3708o0782J0415Q9518K0340j2915J1054j2779J9767J9959p5054
$$ 910854 955600 921892 861110 871525 961043 981383 968468 979522 966743 986510 1006469 931415
2797I31415k0572L5196L3237l1549l5972L0069R819J6704k1739r076q648N5392
$$ 931415 910843 946039 979276 947727 911755 941824 951643 968347 946608 937532 928884 984276
2785I84276p1930p5467P1813K7235q505L387L5694K896L3915K0726n3213M2313
$$ 984276 912346 836879 908692 935927 927422 930809 966503 969399 1003314 1024040 970827 1013140
2773A013140J3420O867N688k5116J550r148J8011l170J5879O5241r732J9467l4733
$$ 1013140 1026560 1033427 1039115 1013999 1015549 1006401 1024412 1021242 1037121 1102362 1092630 1112097 1077364
2760A077364l1042M0515K4237j6270n3833K4723J881n6448m7891o973J1042n4839
$$ 1077364 1046322 1086837 1111074 1094804 1040971 1065694 1067575 1011127 963236 956263 967305 912466
2748I12466k7864M1468p125M430l2260l695m8635L5081K6283l6877k2490k7226
$$ 912466 884602 926070 918945 923375 891115 887420 838785 873866 900149 863272 840782 813556
2736H13556m220K6510O226j7128J6568J01086K781k6669O1481N6151L511P265
$$ 813556 809336 835846 842072 824944 841512 942598 945379 918710 980191 1036342 1039853 1047118
2724A047118n936j1029M9426M1224l6894o0949L5241N612N813j1789K1748M1036
$$ 1047118 1041182 1030153 1079579 1120803 1083909 1022960 1058201 1063813 1069626 1057837 1079585 1120621
2712A120621J3374j0116j0173J4284O6529l1058l2111L8677J9464l7991m6152
$$ 1120621 1133995 1123879 1113706 1127990 1194519 1163461 1131350 1170027 1189491 1151500 1105348
2701A105348k801M3111M40k7849j05799j4502M5586m946n2488n9530J8326K654
$$ 1105348 1102547 1145658 1146098 1118249 1012450 997948 1043534 1038588 986100 926570 944896 947550
2689I47550l0614M7591K4309M6150O0521q996o8484J6217M5562p901K855j118
$$ 947550 916936 964527 988836 1034986 1095507 1086511 1018027 1034244 1079806 1071905 1074760 1073642
2677A073642k4578o2753K1479N9202L0101L7649n7549K3241J4684j4292O7717
$$ 1073642 1049064 986311 1007790 1066992 1097093 1134742 1077193 1100434 1115118 1100826 1168543
2666A168543n2727r5674M1894J5327j3764J8896J8855m3857J4916j8768k3346
$$ 1168543 1115816 1020142 1062036 1077363 1063599 1082495 1101350 1057493 1072409 1053641 1030295
2655A030295j4252J5041J8210j7878J7821N4541J3068L0367K0521k480Q5699O4549
$$ 1030295 1016043 1031084 1049294 1031416 1049237 1103778 1116846 1147213 1167734 1165254 1250953 1315502
2643A315502M0591J1561L0470J9962P612m1644M436L5880N895n2219m2673P866
$$ 1315502 1356093 1367654 1398124 1418086 1425698 1384054 1388490 1424370 1430265 1378046 1335373 1343239
2631A343239O089j7898l821N368J5493J994l173l5754o847K5131J055Q984J2529
$$ 1343239 1349328 1331430 1327609 1332977 1348470 1350464 1347291 1311537 1304690 1329821 1330876 1339860 1352389
2618A352389j8339K7096j4072k3262L0854k7121j654J4111J1132J8499m9767k1742
$$ 1352389 1334050 1361146 1347074 1323812 1354666 1327545 1325891 1340002 1351134 1369633 1319866 1298124
2606A298124J4030J4436l744j8518o8020q550O2639J2161l0756l940J466M2127
$$ 1298124 1312154 1326590 1322846 1304328 1236308 1227758 1290397 1302558 1271802 1267862 1269328 1311455
2594A311455L8152j1350k8071M3724M6576n745K1121J603p51o099j7280j9872
$$ 1311455 1349607 1338257 1310186 1353910 1400486 1394741 1415862 1417465 1416714 1410615 1393335 1373463
2582A373463L1137j4082M819M6857n4549j5799l583M68p0069J2623O482L5031
$$ 1373463 1404600 1390518 1395337 1442194 1387645 1371846 1368263 1368731 1298662 1311285 1317767 1352798
2570A352798J4474N2478M0581n741K671m0135M679M7371J7444p04l0666q520k2308
$$ 1352798 1367272 1419750 1460331 1454590 1457261 1417126 1421805 1469176 1486620 1485916 1455250 1446730 1424422
2557A424422j6986J5379j4675J7657k0380n0120L4418J5217N873L0695k0723l4310
$$ 1424422 1407436 1422815 1408140 1425797 1405417 1355297 1389715 1404932 1410805 1441500 1420777 1386467
2545A386467J8934L2641l185K1913Q599K1626n2603j7605N660P803M3466l0108
$$ 1386467 1405401 1438042 1434857 1456770 1465369 1486995 1434392 1416787 1422447 1430250 1473716 1443608
2533A443608n9060l6357L3918L8248l2335P02P660P907N62N789l456Q660k4431
$$ 1443608 1384548 1348191 1382109 1420357 1388022 1388724 1396384 1404291 1404853 1410642 1407186 1415846 1391415
2520A391415l2369k7234M6631k069j493q470l7472k0704L1604O633j1013K3906
$$ 1391415 1359046 1331812 1378443 1376374 1374881 1366411 1328939 1308235 1339839 1346472 1335459 1359365
2508A359365j7190N5373J7120l688L122n5204J123L4252k1231L6286N1203n4649
$$ 1359365 1342175 1397548 1414668 1410980 1414102 1358898 1360021 1394273 1373042 1409328 1460531 1405882
2496A405882M511O1964M712q610L1355J0722K7591j1521q546M615O565J2989n3588
$$ 1405882 1410393 1472357 1477069 1468459 1499814 1510536 1538127 1526606 1518060 1522675 1529240 1542229 1488641
2483A488641p628m6427m0559j1431K7585r009j3679M794j8883J565K6033K2202
$$ 1488641 1481013 1434586 1394027 1382596 1410181 1401172 1387493 1392287 1373404 1374969 1401002 1423204
2471A423204o6613J4894K2953k1282P9123Q0693k8457K1715n0664J562K5517n2957
$$ 1423204 1356591 1371485 1394438 1373156 1452279 1532972 1504515 1526230 1475566 1477128 1502645 1449688
2459A449688J8907P3065J655m7802O4237J4213k0153N2908o680m802M5783j7355
$$ 1449688 1468595 1541660 1543315 1495513 1559750 1573963 1553810 1606718 1600038 1595236 1641019 1623664
2447A623664l2505N1392K3248m4202K420J1332J9603M131r741J0704J7732L6357
$$ 1623664 1591159 1642551 1665799 1621597 1624017 1635349 1654952 1659083 1649342 1660046 1677778 1714135
2435A714135J00980Q3579p6173k3804J2167J8612l5977l0504j4873K1841N841
$$ 1714135 1815115 1898694 1822521 1798717 1810884 1829496 1793519 1763015 1748142 1769983 1775824
2424A775824q6873l4945M3269Q848J3387l9511M347M1570m8571n79P0098l1063
$$ 1775824 1688951 1654006 1697275 1706123 1719510 1679999 1684346 1725916 1677345 1676766 1746864 1715801
2412A715801p097J6676m1360M6812l576o946n760P079j8114N343K3421L5137P793
$$ 1715801 1708704 1725380 1684020 1730832 1727256 1720310 1714550 1721629 1703515 1708858 1732279 1767416 1775209
2399A775209j7245j9381K9773p117k7936L3482j8359j8678R601n0353n292O2069
$$ 1775209 1757964 1738583 1768356 1761239 1733303 1766785 1748426 1729748 1739349 1688996 1683704 1745773
2387A745773j07506k7768J7417J3231n209o610K6581J2814l453m998Q5418M490
$$ 1745773 1638267 1610499 1627916 1641147 1635938 1629328 1655909 1668723 1665270 1660272 1745690 1750180
2375A750180L4568k8572J8475J749L4616L4822J991L4705O0636K6593K3958k5603
$$ 1750180 1784748 1756176 1774651 1776400 1811016 1845838 1847829 1882534 1943170 1969763 1993721 1968118
2363A968118K4476L6994N5483J755M3399J13300L7022K5072m641J0895R9331n7077
$$ 1968118 1992594 2029588 2085071 2086826 2130225 2243525 2280547 2305619 2300978 2311873 2411204 2354127
2351B354127m0873n2907r7500q463o031k0028j718J0408p2307J7197M4371j7376
$$ 2354127 2313254 2260347 2162847 2154384 2148353 2128325 2126607 2137015 2064708 2081905 2126276 2108900
2339B108900l0323N6894M6926L1308K7662j569j827M6716M9514P134J7612K8485
$$ 2108900 2078577 2135471 2182397 2213705 2241367 2239798 2237971 2284687 2334201 2341335 2358947 2387432
2327B387432Q0795L1058Q2225O1215J6597L3282N9563P6053K115n751j5549k7971
$$ 2387432 2468227 2499285 2581510 2642725 2659322 2692604 2752167 2828220 2830335 2824584 2809035 2781064
2315B781064j02570j17332m413m530j9634J0313M225k0880m3647N6081J8716O093
$$ 2781064 2678494 2561162 2556749 2552219 2532585 2542898 2547123 2526243 2482596 2538677 2557393 2563486
2303B563486M306M4742M9910o0741L3256J14209J6874Q3062O2292P016L4949J01252
$$ 2563486 2567792 2612534 2662444 2601703 2634959 2749168 2766042 2849104 2911396 2918412 2953361 3054613
2291C054613L3507O0877M877L072M2161O0203K7995J6269K21n1560k0048L1017
$$ 3054613 3088120 3148997 3153874 3156946 3199107 3259310 3287305 3303574 3303795 3252235 3232187 3263204
2279C263204J922k2645m3177J0762J5373j6108o3979K5992J04528P0236q2833
$$ 3263204 3265126 3242481 3199304 3210066 3225439 3209331 3145352 3171344 3275872 3346108 3263275
2268C263275j0489N8030j0317K4926N1027M3889j512M2917j7840N6171N1474N2126
$$ 3263275 3252786 3310816 3300499 3325425 3376452 3420341 3418829 3461746 3443906 3500077 3551551 3603677
2256C603677k6846M3462J7076J0282R4223R6478K2299R3624J01718N4470M6311
$$ 3603677 3576831 3620293 3637369 3647651 3741874 3838352 3860651 3954275 4055993 4110463 4156774
2245D156774N6834J29390n402m320K7094K5786j7405O8994O9315L1863k0244J9552
$$ 4156774 4213608 4342998 4337596 4333276 4360370 4386156 4368751 4437745 4507060 4538923 4518679 4538231
2233D538231O1924J14494J28071R5450N2322N7703J01217J29691J57827J57199
$$ 4538231 4600155 4714649 4842720 4938170 4990492 5048195 5149412 5279103 5436930 5594129
2223E594129J16243R1673O3579R7844R1516P2322J65876N8308J49122J53877N8732
$$ 5594129 5710372 5802045 5865624 5963468 6054984 6127306 6293182 6351490 6500612 6654489 6713221
2212F713221J52229M9651l6403j4622L599k116L3196J0809J9641Q4488J56030
$$ 6713221 6865450 6915101 6878698 6864076 6867675 6865559 6898755 6909564 6929205 7013693 7169723
2201G169723J03961J19188J99058J18658J57867J60047K65670K30005K02607J47778
$$ 7169723 7273684 7392872 7591930 7710588 7868455 8028502 8294172 8524177 8726784 8874562
2191H874562J51548J61377J71469K41809K70735K72144L82008L68488M37247M10393
$$ 8874562 9026110 9187487 9358956 9600765 9871500 10143644 10525652 10894140 11331387 11741780
2181A1741780M38276M60137N07226M88626M12524M43523M64647M45882L07487
$$ 11741780 12180056 12640193 13147419 13636045 14048569 14492092 14956739 15402621 15710108
2172A5710108L27511K23077R2929k2348k46123m20465n77521o25670o65462o65893
$$ 15710108 16037619 16260696 16353625 16331277 16085154 15664689 15087168 14461498 13796036 13130143
2162A3130143m82657m77564n15526m57481m55652l41582l69566l72753k81282
$$ 13130143 12647486 12169922 11654396 11196915 10741263 10399681 10030115 9657362 9376080
2153I376080k45264k80447k09665j92898k09660j55456j34698j55824j07938j29515
$$ 9376080 9130816 8850369 8640704 8447806 8238146 8082690 7947992 7792168 7684230 7554715
2143G554715j54138q3012q6952j53576j60593q5224j25100j00309r3744r1310
$$ 7554715 7400577 7317565 7230613 7077037 6916444 6831220 6706120 6605811 6512067 6420757
2133F420757m4019m7595o2644M322m6268p0177j18106m8809m8364j40164j28537
$$ 6420757 6376738 6329143 6266499 6270821 6224553 6154376 6036270 5987461 5939097 5798933 5670396
2122E670396j36875j70463j59546p7136j04971j31091p3215l6374l9913j9032
$$ 5670396 5533521 5363058 5203512 5126376 5021405 4890314 4817099 4780725 4740812 4721780
2112D721780k8360q3855N7013k3809r0862o147J4153l8689o504j1369R447p310
$$ 4721780 4693420 4609565 4666578 4642769 4551907 4545760 4559913 4521224 4514720 4503351 4512798 4505488
2100D505488k9579J453O158n3383k764j4788k6392l7288q0446o5339m0444q1070
$$ 4505488 4475909 4477362 4483520 4430137 4427373 4412585 4386193 4348905 4268459 4203120 4162676 4081606
2088D081606j19862n1347l3985r4086o6695J0708q3567m3898n7600l9976p382
$$ 4081606 3961744 3910397 3876412 3782326 3715631 3726339 3642772 3598874 3541274 3501298 3493916
2077C493916o3284l8137l1010j0144k8513j4954j5773M124L5261k2968l5564J8631
$$ 3493916 3430632 3392495 3361485 3351341 3322828 3307874 3292101 3296225 3331486 3308518 3272954 3291585
2065C291585k5133o673l4453r13j4126m6100l4770n0353k655m996l6647p3013
$$ 3291585 3266452 3259779 3225326 3224413 3210287 3164187 3129417 3079064 3076409 3071413 3034766 2961753
2053B961753m2375q4081l8201k2375n3823m0468j6542P514l5218m6978j7733K062
$$ 2961753 2919378 2835297 2797096 2774721 2720898 2680430 2663888 2671402 2636184 2589206 2571473 2573535
2041B573535k571l7416r587N434M1581j421n0479M8145k2591m2786O6321l3010
$$ 2573535 2570964 2533548 2523961 2529395 2570976 2569555 2519076 2567221 2544630 2501844 2568165 2535155
2029B535155O291l9185r9807n3364L1915l298l9739n512k0036l6479m2649K7142
$$ 2535155 2541446 2502261 2402454 2349090 2381005 2377707 2337968 2332456 2312420 2275941 2233292 2260434
2017B260434K8963q773J8101R02n117l7780p905m9867J6186L2517j5859k1168
$$ 2260434 2289397 2280624 2298725 2299627 2294510 2256730 2248825 2198958 2215144 2247661 2231802 2210634
2005B210634j1919q4190O680J7748o0593N6188k6567p2696L2392j4110j7474m179
$$ 2210634 2198715 2114525 2121205 2138953 2078360 2134548 2107981 2035285 2067677 2053567 2036093 2031914
1993B031914J5881k8147p9993j3704M3195k4604l4554J060L3896Q355l3154K4850
$$ 2031914 2047795 2019648 1939655 1925951 1969146 1944542 1909988 1911048 1944944 1953299 1920145 1944995
1981A944995J9938P0835J3213j8744N91j997n4701J3751K5594k1647j4718O195
$$ 1944995 1964933 2035768 2048981 2030237 2030828 2028831 1974130 1987881 2013475 1991828 1977110 1983305
1969A983305r551p601o0602K259N039j0733N513p122Q894l3906N4018r13l1884
$$ 1983305 1973754 1966153 1905551 1907810 1912849 1902116 1907629 1900507 1909401 1875495 1929513 1928600 1896716
1956A896716j4941o4993n2037K0545K9585j1922M719m2652k2902k8652L907L7056
$$ 1896716 1881775 1816782 1764745 1785290 1814875 1802953 1807672 1765020 1742118 1713466 1717373 1754429
1944A754429L1663l4047p756M199M8902K6477J0227m4354j2624K4309m7525k364
$$ 1754429 1786092 1752045 1744289 1748488 1797390 1823867 1834094 1789740 1777116 1801425 1753900 1751536
1932A751536K9625k9121l335J491p542K2318Q657o012M5848j3389j7715M1819
$$ 1751536 1781161 1752040 1748705 1750196 1742654 1764972 1773629 1767617 1813465 1800076 1782361 1824180
1920A824180L9015j3201j5903M8872o787j4451M2133N4842m631K999Q659Q103
$$ 1824180 1863195 1849994 1834091 1882963 1876176 1861725 1903858 1958700 1954069 1957068 1965727 1973830
1908A973830J7491O0892N411k0999L2978j6220M6991P7006j5668m3905K3412J6031
$$ 1973830 1991321 2052213 2057624 2036625 2069603 2053383 2100374 2177380 2161712 2117807 2141219 2157250
1896B157250K9942K3980L7952O861N6742M5516n0533O6702M1368M381M7626P5961
$$ 2157250 2187192 2211172 2249124 2255985 2312727 2358243 2307710 2374412 2415780 2420161 2467787 2543748
1884B543748k201J3352k0597N2117N0322J7509j3100m96O4044N3057J555k8895
$$ 2543748 2541547 2554899 2534302 2586419 2636741 2654250 2641150 2640654 2704698 2757755 2759310 2730415
1872B730415L997K5737O069J7988J211J6203n6676l9315J8056R6986N0456N0767
$$ 2730415 2734412 2760149 2766218 2784206 2785417 2801620 2744944 2705629 2723685 2820671 2871127 2921894
1860B921894Q3914l5675N27N5541P3873J02843L0167j4109L9748J31636L8349
$$ 2921894 3005808 2970133 2970660 3026201 3100074 3202917 3233084 3218975 3258723 3390359 3428708
1849C428708K9423R6946L2793N1431L8292R2972L5751P4954Q7412N5915O9089
$$ 3428708 3458131 3555077 3587870 3639301 3677593 3770565 3806316 3881270 3968682 4024597 4093686
1838D093686Q6963P6434P9309M3724O5792N5681O1597L9994O4598M1919L8876
$$ 4093686 4180649 4257083 4336392 4380116 4445908 4501589 4563186 4603180 4667778 4709697 4748573
1827D748573K6020M8159O0151O2183R0537L9767Q7642P4141J32923J62038J47787
$$ 4748573 4774593 4822752 4882903 4945086 5035623 5075390 5163032 5237173 5370096 5532134 5679921
1816E679921R6991J03491J31442J81048K08175K43962J82423K29763J49294J46092
$$ 5679921 5776912 5880403 6011845 6192893 6401068 6645030 6827453 7057216 7206510 7352602
1806G352602J53256Q5102N6858j19311j01219j61977k15133j44545j14400j56957
$$ 7352602 7505858 7590960 7647818 7528507 7427288 7265311 7050178 6905633 6791233 6634276
1796F634276n2505l2565m1572M9967J3795l204K9631N0123K6029P3906P6207M6537
$$ 6634276 6581771 6549206 6507634 6557601 6571396 6568192 6597823 6647946 6673975 6747881 6824088 6870625
1784F870625N7202M0977N9877J9978P9996M3032j2095m265n1326r0906j02243
$$ 6870625 6927827 6968804 7028681 7048659 7128655 7171687 7159592 7155327 7104001 7013095 6910852
1773F910852j28076j14787j30362k23842j62138j53641j18052j40108j58223q3691
$$ 6910852 6782776 6667989 6537627 6313785 6151647 5998006 5879954 5739846 5581623 5497932
1763E497932n5996q2692q5137n6571k1091k8425j55478k4544L1952j04681j23406
$$ 5497932 5441936 5359244 5274107 5217536 5196445 5168020 5012542 4987998 5019950 4915269 4791863
1752D791863q9621j06957j07312q2689j30383r7584p7521j06367j11699p3872
$$ 4791863 4702242 4595285 4487973 4405284 4274901 4177317 4099796 3993429 3881730 3807858
1742C807858j21137r8334j23959j13078q5739n5460l0948o6732o3159m1749l3488
$$ 3807858 3686721 3588387 3464428 3351350 3265611 3210151 3179203 3112471 3049312 3007563 2974075
1731B974075m8134l3415o8289k960q6328n8705n0576p1676k7189l2393p974j9123
$$ 2974075 2925941 2892526 2824237 2821277 2734949 2676244 2625668 2553992 2526803 2494410 2486436 2467313
1719B467313m6676r7625n6596n3805n0660o7072l8454k154l0035m6649J2106m247
$$ 2467313 2420637 2323012 2266416 2212611 2161951 2094879 2056425 2054271 2024236 1977587 1989693 1985446
1707A985446n9704K196m3799j9336m5972m3268j7048m837L691p063l0424p8082
$$ 1985446 1925742 1927938 1884139 1864803 1818831 1775563 1758515 1753678 1757369 1750306 1719882 1641800
1695A641800m9602J1929n0230n2708K0878k6903q2483J0297J9928k1531j1682
$$ 1641800 1592198 1604127 1553897 1501189 1522067 1495164 1412681 1422978 1442906 1421375 1409693
1684A409693k7870p4403j9470O404k9913M637k4894l1627m433l7051L3005l9504
$$ 1409693 1381823 1307420 1287950 1294354 1264441 1269078 1244184 1212557 1208124 1171073 1204078 1164574
1672A164574J3862j0490n334j4743l5504N5758k7205l9189k9675K5265K837q7216
$$ 1164574 1178436 1167946 1162612 1147869 1112365 1168123 1140918 1101729 1072054 1097319 1100156 1012940
1660A012940K6919K0600k2674j9145o0698j7997l160k0531l3921M8718P706l9363
$$ 1012940 1039859 1060459 1037785 1018640 957942 939945 936785 916254 882333 931051 938757 899394
1648H99394q34N518o2212J7076K4729j3368r8980n539p166j0969L936j347k0266
$$ 899394 898560 904078 841866 858942 883671 870303 771323 765784 758618 747649 751585 750238 729972
1635G29972n6754J9672l4772n9613K1422o13o057l1331n027K9297n0720J304O4740
$$ 729972 673218 692890 658118 598505 619927 619314 613257 581926 576899 606196 555476 556780 621520
1622F21520j9636k5818k2226J4839l4954M8080k5826J9056L1827n7284m0364M170
$$ 621520 601884 576066 553840 568679 533725 581805 555979 575035 606862 549578 509214 513384
1610E13384j6789M685M0089k2476l6443k969q605o836m0789M012k1340k8734N5612
$$ 513384 496595 501280 541369 518893 482450 479481 470876 464040 423251 427263 405923 377189 432801
1597D32801k5664r669K054k1420K484J6054Q66j767L946l8542j2877P2280p0834
$$ 432801 407137 397468 399522 378102 380586 396640 397506 395739 399685 361143 348266 420546 349712
1584C49712J6678J4457j239k167K6362n6751J0900L2616L483J2250K6101k7864
$$ 349712 366390 380847 379608 377441 403803 347052 357952 390568 394051 406301 432402 404538
1572D04538k9318K5592N7368o3579m1724M1200n2330L4847j622n1543J2901l0570
$$ 404538 375220 400812 458180 394601 352877 394077 341747 376594 374972 323429 336330 305760
1560C05760j3289q204M2529R996k3369j5700J9128L8050j875j8483J997J8372
$$ 305760 292471 284267 326796 336792 313423 297723 316851 354901 353026 334543 336540 354912
1548C54912n6252m4794K6978J3764j4152k9191j1445q080j0606r418m1550N7572
$$ 354912 298660 253866 280844 294608 280456 251265 239820 231740 221134 211716 170166 227738
1536B27738M6358l7265L2115L0521m3133N011J9459M5957j0513J1782L944k9767
$$ 227738 274096 236831 268946 299467 256334 261345 280804 326761 316248 328030 331974 302207
1524C02207l2427r404m1094J4130L6035L4357q362n3613j9759r485l1727P2493
$$ 302207 269780 260376 219282 233412 269447 303804 295442 241829 222070 212585 180858 253351
1512B53351p206L799K1298o5003n4842j319O4760j2623R149J0942P117J3607K204
$$ 253351 246145 249944 271242 206239 151397 150078 214838 202215 211364 222306 229423 243030 245234
1499B45234l7631P89K7727J738l2578J3214j1208j2977j3004K4826K7430k1537
$$ 245234 207603 208392 236119 237857 205279 218493 207285 194308 181304 206130 233560 212023
1487B12023M3876K5467q915k4424O6632L4722p6347L098j900K9668L690j1697
$$ 212023 255899 281366 272451 248027 314659 349381 273034 276132 274232 303900 307590 295893
1475B95893K1457o878l5730m0803k6659j3613L0892q820m2932L7985k1673K443
$$ 295893 317350 310472 274742 233939 207280 193667 224559 215739 172807 210792 189119 191562
1463A91562k118k7487J8312j6744l8129K8096P6170l37m1161K8546l2841N068
$$ 191562 189444 161957 180269 163525 125396 153492 229662 229325 188164 216710 183869 188937
1451A88937n485k0591O0871k2282m5474k7100m23o65n4694J0315K6671l2293L6004
$$ 188937 183452 162861 223732 201450 155976 128876 128453 127788 73094 83409 110080 77787 113791
1438A13791r813L3497k9441l0967K2344P3784J2038r5104P32J5010L4372J2617
$$ 113791 103978 137475 108034 77067 99411 173195 185233 90129 90861 105871 140243 152860
1426A52860m7013q516K9362l236j2861J4508J1984j5677l4179J3885n118J1912
$$ 152860 105847 97331 126693 123457 110596 125104 137088 121411 87232 101117 95999 107911
1414A07911L1924k0459P60j0355n5802J6417K0846K6825k1416L258P160q651K1845
$$ 107911 139835 119376 120136 109781 53979 70396 91242 118067 96651 99909 107069 98418 120263
1401A20263J9025R152J9244L5625n5384l1519L6671m9207o5964K8735J7856m6166
$$ 120263 139288 148440 167684 203309 147925 116406 153077 103870 37906 66641 84497 38331
1389C8331j906M9315K743m193M2811l8044j8614M782N410q421k132R596k5727
$$ 38331 36425 85740 88483 84290 127101 89057 70443 75225 80635 72214 70082 79678 53951
1376E3951N901l3387j2586m3769M9923K5800n3264J0608m872M488J379M7372L684
$$ 53951 59852 26465 13879 -29890 20033 45833 -7431 3177 -1695 2793 4172 51544 55228
1363E5228o050J0918J0293o913j9762j1573O56p484l514K1253J163K2128q0131
$$ 55228 49178 60096 70389 63476 43714 32141 32797 25313 21799 43052 44215 66343 -13788
1350a3788j9149J1793P674P7267P513J3934K3572L081L1995l6865j8149l657K3199
$$ -13788 -32937 -21144 -13470 63797 71310 85244 108816 111897 143892 107027 88878 85221 108420
1337A08420j6628k813K0930l9027n7573R248M3374J2838n5964q772O6353L0561
$$ 108420 91792 88979 109909 70882 13309 22557 65931 78769 22805 14033 80386 110947
1325A10947k8600k4220j8252j4386K8194J146j7693K955J1192M014R88k8803k8444
$$ 110947 82347 58127 39875 25489 53683 54829 37136 40091 51283 55297 56285 27482 -962
1312i62O4716J302K0384K5224p6425j3136K5776j0360k1278O119J9006j6603p126
$$ -962 63754 65056 85440 110664 34239 21103 46879 36519 15241 21360 40366 23763 16637
1299A6637J999o3276K0987k52j0139M7089j1154J8641K3936k708J9728m8531k279
$$ 16637 18636 -44640 -23653 -23905 -34044 13045 1891 20532 44468 41760 61488 12957 10678
1286A0678k0361K776M7792R704l8834J9959m3725J5313O3140J122k9328m3129
$$ 10678 -9683 -6907 40885 50589 11755 31714 -12011 3302 66442 67564 38236 -4893
1274d893n688J1658L7678M1120n4375L2638J865l1518K0085K5486j2388m899J212
$$ -4893 -10581 1077 38755 79875 25500 58138 60003 28485 48570 74056 61668 56769 57981
1261E7981m1344J7428K473K2021K6245J7378J6168K3190k114j4509m38P964j8073
$$ 57981 16637 34065 36538 58559 84804 102182 118350 141540 139426 124917 124479 132443 114370
1248A14370K4805j5304N3173k826K9823K7596n4522p610L4398J6515J0915p5972
$$ 114370 139175 123871 177044 174218 204041 231637 177115 169505 203903 220418 231333 155361
1236A55361l0786n8172l4828O901J6202O59J720L2734P155j2749q6693K7700J89
$$ 155361 124575 66403 31575 38476 54678 55337 57057 89791 96946 84197 -2496 25204 25393
1223B5393Q053M5112k8530j2010j2832M4624k6313J8609K051k9268J044K4268
$$ 25393 33446 78558 50028 38018 25186 69810 43497 62106 64157 34889 35933 60201
1211F0201R59k7634L1351M918k9992k1131J319P982N0295L9394K488n4500L8864
$$ 60201 61160 33526 64877 69795 39803 18672 19991 27973 78268 117662 120150 65650 104514
1198A04514J445k8446Q895O226k2319q865L1490m3138m0883q012j0844L3774P1798
$$ 104514 105959 77513 86408 92634 70315 61450 92940 49802 8919 907 -9937 23837 95635
1185I5635k2637n8931K8024L795J6792N4198n7760l4464N3898J0880m5664k6039
$$ 95635 72998 14067 42091 45886 62678 116876 59116 24652 78550 89430 43766 17727
1173A7727L8979J7735M5841k3308m0109j9311M5198n6500J3122O1583M780J1781
$$ 17727 56706 74441 120282 96974 56865 37554 82752 26252 39374 100957 105737 117518
1161A17518j3198k0626r859j7492O367N7751j9041l1101Q1433L3234o1080m7823
$$ 117518 104320 83694 73835 56343 62710 120461 101420 70319 151752 184986 123906 76083
1149G6083R22L8239k5660L0926l5848L091j3643l7590J1308J0132L3596j4076
$$ 76083 77005 115244 89584 120510 84662 87753 74110 36520 47828 57960 91556 77480
1137G7480n35k0422N344L1863k0713J1465L02o915L1186K217O48K1251M826M988
$$ 77480 76945 56523 61867 93730 73017 84482 84784 77869 109055 111272 111920 133171 137997 142985
1123A42985l2728l6230K2761l169Q420j9414n013p1322K0416N1128j098O749l8429
$$ 142985 110257 74027 96788 93619 102039 82625 77612 6290 26706 77834 76736 83485 45056
1110D5056k0535O983J9700L7512j4167K3866M8662q163p8056j6603K6401O859
$$ 45056 24521 31504 51204 88716 74549 98415 147077 138914 60858 44255 70656 77515
1098G7515o538J9121P3363M4796m1172l7445j5866M1258j3871q888K9893l287
$$ 77515 70977 90098 163461 208257 167085 129640 113774 155032 141161 132273 162166 158879
1086A58879k9501K1367O2969P85n7979J5356J5531K0141M4137j7035M0167R3852
$$ 158879 129378 150745 213714 214499 156520 171876 187407 207548 251685 234650 274817 368669
1074C68669M488p388l0066k9720J8554J010K0464l129n263n2476O5820o3347n1956
$$ 368669 373157 365769 335703 305983 324537 325547 346011 342882 337619 285143 350963 287616 235660
1061B35660k8770K1739m2681q016K8574K1930m04N2937k1180m2808O0026J7647
$$ 235660 206890 228629 185948 177932 206506 228436 228032 280969 259789 216981 277007 294654
1049B94654l2961L1657j7542j046M6786M649N1601O6851N6038j813J7158O7358
$$ 294654 261693 293350 275808 274762 321548 326197 377798 444649 500687 498874 516032 583390
1037E83390K8030R894M4386N9489r661k8947j9146q862R503J009p0966Q4323L8811
$$ 583390 611420 621314 665700 725189 715528 686581 667435 658573 668076 669085 598119 682442 721253
1024G21253J2493K9367J4275k7495M1162J5542m1232R35L2678j2032L3099l5303
$$ 721253 733746 763113 777388 749893 791055 806597 765365 766300 798978 786946 820045 784742
1012G84742J8434P9031K0474k1580J5430K5451K0770k363J2747M2928J3002Q479
$$ 784742 803176 882207 902681 881101 896531 921982 942752 940389 953136 996064 1009066 1017545
1000A017545j710O560N3983J09588M4566O5929M3743L5242Q3847Q0151P8114J09363
$$ 1017545 1015835 1022395 1076378 1185966 1230532 1296461 1340204 1375446 1459293 1539444 1617558 1726921
988A726921J41151J31645R0238J35158J53316J72559J80866J42314J16047J58889
$$ 1726921 1868072 1999717 2089955 2225113 2378429 2550988 2731854 2874168 2990215 3149104
978C149104R0762J85071K00546K18338K81616L74971L69934M37551L11106K31263
$$ 3149104 3239866 3424937 3625483 3843821 4125437 4500408 4870342 5307893 5618999 5850262
968E850262L69102N52769O44090R05060J095076J357270J581216J942444K516368
$$ 5850262 6219364 6772133 7416223 8321283 9416359 10773629 12354845 14297289 16813657
959A6813657L590899M224988M191713L497226K894251l120809p125282n531580
$$ 16813657 20404556 24629544 28821257 32318483 35212734 32091925 24966643 19435063
951A9435063l826491k636820k092089j531449j262934q66767p65621n49924m21927
$$ 19435063 15608572 12971752 10879663 9348214 8085280 7218513 6452892 5902968 5481041
942E481041k44278l18304j61457j58048k77920m76622k87464k66873k61162k04489
$$ 5481041 5236763 4918459 4757002 4598954 4321034 3844412 3556948 3290075 3028913 2824424
932B824424j90903j55081r8679k09382q9473l5492j01403j62539o3111p3022p043
$$ 2824424 2633521 2478440 2379761 2170379 2080906 2045414 1944011 1781472 1718361 1645339 1638296
921A638296j9742p1855n0401l5899p6574n4336j9638J2933j09541m8639l1482
$$ 1638296 1618554 1546699 1496298 1460399 1383825 1329489 1309851 1322784 1213243 1164604 1133122
910A133122k9034k8467k3646k3997k8139m8185k1237m8547p95k5475k8296o56
$$ 1133122 1104088 1075621 1051975 1027978 999839 951654 930417 881870 881075 855600 827304 826648
898H26648m1902k6331K6902L888k0285Q423o6635q3410m087k2566p3823j1712
$$ 826648 784746 758415 785317 789205 768920 777343 710708 627298 623211 600645 526822 515110
886E15110M7648j9857k8258l413q606J9285k3862l7323N3233L0616j05157l5676
$$ 515110 562758 542901 514643 511230 502624 521909 498047 460724 513957 544573 439416 403740
874D03740L1117k184k4063n4259M7121j0009m7439j37Q077l449l4406r899N9431
$$ 403740 434857 432673 408610 354351 401472 391463 344024 343887 351964 348515 314109 304210 363641
861C63641k2717K911L3577l5042o945K8423k8653J0754J6603j7789p0854L8544
$$ 363641 340924 343835 377412 342370 335425 363848 335195 345949 362552 344763 273909 312453
849C12453J2485n6858L580J7715m327j4397m218k2680j7673o6653m268J6140K2724
$$ 312453 324938 268080 271660 289375 285048 270651 266433 243753 226080 159427 155159 171299 194023
836A94023l7589k2312J0882M0264K0021M3565k0188L399J7554k122l1415P0893
$$ 194023 156434 134122 145004 185268 205289 248854 228666 232065 249619 247497 216082 286975
824B86975J0904p9986j4559L6155J4500k3936k8184j9084l6840n7218K2242J8969
$$ 286975 297879 217893 203334 239489 253989 230053 201869 182785 145945 88727 110969 129938
812A29938k9092J9380l3267L5456j4396k0201p604K2186J9416j9865J7067j0723
$$ 129938 100846 120226 86959 122415 108019 87818 80214 102400 121816 101951 119018 108295
800A08295l366M664j3420K423o937j3460N1458l6889l0847r41l7184R5L2515N8965
$$ 108295 104929 109593 96173 98596 91659 78199 129657 92768 61921 60980 23796 23891 56406 115371
786A15371n6015j9754p6880j4296K8293J0211k4418K9194N9362J0325P247J5107
$$ 115371 59356 39602 -37278 -51574 -23281 -13070 -37488 -8294 51068 61393 68640 83747
774H3747K019j5918l376M959L4095n545l3648l9984j1123K9335L5101q679R443
$$ 83747 85766 69848 66472 71431 105526 99981 66333 26349 15226 44561 79662 70983 80426
761H0426J3172j2789j4670L5337j4633k690L9409M152l2304m2001k5772K4181
$$ 80426 93598 80809 66139 101476 86843 84153 123562 127714 95410 53409 27637 51818
749E1818M121N32j4654L6138J0850j7195m7841L7412M7434k8942n9705L549L1322
$$ 51818 55939 56471 41817 77955 88805 71610 23769 61181 108615 79673 19968 23517 54839
736E4839m4748R337L0952K5673k2837o599J3439k5812o2373j0082N0270J2759
$$ 54839 10091 19428 50380 76053 53216 46617 60056 34244 -28129 -38211 12059 24818
724B4818l2517o771j0422K1507m131m055L5884K739m1447j6487k4987K6509K1597
$$ 24818 -7699 -14470 -24892 -3385 -7516 -11571 24313 27052 -14395 -30882 -55869 -29360 -7763
711g763M0978L8086p7873m6461o256M5338K2474k6456k1720M068K2987K2262J6085
$$ -7763 33215 71301 -6572 -53033 -59289 -13951 8523 -17933 -39653 -35585 -12598 9664 25749
698B5749n7288L5268L5236r7637J3753L9487m741k2179Q333o709O9252k8626r900
$$ 25749 -31539 3729 38965 -58672 -44919 -5432 -10173 -32352 -24019 -30728 38524 9898 -2
685bN2688j6741j6784O619L4203M3274k0782p7497M1741R540l4470K9102M1252
$$ -2 52686 35945 19161 25780 59983 103257 82475 4978 46719 56259 21789 50891 92143
672I2143O3553J848P136J1925M3328L1124l0203j3592j5404q4678n0522L5145
$$ 92143 155696 157544 164680 176605 219933 251057 220854 207262 191858 107180 56658 91803
660I1803P979q9324l6970O2007M1977n5894n4147M9019j9976k4152J7699m329
$$ 91803 99782 10458 -26512 35495 77472 21578 -32569 16450 -3526 -27678 -9979 -14308
648a4308J6186p679k7981L788L9119k3816m7936N3845M1776R569m7847m8232k870
$$ -14308 1878 -5801 -33782 -29994 9125 -14691 -62627 -8782 32994 42563 -5284 -53516 -56386
635e6386K0951l94Q52J7409j2537o6827m3837K7231l0297M3909M6777J4500N520
$$ -56386 -35435 -35829 -34977 -17568 -30105 -96932 -140769 -113538 -143835 -99926 -53149 -38649 -33129
622c3129o631k3936K8631r911r314L0295N2688K9473m4572j5262n482L9293j4072
$$ -33129 -39760 -63696 -35065 -44976 -54290 -23995 28693 58166 13594 -1668 -7150 32143 18071
609A8071j5600k0270J9544k1324R39L5005k0832r1180j8019M1219N60J8869L7549
$$ 18071 2471 -17799 1745 -19579 -18640 16365 -4467 -95647 -113666 -72447 -71887 -53018 -15469
596a5469P3292J2875o5711k6946M5651K0383k6574K8674k8961n5268N0358K1883
$$ -15469 57823 70698 4987 -21959 23692 44075 17501 46175 17214 -38054 12304 34187
584C4187j8388k5083L035K3561j1866j5654J8500l9738R765K3354m4973k1083
$$ 34187 15799 -9284 -6249 17312 5446 -10208 8292 -31446 -21681 1673 -43300 -64383
572f4383N5300J1368p427q231k4094J9555L388k4310l4034J5065k2409N915J4888
$$ -64383 -9083 2285 -5142 -13373 -37467 -17912 -14524 -38834 -72868 -57803 -80212 -74297 -59409
559e9409o667k9615L0395p476L7242l1641n0393P293k3448k4167M6506P0643m1008
$$ -59409 -66076 -95691 -65296 -72772 -35530 -67171 -117564 -110271 -133719 -157886 -111380 -40737 -81745
546h1745P367L8395j3228J0938L3349J6844m3664K5496n959l1245M9353k0404
$$ -81745 -74378 -35983 -49211 -38273 -4924 11920 -31744 -6248 -12207 -43452 5901 -14503
534a4503n162j1509J1478O103j609L4745l1529q224J8193j2767M6163K5597j3093
$$ -14503 -19665 -31174 -19696 -13593 -15202 19543 -11986 -20210 -2017 -14784 31379 56976 43883
521D3883k2065k6675j1348j3994J4338n2297k5662J275K0063N0595m8302k2024
$$ 43883 21818 -4857 -16205 -30199 -15861 -68158 -93820 -92545 -72482 -21887 -70189 -92213
509i2213j2547k1921L202J6084Q3970O528j2433j7442q159N562k753J0245l5488
$$ -92213 -104760 -126681 -123479 -107395 -23425 -16897 -29330 -46772 -54931 -49369 -52122 -41877 -77365
496g7365O899L2768o998j9565r737L564n188j4811k0748O2062M8774l3627K1848
$$ -77365 -70466 -37698 -44696 -64261 -73998 -70434 -75622 -90433 -111181 -49119 -345 -33972 -12124
483a2124K9970o6874L5382K3957k3477l7843M391K6262n9280r008N43j1352K6455
$$ -12124 17846 -49028 -13646 10311 -13166 -51009 -46618 -20356 -79636 -88644 -88101 -99453 -72998
470g2998K0284k4101N0348j5529K7222j8971k0267k1249j8474Q901J6414j401
$$ -72998 -52714 -76815 -26467 -41996 -14774 -33745 -54012 -75261 -93735 -84834 -68420 -69821
458f9821k72m0888l6515K541P4662L4586m398L1852J8839k4521n6298J1435L9339
$$ -69821 -70093 -110981 -147496 -144955 -70293 -35707 -40105 -8253 10586 -13935 -70233 -58798 -19459
445a9459j02811m8572L6089J908J2601M6715J0022J6213m2397k9243K1759J02046
$$ -19459 -122270 -170842 -134753 -132845 -120244 -73529 -63507 -47294 -89691 -118934 -97175 4871
433D871j7886p6689K8217k2892J1823m3808q66K6219R865j3841l570K1789r238
$$ 4871 -13015 -89704 -61487 -84379 -72556 -116364 -117230 -91011 -81146 -94987 -98557 -76768 -86006
420h6006J1441k451j2317k4464k6866J6226N2475R529j6095J7169J2721k3117
$$ -86006 -74565 -77016 -89333 -113797 -140663 -124437 -71962 -62433 -78528 -61359 -48638 -71755
408g1755K3091Q42L504K6320K0287k3471L313L312l0202K4390n0935J3413j9476
$$ -71755 -48664 -47822 -44318 -17998 2289 -21182 -17869 -14557 -44759 -20369 -71304 -57891 -77367
395g7367K8206O9932J1018q0660q0778m9026L2311q423N6820j9094j1267J1859
$$ -77367 -49161 20771 31789 -48871 -129649 -178675 -146364 -154787 -97967 -117061 -128328 -116469
383a16469k5381N9362J4111o0227J9092M8255p4967j5847M3811J5481J0068l1489
$$ -116469 -141850 -82488 -68377 -128604 -109512 -61257 -136224 -152071 -108260 -92779 -82711 -114200
371a14200l8603K8492N9103M0263m5328k5862R718j1308M908N3398k8966j9035
$$ -114200 -152803 -124311 -65208 -24945 -70273 -96135 -86417 -97725 -92817 -39419 -68385 -87420
359h7420M8755Q644M14o354m3754O576p731k716J0036K3326K086o1076L3417K2128
$$ -87420 -38665 -30021 -29607 -35961 -79715 -73139 -80870 -83586 -73550 -50224 -48138 -109214 -75797 -53669
345e3669j5338L4851P068k799k5046n6708M2003K9188o81n0372j282n6924N3296
$$ -53669 -69007 -34156 -27088 -29887 -54933 -111641 -69638 -40450 -41131 -91503 -92785 -149709 -96413
332i6413K2152j9732K4951K2608P276J954Q328m3349J4464J7049n484J320j3833
$$ -96413 -74261 -93993 -69042 -46434 -39158 -37204 -28876 -72225 -57761 -40712 -46196 -44876 -58709
319e8709p237O797k8407J6589O547j5258J4490M3580n3853j3368L7330l4854m7741
$$ -58709 -65946 -59149 -87556 -70967 -64420 -79678 -65188 -21608 -75461 -88829 -51499 -86353 -134094
306a34094L8691j7761j2218J0591n063k6256j6479J8181k7006J1452L3521o660
$$ -134094 -95403 -113164 -125382 -114791 -119854 -146110 -162589 -144408 -171414 -159962 -126441 -133101
294a33101k5129K2813J7483m2648K5717K8793K4877j3905L67M495k5253R799k1949
$$ -133101 -158230 -135417 -117934 -160582 -134865 -106072 -81195 -95100 -94733 -90238 -115491 -105692 -127641
281a27641P4Q1898n3871n5907O3682n017m0579M5514L9656k1919J0779m6k0334
$$ -127641 -127567 -45669 -99540 -155447 -91765 -96782 -137361 -91847 -52191 -74110 -63331 -63377 -83711
268h3711l9407L4785p920j2049O863L3199K776j0808K5499l5350J4687K0000L827
$$ -83711 -123118 -88333 -96253 -108302 -101439 -68240 -65464 -76272 -50773 -86123 -71436 -51436 -47609
255d7609l2351q547J3937m7210J294K0026N5283M6444l2068l9124k0568J3103
$$ -47609 -79960 -88507 -74570 -121780 -120486 -100460 -45177 1267 -30801 -69925 -90493 -77390
243g7390k3054l3580O1981m6009l6838R5438P359k6925n8780p312L004L6112Q3690
$$ -77390 -100444 -134024 -72043 -118052 -154890 -59452 -52093 -79018 -137798 -145110 -142106 -105994 -22304
230b2304n2732m8912j2278k9501J0614l239J9027j6978n729J6007K4492k0901
$$ -22304 -75036 -123948 -136226 -165727 -155113 -158352 -139325 -156303 -162032 -146025 -121533 -142434
218a42434k9699J7068J31k9792k3205P3072K1955n5217J4749n3117L9124M3187
$$ -142434 -172133 -155065 -154934 -184726 -207931 -134859 -112904 -168121 -153372 -206489 -167365 -124178
206a24178l0482J694K2277k9546m391J2943m2K4111K4324o481k6747K5606j277
$$ -124178 -154660 -152966 -130689 -160235 -164626 -151683 -151725 -127614 -103290 -109771 -136518 -110912 -112189
193a12189j7840j0873K0768K2728m260M3824K903n4638P3802K9020N303k1377
$$ -112189 -130029 -140902 -120134 -97406 -101666 -57842 -54939 -109577 -35775 -6755 -1452 -22829
181b2829k5480r1972M2435p335n3635K4368m613K7430j9093J2071K757l4480q395
$$ -22829 -48309 -140281 -97846 -105181 -158816 -134448 -139061 -111631 -130724 -118653 -115896 -150376 -158771
168a58771j985L6090k2707L307p854J616j3318J6410J0530q217M0310n0707j4156
$$ -158771 -160756 -124666 -147373 -144066 -151920 -150304 -163622 -147212 -136682 -144899 -104589 -155296 -169452
155a69452R694K1313L5613Q32m9651k054N147N6559k7513l6618Q96m2584j0468
$$ -169452 -159758 -138445 -102832 -102000 -151651 -153705 -148558 -91999 -119512 -156130 -155234 -197818 -208286
142b08286K4962j4078m0192M1035O5556k591N7388L3184l7356l6754J105k6089
$$ -208286 -183324 -197402 -237594 -196559 -131003 -133594 -76206 -43022 -80378 -117132 -116027 -142116
130a42116q906O9494K155k0641m1923m0093N932j4654J7339M5868k8422o892P777
$$ -142116 -151022 -81528 -79373 -100014 -141937 -182030 -176098 -190752 -173413 -127545 -155967 -162859 -155082
117a55082L2368m6768L8335O645n6833J9223L778K8250K8663J1402l9974K0805
$$ -155082 -122714 -169482 -131147 -124502 -181335 -162112 -158334 -130084 -101421 -90019 -129993 -109188
105a09188l1727k4438N281O828K9906j5251j6202J994P847L7793k9399q292O2547
$$ -109188 -140915 -165353 -160072 -153244 -123338 -138589 -154791 -152797 -144950 -107157 -136556 -144848 -82301
92h2301l6814k0659n473L9889m7697J2251K2082j6657l525j9158N021k3462N3931
$$ -82301 -119115 -139774 -145247 -105358 -153055 -140804 -118722 -135379 -138904 -158062 -153041 -176503 -122572
79a22572k645l9295N0954j053n1238N71R695J2560n769N380N9194l8989l9127
$$ -122572 -125217 -164512 -113558 -114611 -165849 -165278 -155583 -143023 -148792 -143412 -84218 -123207 -162334
66a62334K096R545L167o006o667N475O626p700M335j2279J079l8023o589M3406
$$ -162334 -160238 -150693 -147526 -153532 -160199 -154724 -148098 -155798 -151463 -163742 -162663 -200686 -207275 -163869
52a63869M184o0110k0153o909j3445N7316M5644p608j9812P84n237J0577N1916
$$ -163869 -159685 -219795 -239948 -246857 -260302 -202986 -157342 -164950 -184762 -183978 -189215 -178638 -126722
39a26722r220l6397j0085K712l7848M7753L0545n0325j7269Q146l0286J2804J3086
$$ -126722 -135942 -172339 -182424 -179712 -217560 -169807 -139262 -189587 -206856 -198710 -228996 -216192 -203106
26b03106r949N925K3152J3374L87R338J889J4818o699j9182L3062L8566l1270
$$ -203106 -213055 -207130 -183978 -170604 -170217 -160879 -158990 -144172 -150871 -170053 -136991 -98425 -129695
13a29695k6527p500k8040o272J8325J9582R711j6897k7527L2003J4711J3036l5987
$$ -129695 -156222 -163722 -191762 -198034 -179709 -160127 -150416 -167313 -194840 -162837 -148126 -135090 -171077
0a71077
$$ -171077
$$ Imaginary data points
##PAGE= N=2
##DATA TABLE= (X++(I..I)), XYDATA
16383a068853j8368O7746M442M6222J7739k1727J7703K9285K3077J372M3356R293
$$ -1068853 -1087221 -1019475 -1015033 -968811 -951072 -972799 -955096 -925811 -902734 -901362 -858006 -848713
16371h48713J7563M2346L0745P784r962Q006M2847K2514M2280j3744K4198N6918
$$ -848713 -831150 -788804 -758059 -750275 -760237 -752231 -709384 -686870 -644590 -658334 -634136 -577218
16359e77218r512J6136J3673L1634k6712j6604J1596j0323L4502K4760L2193r388
$$ -577218 -586730 -570594 -556921 -525287 -551999 -568603 -557007 -567330 -532828 -508068 -475875 -485263
16347d85263L6372K0562J4892J2005K1704K7724N0047L8525n0084l6557M1787
$$ -485263 -448891 -428329 -413437 -401432 -379728 -352004 -301957 -263432 -313516 -350073 -308286
16336c08286O8550j2746j7031M0220P242q881J352R857m540K5271j3317J1802
$$ -308286 -239736 -252482 -269513 -229293 -222051 -230932 -229580 -219723 -224263 -198992 -212309 -200507
16324b00507N4480L5071k4136J3781N6854K2897l7786J9162P7748O981L2594K2806
$$ -200507 -146027 -110956 -135092 -121311 -64457 -41560 -79346 -60184 17564 24545 57139 79945
16312G9945J9752k6982q946j6076L6615j4055M6120L2304L0505K1888l8094J1195
$$ 79945 99697 72715 63769 47693 84308 70253 116373 148677 179182 201070 162976 174171
16300A74171O4693K4115k7224k9924K1945M3745N048K4645K0859j3950J5362P002
$$ 174171 238864 262979 235755 205831 227776 271521 276569 301214 322073 308123 323485 330487
16288C30487J0019O2524J6113m659n3679j1947L6214J529Q0274m193m6366o58
$$ 330487 340506 403030 419143 414484 360805 348858 385072 386601 466875 462682 416316 415658
16276D15658M9397M0462N536M3714k087k4734J9399r606K1054K3975K058p016
$$ 415658 465055 505517 511053 554767 552680 527946 547345 537739 558793 582768 584826 577810
16264E77810J3064Q226p668O3179l8327J1032M0130j4720Q120k393L8987o769
$$ 577810 590874 599100 591432 654611 616284 627316 667446 652726 660846 658453 697440 690671
16252F90671J2407M5673K451K0145j5138P966k0584k937r939M341N0270K6721
$$ 690671 703078 748751 751202 771347 756209 764175 743591 740654 730715 735056 785326 812047
16240H12047r186L9153k2019k8737r782N3389P916J2103N5017J4805j5439M145
$$ 812047 802861 842014 819995 791258 781476 834865 842781 854884 909901 924706 909267 913412
$$ [...]
##END NTUPLES=NMR SPECTRUM
##END=
