##TITLE=1H_TG-2292-1
 CDCl3, 8 sc, 
 10.7.2020
##JCAMPDX= 6.0         $$ Bruker NMR JCAMP-DX V2.0
##DATA TYPE= NMR FID
##DATA CLASS= NTUPLES
##ORIGIN= UXNMR, Bruker Analytische Messtechnik GmbH
##OWNER= root
$$ XWIN-NMR		Version 3.5
$$ Fri Jul 10 11:46:10 2020 Russian Standard Time (UT+4h)  she@DPX200
##.OBSERVE FREQUENCY= 200.1315
##.OBSERVE NUCLEUS= ^1H
##.DELAY= (6, 6)
##.ACQUISITION MODE= SIMULTANEOUS
##.ACQUISITION SCHEME= undefined
##.AVERAGES= 8
##.DIGITISER RES= 18
##SPECTROMETER/DATA SYSTEM= spect
##.PULSE SEQUENCE= zg30
##.SOLVENT NAME= CDCl3
##.SHIFT REFERENCE= (INTERNAL, CDCl3, 0, 15.7039)
##AUDIT TRAIL= $$ (NUMBER, WHEN, WHO, WHERE, WHAT)
$$ ##TITLE= Audit trail, XWIN-NMR		Version 3.5
$$ ##JCAMPDX= 5.01
$$ ##ORIGIN= Bruker BioSpin GmbH
$$ ##OWNER= she
$$ F:/spectra/data/she/nmr/H-F/1/audita.txt
$$ ##AUDIT TRAIL=  $$ (NUMBER, WHEN, WHO, WHERE, WHAT)
(   1,<2020-07-10 11:45:04.06 +0400>,<she>,<DPX200>,
      <created by zg, POWCHK disabled, PULCHK disabled
       configuration hash MD5:
       00 E9 B6 7A A2 85 ED C7 34 08 36 98 17 FE 4E 26
       data hash MD5: 16K
       99 22 1A E5 59 89 AD E7 66 DB BE 26 D3 39 63 B8>)
$$ ##END=
$$ 
$$ hash MD5
$$ 5C E4 7C 99 0F 11 B7 7C D3 59 1F E3 A1 AD 6C E3
##$RELAX= 
##$RELAX= 
##$RELAX= 
##$RELAX= 
##$RELAX= 
##$RELAX= 
$$ Bruker specific parameters
$$ --------------------------
##$DU= <F:/spectra>
##$EXPNO= 1
##$NAME= <H-F>
##$PROCNO= 1
##$TYPE= <nmr>
##$USER= <she>
##$AMP= (0..31)
100 100 100 100 100 100 100 100 100 100 100 100 100 100 100 100 100 100 
100 100 100 100 100 100 100 100 100 100 100 100 100 100 
##$AQSEQ= 0
##$AQ_mod= 1
##$AUNM= <au_zg>
##$AUTOPOS= <>
##$BF1= 200.13
##$BF2= 200.13
##$BF3= 200.13
##$BF4= 200.13
##$BF5= 200.13
##$BF6= 200.13
##$BF7= 200.13
##$BF8= 200.13
##$BYTORDA= 1
##$CFDGTYP= 0
##$CFRGTYP= 5
##$CHEMSTR= <none>
##$CNST= (0..31)
1 1 145 1 1 1 1 1 1 1 1 1 1 1 1 1 1 1 1 1 1 1 1 1 1 1 1 1 1 1 1 1 
##$CPDPRG= <>
##$CPDPRG1= <>
##$CPDPRG2= <>
##$CPDPRG3= <>
##$CPDPRG4= <mlev>
##$CPDPRG5= <mlev>
##$CPDPRG6= <mlev>
##$CPDPRG7= <mlev>
##$CPDPRG8= <mlev>
##$CPDPRGB= <>
##$CPDPRGT= <>
##$D= (0..31)
0 1.2 0 0 0 0 0 0 0 0.06 0 0.03 0 0 0 0 0.0002 0 0 0 0 0 0 0 0 0 0 0 0 
0 0 0 
##$DATE= 1594367103
##$DBL= (0..7)
120 120 120 120 120 120 120 120 
##$DBP= (0..7)
150 150 150 150 150 150 150 150 
##$DBP07= 0
##$DBPNAM0= <>
##$DBPNAM1= <>
##$DBPNAM2= <>
##$DBPNAM3= <>
##$DBPNAM4= <>
##$DBPNAM5= <>
##$DBPNAM6= <>
##$DBPNAM7= <>
##$DBPOAL= (0..7)
0.5 0.5 0.5 0.5 0.5 0.5 0.5 0.5 
##$DBPOFFS= (0..7)
0 0 0 0 0 0 0 0 
##$DE= 6
##$DECBNUC= <off>
##$DECIM= 24
##$DECNUC= <off>
##$DECSTAT= 4
##$DIGMOD= 1
##$DIGTYP= 9
##$DL= (0..7)
0 120 120 120 120 120 120 120 
##$DP= (0..7)
150 150 150 150 150 150 150 150 
##$DP07= 0
##$DPNAME0= <>
##$DPNAME1= <>
##$DPNAME2= <>
##$DPNAME3= <>
##$DPNAME4= <>
##$DPNAME5= <>
##$DPNAME6= <>
##$DPNAME7= <>
##$DPOAL= (0..7)
0.5 0.5 0.5 0.5 0.5 0.5 0.5 0.5 
##$DPOFFS= (0..7)
0 0 0 0 0 0 0 0 
##$DQDMODE= 0
##$DR= 18
##$DS= 0
##$DSLIST= <SSSSSSSSSSSSSSS>
$$ [...]
##$SUBNAM2= <"">
##$SUBNAM3= <"">
##$SUBNAM4= <"">
##$SUBNAM5= <"">
##$SUBNAM6= <"">
##$SUBNAM7= <"">
##$SUBNAM8= <"">
##$SUBNAM9= <"">
##$SW= 24.9337058887773
##$SWIBOX= (0..15)
0 0 2 0 0 0 0 0 0 0 0 0 0 0 0 0 
##$SW_h= 4990.01996007984
##$TD= 16384
##$TD0= 1
##$TE= 0
##$TE2= 300
##$TE3= 300
##$TEG= 300
##$TL= (0..7)
0 120 120 120 120 120 120 120 
##$TP= (0..7)
150 150 150 150 150 150 150 150 
##$TP07= 0
##$TPNAME0= <>
##$TPNAME1= <>
##$TPNAME2= <>
##$TPNAME3= <>
##$TPNAME4= <>
##$TPNAME5= <>
##$TPNAME6= <>
##$TPNAME7= <>
##$TPOAL= (0..7)
0.5 0.5 0.5 0.5 0.5 0.5 0.5 0.5 
##$TPOFFS= (0..7)
0 0 0 0 0 0 0 0 
##$TUNHIN= 0
##$TUNHOUT= 0
##$TUNXOUT= 0
##$USERA1= <user>
##$USERA2= <user>
##$USERA3= <user>
##$USERA4= <user>
##$USERA5= <user>
##$V9= 5
##$VALIST= <valist>
##$VCLIST= <CCCCCCCCCCCCCCC>
##$VD= 0
##$VDLIST= <DDDDDDDDDDDDDDD>
##$VPLIST= <PPPPPPPPPPPPPPP>
##$VTLIST= <TTTTTTTTTTTTTTT>
##$WBST= 1024
##$WBSW= 4
##$XGAIN= (0..3)
0 0 0 0 
##$XL= 0
##$YL= 0
##$YMAX_a= 986119
##$YMIN_a= -566406
##$ZGOPTNS= <>
##$ZL1= 120
##$ZL2= 120
##$ZL3= 120
##$ZL4= 120
##$ABSF1= 10
##$ABSF2= 0
##$ABSG= 5
##$ABSL= 3
##$ALPHA= 0
##$AQORDER= 0
##$ASSFAC= 0
##$ASSFACI= 0
##$ASSFACX= 0
##$ASSWID= 0
##$AUNMP= <proc_1d>
##$AZFE= 0.1
##$AZFW= 0.1
##$BCFW= 1
##$BC_mod= 2
##$BYTORDP= 1
##$COROFFS= 0
##$CY= 11.3945322036743
##$DATMOD= 1
##$DC= 2
##$DFILT= <>
##$DTYPP= 0
##$F1P= 16.9975609425685
##$F2P= -3.02152046262296
##$FCOR= 0.5
##$FTSIZE= 0
##$FT_mod= 4
##$GAMMA= 1
##$GB= 0.15
##$INTBC= 1
##$INTSCL= 1
##$ISEN= 128
##$LB= 0.24
##$LEV0= 0
##$LPBIN= 0
##$MAXI= 10000
##$MC2= 0
##$MEAN= 0
##$ME_mod= 0
##$MI= 1.114404
##$NCOEF= 0
##$NC_proc= 0
##$NLEV= 6
##$NOISF1= 3.799351
##$NOISF2= 2.8
##$NSP= 1
##$NTH_PI= 0
##$NZP= 0
##$OFFSET= 15.70392
##$PC= 1
##$PHC0= -9792.111
##$PHC1= 14.80092
##$PH_mod= 1
##$PKNL= yes
##$PPARMOD= 0
##$PSCAL= 0
##$PSIGN= 0
##$REVERSE= no
##$SF= 200.130013532006
##$SI= 16384
##$SIGF1= 3
##$SIGF2= 2
##$SINO= 400
##$SIOLD= 16384
##$SREGLST= <1H.CDCl3>
##$SSB= 0
##$STSI= 0
##$STSR= 0
##$SW_p= 3612.71676300578
##$SYMM= 0
##$S_DEV= 0
##$TDeff= 0
##$TDoff= 0
##$TI= <>
##$TILT= no
##$TM1= 0
##$TM2= 0
##$TOPLEV= 0
##$USERP1= <user>
##$USERP2= <user>
##$USERP3= <user>
##$USERP4= <user>
##$USERP5= <user>
##$WDW= 1
##$XDIM= 8192
##$YMAX_p= 0
##$YMIN_p= 0
$$ End of Bruker specific parameters
$$ ---------------------------------
##NTUPLES= NMR FID
##VAR_NAME=  TIME,          FID/REAL,        FID/IMAG
##SYMBOL=    X,             R,               I
##VAR_TYPE=  INDEPENDENT,   DEPENDENT,       DEPENDENT
##VAR_FORM=  AFFN,          ASDF,            ASDF
##VAR_DIM=   8192,          8192,            8192
##UNITS=     SECONDS,       ARBITRARY UNITS, ARBITRARY UNITS
##FACTOR=    0.0002004,     1,               1
##FIRST=     0,             0,               0
##LAST=      1.6414764,     0,               0
##MIN=       0,             -566406,         0
##MAX=       1.6414764,     986119,          0
$$ Real data points
##PAGE= N=1
##DATA TABLE= (X++(R..R)), XYDATA
$$ [...]
2597i41r52L40K046J679j093l437n58K749K669j059l589j189K034L488j21l626
2613a560j681J977K077L23j545j520J66J476J002j09j153r10o11J461K140l48
2629A185l108j136K017K618Rk120k454R80L561K75k330j432Q14J554M30q26j142
2646a105r8J289Q15o21j93k61j013R34J524j64j537r09Q38J234J112r90j897J86
2664h56J808N79o30j035n58O53J427J95j179j090J69P98R59K87j348r23P08J341
2682A305j30p79o12l2L26R35k73l41m42k30K75J246O66j883j100Q62J836L48j314
2701F63k023Q0K363J123j527k501Q13J767M47n91q86o59R19P89k25Q3m27j548
2719a340J57J873J618j697k653m18K541K676r65l962j164L601K351j025l382j007
$$ plain form
2597 -941 -1893 -1553 493 2172 1079 -2358 -2916 -167 2502 1443 -2146 -3335 -1301 2187 2066 -1560
2613 -1560 -3241 -1264 813 1136 -409 -1929 -1763 -287 715 606 -547 -1457 -2068 -607 1533 1185
2629 1185 -1923 -3059 -1042 1576 1585 -535 -2989 -2009 1552 1827 -503 -1935 -1121 433 863 37 -1105
2646 -1105 -1203 86 901 280 87 -174 -1187 -253 1271 1107 -430 -1339 -501 733 1845 855 -1042 -856
2664 -856 952 1531 901 -134 -692 -39 1388 1583 404 -686 -517 281 1240 1527 179 -744 -36 1305
2682 1305 1175 396 -216 -248 78 1013 740 399 -43 -273 2 1248 1914 31 -1069 -207 1629 1977 663
2701 663 -1360 -1280 1083 2206 679 -1822 -1009 758 1205 614 -272 -931 -12 777 552 635 208 -1340
2719 -1340 -1183 690 2308 611 -2042 -2460 81 2757 1792 -2170 -3334 267 2618 1593 -1789 -2796
2735b796J827K677J6k292j561J018J207L94j12q00j622p2K610J742j861l000p19
2752c344K844L548q41m773j278K771L764o19l514k229J587L477R45k586k315L95
2768b168K144J917n00k218k301J478K962J286j572l598j048L473L754r03m899
2783b193j739L120L667L96l514l090J272M135J726k746l015n81K549L104J80l576
2799c05k828J653L749J571k319l722p58L442L682j218m572j521K562L843M29l177
2815E11l525P76M028K321j950l615j573K421L765R73m043l640J526M287J919k505
2831A676m716n08M506L456j998m418j349K414L499O87k960l194M82L426J921q10
2847B114l298k502J685M841J072l561m474O35M932L069k858n380p51M594M095
$$ plain form
2735 -2796 -969 1708 1724 -568 -2129 -1111 96 490 378 -422 -2044 -2116 494 2236 375 -2625 -3344
2752 -3344 -500 3048 2207 -2566 -3844 -1073 2691 2072 -1442 -3671 -2084 1393 2338 -248 -2563 -2168
2768 -2168 -24 1893 1393 -825 -3126 -1648 1314 2600 1028 -2570 -3618 -145 3609 2706 -2193
2783 -2193 -3932 -812 2855 3251 -263 -3353 -2081 2054 3780 1034 -1981 -2562 -13 3091 3271 -305
2799 -305 -3133 -1480 2269 3840 1521 -2201 -2959 483 4165 2947 -1625 -3146 -584 3259 3688 511
2815 511 -3014 -2238 1790 4111 2161 -1454 -3027 -606 3159 4132 89 -3551 -2025 2262 4181 1676
2831 1676 -3040 -3548 958 4414 2416 -2002 -3351 -937 2562 3249 289 -2905 -2423 1003 2924 2114
2847 2114 -1184 -3686 -2001 2840 3912 351 -4123 -3488 1444 4513 1655 -3725 -4476 118 4213
2862D213k180m229j917K753L604N34l299k670O05K601K341n61l220k673J873L676
2878A451J937l191m465J2N240K976k590n182p42M282L747j181m398j928K363L580
2894A911M90k613k962O11K657K191j51l214k145J418L474J560l127l437l2M106
2910G37K930k030m168p12L201K970m60l078k544J999L069P76j851k174q73J635
2926e73L029J96l039k254R65L515J684k209l522k39L535K287j690l162q21K397
2942I9K842o81k342j570J132K121Q01j389j551q55J132K192P51k572j998O44K547
2959A303J352j215l213o44L254K210j514k525r43J512K187K12j924j295J88J433
2975C78J308q36j140j412P58J918P19j902j334L06J464J500j301j658m56J329
$$ plain form
2862 4213 2033 -2196 -4113 -1360 2244 2778 -521 -3191 -2586 15 2356 1795 -1425 -4098 -2225 1451
2878 1451 3388 197 -4268 -4256 984 3960 1370 -3812 -4554 -272 3475 2294 -2104 -4032 -1669 1911
2894 1911 2401 -212 -3174 -2563 94 2285 2134 -1080 -3225 -1807 1667 3227 100 -3337 -3369 737
2910 737 3667 1637 -2531 -3243 -42 2928 2468 -610 -3154 -1155 1914 2690 839 -1335 -2208 -573
2926 -573 2456 2652 -387 -2641 -1676 1839 3523 1314 -2208 -2447 1088 3375 1685 -1477 -2298 99
2942 99 2941 2260 -82 -1652 -520 1601 2402 1013 -538 -1393 -261 1931 2682 110 -1888 -1244 1303
2959 1303 2655 1440 -1773 -2417 837 3047 1533 -992 -1935 -423 1764 1976 52 -1243 -1055 378
2975 378 1686 850 -290 -1702 -944 974 1693 -209 -1543 -1237 227 1727 426 -1232 -1688 -359
2991c59J342m39j382k39L34O80O22k99q31q76P25J236P86j533j770J47K289O35
3009A068r07j904K7J847R52j119j083j14J036L7j48J0Nm64l06L53J202K43j690
3028i55j060J352K047m84j885j106J459J795j89j596q59R79J335o0r57m93L37
3045c40M99OM94L52p16j081R0J784R47j509k066N20K647O19j769k068M11K354
3063A174J246j777j930L51J494R56o65n04p73J02Q85Q57l0j082j378K65K218R71
3081B380j574k688O67K356J936k099k549k48K103K184q51k178r59J137J872K07
3097A696j235j688J6J246J467J22k307j369Q02K665Q56j966k421K81K388J850
3113B403r93k990q26K048K099j49k136j772J23K487J873j277k759j345K236L293
$$ plain form
2991 -359 983 544 -838 -1077 -743 -63 559 260 -571 -1447 -722 514 1300 -233 -2003 -1856 433 1068
3009 1068 161 -1743 -1716 131 1083 -36 -1119 -1233 -197 -160 -308 -298 -293 -757 -1063 -710 492 735 -955
3028 -955 -2015 -663 1384 900 -985 -2091 -632 1163 974 -622 -1481 -502 833 773 -184 -677 -340
3045 -340 159 165 659 1011 295 -786 -696 1088 2035 526 -1540 -1020 1627 2246 477 -1591 -1180 1174
3063 1174 2420 643 -1287 -936 558 1514 849 345 -428 -326 559 1416 1386 304 -1074 -809 1409 2380
3081 2380 806 -1882 -1215 1141 3077 978 -1571 -1819 284 2468 1617 -561 -1520 -383 1489 1696
3097 1696 461 -1227 -1211 35 1502 1624 -683 -2052 -1250 1415 2271 305 -2116 -1835 553 2403
3113 2403 1410 -1580 -2406 -358 1741 1592 -544 -2316 -2193 294 2167 890 -1869 -3214 -978 2315
3129B315l60l099k347J736L098J097k917k353P18K677J273j009k504l35J082J899
3145I71N19j682j443j030K426K325l23l180k089K274L945K59l714l121J418M618
3161B173J202l345l240Q01L153J907j305k774o55J488J957L79j091k503j14J807
3177a60K552J5l053k370J848L582R52l171l509J319M252J358k818l271J89L274
3193I89K194j360l178n91J387K207O82j432k299p28K372K618m90k852k092J676
3209h97L189J165k907l698J228L526J847k482l086l96L012K208r43k555j177Q25
3225a141K269P69r44k491q77K579J916j66k952j758J673K981J072l120k797J070
3241a917L274P33j454k409m04J897J581K96k025j647L34K098J926j377k501q32
$$ plain form
3129 2315 1955 -1144 -3491 -1755 1343 2440 -477 -2830 -2112 565 1838 829 -1675 -2010 -928 971
3145 971 1490 -192 -1635 -2665 -239 2086 1763 -1417 -3506 -1232 2713 2972 -742 -3863 -2445 2173
3161 2173 3375 30 -3210 -2409 744 2651 1346 -1428 -2083 -595 1362 1741 650 -1853 -1967 -160
3177 -160 2392 2407 -646 -3016 -1168 2414 3366 195 -3314 -1995 2257 3615 797 -2474 -2285 989
3193 989 3183 1823 -1355 -1946 -559 1648 2330 898 -1401 -2129 243 2861 2371 -481 -2573 -897
3209 -897 2292 3457 550 -3148 -1920 1606 3453 971 -2115 -2511 501 2709 1766 -789 -1966 -1141
3225 -1141 1128 1897 953 -1538 -2415 164 2080 1914 -1038 -2796 -1123 1858 2930 -190 -2987 -1917
3241 -1917 1357 2090 636 -1773 -2177 -280 1301 1597 -428 -2075 -1741 357 2283 906 -1595 -2427
3257b427J908K327j72k582j383J232K722L34k481j578O09J897Q12p06j767r92
3273b247J245J877M27j513j730j44J706K258p86k982r20K026K560j72k422j485
3289b302J020K680J99k189q58K81J399Q45n9j695r11J192Q88Q94p91j798l75J550
3307c0J776m00k243o71J137J903K26j815j763J561J806J84j379j170M90O50R78
3324A240j92p02o02mJ037N43j97j305n35J002J232j30j465q66N64J607L12j019
3342E20j349L77J182N55p90n33j39J49P46K2l79k84m80K05R48N59j166j139J72
3361h24J495O64p91j452p3J520O95q93j308M71O32K76j30j79l01j34J88J62O46
3380F64m72j293j7J292P57n92j442m07J100J203k07j332n66Q20J172j67j137n22
$$ plain form
3257 -2427 -519 1808 1636 -946 -2329 -1097 1625 1959 -522 -2100 -1491 406 1218 512 -1255 -2247
3273 -2247 -1002 875 1302 -211 -1941 -2085 -379 1879 1093 -1889 -2809 -783 1777 1605 -817 -2302
3289 -2302 -1282 1398 1597 -592 -1450 -1169 230 1075 1016 -679 -1590 -398 490 1384 593 -1205 -1580 -30
3307 -30 1746 1346 -897 -1568 -431 1472 1698 -117 -1880 -319 1487 1671 292 -878 -388 262 1240
3324 1240 1048 346 -256 -260 777 1320 1123 -182 -717 285 1517 1387 -78 -944 -380 1227 1539 520
3342 520 -829 -452 730 1285 495 -38 -177 -28 718 740 361 77 -403 -198 750 1309 143 -996 -824
3361 -824 671 1335 544 -908 -981 539 1234 341 -967 -496 136 412 282 103 -198 -332 -144 18 664
3380 664 192 -1101 -1118 174 931 339 -1103 -1510 -410 793 586 -746 -1312 -492 680 513 -624 -1146
3398a146N59R21K52q07m76l80Q44m3O19l30j328K37R46Q30J69j399r84M95J449
3417D28Q84j550j034K75J121R86m15q63j293P52J746K2r87r06P2J613P95j198
3435D48j299P9J314P13l71j002o21L82J197K84k28j043l18K22J251P52j200j538
3453i78J86J681J338q43k202o17K285K096j366k635k1J340J789k17j841j035J086
3470D6J212Q0p01r45q4K73J234N74j399j267k2J636J455m03k880r34K389K084
3488B348p86k247j032J773J633K66k315j246J139J364J32o51o69m04J27J258L33
3505A023n62j528n30J398J851m95k413j113J828K058j39k035k103J436K376Q71
3521A923k038k038M80J877N99n19j145q99Q57J447K56p73j218o16J440J534m34
$$ plain form
3398 -1146 -587 334 586 -221 -697 -1077 -233 -276 343 13 -1315 -1078 -132 698 867 -532 -1516 -1021 428
3417 428 1312 -238 -1272 -997 124 1110 695 -168 -1461 -709 1037 1059 72 -834 -762 851 1646 448
3435 448 -851 -772 542 1255 884 -118 -739 -357 840 1124 896 -147 -465 -243 1008 1760 560 -978
3453 -978 -792 889 2227 1384 -818 -1435 850 2946 1580 -1055 -1076 264 2053 1836 -5 -1040 46
3470 46 1258 1338 637 -308 -392 -119 1115 1689 290 -977 -999 637 2092 1689 -1191 -2125 264 2348
3488 2348 1562 -685 -1717 56 1689 1955 -360 -1606 -467 897 1029 378 -291 -695 -568 690 1023
3505 1023 461 -1067 -1597 -199 1652 1157 -1256 -2369 -541 1517 1378 -657 -2760 -1324 1052 1923
3521 1923 -115 -2153 -1673 204 803 284 -861 -1760 -903 544 800 27 -1191 -1807 -367 1167 733
3538G33j635j124J305J371M82j284j786P46J832O31p28j810o69J632J620n9j752
3555d95j719J152K256O16j570j846j5K143J508j216j885l07J688R30K94j390r68
3572h24J15J406O26n01p76j323O74J351J285j831j437K83K027Q85q96k660J22
3589a474K029J572q76j890m25J114J526j8j824l66J27J387M37o52r52m00R48R47
3607A210L87j050j329J22J305J037p84j505n73J605R42o66j059l39O33Q85K35
3624A056q85r36N39O53P0L04r29r48L03J129Q32j001r36p71J382J612n40j959
3642a025p27J519J220m72j199o26R72J046j63q33o37J07J42N39N84p22o47p1P67
3661b26P95q2j200q76R28J671l39j426n10P71R84N36j178j093M57J289J90p68
$$ plain form
3538 733 -902 -2026 -721 650 1132 -152 -1938 -1192 640 1271 543 -1267 -1936 -304 1316 1257 -495
3555 -495 -2214 -1062 1194 1810 240 -1606 -1621 522 2030 814 -1071 -1378 310 1240 1534 144 -824
3572 -824 -709 697 1323 822 46 -1277 -603 748 2033 202 -1235 -952 1075 1960 1064 -1596 -1474
3589 -1474 555 2127 1251 -639 -1064 50 1576 1558 -266 -632 -505 882 1319 667 -285 -685 263 1210
3607 1210 1597 547 -782 -660 645 1682 898 -607 -1180 425 1367 701 -358 -697 -64 821 1056
3624 1056 171 -765 -226 427 497 801 -128 -1076 -773 356 1188 187 -749 -1520 -138 1474 934 -1025
3642 -1025 -1752 -233 987 515 -684 -1310 -338 708 545 -288 -925 -818 -676 -137 447 -275 -922 -993 -226
3661 -226 569 487 -713 -1589 -661 1010 671 -755 -1265 -494 490 1026 -152 -1245 -788 501 691 -77
3679g7j36o52M23P78O52r34q50M44P57L69j29j181k03R58P65n16p84j49L14N50
3699C99L78j37q71K3Q0K25M60r9j183j04R64Q35l99q67k47Q6J365Qj064q11Q45
3720a14P21K29p52n13j69N54J016q02l67k80N00L34M04l39q83k96J016J61K17
3739F37k92j211L81R51M39j087k60j15O17K99K12q69o21K67J020K24l64o69o05
3758a046J121J036n08j195m80Q22R00k70j049m84R62R07m11q56m2M11P0J8M75
3777C81k87p81J55L25M91M86j314j100R16J559k7j336r04N01J615L71j637p87
3795a373N41J414R1q98o06R9P91l7j69j97K13j05m40J103L13o02j329N11J300
3814F20R6n25p30l02R16J365q39j525P9J191L33Q6q92r15Q23J031M2q86m1l63
$$ plain form
3679 -77 -213 -865 -442 336 988 54 -796 -352 405 774 645 -536 -739 219 984 468 -316 -465 -151 399
3699 399 777 640 -231 -208 -128 97 557 458 -725 -829 135 970 571 -296 -543 -457 908 916 -148 -959 -114
3720 -114 607 836 84 -429 -598 -44 972 170 -197 -477 23 357 761 422 -461 -757 259 420 637
3739 637 345 -866 -485 466 905 -182 -442 -557 60 359 571 -298 -919 -652 368 592 228 -441 -1046
3758 -1046 75 1111 603 -592 -1072 -250 650 380 -669 -1153 -191 716 305 -551 -593 -182 -112 -94 381
3777 381 94 -687 -532 -207 284 770 -544 -1644 -728 831 804 -532 -1436 -935 680 1051 -586 -1373
3795 -1373 -832 582 673 -225 -831 -732 59 22 -147 -344 -131 -236 -676 427 740 138 -1191 -680 620
3814 620 716 191 -539 -841 75 1440 601 -924 -845 346 679 765 -127 -1042 -219 812 854 -32 -73 -436
3834d36N83L22M07o89n47K72P39J70l96r45N9J051M31m08r58m03Q60O09M56r67
3854B10p08L80N96K62k51m45q65M37J376J98j303n63N08M05Q20p27r65l7P47N27
3874F02r4l06p87L60N60L17j62j181ON84P51j34j004p87J289J108o27j168n2O39
3894h6O50J7o77q39M30M91K60j63K83p02n57P48O79r6n80r32N47J337J68r82j584
3915a588J253J152O1j094q58M56J437K22j414m37L94Q04j75o26L45M37o18J02
3933a47Q5N06rr36k89Q14R12q66q56k78J056Q97k89j448m93J426J063n25q66k34
3953d77L93L77K87o24k86R2N42l59M62k35n29K84M80P6k97m99J21M03K41M51q60
3974D3n21N36O52j31J33j170k2L35Q69l58p42k23P10N34M77r88r98O60J222r3
$$ plain form
3834 -436 147 469 876 187 -360 -88 651 821 425 -520 -461 590 1021 613 -345 -748 112 721 1177 210
3854 210 -498 -118 478 740 489 44 -821 -384 992 1190 -113 -676 -168 237 1057 330 -635 -672 75 602
3874 602 508 202 -585 -225 335 652 490 -691 -685 -101 650 516 -488 -1275 14 1122 495 -673 -725 -86
3894 -86 564 581 -96 -935 -505 -14 246 83 366 -336 -893 -145 534 438 -142 -1074 -527 810 978 -4 -1588
3915 -1588 -335 817 878 -216 -1074 -618 819 1041 -373 -810 -416 388 213 -413 -68 369 -249 -147
3933 -147 -62 444 435 -501 -790 24 936 70 -786 -1064 -8 889 600 -848 -1341 85 1148 623 -243 -477
3953 -477 -84 293 580 -44 -330 -238 304 -55 407 172 -357 -73 407 483 186 -313 -192 211 452 903 43
3974 43 -478 58 710 579 712 -458 -480 -145 724 366 -376 -599 111 645 1122 134 -864 -204 1018 925
3994I25p83p19L39Q42J45m53q38L37L36K27J27j64l71l77O93L86j14l67k42m62
4014e33K95J158o47r04L57P10K32j74m32o08K92R59k89q02R5j88M28N18J7r38
4034d54j47Q26K35k77k07o48R0Q07K38n99o79O55M27k18L31m99k68J45K50n1k01
4055b44l08n3j20J132K44j051p62N65N73Q35o23r02l13J323O73j014o24n9O96
4074c2K61L10j004K6M65M33k25K4j14j80j18O39J24n45l84K51J02P20k56r00l7
4095d40J033M34o71m21j73K45O84K49m35m43K63K16L33j30m76n80M20N76j76j12
4115C96m72O0K30Q49n12j108J26R21Ok74j91k42N81K99l18n12K42O3k22M95m6
4136C71k53l40j19L66J82L6m94p08R31P89n51j002M63J34L52K33m96p15M54J124
$$ plain form
3994 925 142 -577 -238 604 749 296 -542 -205 131 358 485 321 -50 -427 266 652 538 171 -71 -533
4014 -533 -238 920 273 -631 -274 436 668 494 62 -546 -254 705 416 -386 -291 -479 -51 467 484 -454
4034 -454 -601 225 460 183 -24 -672 -582 225 463 -136 -815 -160 267 49 380 -119 -387 -242 8 -43 -244
4055 -244 -552 -605 -725 407 651 -400 -1162 -597 -24 811 188 -714 -1027 296 969 -45 -669 -728 -32
4074 -32 229 539 -465 -439 26 459 234 258 144 -36 -154 485 609 64 -320 -69 33 753 497 -403 -440
4095 -440 593 1027 356 -65 -238 7 691 940 505 62 325 541 874 744 268 -312 108 684 508 396
4115 396 -76 -16 214 1063 551 -557 -431 490 496 222 31 -211 370 669 351 -161 81 144 -78 417 371
4136 371 118 -222 -341 25 207 243 -251 -959 -28 761 210 -792 -329 -195 157 390 -106 -821 -367 757
4156G57m41m86l82j52M99O16l20o39O6L48r6J72m21k16L48L10J29p9p17M52l59
4177f11N31N61m81p14K00J95N98J34p17p22M05J038o85R7m50L24M30K66p99o49
4197a049P54O29J53j064K14K65P7K70m23N2m7j4k5j51N49L33q55O8Q87k55j52
4218B16m06m02O26P41q13l15k5P33j37k42K38k58j76N60m65j70M99l7k41M06K60
4239E92k62n18K10L37K94l20l64k63K25Q39p32k72J07L86n21M85J55p37L76L59
4259C76l37J27j3j79o29P83j26p9RO6j42P4L98l74n76O52N43p42J53j49k61K02
4281b24N95m03l50L60l6l84N61j45N9l48N10k04k30M96l37j41j64P30l76l36O2
4302c05r0M61L22n23n25M04L04J82l35l86J7M06N52l56p22L75M72m61j42L02k28
$$ plain form
4156 757 316 -170 -552 -704 -205 411 91 -548 -482 -134 -230 -58 -479 -695 -347 -37 92 13 -704 -252 -611
4177 -611 -80 481 0 -714 -514 -319 279 413 -304 -1026 -621 417 -268 -171 -621 -297 133 399 -400 -1049
4197 -1049 -295 334 487 -577 -363 -98 -21 249 -174 -122 -169 -183 -208 -359 190 523 -332 -264 623 368 216
4218 216 -190 -592 34 775 -38 -353 -378 355 218 -24 214 -44 -220 340 -125 -295 204 167 -74 332 592
4239 592 330 -188 22 359 653 333 -31 -294 -69 770 38 -234 -127 259 -262 223 378 -359 17 376
4259 376 39 166 153 -26 -655 128 2 -77 -68 -2 -144 -70 328 -46 -622 30 573 -169 -16 -165 -426 -224
4281 -224 371 -32 -382 -22 -58 -442 119 -26 33 -315 195 -9 -239 257 -80 -221 -385 345 -31 -367 -305
4302 -305 -395 66 388 -135 -660 -256 48 230 -105 -491 -474 -68 484 128 -594 -219 253 -208 -350 -48 -276
4323b76j45P56j11n41K85p2m17K39O92m78%k34M89N6M1m52n71Q23Q32m79r35J30
4345c68N02J19O1m23n01P44J27m48p0N21l19j8K40M30n08k18J19l50L68N93m70
4366A31p94R88M94l61n73K52k09J85M99o30k40K77K62L41j96j64o32K11P21l02
4386B60j89O1j97J21L57J71r03J64N16n1j14j83n1k42N94Q1m31j33L6J68j21L99
4408C13j05p24K63O07j15m16k11M7J1M30J14p38n0L48K88K14m66l49O2Q68j8n26
4430a53m03N67k63N87l14k80p0N74o6k98N65k09n71K25L89j34l44j51K81J94O2
4451A88P8o23R5R86k85l68o5K63n57P13J68n26k07M23l86M99r3m02j15N99L41
4472G26l34o58M48j81K91J0l66m25N73o9j86L58j39n75L07O21l73k29j11O09k95
$$ plain form
4323 -276 -421 335 224 -317 -32 -104 -521 -282 410 -68 -68 -302 187 243 284 -168 -739 84 916 437 -498 -368
4345 -368 134 253 314 -109 -610 134 261 -187 -257 264 -55 -73 167 597 89 -129 -10 -360 8 601 131
4366 131 -663 325 819 458 -115 137 -72 113 612 -18 -258 19 281 622 426 262 -370 -159 562 260
4386 260 71 132 -65 56 413 584 -319 -155 361 310 196 13 -38 -280 314 395 -36 -169 -133 35 -86 313
4408 313 208 -516 -253 354 239 -177 -388 -341 -330 100 214 -524 -574 -226 62 276 -190 -539 -477 391 373 -153
4430 -153 -556 11 -252 335 21 -259 -329 245 179 -119 446 237 -334 -109 280 146 -198 -349 -68 126 188
4451 188 266 -357 -262 724 439 71 6 269 -288 425 593 67 -140 283 -103 396 303 -99 -214 385 726
4472 726 392 -266 182 1 292 302 -64 -489 84 15 -171 187 48 -527 -220 401 28 -201 -312 297 2
4493BL13k29m42p8O89P6l03k90K91p6J70O12r27m2O03M5q1j32j32q7L76L51o44
4516F5L1m8J78K30j06mn47K42P29m68n78N04k03L45K4j41n21M30lj4l83N97k71
4539H8l49j5Q1J95j41n6k39K37L01k91o05M28M78k85k74j08J33L54M50r71k24
4560h13P52N7k65l19K86J58K64k27j21k38L96l34l2J70L68m57K80L86k84k77N58
4581C08l38l22M06J03k80N8P8n8k42M10l41l08J40P29l72j23nk3M75K82p18o64
4603h05P94M84m58m0j12J96ML19n22l70O93J54n13L1N76k44j60K51k1k22P7K15
4625C27k69m5J37j82K4J77J29l88M10j4l78N73l0m54L4J64K52n07L69R0k57K89
4647D51j26k63M0J31k98O4N35l00m46K76M78o05ML19n65L55K41m74j56L46M92
$$ plain form
4493 2 315 86 -356 -434 255 331 28 -262 29 -47 123 735 -192 -234 369 414 333 201 69 -18 358 709 65
4516 65 96 48 226 456 350 346 -201 41 770 302 -276 228 25 370 394 253 -268 162 159 145 -238 359 88
4539 88 -261 -276 -195 0 -141 -197 -436 -199 102 -189 -794 -366 112 -173 -447 -555 -422 -68 382 -589 -813
4560 -813 -61 -4 -269 -588 -302 -144 120 -107 -228 -466 -70 -404 -436 -266 102 -355 -75 311 27 -250 308
4581 308 -30 -352 54 157 -123 -65 13 -45 -287 123 -218 -526 -386 343 -29 -152 -157 -180 295 577 -141 -805
4603 -805 -11 473 15 -25 -137 59 63 382 -140 -510 183 337 -176 -145 431 187 27 278 257 35 112 327
4625 327 58 13 150 -32 -8 169 298 -90 320 306 -72 501 471 17 51 215 467 -40 329 419 162 451
4647 451 325 62 102 233 -65 -1 534 234 -212 64 542 -63 -59 260 -305 50 291 -183 -339 7 499
4668D99p38k1K97l54K01j7%l03N5L27k56J83j04j4j32L91j88n4K26J8m33O05j72
4691A6l95k91L30J86R0K53l38k78L42K62j47l21K46k92K91J82k42k21J6P76m99
4712c4Q0K41k12l63N60J04n07K3P8M7k03J70k1k98RL40l39M8J91k6Q8M40k92n16
4736c92J05M19m9j9k77k67N76M82l94l46J21L46Pl61l13mK49M95o0m97K06l3l25
4759c31Q24k15J2m86J93J92M2J52k88m38O17K02k01m43L38k78J22K95j36l76K30
4780B7L54j56k06n8NK05r5M2k63o3K62K62j49j50n62Q0Q92k23l80j62K54M0L60
4803C16j71m75k68P59pl70J75k63j47J28J31p8L9j51N2l2M12J11q04O38J59j62
4825hn83J82kM31J38m35Q9nN48l36n19M40o4l8J08J25m65J60K95j78L16j75l29
$$ plain form
4668 499 -239 -260 37 -317 -116 -133 -133 -436 -381 -54 -310 -127 -231 -245 -377 14 -174 -228 -2 16 -417 188 16
4691 16 -379 -670 -340 -154 -64 189 -149 -427 -85 177 30 -291 -45 -337 -46 136 -106 -327 -311 465 -34
4712 -34 46 287 75 -288 272 376 -131 -108 -30 17 -186 -16 -37 -335 -326 14 -325 -277 -86 -112 -24 416 124 -392
4736 -392 -287 132 83 64 -213 -480 96 578 184 -162 -41 305 312 -49 -362 -366 -117 378 318 -179 27 -6 -331
4759 -331 493 278 290 -196 -3 189 231 383 95 -343 274 476 275 -168 170 -108 14 309 173 -203 27
4780 27 381 225 19 -39 -34 171 76 118 -145 -208 54 316 167 17 -545 -465 427 204 -176 -338 -84 -44 316
4803 316 145 -330 -598 161 154 -216 -41 -304 -451 -323 -192 -270 -231 -382 -330 -362 50 161 -643 -5 154 -8
4825 -8 -591 -409 -411 20 158 -277 -188 -193 355 19 -500 -60 -124 -162 -54 71 -394 -234 61 -117 199 24 -305
4848c05l98M82K99K15n10Q5k36K91N83n74j61j19N62n3l19J29j39M5L98N2l81
4869e4P4J27n28P47J03p92p9L54M29k59j36pr9M64R3p00j65Q89k53j49j8l20r4
4892c73L98L38l65J37K12l69L7L93n4m85K27j7K16m8l5k31j47J17K14n16L43K22
4914B14k08K94k59J75n35P53k8m11M5Q9n47O53J94m09j96K30L62m38L03n91k0
4935c30K08L27n36L88K56k86j94K07k2r5Q7j4LO8K87m28n19R40j33k17j15J06
4957a2Rk25J71m38L46J31m8m15j13P56n2j63k13L1M9M34j40l89k8K02J26N9K6
4980A04K36q32K71K14K29Q9l05m12K30M32K01q38R3K06R1K93l67r8J79K75k0j35
5002A36j61K72l37M72k47j72p5j52M30j09P4j10k23K56L38K5q40N08M74M8o20
$$ plain form
4848 -305 -703 -221 78 293 -217 -132 -368 -77 506 -68 -229 -348 214 161 -158 -29 -168 -123 275 327 -54
4869 -54 20 147 -381 366 469 -323 -402 -48 381 122 -14 -21 -120 344 437 -263 -428 461 208 59 41 -279 -373
4892 -373 25 363 -2 135 347 -22 15 408 354 -131 96 79 295 247 212 -19 -166 -49 165 -351 -8 214
4914 214 6 300 41 216 -319 434 406 -5 40 129 -418 235 429 20 -176 54 416 -22 281 -310 -330
4935 -330 -122 205 -331 57 313 27 -167 40 18 -77 10 -4 -1 67 354 -74 -593 347 214 -3 -118 -12
4957 -12 -3 -228 -57 -495 -149 -18 -66 -481 -594 162 110 -53 -266 -235 -186 248 108 -281 -309 -107 19 78 104
4980 104 340 -492 -221 -7 222 311 6 -406 -176 256 457 -381 -288 -82 9 302 -65 -163 16 291 271 136
5002 136 -25 247 -90 382 135 -37 -112 -264 166 57 131 21 -202 54 392 417 -423 85 559 607 -13
5023a3K39n30M75Nm85N17k07j8n2L95N7o34J33L83k56Q6J68m37l36J002l39l37
5045a84jK96L4M19n02l70P4O57k16n40J50L22m32J75M03m36l42M61J35l1m6l42
5067c16k98O84K99m15m46J09L52J47m4M3m32L27K07m16Q0k02L68n17N76J7k61
5088a38j62P6L13K21M3o33k84P24K39k97o73K66M02M05m1o00n50R42L53p63K97
5109A40L8k14K00k51l4J68Q9l4p2K95j8o37m80R47L85m34o2l15L72M97k6o38m65
5132e49N95L59l25N5j73k56N06K55k34n17L82m5m0L28j28n82J32N68J45n50k22
5153b96M9KP77o83j54L28K12j14k25k9j19N39M1j01j8k79k04K33M24L08m65p43
5175e17N59K31J28o02mJ44J49N09n48o53R1O54K09k79n03K47J70L30m58o1k36
$$ plain form
5023 -13 226 -304 171 176 -309 208 1 -17 -69 326 383 -251 -118 265 9 95 263 -174 -510 492 153 -184
5045 -184 -185 111 145 564 62 -308 -234 423 207 -333 -183 139 -293 -118 285 -151 -493 -32 103 72 26 -316
5067 -316 -614 70 369 -46 -492 -383 -31 116 72 115 -317 10 217 -199 -119 -321 47 -470 106 123 -138
5088 -138 -300 -224 89 310 353 -280 -564 160 399 102 -571 -305 97 502 461 -139 -689 253 606 -157 140
5109 140 178 -36 164 -87 -121 47 136 102 30 325 307 -330 -810 137 522 88 26 -289 83 580 554 -84 -549
5132 -549 46 405 80 135 -38 -294 212 467 233 -284 98 53 13 341 213 -369 -237 331 476 -74 -296
5153 -296 -247 -245 532 -151 -305 23 235 121 -104 -133 -252 287 328 227 209 -70 -274 -41 383 691 226 -517
5175 -517 42 273 401 -201 -205 -61 88 597 49 -604 -513 141 350 71 -432 -185 -15 315 -143 -204 -440
5196d40q5K92J66J13n48k85P20j05L75n73l18J18R17J99p53m21M47L95K2n11n
5217b80j85P29m9l08K1J17l32J63N76n80k42J8M07M8J18l53m50N52N49j17q40
5238d38L55K51j32O5j32l52L41K69M0R6k95j05l03M09m0j45k04o6K58O16l01m47
5260b60l29Q39N67p96m15K21L69NM53p22j81M8O68k63k21K78l47J13K15r4k18
5281g0k9R7J95q0L29q43L5Q01L8k94l68k38P38J42k95n71K87L95J11m24n3K87
5303A90n56O47K5m9n68r4K54M66L69q96l62J00J072j74o18l90J54O08M85m89q33
5324f59M78N99o8o02j60j37M11L19m2m08j71K17J0K51L67m66q88J068N3j9k44
5345i1m25K95M84K11p68j93J46K58J09J49n79j62L31M53J8k89k89j01M40P16n82
$$ plain form
5196 -440 -525 -233 -67 46 -502 -787 -67 -172 203 -370 -688 -570 347 546 -207 -628 -181 214 236 -275 -280
5217 -280 -465 264 215 -93 -72 45 -287 -124 452 -128 -370 -352 55 103 221 -132 -582 -30 519 402 -438
5238 -438 -83 168 36 101 -31 -383 -42 227 267 363 68 -37 -340 69 29 -116 -320 -386 -128 488 187 -260
5260 -260 -589 250 817 21 -394 -173 196 201 654 -68 -249 -201 467 204 -17 261 -86 27 242 148 -70
5281 -70 -99 -2 193 113 442 -401 -366 435 473 179 -189 -427 311 453 158 -413 -126 269 380 -44 -97 190
5303 190 -366 281 306 257 -311 -405 -151 315 684 -212 -574 -474 598 424 -194 -584 -430 178 663 174 -659
5324 -659 -181 418 350 -252 -412 -549 -138 181 139 -269 -440 -223 -213 38 405 -61 -949 119 172 153 -91
5345 -91 -516 -221 263 474 -294 -487 -341 -83 26 175 -404 -566 -235 218 236 -53 -342 -443 -3 713 131
5366A31o88o5J075J40p07O5p91R71N05m78n24K76J23J79J15l75j31P5J41P2K75
5387C84j57n10lM55M71l33q88K33M62O56l28j074J85O72O42n48p07L70L46M60
5407G88n46k05m20k2K93N52o30M23l92o9L32K03lr50L86O28J29n93o37K20P71
5428B58J81l58l82J14N14n0r4J19n16Q0L21P6k51mm21M31O38K5q82l18J02O65
5450B48M75r70l87J4J145J17r79o07N28N12K68l58m31QL98J03k20J17j12j70K3
5471b78O43j37m43j73J26M59J8k67n04J92Q86l44l93j68R8M55M93l69o09j03Q22
5492D04l84J30l99k54N4P83M1p75m4K48N97J45k02o60j86P55L55l41m64j93R01
5513E11jj59k87k95N35k62K29l3j99k36NQ21o2n05m29j37J068J99o45p41m8J243
$$ plain form
5366 131 -557 -622 453 593 -114 -49 -840 131 636 158 -366 -90 33 212 327 -48 -179 -104 37 109 384
5387 384 227 -283 -286 169 640 307 -581 -348 114 770 442 -632 -447 225 867 319 -388 -18 328 788
5407 788 242 37 -383 -405 -112 440 -190 233 -159 -228 104 307 304 -646 -260 368 497 -96 -733 -513 258
5428 258 439 81 -301 -187 327 277 183 302 -214 -134 187 263 12 8 -413 18 656 681 -201 -519 -417 248
5450 248 723 -247 -634 -620 525 642 -337 -944 -416 96 364 6 -425 -417 -19 84 -136 -19 -131 -301 -278
5471 -278 365 228 -215 -388 -262 197 215 -52 -556 -364 522 178 -215 -383 -285 170 663 294 -315 -418 404
5492 404 20 150 -249 -503 -449 334 375 -400 -444 -196 401 546 344 -316 -502 253 608 267 -197 -390 511
5513 511 510 351 64 -231 304 42 271 238 39 -197 -192 629 567 62 -367 -504 564 763 118 -623 -671 572
5535E72L75o66p85L65K77N88l41o93J04N41j5K70l12k92k51L25M53m33j44j53
5555b15O0N34J82o31p61L35Q29K55m84o39NO80O03o75m52K74LM80k36j56l05o1
5577c75L24M48j55n42l53M52P98k14q63l84N72Q86m00n10k79K31O90M01r98m81
5597g52L70N80r6k45p9l54L70K21K85j56n73k9J67O49m3p57J92N6Q32m76o35M1
5619d32k5Q05J90k67q43j79P90M80k49m42p50J039L23n6k55n79P9M93N84m35m86
5640b15l35N69M62k48p49K71J41P64j37j029L54r4L62N23p4r74rM53N04j48k26
5661A65o75L8J032O6k28q82J35P73O2Q0r79l01P68R85p17n41k20M29L38K20n21
5682B7m02OL27M22r8o56J32J0O43L92p36o04K76L87M18l77p56r1J019N01q41l42
$$ plain form
5535 572 947 281 -504 -139 138 726 385 -308 -204 337 322 592 280 -12 -263 62 515 82 -62 -215
5555 -215 -155 379 561 -70 -831 -496 333 588 104 -535 -530 150 753 78 -374 -100 -97 383 147 -9 -314 -375
5577 -375 -51 397 242 -300 -653 -201 597 383 -480 -864 -292 594 194 -316 -595 -364 326 727 -271 -752
5597 -752 -382 198 102 -143 -222 -576 -206 15 300 144 -429 -458 -291 358 315 -442 -250 -194 638 162 -473 -432
5619 -432 -457 348 538 271 -572 -751 39 519 270 -172 -922 117 440 384 129 -450 -371 122 706 271 -215
5640 -215 -550 19 481 233 -516 -245 -104 660 523 -506 -152 -246 116 639 565 -409 -418 35 539 391 165
5661 165 -510 -472 560 626 398 -484 -349 424 486 566 -413 -714 54 1039 322 -219 -439 -10 328 548 27
5682 27 -375 -369 -42 380 282 -374 -242 -232 411 803 67 -537 -261 126 544 167 -589 -680 339 840 -1 -343
5704c43k45M19N45j24k73n24O4K41P84k4p18n26L30R99j32o05o63N13M74N60q66
5725a14q30L13J307J67n04q54J84K89L06k06n19J76M43nL6Rj25n95K40O99M3m82
5747b2n81J98O22O24p96p34K25J076J19o85n32j66R04M87n78m57p7O04r6J21j32
5768A24n32J38N35K44l37k49m16M76P30k21o98l79Q02Q7rj90l40k14P03N29n47
5789B36m62J24J71K74J75l39p58K8Q94M65p17m57j61R96K02o45p13M39N30J21
5809D03k61j55k17K85M23l23n15J47L30n3J95j37n07K57J89M03n14q4j23m73Q78
5830A48M27l74q35L65M45J20k61l99R8K47L02m15O3m0j7J54M2K23o64j6L17J52
5852H2R7o13m34R26L78K71j181k65L84J029l00n88n15N12K47O07p54k92J99M21
$$ plain form
5704 -343 -588 -169 376 252 -21 -545 -481 -240 544 520 -198 -724 -394 605 473 -132 -795 -282 192 752 -114
5725 -114 -944 -631 676 843 339 -515 -331 -42 264 58 -461 -285 158 153 189 198 73 -522 -282 417 460 -22
5747 -22 -603 -405 217 841 45 -689 -464 612 731 46 -486 -652 252 739 161 -296 -373 231 135 256 124
5768 124 -408 -270 265 509 172 -77 -493 -17 713 492 -206 -585 217 304 295 105 -235 -449 254 783 236
5789 236 -226 -102 69 343 518 179 -579 -551 343 808 91 -366 -527 469 671 26 -687 -248 282 403
5809 403 142 -13 -230 55 478 155 -360 -213 117 64 259 122 -385 -128 61 464 -50 -134 -257 -730 148
5830 148 575 201 -634 -269 176 296 35 -364 -266 -19 283 -132 -69 -109 -126 28 70 293 -371 -387 -70 82
5852 82 179 -434 -868 58 436 707 -474 -739 -355 674 374 -214 -729 -217 30 637 -117 -409 -210 211
5872B11O4j13j87n39L36M58n0M1j27p50M08J034n78m05o69N92O80K93q60o68N62
5893b67O87J31o35p6o6M26N18m12j042K24O67J04P9k26n25Q9R20m0l47n51N2M54
5915A64L10l0o64l39P64N59m83k63o90N01L58O19m24r18J27PR85K19o43q98K84
5936d55J113L01q46o19j44J176N34p42r33k95R20Q59l71r91l03M93N62M08n90
5955G7p07K63K39P93k91n59n47M63Q81k42n26o20m7R57O00p10q60L17O71P10n53
5976C09p82j99K42Q61l6n43o39M69J53M98K65j266m60P75R47j44j130l02L61J019
5996C98N42j133o61K90N74R80m75n43o84K81P91j89l14n60K41O56L10N16j293
6015b73p35R50M37K27n31j050L83J263J46q46p02Q6Q58O96m34j177k48J143N09
$$ plain form
5872 211 275 162 -25 -564 -228 230 180 221 94 -656 -248 786 208 -197 -866 -274 406 699 -161 -829 -267
5893 -267 420 551 -84 -160 -226 200 718 306 -736 -512 155 259 338 112 -413 -324 596 556 209 -342 -290 164
5915 164 474 444 -220 -559 205 764 281 18 -672 -171 187 806 382 -536 -409 -402 583 802 159 -739 -455
5936 -455 658 959 113 -506 -650 526 1060 318 -615 -910 10 869 498 -493 -796 -303 259 667 77
5955 77 -630 -367 -128 665 374 -185 -732 -269 612 370 -156 -776 -823 134 734 24 -836 -519 152 862 309
5976 309 -473 -672 -430 431 395 -148 -787 -318 -165 333 598 -668 -1128 -353 594 450 -680 -982 -621 398
5996 398 940 -193 -854 -564 10 990 515 -28 -712 -431 360 171 -143 -703 -462 194 504 1020 -273
6015 -273 -1008 -58 379 606 75 -975 -592 671 817 -29 -731 -645 213 909 475 -702 -950 193 702
6034G02n15k12l33K35K92N50p70l58M00J49L61o3m75o84J58J555l35p53l74P4
6054c96J012K15o19o83q9P04M33k25o05j66L44N38L20r15l66M5P52N06k56p08
6074a59q37Q88R42j20j121l15O71N06J26q20o64K83Q65K40l04o32j13M13Q42k95
6094C96k82n72Q3M72P94n58q32j10M27O91k21o37k92J98R55m9p95j38J51M70K83
6115D34m84n69l2N65M80j32n29l30K05Q73J12p66l00R1P54n6o11n6KL53M29j64
6137B69m35k62O96j52p6L66n29l16J92N60j6k3n48r4O86P38r09o81M06Q68m9o39
6159E2n58J18P55L14p61n14M61N42J26n59M7j6J90J48m4o28K37O6j60M15J21k69
6181H3l98M41L54l67J87q14J92P50Q2n15l61L80K00K75k89m60n7N18K38l03l79
$$ plain form
6034 702 187 -25 -358 -123 169 719 -51 -409 -9 140 501 438 -37 -721 -563 992 657 -96 -470 -396
6054 -396 616 831 212 -471 -560 144 577 352 -253 -419 -75 463 783 -132 -498 -453 299 805 549 -159
6074 -159 -996 -108 834 714 -407 -722 -51 455 581 -239 -903 -620 245 485 181 -451 -564 -151 691 396
6094 396 114 -458 -375 97 891 333 -499 -609 -182 509 288 -349 -641 -443 512 463 -332 -470 -319 151 434
6115 434 -50 -619 -651 -86 394 262 -267 -597 -392 481 593 -173 -473 -382 372 316 -295 -351 -349 4 433 269
6137 269 -166 -428 268 116 40 406 -123 -439 -247 313 297 274 -274 -368 318 1056 147 -534 -128 740 691 52
6159 52 -506 -388 367 681 -80 -594 -133 409 535 -24 23 7 197 345 301 -327 -90 -24 -184 231 352 83
6181 83 -315 126 480 113 300 -514 -322 428 510 -5 -366 14 214 489 200 -260 -317 201 439 136 -243
6202b43j20L87Q79k70p13p80L08P53M31m86m69k14N75O23m73m00l96P83L77m31
6222A21k06l40L53K68M52r47k00J49N8N28Mo06j97j16J073J13p11m14m13J450
6242D19L50n40q26O8N89N21k63n20n91P82P59m83k46m60k22Q47K75k05q35J09
6262d72N88P50m28l90q57L68Q84J71q16m86J71Q36J53k31n00R4R2O02m8o26j71
6283c16LK46J187q97r28J27N70Q70k52q85o80M04J359K37j383l30L84J244N8r80
6303C8q81K26Q74N89n72l47m66l3J009O06q06r69O4Q39O29O5j161q31Q11J145
6323H29k01r66l29L73R58O24j113r87Q6R94O94l79r08m46N71R02K79j050m91m19
6343i79J053P79k30j406o5J275N43n71r08l29P71R68kj025l59q7R42O7o3j003
$$ plain form
6202 -243 -363 24 903 633 -80 -860 -552 201 632 146 -323 -537 38 661 188 -212 -608 175 552 121
6222 121 -85 -425 -72 196 648 -299 -499 -350 -292 236 240 -366 -563 -679 394 507 -204 -618 -1031 419
6242 419 769 229 -597 -529 60 581 318 -202 -793 -11 748 265 19 -441 -663 184 459 254 -581 -472
6262 -472 116 866 438 48 -809 -441 443 614 -202 -688 -517 319 472 241 -259 -165 -73 529 481 -145 -316
6283 -316 -313 -67 1120 223 -705 -578 -8 862 610 -275 -955 -551 808 1045 -338 -668 -284 960 1018 38
6303 38 -843 -617 257 846 274 -73 -539 -572 437 1043 237 -732 -668 171 800 865 -296 -1127 -316 829
6323 829 628 -338 -667 -294 664 1288 175 -812 -726 268 962 583 -325 -771 -200 702 981 -69 -560 -979
6343 -979 74 853 623 -783 -848 427 970 399 -509 -838 -67 901 899 -126 -485 -572 370 437 374 -629
6363f29L1P05K71n8m04n39j77J107L56k67j116m13J217Q24l81r19n27M98J396
6382I75k35j494j57L38R39K35m03q43l19J158O15m40q21m88M63P74L55n59p90
6401f97N1J135J34j47r04r4K14J158l52m45n70L9P88K52j99p25k54N54R29j21
6421G46q12j045K99J543L87j027q19J91Q76M51n54o48l42J456O4m88q37J76N72
6440A89k08N70p05n5J53M4L43M4k56o56M28M90N20q05p42L98N97P39j134k29l80
6461f55J114L06q21m68J04K04P45k23l60k52j1P56O3l89k13m57J90J090k66p80
6481c23j63P57J04ln24n37N66O83l72l57l31L90n8K92J49o92K58J46K9K7k00r9
6503b58k48O74j35K10q18L4K87O83j43n24m01N88N45j02m58o95P61K18M50r26
$$ plain form
6363 -629 -598 107 378 320 -84 -623 -800 307 663 396 -720 -1133 84 908 527 -392 -919 -421 975
6382 975 740 -754 -911 -573 366 601 198 -645 -964 194 809 369 -452 -940 -477 297 652 93 -697
6401 -697 -646 489 623 476 -428 -522 -308 850 498 53 -517 -478 310 562 363 -362 -616 -62 867 746
6421 746 -66 -1111 -812 731 1118 91 -728 -537 339 790 236 -412 -754 702 766 278 -559 -383 189
6440 189 -19 551 -154 -209 -56 -12 331 375 119 -537 -109 381 901 96 -646 -248 349 1088 -46 -275 -655
6461 -655 459 765 -56 -524 -420 -216 529 306 -54 -306 -317 439 502 113 -100 -557 -367 723 457 -323
6481 -323 -486 271 375 372 -152 -689 -123 560 188 -169 -500 -110 -168 124 273 -419 -161 -15 14 41 -159 -258
6503 -258 -506 168 33 243 -575 -541 -254 429 286 -238 -639 -51 494 392 -66 -761 0 218 668 -258
6523b58l20M17L18M31o13m49J41N22M09p04k46L5L32O4L75k39q71M53K78K92j51
6544B16o41J63J37N8Q0L8l15K30N80j53j97q15L93L37M02l34n17J3R6O90J47p34
6566a26n15N31J003k01o48m78L96M53J16n96l12P3O37K85m72m11k73L84L40K64
6586D50k46m19q0M48O07k04j139m15Q53R55o00n01o06P34P80J34n88m82j58R70
6606D93L39n74n26n69O10P15K60j197n2p5Q83L9Jr14k82O67P46l8j228m0L40R96
6628E94K97j162o88L54Q14J87l61q11J3N22P20l6m05n69l3P20J071j170j231L81
6648g93R22P19k75j080o99J061J127q9j253p85P37J399r8p62r82K74Q71M18n75
6667A37l19o71N15Q41l6m56j028L18R89O30m49j120j64Q06P54J80j092p10N54
$$ plain form
6523 -258 -578 -161 157 588 -25 -474 -333 189 598 -106 -352 -317 15 79 454 215 -656 -203 75 367 216
6544 216 -425 -262 -125 -67 13 51 -264 -34 546 393 196 -619 -226 111 513 179 -338 -325 -229 461 608 -126
6566 -126 -641 -110 893 692 44 -434 -38 415 531 -65 -377 -304 333 618 146 -265 -538 -154 186 450
6586 450 204 -215 -295 153 760 556 -583 -998 -145 810 210 -291 -897 -163 617 751 163 -319 -477 493
6606 493 832 258 -268 -837 -227 488 748 -449 -501 -576 307 346 347 -567 -849 -182 564 526 -702 -742 -402 594
6628 594 891 -271 -959 -605 209 396 35 -776 -763 -241 479 443 38 -531 -564 156 1227 57 -1174 -793
6648 -793 129 848 573 -507 -1206 -145 982 893 -360 -1145 -408 991 893 131 -851 -577 294 712 137
6667 137 -182 -853 -338 503 467 11 -1017 -699 290 920 471 -649 -813 -7 747 927 -165 -875 -321
6686c21P39K16j91j028k04J119O60j97j227l50L00J328L79j677l77O98R17J13
6704H97r68p86L36R92N82o33p15k42J85J087J92q86p31lR08N73l08p11p42O43
6724c30J272j24q92o86K09J201K15n92r96K03R13K55k03j042r0L26R17K71j194
6743c67k46K12N31N04k59q98o83R89J113j65q90o88L10J163n1p51q92O95Q21J41
6763E89m89k93m71L40J006l45p79J31r8O61M18l80o47k84P93O98n76m95l41L76
6783a86R95J86j142p46M86P70M95o76o30J54O43M24n94o19R9L01K45k01L15p50
6803d31l4M14L67J0l43k82J02O97J32n00m65q7J103m00j12m40o82J319K82o54
6823dm52K32J14M34j50l0n24J7P19J80n74n39K51J77M70k20j11k88J09O72m24
$$ plain form
6686 -321 418 634 443 -585 -789 330 990 793 -434 -784 -484 844 1223 -454 -831 -133 784 897
6704 897 -71 -857 -521 471 1053 420 -295 -537 -352 735 927 41 -690 -693 215 788 480 -231 -973 -330
6724 -330 942 818 -74 -760 -551 650 865 273 -723 -520 393 648 445 -597 -687 -361 556 827 -367
6743 -367 -613 -401 130 634 375 -523 -1206 -217 896 731 -159 -847 -537 626 575 -176 -1068 -373 448 589
6763 589 100 -193 -664 -324 682 337 -442 -311 -409 252 670 290 -357 -641 152 850 274 -221 -562 -186
6783 -186 809 995 -147 -893 -407 363 858 182 -448 -294 349 773 179 -440 -341 -40 205 4 319 -431
6803 -431 -465 -51 316 326 -17 -299 -197 500 632 132 -333 -420 683 283 171 -269 -951 368 650 -4
6823 -4 -456 -224 -110 324 174 144 -380 -363 356 536 -38 -577 -326 -149 321 101 -10 -298 -189 483 59
6844E9k01N8j32M80J7k85k99J27O00p9k75j53K9k39M68J85n07j76J2N20J66q02
6866d27Q8n3O68M39o94p18K28M72M17m34k36o8L56m9J4N5n33N10J5M57n54m55
6888e02j13Q46M28n88p00K17M59L27j11n22k33L79N46j98p27K90M06l34K51M81
6908F02r58N2L75K95r4k19m66R4L73M41k43o84r8O97N72l38q21j20O45N99m40
6929B64p30j72O26O63l82mo99J00L92M19l6o90J07k42O65J28m1r58k9R40L33p4
6951E80r98m17N64J128l72q40l64L93R43J16p85r37N18Q15L59j15r23r5M54O40
6971F64j52n43n59K86N78M68n26j061K7J131N25o62o51k22N23P80K6p24n24K60
6991c56O61M91p35o57l45Q22J039j07r65o74K51J087M11p64r95K35J019L91o70
$$ plain form
6844 59 -142 -84 -216 264 281 -4 -303 -176 424 345 70 -83 -54 -293 175 360 -147 -323 -311 209 375 -427
6866 -427 -339 -392 276 715 21 -697 -469 3 420 -14 -250 -318 38 -11 3 58 -475 35 50 507 -47 -502
6888 -502 -615 231 659 71 -629 -412 47 374 263 -259 -492 -113 433 235 -492 -202 204 -130 121 602
6908 602 -356 -304 71 366 272 53 -413 -319 54 495 252 -432 -530 167 739 401 -420 -540 105 704 264
6929 264 -466 -638 -12 651 269 265 -434 -334 58 477 441 -249 -142 -384 281 409 368 -590 -619 321 654 580
6951 580 -418 -835 -271 857 485 -355 -719 -326 617 733 -52 -989 -471 344 703 588 -335 -430 24 664
6971 664 512 -31 -590 -304 274 742 216 -845 -818 313 838 176 -475 -697 -174 606 632 -92 -616 -356
6991 -356 305 796 61 -596 -941 -119 920 813 -152 -826 -575 512 923 159 -836 -601 418 809 139
7010A39p36k82Q63Q46k72q83n65L35P73K66k44r60J09P04N28N8j045n28L70Q78
7030C54L56p87r63L73J154L91p31o51l80P82R16m80o97l46K71O82M41m83q49m92
7050a139J170R33m37r90n89M91J489k79o84o20L80P72K20o41m84l61J078N62l87
7069D84r78R0M92J97N00k88j165J51P92K66K56j105m63N19J183j25r58p29L28
7088e53J138M58o37j081M7R84M46k34j126l9O86L56J3m05o68MJ066M32l30r29
7108c72j70M03Q50j62q06l44O05L72K81n52q91M85K99N02j21n01o19M38P80L94
7128H71q82n86L42L86O57o17n70l90P01Q98k42r86j99N94L36K4p01j93J67Q66
7148D76L5n81k18P5K48M05q4m05n18K05N40n4n7m24p4P49j66j99l48L31q4M27
$$ plain form
7010 139 -597 -879 -16 830 558 -325 -890 -555 218 484 240 -720 -611 93 621 679 -366 -894 -524 354
7030 354 710 -77 -1040 -667 487 878 147 -504 -884 -102 814 334 -363 -709 -438 244 685 202 -647 -1139
7050 -1139 31 964 527 -463 -1052 -561 928 649 -35 -655 -275 497 717 76 -408 -769 309 871 484
7069 484 -494 -404 88 285 785 497 -668 -517 275 541 797 -308 -771 -252 931 806 -152 -881 -553
7088 -553 585 1043 406 -675 -628 356 802 568 -558 -597 89 445 458 53 -615 -611 455 887 557 -372
7108 -372 -542 -139 711 549 -257 -601 4 376 657 105 -786 -301 -2 500 379 -122 -741 -303 477 871
7128 871 -11 -597 -255 131 788 171 -399 -789 -88 810 568 -418 -617 -23 313 337 -364 -557 -390 476
7148 476 511 -70 -288 -213 35 440 356 -49 -567 -362 178 124 67 -357 -431 318 152 -47 -395 -64 -148 279
7170B79J29m25k91L82J04k04J75n08m2K91K05J86o53J04K76K46P1m10m95O29L48
7191C97m20k06j01nN68K08o09O2q6N54q7r4l25Q5j10L47K28m39P8k35J22L53r2
7214A93k66k33K19M17j63l39k39K67O62o6p94J15N45Q2m3l69n24L26O12K01l97
7235B06m25R3J65L32k09J78n46J1N76j46p5l47l88N04N60k55m78r6O70O4j23m21
7257a50j24J12M15P0m91m18L01J41L33J3m96j81K47M38J92o19j2J22L07L99o57
7278e8n82K01O91k1p5n11n26P42L24o1j65n42M55L49L48m01q15L26L87L24P3n87
7300a24n50L90N88K28n07r45N72M44N39k3q73j95L13M19P2p24j27J67N57O22o07
7321B36j026J18J064P11q78n28j59O15O79j83p70p02O46P97O3n04q12K37P78K9
$$ plain form
7170 279 408 -17 -308 74 178 -26 149 -359 -401 -110 95 281 -372 -268 8 254 325 -85 -580 49 397
7191 397 -23 -229 -330 -335 233 441 -168 -106 -192 362 275 181 -144 -59 -169 178 406 -33 45 -190 -68 285 193
7214 193 -73 -306 -87 330 167 -172 -411 -144 518 452 -342 -227 318 400 357 -12 -536 -210 402 603 206
7235 206 -219 -126 39 371 162 340 -206 -195 381 235 160 -187 -575 -71 489 234 -244 -340 330 394 271 -150
7257 -150 -274 -162 253 323 -168 -586 -285 -144 189 202 -294 -475 -228 210 402 -217 -229 -107 200 599 -58
7278 -58 -640 -439 252 231 156 -355 -881 -139 185 124 -41 -583 -128 221 569 168 -647 -321 66 390 463 -124
7300 -124 -674 -284 304 532 25 -920 -348 96 635 612 -261 -456 -143 276 348 -376 -503 -336 221 843 236
7321 236 -790 -672 392 1103 225 -303 -462 153 832 649 -121 -823 -177 620 683 179 -633 -396 382 411
7341D11k32j29p35L38P27M16n51r26Q0N55P41k09o24m79O57J160j89j145j000
7360a134P61J112j45o76p89J55J041K39k23n47j73J48O05r5m41m78LJ081M19n44
7380C19q13j75O95Q22m00q08m29N91O38o1k22r64Q4R23N73o89n33k31N65O71j98
7401C58j91q94K62N54N20k52r96P2P41M99l60p36n31O22J009L9m44q84K3O80O01
7422F92m05q01K81K23M67J34m57p83N62M26J63n48m34O9N92M99m53n45k93K92
7442c19R38j6n67l81L68N23k0n18n57M2M84N15l1n76l84K9J164j75o28l30K7M68
7464E6N10m61k50j59N30M46k85o08r5K28M03K59n36m78j46K95R87m13n21Jj87
7485d24P16K44k57p45K25O44j2j39o98N2L79L64l9n04k85K26N60j58k36k24Q6
$$ plain form
7341 411 179 50 -685 -347 380 796 245 -681 -601 -46 695 486 -138 -617 40 1200 1011 -134 -1134
7360 -1134 -373 739 594 -82 -871 -716 325 564 341 -206 -379 -231 374 279 -162 -640 -637 444 863 319
7380 319 -494 -669 26 848 448 -360 -789 -198 440 379 157 -807 -723 200 773 84 -449 -680 -115 556 358
7401 358 167 -727 -465 89 609 357 -639 -567 174 673 313 -423 -954 -332 677 716 272 -612 -589 91 692
7422 692 287 -514 -233 -10 457 591 134 -649 -87 339 502 -46 -480 -411 181 680 227 -318 -611 -319
7442 -319 619 603 36 -345 23 546 526 8 -549 -507 -23 492 461 -115 -499 -470 694 519 -109 -439 -412 56
7464 56 566 105 -145 -304 226 672 387 -221 -316 -88 315 574 38 -440 -586 -291 696 283 -238 -237 -424
7485 -424 292 536 279 -466 -241 403 391 252 -446 -394 -15 349 310 -194 -479 -253 307 149 -87 -311 -225
7506b25J88L48r0n40Pj2N15J54k11n58J30N31k49l10j1n0M06K30l56l36j3K85
7528a67L38om47n6K12K21rp0j4l32L72J85J44n30n37O54L56k51k73j52K82M72
7550C92j86m49J8M5L29J74l73k35K24J16j18M42p39J37L45pJ80j71p0n65N50J65
7572B04k75j83p8K97M05l76k47j30M13L91l22j71l19M58K79l83L23n29J28K29
7592A14K53j17p03j0O70J49n6n98K0K69O1L69n57k54K21K45J77j47m64J95J54
7613iK57J24n53l1L75J86jl34m08J6L03L67n5k04l44L52K52K6o19K08k7M23J66
7636D70k88m61r3O46l09JO2n24K31K46N79n70n43K85N33K27k39o05J32J64J76
7657A20L54p31l24L85O56k7n66n11K10N16pK24n78j12N3R65j12o08m35M8L76M67
$$ plain form
7506 -225 -37 311 221 -319 -312 -324 191 345 134 -424 -294 237 -12 -322 -333 -383 23 253 -103 -439 -452 -167
7528 -167 171 165 -282 -338 -126 95 86 16 2 -330 42 227 371 -159 -696 -42 314 63 -210 -362 -80 392
7550 392 206 -243 -225 -180 149 323 -50 -285 -61 55 -63 379 -360 -223 122 115 295 124 54 -511 39 204
7572 204 -71 -254 -332 -35 370 -6 -253 -383 30 421 99 -72 -391 67 346 -37 286 -243 -115 114
7592 114 367 250 -453 -463 207 356 300 -298 -278 -9 52 421 -136 -390 -169 76 253 106 -358 -163 -9
7613 -9 248 372 -181 -212 163 349 348 14 -394 -378 -75 292 237 33 -311 41 293 319 -300 -92 -119 304 470
7636 470 182 -279 -372 274 -35 -34 28 -496 -265 -19 560 -10 -553 -268 265 492 253 -352 -220 -56 120
7657 120 474 -257 -581 -196 460 433 -133 -644 -434 82 75 299 -279 -391 -338 627 515 -93 -528 -480 -104 363
7679C63k82q20N06J47Q13j39r85j84K84R28j33m67m90N37J84L1k40n54K54L82
7699A35J86J06l76m94K14O64N5n64m71Q2P55K62j73p38j10K93Q35j19n58q04O00
7720b20M07M93m13j035L03M51N12k47l25n22N03N42P4n52l84M09L25O50p22o82
7740d33J28J83N97O9o40l44M35L2O47m68o54J21O11M14k43p32k00L6P14N85r06
7761d8l70J01O47o5j08p01M31J55M07k56m15j78K40K15K49j1p37K52k9P07q3k80
7783A23p38K33P95L41q17l9k70N14M55n28l91j84N13M13q6n09j23M87j9K3m94
7804c01k30J03N54O1L38q64j55M81L31J31n49j97j64N80J95k36m55k16Q69K69
7824E45m49n17j46N65M19j46k71m39L47J38K42j9o50L68k25L52R0q1o29K70O49
$$ plain form
7679 363 81 -739 -233 -86 727 588 -397 -581 -297 631 498 31 -459 78 262 293 53 -501 -247 135
7699 135 321 427 51 -443 -229 435 490 -74 -545 -463 292 554 381 -357 -467 -174 661 542 -16 -820 -220
7720 -220 187 680 267 -768 -465 -14 498 251 -74 -596 -93 449 523 -29 -413 -4 321 971 249 -433
7740 -433 -305 -122 475 544 -96 -440 -5 27 674 206 -448 -327 284 698 455 -277 -477 -441 273 858 -48
7761 -48 -418 -317 330 265 157 -544 -113 42 449 193 -222 -400 -160 55 304 293 -444 -192 -221 486 403 123
7783 123 -615 -382 413 754 -63 -102 -372 142 597 69 -322 -506 7 420 334 -175 -298 189 170 193 -301
7804 -301 -531 -428 126 187 525 -339 -494 -13 318 449 -100 -297 -461 119 314 78 -377 -593 276 545
7824 545 96 -421 -567 -2 417 271 0 -439 -92 46 288 269 -381 -13 -238 114 204 123 -506 -236 413
7845D13o5l15l23K56P4n8j5o7j24M76L64m35k63j47L7K04J55k72j14K30J41K18
7867C70k40k95J04K39QJ16k43k06N70k63J63p32Q4L80J98N0j19l47k32L59M3L11
7889C18n86K53J26Jpq8j41j32M85J2l48q3P9Q5J87j5m18Q2J7J61J24k33l9l1K30
7914C9O5n5j71j2L65l83Q1J31m40L34Q5J72k70k60K02Nrj54R5J50P9J98r4l91
7938b38K35j73L54p7k34m2K57J83j30J01o26M28QK29m86j06j93N21L15k32j29
7959c5j00L53q9j62l8k65J39K78J39J69l40j83J54R9M1q2k67L37PK31m51p3j94
7982c32K84L49J74o82k92N64J70M6k07m04J87M81q0k69m09J90P3K13J41l3m96
8003c32K25J82K86J76p11j71O29J72j88m71m77O65N72l5l51m67q6M85k09J51l12
$$ plain form
7845 413 348 33 -290 -34 40 -18 -33 -100 -224 252 616 181 -82 -229 -192 12 167 -105 -219 11 152 370
7867 370 130 -165 -61 178 186 302 59 -147 423 160 323 -409 -325 55 253 303 184 -163 -395 -36 7 318
7889 318 -268 -15 111 112 105 17 -124 -256 229 241 -107 -190 -111 -26 161 146 -272 -190 -173 -12 112 -121 -160 -191 39
7914 39 104 49 -122 -134 231 -152 -71 60 -380 -46 39 211 -59 -319 -117 -112 -121 -275 -180 -30 49 247 153 -238
7938 -238 -3 -176 178 101 -133 -175 82 265 135 236 -390 38 46 275 -211 -317 -510 11 326 94 -35
7959 -35 -135 218 129 -33 -71 -336 -197 81 220 389 49 -134 20 119 160 78 -189 148 155 386 -65 -138 -332
7982 -332 -48 301 475 -207 -499 65 235 281 74 -330 -143 338 258 -11 -420 -230 -157 56 197 164 -332
8003 -332 -107 75 361 537 -174 -345 284 456 268 -203 -680 -15 557 522 171 -296 -382 103 -106 45 -267
8024b67l38P55q4J79j034L66K10L50K04l01o63K72N32n1j33l45J10J09L94j87
8044G8k43m61L43L24K82n11k31m21J054J85j93l78k17N5N08Q5n26k05J95K93l3
8065a7j8j3r7q2L65K17p38J6K83J67L78j31m88R9j57Q99l03o08k46M05L80R6m95
8088h8k56L67N8K47o32J11P1J36M23j59l24k07K58jK26j65j86J46j65M17J29o30
8110b24J26K83J99K43o10k17q2M83J51J27q98q8O79L47k12k77l10K41K62L76o51
8131e2j34l45P56N5j30j30l77J88M59j42J60p11K01N71l01L23m49j52P9O28l26
8152A71j89l91M02K87k8k17l36K92K28J9j69k88K33n6K45J46k92J48k09J66N6
8173B18r9k81Q6nK61j01k80k79M39J64j3j69K2J69l63K59Mp2
$$ plain form
8024 -267 -605 150 66 245 -789 -423 -213 137 341 40 -623 -351 181 130 -3 -348 -238 -129 265 78
8044 78 -165 -626 -283 41 323 -188 -419 -840 214 399 206 -172 -389 -334 174 259 -267 -472 -277 16 -17
8065 -17 -35 -48 -145 -227 138 355 -383 -367 -84 83 461 330 -158 -59 -216 683 380 -228 -474 -69 311 407 -88
8088 -88 -344 23 81 328 -304 -193 -122 14 437 278 -46 -253 5 4 230 65 -121 25 -140 277 406 -224
8110 -224 -98 185 384 627 17 -200 -282 201 352 479 -419 -507 172 519 307 30 -280 -39 223 599 -52
8131 -52 -186 -531 225 280 150 20 -357 -169 290 148 308 -403 -202 369 68 391 -58 -210 -131 497 171
8152 171 -18 -409 -7 280 252 35 -301 -9 219 238 69 -219 14 -42 203 349 57 205 -4 162 218
8173 218 119 -162 -76 -81 180 79 -201 -480 -41 123 110 -59 -37 132 -231 28 32 -40
8191d0
$$ Imaginary data points
##PAGE= N=2
##DATA TABLE= (X++(I..I)), XYDATA
0@%%%qJ6j6K4m0M8n6Q0j04J20j44J84k24K64l17L75m42N20o05P02q11R34j073
26e73J226j394J580j788K015k265K542k845L178l544L945m381M864n396N976o615
42c475P325q111Q984r965J1067j2314J3748j5409J7354j9679K2516k6061L0647
55A6627l6843M5726n9639Q4718j44058N31496N48092q77793l87463K55060N77054
66E52977M1064l42774l00867J70243K59389N946k35437p6788Q4607J20589N308
77B84257q5606j45874n1109M1897J00888J00284K4047j81743k01025O9636K72490
88B28142P8065k20721k48700L3648K85590J86263j85368l12555j5968K83317K07380
99C19093q6711k73952j68246J45424K98505N5563k45865j89202R5396K15063O5025
$$ plain form
0 0 0 0 0 -8 8 -8 16 -24 24 -32 48 -56 64 -80 104 -120 144 -173 202 -240 280 -325 377 -434 500 -573
26 -573 653 -741 839 -949 1066 -1199 1343 -1502 1676 -1868 2077 -2304 2560 -2836 3140 -3475
42 -3475 3850 -4261 4723 -5242 5825 -6489 7259 -8150 9204 -10475 12041 -14020 16627
55 16627 -20216 25510 -34129 50589 -93469 438027 986119 108326 -279137 -24077 552977
66 552977 594041 251267 -49600 120643 380032 385978 150541 73753 158360 278949 284257
77 284257 198651 52777 1668 43565 144453 244737 268784 87041 -113984 -44348 228142
88 228142 306207 85486 -163214 -129566 156024 342287 156919 -155636 -171604 111713 319093
99 319093 232382 -41570 -209816 -64392 234113 289676 43811 -145391 -49995 165068 230093
110B30093j54135j81439K6240J84293P7391j02290j23780m5505M4289J22984P7830
121A55971r1916j58591m0391Q4229J07552L6791j01423j54053j241J64068R8078
132I9074j02536j77926l5737J79349J81727r4109k72054o9669K11359J88543l7390
143G0631j74337j22144N8718J80754Q1979j08313j31893k549R9450R6781p269
154D1808j17971o8325R4036J26773J569r1337p8969J881J05473R6360n8540j36527
166h3769j6835J07878Q4219j4949q7807p0267L5549R3021K2967n6100o2833l9281
178h8207L0772J14928N1935j18076j26435M5092J32789L7947r2847j11630J0189
189a13543J29394O4893r2613r8001L1307R1353L7184m2049p8545j8566P6126N3372
$$ plain form
110 230093 75958 -105481 -79241 105052 182443 80153 -43627 -89132 -44843 78141 155971
121 155971 64055 -94536 -134927 -50698 56854 93645 -7778 -161831 -163072 996 99074
132 99074 -3462 -181388 -217125 -37776 143951 49842 -222212 -291881 -80522 108021 70631
143 70631 -103706 -225850 -167132 13622 95601 -12712 -144605 -147154 -47704 49077 41808
154 41808 -76163 -144488 -50452 76321 77890 -13447 -92416 -90535 14938 111298 52758 -83769
166 -83769 -100604 7274 91493 76544 -11263 -81530 -45981 47040 70007 13907 -48926 -88207
178 -88207 -57435 57493 109428 -8648 -135083 -89991 42798 80745 -12102 -123732 -113543
189 -113543 15851 80744 -11869 -109870 -78563 12790 49974 7925 -70620 -89186 -13060 40312
201D0312m2803l5335L1176J5135j6560J4802K7483j2848l0737j0746K5048M9564
213E4491N409o3358k6373O4911M6710l3823l7078j466Q949K0085R256l3154k1363
226f804L4039K4820k2166j8711K015J006N989l132k3871K534K8707j5882m1665
239c3121J6255M1007n013j9294l615j5899j0165K4183J5429j4351j4489m059R517
252a3615L2458P691m5312j7099M8263K7273l0156l1164q819J1354M8545L5971
264F5390l7773n1317J1593L7864J4541o206k7273l0841J2945L9415J1555j1612
276B8281k0437k9291J3654O7171Q198r1156o0517M8515P4646J6124m7738o3706
288e6256P72P5482M0524n2369o8626j2299M0781O2866J2604q2722o9331N8845
$$ plain form
201 40312 -2491 -37826 -6650 8485 -8075 6727 34210 21362 -9375 -20121 4927 54491
213 54491 59900 -3458 -29831 35080 81790 47967 10889 9423 18372 38457 47713 14559 -6804
226 -6804 27235 52055 29889 11178 13193 14199 20188 17056 -6815 -4281 24426 8544 -33121
239 -33121 -16866 24141 19128 -166 -3781 -19680 -29845 -5662 9767 -4584 -19073 -23132 -13615
252 -13615 18843 26534 -18778 -35877 12386 39659 9503 -21661 -30480 -19126 29419 65390
264 65390 27617 -23700 -12107 25757 40298 34092 6819 -24022 -11077 28338 39893 28281
276 28281 7844 -21447 -7793 59378 67576 -23580 -84097 -35582 39064 55188 7450 -56256
288 -56256 -55484 19998 60522 8153 -60473 -72772 -31991 30875 43479 -39243 -108574 -49729
300d9729J08261J8696p4315q5617j7985Q2227R3611k3160j02782l6606O4630Q2308
312E9539K0270o7418q0816J9897R4728L0846n6791n7510j3422M3915Q7929K9783
324A10950r3144r9246K8153J11927N7729o7127j27385k5255J29258J09436o2890
335G2406j36452l7256Q3659J03941R966j15194j07148M4105J27376M1480o8797
346A8086q5648k5623O1416Q9575J644r3627o8945K9809R3663O4545n3994j34021
358a03120k8821J38501J17640n5816j37096n2925P9197J23867K5789j07977r8477
369i9238L6301J07987N3787m0970r6309m6367Q1717J15042r174j17225p9411L7360
381e6500J17672P8174p1672j53595k8157J39336J15274n0472j44449p0963Q6667
$$ plain form
300 -49729 58532 77228 2913 -82704 -100689 -18462 75149 51989 -50793 -87399 -22769 59539
312 59539 79809 12391 -68425 -48528 46200 77046 20255 -37255 -50677 -6762 81167 110950
324 110950 17806 -81440 -53287 58640 116369 49242 -78143 -103398 25860 135296 72406
335 72406 -64046 -101302 -17643 86298 96264 -18930 -126078 -81973 45403 86883 18086
346 18086 -67562 -93185 -31769 57806 59450 -34177 -103122 -73313 20350 84895 30901 -103120
358 -103120 -131941 6560 124200 68384 -68712 -121637 -42440 81427 107216 -761 -99238
369 -99238 -62937 45050 98837 57867 -38442 -84809 -3092 111950 102776 -14449 -93860 -56500
381 -56500 61172 139346 67674 -85921 -114078 25258 140532 90060 -54389 -125352 -38685
392c8685J36967J459j32262p7981N9041R6666L5198m8731r8185m4982P4181R9811
404F2497m0q8139p5927J5686J07466Q1140o4055j35216k5349J10633J07143j8615
416G7224j32141r3904Q6530J73096K6754j46149j13841M5560J30029O7307p0329
427E0136j25997j8601J10224R0424k6218r2375n8822L9551J05827L6171r1280
438A9040r7478J6583Q8643O2169j5980q6530o8088M3962J03450K7868p5581r1729
450g3671j2556R1444R4012l7214j28947m1435R5001J02484o028j08177r5189M4659
462g5617J40239M4267j11438j03234L2944J08081N4019n4115r3192j1871P7630
473G713N0694k3805m2489k6734k491M7775N9748j3415p4180l9250L6320P2085
$$ plain form
392 -38685 98282 99741 -32521 -110502 -51461 45205 80403 31672 -66513 -111495 -37314 62497
404 62497 62457 -25682 -101609 -85923 21543 102683 38628 -96588 -121937 -11304 95839 77224
416 77224 -54917 -148821 -62291 110805 137559 -8590 -122431 -76871 53158 120465 50136
427 50136 -75861 -94462 15762 106186 79968 -12407 -71229 -31678 74149 110320 19040
438 19040 -78438 -61855 26788 88957 72977 -13553 -81641 -37679 65771 93639 18058 -73671
450 -73671 -86227 5217 99229 62015 -66932 -108367 -13366 89118 83090 -25087 -120276 -75617
462 -75617 64622 108889 -2549 -105783 -72839 35242 89261 35146 -58046 -69917 7713
473 7713 58407 34602 -7887 -34621 -37112 10663 70411 56996 -17184 -56434 -20114 51971
485E1971L1687o3426r3441J1648J07863N2667o6123r1325r972Q3641P7772m0524
497E2438j14786k8654Q4073O6472k0075n8449l8824J3879N6978K9110l7617n2034
509d7489j3420K7023M8390J6546n1757n3833K8344O7306J3784m0843m5926j1035
521f2910M2811N1142j5021n7527j0822M1369L5150K061k9249l6029O245M2408
533I628J8017k0115k4159j4135J1302M9298K6322m6909n3070J6334N0095J5047
545C7655k8362m0640l536M6133L1359k9979l6611O010K0825Q519k731k0720j8745
558c0823J6591K3459q454j2439O804p48p745Q023O092j0518n909K698K168J1823
572A022R188j6499j3407J8379J3616q307j411K088j0751J668K1266K854j4500
$$ plain form
485 51971 83658 20232 -73209 -61561 46302 98969 32846 -58479 -68451 15190 92962 52438
497 52438 -62348 -91002 -6929 59543 39468 -18981 -57805 -43926 13052 42162 4545 -47489
509 -47489 -60909 -33886 14504 31050 -20707 -74540 -46196 21110 34894 -5949 -51875 -62910
521 -62910 -20099 31043 16022 -41505 -52327 -10958 24192 26253 -2996 -39025 -32780 9628
533 9628 27645 7530 -16629 -30764 -19462 29836 56158 9249 -43821 -27487 22608 37655
545 37655 9293 -31347 -34883 11250 42609 12630 -23981 -17971 2854 11373 8642 -12078 -30823
558 -30823 -14232 9227 773 -11666 -4862 -5610 -13355 -5332 760 -9758 -15667 -12969 -10801 1022
572 1022 10210 -6289 -19696 -1317 12299 3992 2581 4669 -6082 -4414 16852 19706 5206
585E206n8Q299L075L298m277q556J1256J3540j6330j3769J8949J2733j7033j3020
599C313P359J3478J2406q417l5944r932M0648K6868k9472m0090j845L1014K8900
612C8286j2990m4261q125M0508J6453k9818k0264M746P607J0605Q754j1621j7000
625a7120P03Q565J1986J3369j5571l7009N6M0699K2633j7887k9874j5099K4869
638i680M8648J070n8408l2849L5549M6830P890l1119l9675p45N0136L3661k6436
651B4872m5777j5070K3985M4969J3625n2234m8663L1743O4854Q033m7296m2325
663c9284R02M4242L5820k3629m8765p795L0281K7546R187k2003m0186n524M1029
676A821L1361j3818l9990l0964J7805O8450L3330o1815p5569J6357Q2356M3894
$$ plain form
585 5206 5148 13447 16522 19820 15543 6987 18243 31783 15453 1684 20633 33366 16333 3313
599 3313 10672 24150 36556 28139 -7805 -17737 22911 49779 20307 -19783 -21628 9386 38286
612 38286 25296 -18965 -27090 13418 29871 53 -20211 -15465 -7858 2747 11501 -120 -17120
625 -17120 -16417 -7852 4134 17503 1932 -35077 -35021 5678 28311 10424 -19450 -34549 -9680
638 -9680 38968 40038 -18370 -51219 -15670 31160 39050 7931 -31744 -32489 17647 51308 24872
651 24872 -20905 -35975 -11990 32979 46604 -5630 -54293 -22550 42304 50337 3041 -39284
663 -39284 -38382 5860 41680 18051 -30714 -38509 -8228 19318 28505 6502 -33684 -39208 1821
676 1821 33182 19364 -20626 -51590 -33785 34665 67995 6180 -69389 -53032 29324 73218
688G3218m5371q3241j3752Q2530O5522l9458p5761j0644M9643M6425q19n0349
700b057m3499K2044N5209J7067k7582l7754j7658K7131N2358O925n3591m5687
712d7094J2686N2510M0577k5334p6632k6092O9798O9426k2895p6071l9958L4595
724c4484P2250K4637o2029o8424J4521P0094M0855k7714o8089k9960N5729P0645
736E8031j4537p3507l1321L7017N6997K1649m0017n8060N35N7718L7028j9193
748C2340m6775l0515K0854O0213K4219m6807n3334M634N0600M4601j3957p2157
760b6084m2365N3278P8492k727p2756n0256K6763P2981L0788n6182p0169O268
772e1969N9930L4437j8260m7668l2843K7523O0879J2029n2465m6546Q585M8685
$$ plain form
688 73218 27847 -55394 -69146 13384 78906 39448 -36313 -46957 2686 49111 48292 -2057
700 -2057 -45556 -23512 31697 48764 21182 -16572 -34230 -7099 45259 52184 -1407 -47094
712 -47094 -34408 18102 58679 33345 -43287 -69379 419 69845 46950 -29121 -69079 -34484
724 -34484 37766 62403 374 -68050 -53529 16565 57420 29706 -38383 -68343 -12614 58031
736 58031 43494 -30013 -61334 -24317 32680 54329 14312 -43748 -43213 14505 51533 32340
748 32340 -14435 -44950 -24096 36117 60336 13529 -39805 -35171 15429 60030 46073 -26084
760 -26084 -68449 -15171 63321 60594 -12162 -62418 -35655 37326 68114 11932 -58237 -51969
772 -51969 7961 42398 24138 -23530 -56373 -28850 32029 44058 -8407 -54953 -46368 2317
784B317L8822k0596o4435k1947N3629N6231q175n4893m1479K1084O6324K6214
796E3096n1682n4375J3150N0248K9558j1055m2245l0498K4007N0989J3330l4324
808A0199m0797p221M3676N0822j4984o7167k4751M7201N2039k429n1902m3904
820d9218K2230O6812J6913n6136m5864J7380M6786K2164k3885m4173q881L5709
832a63K6087r251k0618j6631o874K2318L3165o581m0034j8902K1816L6377J1979
845C2688l3620m3085J1342N2399J9669l3597l7369j159L6180L5847j3514m9986
857b4205j4694L7102L0219p068k4645j8506O181L0618J4398k3061k5007Q16J6709
870a143J6907J704k3118j9128J4927K3919l81j1967j1645j0655O427K2404L787
$$ plain form
784 2317 41139 20543 -43892 -65839 -12210 44021 35846 -19047 -60526 -39442 26882 53096
796 53096 1414 -52961 -39811 10437 39995 28940 -13305 -43803 -19796 31193 44523 10199
808 10199 -30598 -37819 5857 56679 41695 -25472 -50223 -3022 49017 46588 -5314 -49218
820 -49218 -26988 39824 56737 601 -45263 -27883 18903 41067 17182 -26991 -35872 -163
832 -163 25924 16673 -3945 -20576 -27450 -5132 28033 21452 -18582 -37484 -15668 20709 32688
845 32688 -932 -44017 -32675 19724 39393 5796 -31573 -32732 3448 39295 25781 -24205
857 -24205 -38899 -1797 28422 21354 -3291 -21797 -15616 15002 29400 6339 -18668 -17852 -1143
870 -1143 15764 17468 -5650 -24778 -9851 14068 13687 1720 -9925 -20580 -14153 8251 12038
883A2038k1787j3574P653J7440J2676j1320k9042l581K9948J4723j9636j9528
895b3990M17J6338K0246m87k6561j1695K0075J4450p755r662k645K115R816O922
909G584n634l731K931l868j162J1996J026j5922k314J4828N165n441k577j871
923A010J719O450l947j1274M773J0153m535o569L961J990j203K262l225n248O068
938B385L332j2373l669J3864M226r225k863K723P33K194r30l792L681L545j1778
953g947l847J9401R078j7570j3353R599J6076O294j2959k1196L200K9617R915
966B6308k3581j7472Q653J8600J0791q686k2305l982K1003J0161j1737p145O4
979F72j566O116J0867m161j3921l444N531R312O710j2296k0728M729K5759O766
$$ plain form
883 12038 -9749 -23323 -15670 1770 14446 3126 -25916 -29497 451 15174 -4462 -23990
895 -23990 -23573 -7235 13011 12524 -14037 -25732 -5657 8793 1038 -8624 -11269 -9154 662 7584
909 7584 1950 -1781 1150 -2718 -3880 8116 9142 -6780 -9094 5734 10899 5458 2881 1010
923 1010 2729 9179 5232 -6042 -1269 8884 4349 -2220 1741 3731 2528 4790 1565 -3683 2385
938 2385 5717 -6656 -10325 3539 7765 -1460 -4323 -1600 -867 1327 397 -3395 286 3831 -7947
953 -7947 -11794 7607 16685 -885 -14238 -4639 11437 17731 4772 -16424 -13224 16393 26308
966 26308 2727 -14745 -6092 12508 23299 14613 -7692 -11674 9329 19490 7753 608 672
979 672 -894 5222 16089 11928 -1993 -5437 94 9406 16116 3820 -16908 -12179 13580 20346
993B0346j6165j6361m536J3314K3782j334l2129j7513K0549K6168N180j8799k6473
1006b3971j160L2267K0431j9929k8501k645J9490K1654R79k6812j8427J9175K7024
1019A9575l836j9841j0727K263J4582J5045o438k0449o314R018J4864J2962r767
1032A0937l1648r055L1099K7354j1701l2079j7474J7089L8309Q818l8767l2754
1044c9872J8073L7842J0263k3921l2844k850L6591K6727k0586l4254m994K0809
1056i016K3941N969k4647k8518Q538L3752J3356j7427k3829q652J9804K9062k99
1069B2034l0245j6413J2916K2281J4448j0618l2179j2238L1692L3795q326l4767
1081g620k2215J4774M0770J6479l6439m0876J1545M4024J9336k3066l8352q792
$$ plain form
993 20346 4181 -12180 -16716 -3402 20380 19046 -13083 -30596 -10047 16121 21301 2502 -23971
1006 -23971 -25131 7136 27567 7638 -20863 -23508 -4018 17636 18615 -8197 -26624 -7449 19575
1019 19575 15739 -4102 -14829 -12566 2016 17061 10623 -9826 -16140 -7122 7742 20704 10937
1032 10937 -20711 -29766 1333 28687 16986 -15093 -32567 -15478 22831 31649 -7118 -39872
1044 -39872 -21799 16043 26306 2385 -30459 -33309 3282 30009 9423 -24831 -29825 -9016
1056 -9016 14925 20894 -3753 -32271 -23733 10019 23375 5948 -17881 -26533 -6729 22333 22034
1069 22034 -8211 -24624 -11708 10573 25021 14403 -17776 -30014 1678 35473 27147 -7620
1081 -7620 -29835 -15061 25709 42188 5749 -35127 -23582 20442 39778 16712 -21640 -30432
1093c0432L6175L3314j8664m0189o420K5036K0814O96j9288j9832M914K1379R637
1106A7140q027j4265j5163K741K8263J7106k1483l0448j83K7374K5769o653l9397
1119a7226k2056L0753M1619n783l7873j9745J8174L4923R413l1080k9338J1920
1131a6299L0657Q680j3112j8294r695J4050K6125K473k4387j8287M176J9168J8029
1144B3284o178k9108j2659K2656K4544k578k1543k0237K967K8463J6840k1915
1156D536k9673K749K5028J7691n467k7162j8843J8880L0223q86k6149j7006O860
1169a9219K3467J7170j5137k9156r44K4051J3695o605j4893j3390N619K3364J0303
1182A8325j6553j8278J305J5126J6394k549k4067j2509J8852K1830l407j6484
$$ plain form
1093 -30432 5743 39057 20393 -19796 -26216 -1180 19634 20330 1042 -18790 -13876 7503 17140
1106 17140 9113 -5152 -20315 -17574 10689 27795 6312 -24136 -24319 3055 28824 22171 -17226
1119 -17226 -39282 -8529 33090 27307 -10566 -30311 -12137 22786 32199 1119 -28219 -16299
1131 -16299 14358 23038 9926 -8368 -18063 -4013 22112 24585 198 -18089 -13913 5255 23284
1144 23284 17106 -12002 -24661 -2005 22539 19961 -1582 -21819 -18852 9611 26451 4536
1156 4536 -25137 -22388 2640 20331 14864 -12298 -31141 -12261 17962 17076 -9073 -26079 -19219
1169 -19219 4248 21418 6281 -22875 -23819 232 13927 7322 -7571 -20961 -15342 8022 18325
1182 18325 1772 -16506 -15201 -75 16319 13770 -10297 -22806 -3954 17876 14469 -2015
1194b015j1202L378J8316J2435j3605k0799J407J6388R417j805j2910j2554P653
1207e896J9193K858j4158j0566n68R519J4241j541k0731p774J5448J2913l306
1220I632j0238r061K465J4979N756j4153j0179O231Q197L027l91p997o087P540
1234b79P791l157k707o60n281n69J1294M332r530o727K268P591P606m185j5045
1249g258j498J6835N846j2134p984M061O667M767k690r969r52J0451J153p655
1263c60J45L390k238r26K759m57M90N68n742k251Q966K564r567k681O365K244
1279C269k787q22k038M83N196r42p629Q43N930j701k272K160j207j921K967n18
1295i89m620L768N717n652n848K799L170J811K049m858o756M395P771j726m639
$$ plain form
1194 -2015 -13217 -9839 8477 20912 7307 -13492 -12085 4303 13720 11915 -995 -13549 -5896
1207 -5896 13297 16155 1997 -8569 -9137 382 14623 13082 -7649 -15423 25 12938 9632
1220 9632 -606 -9667 -7202 7777 13533 -620 -10799 -4568 3629 6656 6265 -1732 -7819 -279
1234 -279 7512 4355 1648 988 -4293 -4862 6432 10764 1234 -5493 -3225 4366 11972 7787 -7258
1249 -7258 -8756 8079 13925 1791 -6193 -2132 4535 9302 6612 -3357 -4309 6142 7295 -360
1263 -360 -215 3175 937 11 2770 2313 2803 3371 -2371 -4622 4344 6908 -2659 -5340 1025 3269
1279 3269 482 -340 -2378 -1895 3301 2359 -5270 -4427 1503 -198 -2470 -310 -1517 -3438 -471 -989
1295 -989 -5609 -1841 3876 -1776 -7624 -4825 -1655 156 2205 -2653 -9409 -5014 2757 1031 -3608
1310c608p62k526J548Q165q71r806m03P500K065j529k732n479R58R898K425q967
1326d124n096L068M769O297P63j2108p019R867J0150j865p002n928q96J0286J0421
1341A1583p947j2841M16R634N352j129q530p940P073J3357p14j0202m413L78M795
1356a128J0239j39j5182p872R999J2823K604r101j4282M10J8253R024j4871j4705
1370a3928M247J2515P184l420j3646n999J2649J1595m959r783m067q16P455J0887
1384I914k193j3015n439O029J0642O729p803j8389r02J9910J0373j1522j4062
1397i728j303J0659J3284n11j7934r800J1633J3653M94r660j1313j157J5735J2673
1411A6725j0069j7054k149J0163J1958L033j3932j5550O212J8597N289j1014j1492
$$ plain form
1310 -3608 -4370 -6896 -5348 2817 1946 -7860 -8263 -763 1302 -227 -2959 -8438 -7480 2418 4843 -4124
1326 -4124 -9220 -6152 -1383 4914 5677 -6431 -13450 -3583 6567 4702 -2300 -8228 -9124 1162 11583
1341 11583 3636 -9205 -8789 845 6197 5068 -3462 -11402 -4329 9028 8314 -1888 -6301 -5923 -1128
1356 -1128 9111 8972 -6210 -14082 -4083 8740 11344 2243 -12039 -11629 6624 15648 777 -13928
1370 -13928 -9681 2834 10018 6598 -7048 -13047 -398 11197 6238 -3545 -7612 -8428 -973 9914
1384 9914 7721 -5294 -10733 -4704 5938 12667 4864 -13525 -14427 5483 15856 4334 -9728
1397 -9728 -11031 -372 12912 12401 -5533 -15333 -3700 9953 10447 787 -10526 -11683 4052 16725
1411 16725 6656 -10398 -12547 -2384 9574 12607 -1325 -16875 -10663 7934 13223 2209 -9283
1424i283l171R590J4031k117j6685o139Q613J0032M388n572j4497m101J5763J3848
1438A4700p269j5802o881Q622J7757N506j8698j7241R423K0410N241j1990j5667
1451a1889k256J6889J5303r577j8531j409J2170R051M52q238j0799K372J2623
1464F161M925n559p996o046L742J4329N537j4484j2209N131J2444P584n176j6171
1478g788o789J4819J5673n982j5661o144P112J3852N603j3493j5463N409J6701
1491G849L942q016j0450l963R957J3064k716j4815m186P152P830K582m943j0089
1505f802p85R937O662l406n593o081r68J1305R220r052j4323J200J1532Q037k107
1520H776j3209q289J1039J4982l759j4904m892O365J0121M143r081j1703L345
$$ plain form
1424 -9283 -12454 -2864 11167 9050 -7635 -13774 -5161 4871 9259 3687 -10810 -14911 852 14700
1438 14700 7431 -8371 -15252 -6630 11127 16633 -2065 -19306 -9883 10527 15768 3778 -11889
1451 -11889 -14145 2744 18047 8470 -10061 -11470 700 9751 10203 1965 -8834 -6462 6161
1464 6161 11086 5527 -2469 -8515 -4773 9556 15093 609 -11600 -6469 5975 13559 8383 -7788
1478 -7788 -14577 242 15915 9933 -5728 -11872 -4760 9092 14695 1202 -14261 -8852 7849
1491 7849 11791 3775 -6675 -10638 -681 12383 9667 -5148 -9334 -2182 5648 8230 3287 -6802
1505 -6802 -7587 2350 9012 5606 13 -6068 -7036 4269 13489 4437 -9886 -8686 2846 10883 8776
1520 8776 -4433 -12722 -1683 13299 9540 -5364 -10256 -3891 6230 10373 1292 -10411 -7066
1533g066J1320K416n125m037l696P08P984M363p162o091O80M355O059O12j0162
1548d842o538R001R520l833p876k650K112Q059M399q300q205L186P981J319k099
1563A234l243n505K939Q387Q70n097k919j718K026P446J096r426l797P405N026
1578D724j859m515k837J244P545O40q089l098N360L472r06k91k152k484L437L126
1594C317k735j158J073k684o18M961J823m362j427J775J224K000n95m942j105
1609c453O412K072n090j419J570Q75K283Q81n189j471M229J561l276M07J228q76
1625G44R74O65k987M35M531j435n345O29L938j4m40n36k499J000L946k351m602
1642c347L090L305j949k347K80j99K120K603l598l436L262J874l301K57L522j058
$$ plain form
1533 -7066 4254 6670 1545 -2492 -6188 -5480 2504 6867 -295 -6386 -5706 -1351 4708 5320 -4842
1548 -4842 -11380 -2379 7141 3308 -4568 -7218 -5106 2953 7352 -948 -9153 -5967 2014 3333 1234
1563 1234 -2009 -7514 -4575 3812 4682 -415 -3334 -5052 -3026 4420 5516 -3910 -7707 -302 4724
1578 4724 2865 -1650 -4487 -3243 4302 4942 -3147 -6245 -885 2587 1681 1390 -762 -3246 191 3317
1594 3317 582 -576 497 -2187 -2805 2156 3979 -383 -1810 -35 1189 3189 2594 -2348 -3453
1609 -3453 2959 5031 -59 -1478 92 967 3250 4131 -1058 -2529 1700 3261 -15 392 1620 744
1625 744 1718 2383 -604 -169 4362 2927 -2418 -1789 2149 2135 1695 1159 -1340 -340 3606 1255 -3347
1642 -3347 -257 3048 1099 -1248 -968 -1167 953 3556 -42 -3478 -216 1658 -1643 -1386 2136 1078
1658A078l343k67P08L219K889l865p118K814P882n52n310j791M85L360L448l517
1674A20n890L046N846j137l435j079K2J235L641o65m717k64J954M85K004J239
1690B405m595l852M188M121j168k809k058p10L882M777m079n716J466M210J443
1705A505J14l440n066K710P600J74n804k273L97L546N246j163q533k209P023M667
1721D494k093l715l547J683P166J787o952l631L239L220J169K6l938l509M239
1736c62N501r26l489k445k087L951O628j893p592j944M980M858J374m591p291
1751e328J311R426K273o902m546J288M155M459q02p923k345O105M692k026l257
1766E80l792j83O257M545m829o491J180L693L109R17m198n720K182P166M77l743
$$ plain form
1658 1078 -2265 -2532 -1824 1395 4284 419 -6699 -3885 3997 3445 -1865 -3656 -3171 189 3637 120
1674 120 -5770 -2724 3122 1985 -1450 -2529 -2507 -1272 2369 1704 -3013 -3277 -1323 -838 1166 2405
1690 2405 -2190 -6042 -1854 2267 1099 -1710 -3768 -4478 -596 4181 102 -5614 -4148 62 1505
1705 1505 1619 -1821 -6887 -4177 3423 3597 -2207 -4480 -4083 -537 4709 3546 -4987 -7196 -173 4494
1721 4494 2401 -1314 -4861 -3178 3988 5775 -1177 -4808 -1569 1651 2820 2846 -1092 -4601 -362
1736 -362 5139 4213 724 -1721 -3808 143 6771 4878 -2714 -4658 322 5180 6554 1963 -5328
1751 -5328 -4017 5409 7682 780 -3766 -2478 1677 6136 5334 -2589 -4934 1171 5863 3837 580
1766 580 -3212 -3395 2862 7407 2578 -3913 -2733 960 4069 4986 788 -4932 -2750 4416 4893 1150
1782A150l042j456K674O711q62p904k992N000M703N94l338o194l62Q187M401o337
1798I33n782R24L887M664k32o922m057N248N108j112k827l185j207M012N091k667
1814A876n739j79L264K205J548k249n868M82O887J616l932k857j297K079N771
1829C607M15p134k784M509L507K97j777l780k302N359M926l150m657j116K217
1844a863M095J758m638n560L771N961k11l201k382n47K837M155k084n084K05L240
1860D52Q99R95p60l773p55L956J965j718j612j781N2M067L173m538m617K696L828
1877B529J074j598l933j658M721M431l131n067P92K768J572J164k944l510K087
1892g03M040j042k041Rm26l90K563R57l023j065J614J78L48J065k626j952L212
$$ plain form
1782 1150 -1892 -3348 -674 6037 5175 -2729 -5721 -721 3982 4576 1238 -4956 -5318 2869 7270 933
1798 933 -4849 -3925 -38 4626 4394 -2528 -6585 -1337 3771 2659 -168 -3353 -4560 -548 4543 1876
1814 1876 -3863 -4042 -778 1427 2975 726 -5142 -4660 2227 3843 -89 -2946 -4243 -2164 3607
1829 3607 4022 -3112 -5896 -1387 2120 2417 640 -3140 -5442 -83 4843 1693 -2964 -4080 -1863
1844 -1863 2232 3990 -648 -6208 -2437 3524 3313 112 -2270 -2817 20 4175 2091 -2993 -2788 452
1860 452 1351 2346 1586 -2187 -2942 1014 2979 1261 -351 -2132 -2080 1987 5160 622 -3995 -1299 2529
1877 2529 3603 2005 -1928 -3586 1135 5566 2435 -2632 -1840 928 2500 3664 720 -2790 -703
1892 -703 3337 2295 254 263 -163 -553 2010 2967 -56 -1121 493 671 1019 2084 -542 -2494 718
1909G18K731k904j966K22L20K104J906k935l905K471K932m32j178j201j493J741
1925h69K828j617k653J267J227o60L92J75k329K24K685k66k076O83m46l30J785
1942B0J222k752j293J909N70o5N72j514j658K577J981k346j447K029m78j89Q83
1959B1r47j010J863P44k044K30J426j260p27J704O47j599N9N61m94J152R81k543
1977a236r60K230J260j727o81J126l59P18L97k234L27K783k09k935O15J629q42
1994i8K26K89p67j68K154j098j494J288J361j397l23P13p40L81J243j132j543
2011a105J950Q24j595j70J406l76l27N81r09p39K282j73k243N80J365n42n33N17
2029G93n77o7J422l78k169P59J977p63j289L46k27J90J440p81j959R47J339j076
$$ plain form
1909 718 3449 545 -1421 -1199 -879 1225 3131 196 -3709 -1238 1694 1262 84 -1117 -2610 -869
1925 -869 1959 342 -2311 -1044 183 -477 -85 90 -2239 -2015 670 404 -1672 -989 -1435 -1765 20
1942 20 1242 -1510 -2803 -894 -324 -389 183 -1331 -2989 -412 1569 -777 -2224 -195 -673 -862 21
1959 21 -926 -1936 -73 671 -1373 -1143 283 -977 -1704 0 647 -952 -893 -332 -826 326 1307 -1236
1977 -1236 -2196 34 1294 -433 -1114 12 -347 371 768 -1466 -1139 1644 1435 -1500 -885 744 -98
1994 -98 128 417 -350 -518 1636 538 -956 332 1693 296 -27 686 -54 327 1570 438 -1105
2011 -1105 845 1669 74 -96 1310 934 607 1188 279 -460 1822 1649 -594 -14 1351 809 276 793
2029 793 216 149 1571 1193 -976 -217 1760 997 -292 54 -173 17 1457 676 -1283 -336 1003 -73
2047g3p73J028o29l17N79jj405J205O41j421k07J445n69j061P46O55q36Q16j51
2066c28j652P70K000j358j665J056J140q32N11k9j472J158J471j150j515R32Q17
2083a46p03J227j81j646L53J721p64n09P5j83q5J519K80k058J27J270L72m72l61
2102a64m49n88J965P66k029J11N63k14O2J187l55j798P51J547q35Q5n42p78R45
2121B30K136r13k156K39J738k31o6m27j330O88K654o35k271K89Q11J06O44J86
2139A692j739p23J780N04j55n7j269j156K163J924k127j837O60J324O65L70j930
2156H9j790K033K011j369j388J93j01N56J425n91k238J95J632J43m3l76j600m06
2174a625K665J056k439j244M63P90J334L82k854j510K367J693j249l83r75n25
$$ plain form
2047 -73 -846 182 -447 -764 -185 -186 -1591 -386 255 -1166 -1373 72 -497 -1558 -812 -157 -993 -177 -328
2066 -328 -1980 -1210 790 -568 -2233 -1177 -37 -869 -358 -387 -1859 -701 770 -380 -1895 -963 -146
2083 -146 -849 378 197 -1449 -1096 625 -139 -648 -573 -756 -841 678 958 -1100 -973 297 669 197 -164
2102 -164 -613 -1201 764 1530 -499 -388 175 -39 23 1210 855 -943 -192 1355 520 605 63 -715 230
2121 230 2366 1453 -703 -464 1274 1043 977 550 -780 -92 2562 1927 -344 -55 756 862 1506 1692
2139 1692 -47 -770 1010 1514 1359 1302 33 -1123 1040 2964 837 -1000 -340 984 1649 2019 89
2156 89 -1701 332 2343 974 -414 -221 -322 234 1659 1068 -1170 -975 657 800 757 381 -1219 -1625
2174 -1625 1040 2096 -343 -1587 -1124 -334 1000 1382 -1472 -2982 -615 1078 -171 -554 -1529 -2054
2190b054J658J673j346k194MJ626R01M73j407k438J029L226m4k223j161M65J499
2207c13J196l81l055j92K471P61o76o34o08p58K032J182j486j163J49J50J414
2224H9J418k051k463J412K748O3j599j147m96J777K577j372k885M69J745N93p3
2241H05n6k018k1K541O77j281q93l14J15K258P98k623j712J854J950m5q55j483
2259c03p31J995J305j226j448O97m7M43J190o12j941j57J866P81n83p16j607J51
2277i43L048N32k867j210J564J095L70r82j933K09K316N33j654n28L26k08L19
2294a3J195q37j251L41M72M54P18o82k151K31K877J96j827p86J72P65J286n97
2312E63j961j15J921K59j201J04R9p39O53O60o69l41K63r39N69J860o65j943J42
$$ plain form
2190 -2054 -396 1277 -69 -2263 -2259 -633 268 741 -666 -3104 -2075 1151 1107 -1116 -2277 -1812 -313
2207 -313 883 502 -2553 -2745 -274 487 -189 -823 -1431 -2189 -157 1025 -461 -1624 -1475 -1325 89
2224 89 1507 -544 -3007 -1595 1153 1216 -383 -1530 -2026 -249 2328 956 -1929 -1460 285 878 805
2241 805 749 -1269 -1290 1251 1928 647 -246 -560 -445 1813 2611 -12 -1724 130 2080 2035 1180 -303
2259 -303 -1034 961 2266 1040 -408 289 242 685 1875 1263 -678 -835 1031 1812 1229 513 -1094 -943
2277 -943 2105 2637 -230 -1440 124 1219 1589 607 -1326 -1117 1199 1732 78 -450 -124 -332 -13
2294 -13 1182 345 -906 -565 -93 361 1079 397 -1754 -1523 1354 1550 -277 -1063 -891 -126 1160 563
2312 563 -1398 -1513 408 667 -534 -430 -331 -1070 -417 243 -426 -767 -504 -1443 -874 986 321 -1622 -1480
2331a480J160L61k76m91o96J44J563J24j597M67L50p92O87J151j108j180M73Q65
2349b75N45J01r16j705J435K302o17j695m00M97R87J004n38k040O37J023M79l28
2367D96n4q55q42J899J671j335j787p4Q97J523O93k055k325K339K250p80j430
2384B31o83r3J400J424r05j521l91P19Q73J019k46k910n41K732J861j260k236
2401e27j055J215L171q0k998j801J965K061l75r09r94j028J568J676l87j652j197
2418a347l23J936K549r77m311m71L186K677p94k970k741K187M525j5m569j679
2434c137J987K388P41j297k578p42K224J946m23j467j883p79L164K988j536m888
2450c292n99L402L155n28l965k950K708N246k67m406k208J140L089K095j438l949
$$ plain form
2331 -1480 -320 41 -235 -726 -1422 -1278 285 409 -1188 -721 -371 -1163 -476 675 -433 -1613 -1140 -275
2349 -275 270 371 -545 -2250 -815 1487 870 -825 -1225 -728 259 1263 725 -1315 -678 345 824 496
2367 496 442 -413 -1255 644 2315 980 -807 -881 16 1539 2232 177 -2148 191 2441 1661 231
2384 231 -452 -545 855 2279 1374 -147 -538 181 1054 2073 1827 -1083 -1624 1108 2969 1709 -527
2401 -527 -1582 -367 2804 2724 -274 -2075 -110 1951 1576 667 -327 -1355 213 1889 1502 -150 -1347
2418 -1347 -1670 266 2815 1838 -2473 -2944 242 2919 2125 -845 -3586 -1399 3126 3111 -1458 -3137
2434 -3137 -1150 1238 1979 682 -1896 -2638 -414 1532 1109 -358 -2241 -3020 144 3132 1596 -3292
2450 -3292 -3891 -489 2666 2138 -1827 -4777 -2069 3177 2910 -1496 -3704 -2564 525 2620 1182 -2767
2466b767o98K527K728j14k309k495j58L790K773k477l869p68L263L893m60m632
2482a773k924L020M086N18l560k272K97L072L031j893l595r86K688K497J174k751
2498F29l853M43M461K588k566l913j493L410M421m54m621k562K569L658Q91k747
2514H61l219J07L536K860k014l518j280K012L339J206k998m094P23M055K502k199
2530A879m009j105L005M422o15m618k260K309L408J262k295l710m04L424L036
2545C729r28l357k288R25M147K032l501m547N02M816K721k342l939j713L848L666
2561C771j401l988j207J824K655P08j738l091K4K554K030m58k559k211M54L834
2577A201K582l421m204N82L688K487j550m192j575L903L361j472l440q77R91K434
$$ plain form
2466 -2767 -3465 -938 1790 1676 -633 -3128 -3286 504 3277 800 -3069 -3837 -574 3319 2859 -1773
2482 -1773 -4697 -1677 2409 2927 -633 -2905 -2608 464 3495 1602 -1993 -2979 -291 2206 3380 629
2498 629 -3224 -2781 1680 4268 1702 -2211 -3704 -294 4127 3673 -948 -3510 -941 2717 3608 861
2514 861 -2358 -2251 1285 4145 2131 -1387 -2667 -655 2684 3890 892 -3202 -2479 1576 4078 1879
2530 1879 -2130 -3235 -230 4192 3577 -1041 -3301 -992 2416 3678 1383 -2327 -2731 693 3729
2545 3729 2801 -556 -2844 -1919 2228 4260 759 -3788 -3286 1530 4251 1909 -2030 -3743 105 3771
2561 3771 2370 -1618 -2825 -1001 1654 2362 624 -2467 -2443 111 2141 1683 -876 -3087 -2633 1201
2577 1201 3783 362 -3842 -3260 428 2915 1365 -2827 -4402 -499 2862 1390 -2050 -2927 -1936 498
2593D98J340j714k177o01J915J381P15j404k818K29L311K030k581l081K03K819
2609F5K619j270l612q68L007K168j018k030q79Q04J663Q11r05j023m78N72O15
2626B41J835r21k838k78K848J690r65k602j232K199K636m30k779j439K238J255
2642A458p0j089j099K76J499K18q34p7m53q3O16J290p85j594l07J197J336K4j336
2661A87j624J153K095Qj574p00K08L86Q50P69j287j135K63J057M72l8j491l77
2679g78Q88J392l57j490l8n2N70R45p82n95q8L17Q6O18K19j627q28J183J778k17
2699A144k000j160R16K389K44k257j998J046K429K37j287j170RR86J012k43n91
2716b94m94n01J14J903P41j986k094P33K551J601k067l211J68L611K167k851k928
$$ plain form
2593 498 1838 124 -2053 -2654 -739 642 1357 -47 -2865 -2636 675 2705 124 -2957 -2754 65
2609 65 2684 1414 -2198 -3066 -59 2109 1091 -939 -1818 -1014 649 1460 555 -468 -946 -374 241
2626 241 2076 1155 -1683 -1961 887 2577 1612 -990 -2222 -23 2613 2183 -596 -2035 203 1458
2642 1458 1388 299 -800 -524 975 1193 359 282 -171 -254 362 1652 867 -727 -1034 163 1499 1523 187
2661 187 -1437 -284 1811 1819 245 -455 -247 139 989 1758 471 -664 -401 656 1128 1090 -401 -778
2679 -778 110 1502 1145 -345 -383 -435 135 1080 298 -297 -385 -68 18 636 855 -772 -1600 -417 1361 1144
2699 1144 -856 -2016 -1100 1289 1533 -724 -2722 -1676 753 990 -297 -1467 -1458 -472 540 297 -294
2716 -294 -788 -1289 -1175 728 1469 -517 -2611 -1878 673 2274 207 -3004 -2836 775 2942 91 -2837
2733b837O17K630J605q25k397r76J498J865N5j010r06q33J163J786O11k178k164
2750b296N54L137J905j965l988m06L983L034k055l882j137K852L627n93l410j880
2766b520J597K753M43p14k551r83K146K476M39k769k487p9L945K374k139m434
2782b503p52M112L248j224m534j721K983L695M57l846k758J142L293J919j315
2797B196l702j509K681L623J1l390k941N62M096K734k905m406j32L678K957j119
2813B434l629k611K290L970Q75l019l664L33L490K881r83m465k303K839M279M94
2829C211l854l609J245M740K432l661m387K52L368K910j048l298j973J837L348
2844A513J275k310k967j233K840L908n89m241l072K453N283J121m177m565R85
$$ plain form
2733 -2837 -2220 410 2015 1190 -1207 -2183 -685 1180 1235 225 -681 -1514 -351 1435 2046 -132 -2296
2750 -2296 -1742 1395 3300 1335 -2653 -3059 924 3958 1903 -1979 -3116 -264 3363 2770 -640 -2520
2766 -2520 -923 1830 2273 1559 -992 -1975 171 2647 3086 317 -2170 -2249 1696 4070 1931 -2503
2782 -2503 -3255 857 4105 2881 -1653 -3374 -391 3304 3761 -85 -2843 -1701 1592 3511 2196
2797 2196 -1506 -3015 -334 3289 3300 -90 -3031 -2469 1627 4361 1456 -2950 -3082 596 3553 2434
2813 2434 -1195 -3806 -1516 2454 3329 310 -3354 -3021 469 3350 2367 -2098 -4401 -1562 2717 3211
2829 3211 -643 -4252 -3007 1733 4165 504 -3883 -3631 -263 2647 1599 -1699 -3672 -1835 1513
2844 1513 2788 478 -2489 -3722 -882 3026 2437 -1804 -4876 -2423 2860 3981 -196 -4761 -3776
2859c776N636K572l783m658M12L737K945j165l562j756J996L039J020j910k784
2874b037j351K733L674r9l991l089J915M969J555l780m536Q44N353K137l025l920
2890b648n08L620K975q77l359j835J415K841J174j356l057j171K531L400k9l621
2906e05k621J344M266J709l258l961O68M066J994k048l535n40K421L305n71l114
2922c80j535O85K213J916j208k585j545K049K806N39l032k638R25L769J390l032
2938C37k819N00L167J570j556k461q48K084J981l77j669j580L42J624J604p56
2954A143j891j586J064K611Q04k222k577N19L411J395k411k558k7K213J838q75
2970H51k287j067J650J427L21r98j478m90J508J621q5k051q91K71K392N97j368
$$ plain form
2859 -3776 1860 4432 649 -4009 -3597 140 3085 1920 -1642 -3398 -1402 1637 2657 747 -2037
2874 -2037 -3388 -655 3019 2920 -1071 -4160 -2245 2724 4279 499 -4037 -3193 2160 4297 1272 -2648
2890 -2648 -3156 464 3439 2562 -797 -2632 -1217 1624 2798 1442 -1615 -2786 -255 3145 3116 -505
2906 -505 -3126 -1782 2484 4193 935 -3026 -2358 1708 3702 1654 -1881 -2421 0 3305 2734 -380
2922 -380 -1915 -1230 983 2899 1691 -894 -2439 -390 2416 2955 -77 -2715 -1790 1979 3369 337
2938 337 -2482 -1982 1185 2755 1199 -1262 -2110 -26 1955 1578 -91 -1671 -1329 295 1899 1143
2954 1143 -748 -2334 -1270 1341 2145 -77 -2654 -2135 1276 2671 260 -2298 -2325 -112 1726 851
2970 851 -1436 -2503 -853 574 895 -103 -1581 -2071 -563 1058 973 -1078 -1969 -1698 694 1291 -77
2987g7j749K93J817O74r52j190m58R91J155P4j146m87MQ95J241l43j315j313Q68
3006a018J946N03j661j425N40K001N49j253j031J68J290K3m70k76L43k88j38N87
3024C90M64P0j181q53J384J674j033j876l10J910J213p23k117k15J622J358n65
3041A212j819K74P61M0K55lN2o51l85L14J766k2k263j098J105K495M41k438k230
3060b194J721K338J67k032j551R24J899K05j223q52o9M53R28J82l66j265q06J087
3078d54J629L02j794j695N43K810P17k199k570P48K441J703j660k552k30K229
3094c2J420l67k121j004O89J911O83q69k051m96J772J719M7k374j748J157K675
3111A011R45k173k286O2K516K086j173k786p83J386K449R45k178k437K9K704K592
$$ plain form
2987 -77 -1826 -1533 284 958 6 -1184 -1642 -651 504 578 -568 -1055 -1051 -156 1085 742 -573 -1886 -1018
3006 -1018 928 1431 -230 -1655 -1115 886 1435 182 -849 -681 609 632 162 -114 229 -59 -197 390
3024 390 854 924 -257 -1110 274 1948 915 -961 -1271 639 1852 1129 -988 -1203 419 1777 1212
3041 1212 -607 -333 428 468 723 720 772 121 -264 50 1816 1794 -469 -1567 -462 2033 2474 36 -2194
3060 -2194 -473 1865 2032 0 -1551 -627 1272 1477 254 -598 -667 -214 714 896 530 -735 -1541 -454
3078 -454 1175 1477 -317 -2012 -1469 1341 2058 -141 -2711 -1963 478 2181 521 -2031 -2261 -32
3094 -32 1388 1021 -1100 -2104 -1415 496 1179 310 -1741 -2237 -465 1254 1301 -1073 -2821 -1664 1011
3111 1011 1956 -217 -2503 -2441 75 2161 988 -1798 -2581 -1195 1254 2199 21 -2416 -2387 317 2909
3128B909j602l125j093K425K975j54l636j418J481K824O60j912k396M38K135J466
3144A977n31j580j216k8K108K046j523k964q55K897K936p83l890j795K565M104
3160C468n2m238k539K461L356Q34k572k433L56K102J689o18j904j260K26K447
3176A323J576j073l079j282K505L376m53m010k118K645L544M15l952k556J851
3191a288L362R52k093k710k30K550J410j37k286j703N64K507K224j935l104r45
3207b862K616K908j07l766k418J931L993M53l295k504Q67L190J194j621k371o69
3223b461K337J392J33k267j319P37K028J360j131k870p78K660K670o87l426j476
3239c098J656L455k79k022k276M20K560J635j385k243r64J694J969P63j726k601
$$ plain form
3128 2909 1307 -1818 -2911 -486 2489 2335 -1301 -2719 -1238 1586 2246 334 -2062 -1624 511 1977
3144 1977 1446 -134 -1350 -1378 730 2776 1253 -1711 -2566 331 3267 2484 -1406 -3201 -636 3468
3160 3468 3416 -822 -3361 -900 2456 3290 718 -1715 -1359 743 2432 1814 -90 -1350 -1124 1323
3176 1323 2899 1826 -1253 -2535 -30 3346 2893 -1117 -3235 -590 2954 3369 -583 -3139 -1288
3191 -1288 2074 3026 933 -1777 -2007 543 1953 1816 -470 -2173 -1609 898 3122 1187 -1917 -2862
3207 -2862 -246 2662 2555 -1211 -3629 -1698 2295 2748 -547 -3051 -2184 1006 2200 579 -1792 -2461
3223 -2461 -124 1268 1401 -866 -2185 -1448 580 1940 809 -2061 -2839 -179 2491 1804 -1622 -3098
3239 -3098 -1442 2013 1734 -288 -2564 -2144 416 2051 666 -1577 -2541 -847 1122 1885 159 -2442
3255b442K16K544J909j188k765q70K468K180l44k691j402J673K154L12j670j349
3271a265q3J650J178j96j650j226R18K058R95j617k469oK565J695j001k661n25
3288a640J784K276o92j824j492J239J651K24o99j100k59J069R36J04j143j355
3304i21J12J843J260j277k137m1J880J303m66k306r67K144J462o11j712q88J076
3321b46J129M24n98j354j0O69P53K47o58r19p32J576Q57k79j737p56J388J522
3339A276l9j700q74Q47J191o6o99k62k72M71K12K67p01m90p7K53J077J61j229
3358f54q21P48J340J97j396j218Q72J205R18j399j187O35O53L28J68r50k70N06
3376c25L19J7Q1l20n02k3J343L17r65j376L13J707P17j095j249k96J686J092r34
$$ plain form
3255 -2442 -2226 318 2227 1039 -1726 -2596 -128 2052 1708 -983 -2385 -712 1442 1754 84 -1265
3271 -1265 -1348 302 1480 1284 -366 -1592 -674 1384 2379 762 -1707 -1713 852 2547 1546 -1115 -1640
3288 -1640 144 2420 1728 -96 -1588 -349 1302 1526 827 -273 -532 537 1473 1577 434 -921
3304 -921 -809 1034 2294 1017 -1120 -1161 719 2022 1556 -750 -1717 427 1889 1278 -434 -1322 -246
3321 -246 883 1307 709 -645 -655 14 767 1014 356 -563 -1295 281 1138 859 -878 -1634 -246 1276
3339 1276 1237 -463 -1337 -490 701 635 -64 -326 -598 -127 85 352 -349 -839 -916 -663 414 575 -654
3358 -654 -1475 -727 613 810 -586 -1804 -932 273 1191 -208 -1395 -760 -107 221 389 -561 -831 -325
3376 -325 -6 11 92 -228 -730 -753 590 907 -58 -1434 -1121 586 1303 208 -1041 -1337 349 1441 507
3395E07j209j63Q43Q34p2p72p60M99O56j23M91m54r73N68Q37J26l47o48n88N60
3415a88J217K32j093r33N66R44L12l64j238l42J005J523o18j495n9K86J414J51
3433A320p67j737N34J717K41o47p48n51O43J360m02q15p42R4P37R82J88j266j555
3452a414O91J927P37j798j724%K461J609k085k330M06K354R82j349j574l19J184
3469b42J472l51j253n69O5P30R28J50j320j237M93J476J212j374k074m93K680
3486B93J600j458k891N22J955J660q94k325n00J800J260m26j312p21K54Q72P24
3503D13L14j491n80J89J295J294j114k227K47J933J868j294k597n63J841K164
3519A692l48k268q94J223J790k45p62j264O5J075J296o68j208o22K10J471P42
$$ plain form
3395 507 -702 -865 -22 812 740 -32 -792 -293 363 240 731 277 -696 -128 709 835 488 -160 -748 -188
3415 -188 1029 1261 168 -765 -199 745 1057 693 -545 -887 118 1641 1023 -472 -531 -245 1169 1320
3433 1320 553 -1184 -650 1067 1308 661 -87 -638 5 1365 963 148 -594 -500 237 1219 1407 141 -1414
3452 -1414 -723 1204 1941 143 -1581 -1581 880 2489 404 -1926 -1520 834 1816 467 -1107 -1426 -242
3469 -242 1230 879 -374 -943 -878 -148 780 930 -390 -1627 -1134 342 1554 180 -1894 -2387 293
3486 293 1893 435 -2456 -1934 21 1681 787 -1538 -2038 -238 1022 596 -716 -1437 -1183 -311 413
3503 413 727 -764 -1344 -1155 140 1434 320 -1907 -1660 273 2141 847 -1750 -2313 -472 1692
3519 1692 1344 -924 -1818 -595 1195 950 188 -1076 -1011 64 1360 692 -516 -1138 -928 543 1285
3536A285p25j681l8J320J617q26j349r87R32J541L98j474j542O00J442J303q32
3553I84j759p66J499K295n24k277j054J011J987N99j726j760M75K053M69r34j071
3570d99l84R12J350j66j073o63J04N98J489j08j846j561J498K075j63j459j571
3587a467K40K239J108j588k281N30K075N45n34j712n95J372J068n1q34o86k41
3604h12Q20J060n95j295l77M20J273N45j104j541K37J850R55j309j303j86J076
3621b86J102o56o18o46M45N80L52K15j012p45O46J324P0j029j290L56J287J461
3639A556j376j639k13J742J165j017j229N0R37P37n15j078p0O64O9L17N69p58
3657h9n76J5J180M19q76p45n73R21J677n30j654n04J390J007k24j083r03O55J208
$$ plain form
3536 1285 560 -1121 -1159 161 1778 952 -397 -1384 -452 1089 1487 13 -1529 -929 513 1816 984
3553 984 -775 -1541 -42 2253 1729 -548 -1602 -591 1396 1995 269 -1491 -1016 1037 1506 572 -499
3570 -499 -883 29 1379 1213 140 -523 -419 179 1668 1560 -286 -1847 -349 1726 1563 104 -1467
3587 -1467 -1227 1012 2120 532 -1749 -1219 856 1401 867 -845 -1440 -68 1000 949 115 -571 -812
3604 -812 8 1068 473 -822 -1199 -779 494 1039 -65 -1606 -1369 481 1436 127 -1176 -1362 -286
3621 -286 816 160 -458 -1104 -659 -79 273 488 -524 -1269 -623 701 771 -258 -1548 -1192 95 1556
3639 1556 180 -1459 -1672 70 1235 218 -1011 -961 -24 713 198 -880 -950 -286 -217 100 669 -89
3657 -89 -665 -650 530 949 73 -672 -1245 -324 1353 823 -831 -1335 55 1062 838 -245 -1148 -493 715
3676G15L45r92l78J28M47J82L77q43o65O41O17M12p16o72l9P18J008p50q06m47
3696g18Q29P05k81n07m38J95L94K47K46l96m75l22J077L46o30l95p45Q38O84J60
3716H14r86q87R75P56k40o52m73J73O90O30p90n67J37j29O15M59m41j124L67R10
3736B37N36m82p88o92P94J212j75j147l91O02L82L05qp37k71L11O21K7o54n27
3756h45M6J115N16n27j135l37J371N41n78r77k23J039P60k37j209l11Q19L96j94
3775C0K60m45j39l17N50O64J51q30q41P36J400j78j605q52J346J045N06j787j173
3794a479J162J496m29r62n31P20L18M71m02l77j11M84P8J16j33m47q41P33J023
3813H89J62j108n82K15J001N46q41j218Q8J528P73q18p93l18P93Q76n71q53m57
$$ plain form
3676 715 1060 68 -310 -182 265 447 824 -19 -684 -43 574 986 270 -402 -441 277 1285 535 -271 -718
3696 -718 111 816 535 28 -410 -215 179 426 672 276 -199 -521 556 902 272 -123 -868 -30 654 814
3716 814 -172 -1059 -84 672 432 -220 -693 -520 170 800 10 -557 -420 -549 66 525 84 -1040 -673 237
3736 237 773 291 -497 -1189 -395 817 642 -505 -896 -294 88 393 385 -352 -623 -312 309 336 -318 -845
3756 -845 -799 316 832 305 -830 -1167 204 745 167 -810 -1033 6 766 529 -680 -991 -172 224 30
3775 30 290 -155 -294 -611 -61 603 754 -76 -917 -181 1219 1041 -564 -1416 -70 975 1481 -306 -1479
3794 -1479 -317 1179 750 -212 -743 -23 295 766 364 -13 -124 360 438 554 421 -26 -867 -134 889
3813 889 1051 -57 -639 -424 577 1123 282 -936 -848 680 1453 635 -158 -476 317 1193 622 -231 -688
3832f88P64L05N62m28j016l20J176M80J3p52o21o3O53R20j027o21Q6R35Q3O4o72
3853a67n04M08J014l33m85l30m08O53J246l98j268n02R60O71k6o88r96K25J180
3872B52M67o92l78k81M34O81Qq65m63J85R80J55m16p56l52J061Q74j74j689K24
3892g45P92K48j07k23q40N90N59k37l5o1j98j07N03P46k98j236j80Q80R08p6j400
3913e17p19J122J349m06j288m58J022P85n2j308n01R99N70m41n1K09l51K60j22
3932A02L21Q0J10p86j57R87K58m95j236K88J263L29p59j278K89J398N81q94j196
3951g95K39Q13K88J95o90p58O31O76l18m67J2K24l57J139j60r66j30J48L02N29
3971E55L0n09o31N90P56n51l06o49k13Q25R38n81p84j88R17L37k0r51n33O41J080
$$ plain form
3832 -688 76 381 943 515 -501 -821 355 835 848 96 -525 -588 65 985 -42 -663 -577 358 441 505 -167
3853 -167 -671 -263 751 418 -67 -397 -805 -152 1094 696 -572 -1074 -114 557 531 -157 -1153 -928 252
3872 252 719 27 -351 -632 -198 483 491 -374 -837 -652 328 483 67 -689 -1041 20 894 720 -969 -745
3892 -745 47 295 188 -35 -875 -285 274 37 2 -59 -257 -364 139 885 587 -649 -829 51 959 883 -517
3913 -517 -1236 -114 1235 829 -459 -917 105 890 838 -470 -971 28 598 157 106 315 -36 224 102
3932 102 423 503 613 -173 -330 657 915 420 -816 -528 735 1064 305 -973 -684 714 1295 401 -795
3951 -795 -556 257 545 740 50 -708 -77 599 281 -186 -174 50 -307 832 672 -294 -424 -276 26 555
3971 555 585 76 -555 35 791 240 -66 -715 -928 -103 835 254 -530 -718 199 536 516 -435 -968 -327 753
3992G53k11j082k45N93O05Q9l64r29K85O72J66m40j08Lj76M08l3K83n45p3N0M36
4014A37L12n29q87M11R72R7o93p8n69K78Q37M00j152j31M55J37K87k65m98m53
4034i32J069K03k64p67k7P48M99j50o16m85P15K47j16J02m44j03M70M18m49m15
4054b97L17l61K78N62L73r52m99K90J010L04r32p84j49J571N23j375n84M79P33
4073E07J50j08q68j69Q61M92o14j68J64j85K35j3pn26L4K66J76M88m30r25L45
4094b95Q92j1l54n71k6L30O19l58o25l20J131o3n01K47l42m97O57P73p09n23N1
4115d95J0P46M06j113m75N81N99q3k98m53K91K85K11k38o54J85L46J63q6J95l24
4136b01l63K70L52M8l27l22l24Q83P49l45j081r7Q36K57r8n29o71P13Q14j36r29
$$ plain form
3992 753 542 -540 -785 -192 413 502 138 -791 -506 166 332 -108 -216 -213 -389 19 -14 269 -276 -349 -299 137
4014 137 449 -80 -967 -556 416 513 -180 -258 -827 -549 288 688 -464 -595 -140 -3 284 19 -479 -932
4034 -932 137 340 76 -691 -718 30 529 379 -237 -722 -7 240 124 226 -218 -321 149 567 118 -297
4054 -297 20 -341 -63 499 872 -80 -579 -289 721 1025 93 -691 -840 731 1254 -121 -705 -226 507
4073 507 657 549 -319 -488 373 865 251 83 247 62 297 284 277 -249 -215 51 227 715 285 -640 -295
4094 -295 597 586 232 -339 -365 -35 584 226 -399 -719 412 349 -152 95 -247 -744 -87 686 -23 -546 -495
4115 -495 -485 261 667 -446 -921 -340 259 176 -122 -575 -284 1 212 -26 -680 -495 -149 14 -72 123 -201
4136 -201 -564 -294 58 106 -221 -543 -867 16 765 420 -661 -758 78 335 237 -292 -963 -250 564 428 -501
4157e01P3k8M93M28n84n51j33J055J63n58J93n55j93R77Q4o91L8L39m23K70L54
4178B50o5q74M08N79Q0k2n85o16O37P63j77o97K0J49L07K32o37k81L50R04l19
4199D06j061N71R9L21k21pj80K87J30l28r7K84J20q37J37P51j55k55k14J4M33
4220A98L74l22o27J94Q67m06j62p1l05K53L47o4l10J29J76m45J62N67k66o26p
4241c44L85j15N7o5l17M85M05n87o6m0L90j85j98m8r3N68k53k63K91O8p5n57O08
4264E1J55l28lr5L5K23L32n46k91L95L33m09n1j31J01L25O28o76j82J14Q9J2j04
4287b3J38l58j00L94m5l03P8J48o4N4J77M2o25L60K96l43M87p3r38M25Q86k40
4309C73q09M25J30j28N06k56n77M32M77j88m80L82m03R8N84j73l75K06K21m10
$$ plain form
4157 -501 -428 -456 37 465 -119 -670 -803 252 415 -143 50 -505 -698 279 363 -328 -290 49 -374 -104 250
4178 250 185 -689 -281 298 378 356 -229 -845 -208 555 378 -319 -299 -150 157 389 -248 -529 -179 725 406
4199 406 -655 -84 15 336 115 108 -72 215 345 17 -80 204 324 -513 -376 375 220 -35 -249 -235 198
4220 198 572 250 -377 -183 684 278 116 45 -260 -7 340 276 -34 95 271 -174 -12 555 289 -337 -344
4241 -344 41 -74 -17 -82 -399 86 491 -96 -162 -202 188 3 -195 -243 -336 232 -21 -284 7 75 0 -557 51
4264 51 206 -122 -125 -220 -185 38 370 -176 -467 -72 261 -148 -199 -330 -229 96 724 48 -134 -20 69 81 -23
4287 -23 115 -243 -343 51 6 -297 -219 -71 -135 -81 96 138 -487 -127 169 -174 313 240 -698 -273 613 373
4309 373 -436 -11 119 -9 497 241 -336 96 573 385 -95 287 -116 -18 566 393 18 224 445 35
4329C5n0L21o9m07M6M67op4m70j89O10O37l42r62K26P01q4j4k24m43L77M02l79
4352A09m03N78j28k9M9J47k04l67K47J87j50K32j98o02N45Q45p41m16l7M89k36
4373h3P61p86o51M06O11q8k67l17q9L18P09k66n93K5J79n9O80k65p33M7P09J31
4395C79o04%k12L37N1L05m90k63L31L16k54N0J10l52L56L33j22n33J89r7J4N91
4417D35m4p45k54Q19K40k46k47n82M81R22k33n94l50L40M57k53K51o00j80O00
4437B17K91m73k66K12j84L96n6r2m29J40N40j28J45On40j35R75j64n88J51P7M2
4459A37o5M51j44r19R48L2j71k51K7l16P37L89j149n8N16K11j15J23n16j79M93
4480A81N56p80j8K88l96L16L69l38m03m4K99O2jk83Qk42P05Q6q17R8J99j62M69
$$ plain form
4329 35 -15 306 237 -170 -124 343 337 263 -207 -396 214 851 509 -453 -227 474 390 376 152 -291 86 488 109
4352 109 -294 284 156 127 176 323 119 -248 -1 186 36 268 70 -532 13 858 117 -299 -336 153 -83
4373 -83 678 -108 -759 -353 258 170 -97 -414 -503 -185 524 258 -335 -310 -131 -190 490 225 -508 -461 248 379
4395 379 -225 -225 -437 -100 -49 256 -234 -497 -166 150 -104 -54 56 -296 60 393 271 -262 -73 -170 -156 435
4417 435 391 -354 -608 211 451 205 -42 -624 -143 779 546 -48 -398 -58 399 146 397 -203 -383 217
4437 217 508 35 -231 -19 -203 193 137 45 -384 -244 296 168 313 319 -221 -356 619 455 -133 18 95 137
4459 137 72 523 379 -540 408 440 269 18 45 -271 466 855 -294 -352 164 375 260 383 -133 -312 181
4480 181 737 -43 -61 227 -169 147 516 178 -225 -269 30 92 91 -192 -184 -426 279 365 -452 -354 -155 -317 152
4503A52k2n84J59O1M70p26J30K45k99J50O63n86m22L07L28m1l4m17j94N70M53
4524C63l88m56J50J92J35m7O2o24P40P6n26k72N90m04j6K67Q4j23L0J08l67L57
4546f9L78j90n39M85J46o4o65J07L81j34L97m68j54K75L15M5n48N7j15L27J34
4567A01j18m12L81L23n15M27j48J46j48J81k18l17P53l57j64J88M12k28m18L53
4587B22lp3J93j88k83N39K10o38J3K81j6J95P1l23m94Q14J90m01m76N94k89J71
4609C09q9j45j38k1P82p98M5M07j80K0k24P4l2j12J97o03M00K02k44k29O52k09
$$ plain form
4503 152 130 -454 -295 -234 236 -490 -360 -115 -414 -264 399 -187 -609 -302 26 -15 -49 -466 -660 -90 363
4524 363 -25 -481 -331 -139 -4 -51 11 -613 127 203 -323 -595 -5 -409 -425 -158 -74 -197 -167 -59 -426 -69
4546 -69 309 119 -420 65 211 147 -518 -411 -30 -164 233 -235 -389 -114 201 246 -302 -245 -360 -33 101
4567 101 -17 -429 -48 275 -240 187 39 185 37 218 0 -317 436 79 -85 103 515 287 -131 222
4587 222 219 146 339 151 -132 407 617 -21 -8 273 257 452 523 200 -294 520 710 309 -167 427 138 309
4609 309 220 75 -63 -84 698 -100 -55 352 172 192 -32 42 10 -102 95 -508 -108 94 -150 -379 273 64
$$ [...]
8191a73
##END NTUPLES=NMR FID
##END=
