##TITLE=1H_TG-2291-B1
 CDCl3, 8 sc, 
 24.9.2020
##JCAMPDX= 6.0         $$ Bruker NMR JCAMP-DX V2.0
##DATA TYPE= NMR FID
##DATA CLASS= NTUPLES
##ORIGIN= UXNMR, Bruker Analytische Messtechnik GmbH
##OWNER= root
$$ XWIN-NMR		Version 3.5
$$ Thu Sep 24 10:35:02 2020 Russian Standard Time (UT+4h)  she@DPX200
##.OBSERVE FREQUENCY= 200.1315066352
##.OBSERVE NUCLEUS= ^1H
##.DELAY= (6, 6)
##.ACQUISITION MODE= SIMULTANEOUS
##.ACQUISITION SCHEME= undefined
##.AVERAGES= 8
##.DIGITISER RES= 18
##SPECTROMETER/DATA SYSTEM= spect
##.PULSE SEQUENCE= zg30
##.SOLVENT NAME= CDCl3
##.SHIFT REFERENCE= (INTERNAL, CDCl3, 0, 15.7039)
##AUDIT TRAIL= $$ (NUMBER, WHEN, WHO, WHERE, WHAT)
$$ ##TITLE= Audit trail, XWIN-NMR		Version 3.5
$$ ##JCAMPDX= 5.01
$$ ##ORIGIN= Bruker BioSpin GmbH
$$ ##OWNER= she
$$ F:/spectra/data/she/nmr/H-F/1/audita.txt
$$ ##AUDIT TRAIL=  $$ (NUMBER, WHEN, WHO, WHERE, WHAT)
(   1,<2020-09-24 10:34:00.45 +0400>,<she>,<DPX200>,
      <created by zg, POWCHK disabled, PULCHK disabled
       configuration hash MD5:
       00 E9 B6 7A A2 85 ED C7 34 08 36 98 17 FE 4E 26
       data hash MD5: 16K
       AE 65 EC 07 46 5A 25 E0 F7 ED BD 23 81 38 FA F6>)
$$ ##END=
$$ 
$$ hash MD5
$$ BE B0 31 D2 50 B7 E1 42 CB B5 6A A8 6F 43 96 8F
##$RELAX= 
##$RELAX= 
##$RELAX= 
##$RELAX= 
##$RELAX= 
##$RELAX= 
$$ Bruker specific parameters
$$ --------------------------
##$DU= <F:/spectra>
##$EXPNO= 1
##$NAME= <H-F>
##$PROCNO= 1
##$TYPE= <nmr>
##$USER= <she>
##$AMP= (0..31)
100 100 100 100 100 100 100 100 100 100 100 100 100 100 100 100 100 100 
100 100 100 100 100 100 100 100 100 100 100 100 100 100 
##$AQSEQ= 0
##$AQ_mod= 1
##$AUNM= <au_zg>
##$AUTOPOS= <>
##$BF1= 200.13
##$BF2= 200.13
##$BF3= 200.13
##$BF4= 200.13
##$BF5= 200.13
##$BF6= 200.13
##$BF7= 200.13
##$BF8= 200.13
##$BYTORDA= 1
##$CFDGTYP= 0
##$CFRGTYP= 5
##$CHEMSTR= <none>
##$CNST= (0..31)
1 1 145 1 1 1 1 1 1 1 1 1 1 1 1 1 1 1 1 1 1 1 1 1 1 1 1 1 1 1 1 1 
##$CPDPRG= <>
##$CPDPRG1= <>
##$CPDPRG2= <>
##$CPDPRG3= <>
##$CPDPRG4= <mlev>
##$CPDPRG5= <mlev>
##$CPDPRG6= <mlev>
##$CPDPRG7= <mlev>
##$CPDPRG8= <mlev>
##$CPDPRGB= <>
##$CPDPRGT= <>
##$D= (0..31)
0 1.2 0 0 0 0 0 0 0 0.06 0 0.03 0 0 0 0 0.0002 0 0 0 0 0 0 0 0 0 0 0 0 
0 0 0 
##$DATE= 1600929239
##$DBL= (0..7)
120 120 120 120 120 120 120 120 
##$DBP= (0..7)
150 150 150 150 150 150 150 150 
##$DBP07= 0
##$DBPNAM0= <>
##$DBPNAM1= <>
##$DBPNAM2= <>
##$DBPNAM3= <>
##$DBPNAM4= <>
##$DBPNAM5= <>
##$DBPNAM6= <>
##$DBPNAM7= <>
##$DBPOAL= (0..7)
0.5 0.5 0.5 0.5 0.5 0.5 0.5 0.5 
##$DBPOFFS= (0..7)
0 0 0 0 0 0 0 0 
##$DE= 6
##$DECBNUC= <off>
##$DECIM= 32
##$DECNUC= <off>
##$DECSTAT= 4
##$DIGMOD= 1
##$DIGTYP= 9
##$DL= (0..7)
0 120 120 120 120 120 120 120 
##$DP= (0..7)
150 150 150 150 150 150 150 150 
##$DP07= 0
##$DPNAME0= <>
##$DPNAME1= <>
##$DPNAME2= <>
##$DPNAME3= <>
##$DPNAME4= <>
##$DPNAME5= <>
##$DPNAME6= <>
##$DPNAME7= <>
##$DPOAL= (0..7)
0.5 0.5 0.5 0.5 0.5 0.5 0.5 0.5 
##$DPOFFS= (0..7)
0 0 0 0 0 0 0 0 
##$DQDMODE= 0
##$DR= 18
##$DS= 0
##$DSLIST= <SSSSSSSSSSSSSSS>
$$ [...]
##$SUBNAM2= <"">
##$SUBNAM3= <"">
##$SUBNAM4= <"">
##$SUBNAM5= <"">
##$SUBNAM6= <"">
##$SUBNAM7= <"">
##$SUBNAM8= <"">
##$SUBNAM9= <"">
##$SW= 16.880792210976
##$SWIBOX= (0..15)
0 0 2 0 0 0 0 0 0 0 0 0 0 0 0 0 
##$SW_h= 3378.37837837838
##$TD= 16384
##$TD0= 1
##$TE= 0
##$TE2= 300
##$TE3= 300
##$TEG= 300
##$TL= (0..7)
0 120 120 120 120 120 120 120 
##$TP= (0..7)
150 150 150 150 150 150 150 150 
##$TP07= 0
##$TPNAME0= <>
##$TPNAME1= <>
##$TPNAME2= <>
##$TPNAME3= <>
##$TPNAME4= <>
##$TPNAME5= <>
##$TPNAME6= <>
##$TPNAME7= <>
##$TPOAL= (0..7)
0.5 0.5 0.5 0.5 0.5 0.5 0.5 0.5 
##$TPOFFS= (0..7)
0 0 0 0 0 0 0 0 
##$TUNHIN= 0
##$TUNHOUT= 0
##$TUNXOUT= 0
##$USERA1= <user>
##$USERA2= <user>
##$USERA3= <user>
##$USERA4= <user>
##$USERA5= <user>
##$V9= 5
##$VALIST= <valist>
##$VCLIST= <CCCCCCCCCCCCCCC>
##$VD= 0
##$VDLIST= <DDDDDDDDDDDDDDD>
##$VPLIST= <PPPPPPPPPPPPPPP>
##$VTLIST= <TTTTTTTTTTTTTTT>
##$WBST= 1024
##$WBSW= 4
##$XGAIN= (0..3)
0 0 0 0 
##$XL= 0
##$YL= 0
##$YMAX_a= 444104
##$YMIN_a= -409673
##$ZGOPTNS= <>
##$ZL1= 120
##$ZL2= 120
##$ZL3= 120
##$ZL4= 120
##$ABSF1= 10
##$ABSF2= 0
##$ABSG= 5
##$ABSL= 3
##$ALPHA= 0
##$AQORDER= 0
##$ASSFAC= 0
##$ASSFACI= 0
##$ASSFACX= 0
##$ASSWID= 0
##$AUNMP= <proc_1d>
##$AZFE= 0.1
##$AZFW= 0.1
##$BCFW= 1
##$BC_mod= 2
##$BYTORDP= 1
##$COROFFS= 0
##$CY= 11.3945322036743
##$DATMOD= 1
##$DC= 2
##$DFILT= <>
##$DTYPP= 0
##$F1P= 16.9975609425685
##$F2P= -3.02152046262296
##$FCOR= 0.5
##$FTSIZE= 0
##$FT_mod= 4
##$GAMMA= 1
##$GB= 0.15
##$INTBC= 1
##$INTSCL= 1
##$ISEN= 128
##$LB= 0.24
##$LEV0= 0
##$LPBIN= 0
##$MAXI= 10000
##$MC2= 0
##$MEAN= 0
##$ME_mod= 0
##$MI= 1.114404
##$NCOEF= 0
##$NC_proc= 0
##$NLEV= 6
##$NOISF1= 3.799351
##$NOISF2= 2.8
##$NSP= 1
##$NTH_PI= 0
##$NZP= 0
##$OFFSET= 15.70392
##$PC= 1
##$PHC0= -9977.495
##$PHC1= 23.2009
##$PH_mod= 1
##$PKNL= yes
##$PPARMOD= 0
##$PSCAL= 0
##$PSIGN= 0
##$REVERSE= no
##$SF= 200.130013532006
##$SI= 16384
##$SIGF1= 3
##$SIGF2= 2
##$SINO= 400
##$SIOLD= 16384
##$SREGLST= <1H.CDCl3>
##$SSB= 0
##$STSI= 0
##$STSR= 0
##$SW_p= 3612.71676300578
##$SYMM= 0
##$S_DEV= 0
##$TDeff= 0
##$TDoff= 0
##$TI= <>
##$TILT= no
##$TM1= 0
##$TM2= 0
##$TOPLEV= 0
##$USERP1= <user>
##$USERP2= <user>
##$USERP3= <user>
##$USERP4= <user>
##$USERP5= <user>
##$WDW= 1
##$XDIM= 8192
##$YMAX_p= 0
##$YMIN_p= 0
$$ End of Bruker specific parameters
$$ ---------------------------------
##NTUPLES= NMR FID
##VAR_NAME=  TIME,          FID/REAL,        FID/IMAG
##SYMBOL=    X,             R,               I
##VAR_TYPE=  INDEPENDENT,   DEPENDENT,       DEPENDENT
##VAR_FORM=  AFFN,          ASDF,            ASDF
##VAR_DIM=   8192,          8192,            8192
##UNITS=     SECONDS,       ARBITRARY UNITS, ARBITRARY UNITS
##FACTOR=    0.000296,      1,               1
##FIRST=     0,             0,               0
##LAST=      2.424536,      0,               0
##MIN=       0,             -409673,         0
##MAX=       2.424536,      444104,          0
$$ Real data points
##PAGE= N=1
##DATA TABLE= (X++(R..R)), XYDATA
0 0 0 0 0 0 0 0 0 0 0 0 1 -8 8 -8 16 -16 24 -28 32 -40 48 -60 72 -84 100 -118 140 -161 186 -214 247 -283 323
33 323 -366 415 -471 529 -595 667 -746 834 -928 1031 -1144 1268 -1403 1551 -1710 1887
49 1887 -2079 2290 -2523 2779 -3061 3376 -3729 4123 -4573 5082 -5674 6369 -7195 8197
63 8197 -9443 11043 -13175 16169 -20718 28647 -78770 444104 -94195 -409673 281995
74 281995 59501 -169795 41468 161729 89771 -13755 43926 232064 19582 -21226 78920
85 78920 166133 13309 -71672 155773 75838 -124483 26500 135932 -69447 -65544 43155
96 43155 36464 -30151 -81841 85210 20810 -85704 4487 76320 -21278 -44580 28832 55921
108 55921 -5321 -90736 79130 41544 -91592 -12683 74785 -3087 -113213 33960 60594
119 60594 -93706 -64906 103959 -37703 -81854 67190 -7704 -28168 -6960 441 7248 20110
131 20110 -55363 16140 69225 -89766 -17657 69159 -25380 -80442 49382 25986 -64259 -9380
143 -9380 26920 -4867 -55657 24976 25039 -11133 -29675 30298 37011 -46116 26887 29938 -3201
156 -3201 5524 34817 12137 12040 3207 10134 39749 -21586 25799 14858 -4554 11095 7695 -13653
170 -13653 -12790 22085 -22941 -4488 4534 -4032 -38317 6314 14512 -50315 5795 9823 -10605
183 -10605 -18142 15015 334 1402 -6037 68 45779 -19091 -1070 36686 29192 -32637 7325
196 7325 63703 -17207 -23656 44760 34214 -61276 8592 33275 -21645 -39101 -6494 34514
208 34514 -49552 -46357 11146 5504 -74973 -31719 33484 -31557 -68238 -7023 48984 -74183
220 -74183 -52934 51675 3992 -73075 3939 72200 -42833 -42889 47229 49704 -54173 -358
232 -358 74884 9954 -20941 9225 79056 -949 -43525 56823 81607 -57236 -17869 113786
244 113786 -9155 -61929 40270 74610 -57253 -31369 75804 3719 -62798 -3122 56771
255 56771 -33337 -48267 9768 39958 -40875 -61216 48062 12108 -72864 -27197 77967 -31160
267 -31160 -80021 46688 44442 -69009 -38410 81227 -11976 -60275 22433 54334 -33742 -40183
279 -40183 45469 20271 -31323 -27848 58797 8660 -54942 7389 51209 -18757 -62790 49624
291 49624 36934 -61782 -26081 81291 -27508 -75503 55148 17112 -45702 -15295 34565
302 34565 -5744 -30354 -11142 26366 -5 -47605 19011 29975 -15344 -44581 42062 29984
314 29984 -60961 11004 57664 -18778 -36504 56253 15925 -27654 4962 39091 8564 -22032
326 -22032 34038 16695 2505 -3567 17984 23798 -5889 -6436 30073 20297 -35265 20157 15681
339 15681 -15404 -12550 11328 5969 -33056 529 1779 -19419 -26206 2715 -20119 -17004 -2178
352 -2178 -25458 -4566 -15008 -10652 -15880 3106 -9613 -14250 9403 -3206 -4858 -3926 9117
365 9117 -10276 12957 -2075 -4785 21141 -8545 -7486 10742 15198 -24740 8349 23665 -7779
378 -7779 -11996 17650 21038 -27582 11411 23763 3362 -10065 14661 22785 -7083 -5855 11259
391 11259 29469 -24873 -5756 32593 1273 -33499 4809 34591 -35911 -19801 27565 9397
403 9397 -44462 1118 32135 -22351 -23198 10431 28944 -25526 -13881 29414 16411 -33304 -3466
416 -3466 52299 -12710 -30421 25515 43575 -40483 -20151 53006 -3743 -43670 13314 41458
428 41458 -37911 -25250 23032 11558 -40033 -23961 35317 -11074 -43945 -5985 36107 -35018
440 -35018 -48666 31544 17879 -55152 -19912 58346 -25796 -48448 27176 31502 -40752 -20239
452 -20239 49334 2532 -33077 1814 45096 -12813 -28708 26558 34307 -19055 -27148 54168
464 54168 16107 -42875 8155 61119 -18030 -33862 54327 25401 -32676 -3119 56249 -6022
476 -6022 -27347 27250 27596 -14715 -21253 27833 9963 -26002 -22420 31964 -2106 -51351 6887
489 6887 21578 -34675 -42938 33168 -2475 -49531 -1086 27624 -23351 -33778 27185 2791
501 2791 -18419 -5361 22329 6450 -16795 3407 21680 6681 -26219 20652 23251 -14668
513 -14668 -14139 27706 9768 -36117 14054 19993 -17585 -16362 23593 -2941 -20320 3803 3055
526 3055 -826 -14380 5886 2028 -1092 -10620 575 12808 -12677 -4217 12468 8492 -18634
539 -18634 13838 12551 -12193 6701 12627 2898 -2946 20068 -326 3646 13124 4043 1609 12536
553 12536 13007 -10757 16934 8455 -5486 1180 9974 -161 -6595 6484 -4065 1461 -11541
566 -11541 -3053 -493 -6451 -14497 -5347 9649 -24136 -11442 6843 -6011 -28229 3672 11116
579 11116 -23833 -8009 7712 1132 -21395 3286 8555 -3189 -9991 1314 19444 -10518 -9918
592 -9918 11189 19466 -20442 -3867 32860 -4960 -21779 16568 27426 -28397 -4862 28080
604 28080 3995 -24101 4926 28103 -17404 -14153 13360 17688 -20559 -10761 26380 4687 -28285
617 -28285 108 38392 -21032 -22880 28426 18991 -31427 -4424 39428 -11255 -22547 17811
629 17811 26356 -22660 -8482 25849 7172 -18118 -7192 32944 -3913 -24588 12184 27164
641 27164 -23329 -20667 32731 3266 -31478 -1117 35768 -22289 -27381 23172 7350 -25863
653 -25863 -11184 23177 -5528 -22881 -3005 21886 -13934 -28268 16513 12614 -22651 -20068
665 -20068 31392 -1573 -35725 8213 26671 -21725 -22685 32006 1765 -23732 724 24226
677 24226 -7269 -18208 16068 14494 -6728 -12990 22248 10747 -13884 -2823 28500 4866
689 4866 -25488 24631 21529 -17164 -6519 32497 1659 -18267 15460 16807 -6333 -10498 19521
702 19521 1704 -7842 -761 8917 4367 -15593 1128 9940 -4144 -21015 11041 6409 -20092
715 -20092 -4173 9947 -5632 -20887 9730 199 -13558 -3428 5416 -5230 -8656 4289 -5872
728 -5872 2661 -4436 -1957 3156 1300 -5136 -926 9315 -8478 750 4993 1910 -6657 5268
742 5268 3429 -7651 7267 -2494 -1782 3125 3858 -9176 4736 6112 -11482 3061 4635 -1065
756 -1065 -9063 9804 1506 -7551 2377 3770 1739 -3466 5005 923 8549 -5845 402 14837
770 14837 -3809 -4362 10171 13141 -12992 3110 16367 -2283 -11771 11429 12276 -16280 3431
783 3431 7834 962 -10195 -1091 10597 -4936 -11188 2506 12682 -15988 -8880 10211 4383
796 4383 -20929 -3321 22010 -17097 -15046 12785 6416 -22476 -2425 14424 -5963 -15749 846
809 846 15305 -16319 -10304 8472 6929 -15138 -10133 21030 -1629 -21355 5367 23328 -20025
822 -20025 -10211 23342 3839 -18237 1498 25880 -11215 -11514 15746 12740 -12959 -2762 18896
835 18896 3552 -10195 -1575 25085 -4383 -14943 17507 16511 -15557 -6934 29018 -1662 -17125
848 -17125 10381 20908 -14496 -9010 20049 910 -11624 -2420 16289 -3482 -12756 2366 12483
861 12483 -8044 -18164 15485 4219 -18530 -6710 19293 -8666 -21225 11213 7237 -16002
873 -16002 -9526 17430 -5771 -13079 3017 7926 -4091 -11630 7735 5993 -5471 -9879 13538
886 13538 3692 -14730 2484 12827 -3947 -15452 15515 4266 -14367 -1286 11935 -5090
898 -5090 -11245 8652 161 -4091 -6086 5307 568 -4922 -1293 3796 5656 -8949 3949 8165
912 8165 -682 -6435 11310 7037 -8574 8161 7159 325 -2171 10155 1142 -511 5976 1384
926 1384 2816 327 2561 -3486 5996 -2185 -3453 3971 -1881 -3188 -2037 2836 -8116 -407 -1573
941 -1573 -4235 -1280 -3019 -4520 -4608 3700 -10436 -1878 3390 -6143 -7332 4304 1783 -13151 3954
956 3954 2702 -3620 -5204 5189 1634 -5148 2146 645 4733 -5153 514 5918 3046 -8006 2288
971 2288 11940 -9629 -2980 9679 4367 -13499 4975 11759 -8682 -4978 8306 6587 -10632
984 -10632 3326 7255 747 -6143 2358 11888 -3809 -4222 6654 13210 -10418 -1984 17391 327
998 327 -11020 8100 16793 -12901 -2424 13365 3061 -11531 2848 11868 -7093 -5562 2073
1011 2073 9032 -9871 -8815 7897 3682 -14556 -5733 15881 -10063 -14738 6780 8479 -17854
1024 -17854 -6715 15106 -6469 -12528 1800 9610 -10788 -6730 6674 4392 -9062 -6301 13822
1037 13822 -2381 -10510 1351 13480 -7508 -10555 13709 5557 -12731 -2412 18224 -7092
1049 -7092 -9796 9346 7491 -8080 -5045 13183 -809 -6679 594 11303 -1470 -7434 5501
1062 5501 9207 -3885 -8612 15801 2905 -10194 3823 13578 -5389 -7913 13760 2644 -6823
1075 -6823 650 10558 -3366 -4183 4176 2511 153 -7283 5091 3267 -5507 -6099 7676 -294 -12896
1090 -12896 3817 4091 -6991 -8731 8491 -3301 -9404 1735 624 -4095 -5372 3099 -2563 -1104
1104 -1104 -3837 666 1824 -4116 -1169 1874 3159 -7390 3338 3548 -4505 -1524 3871 293 -5635
1119 -5635 4759 -1336 -1201 -181 1112 -1325 939 2445 -4048 5110 646 -1256 1058 5541 -936
1134 -936 -591 6985 -148 1771 1407 4039 92 3534 650 840 5859 -2954 1087 3719 2319 -6340
1150 -6340 4426 4957 -6816 -506 4509 -462 -7987 4797 826 -4476 -2442 1465 545 -5640 -580
1165 -580 -27 1913 -7304 -847 5233 -3853 -7064 2999 5866 -11999 -738 7554 -3413 -9167
1179 -9167 4949 4239 -9985 -1042 3634 1035 -7891 346 4235 -1810 -5511 281 8104 -6743
1193 -6743 -4117 7943 5429 -10288 1751 13006 -5743 -4695 8365 7528 -9398 1830 9469
1206 9469 -1199 -5121 2849 8305 -4625 -2663 3548 6556 -6189 -3595 10519 828 -7972 2420
1220 2420 12860 -7378 -4461 10617 4040 -8377 1842 12111 -5616 -4200 4592 5380 -6311
1233 -6311 -3361 5297 161 -6018 -3724 7917 -4736 -9492 2144 5742 -8962 -7531 9663 -2694
1247 -2694 -9355 885 7368 -7600 -4429 6306 432 -4456 -3084 6018 -1303 -4618 -692 5982
1261 5982 -1906 -8139 5589 2981 -6008 -4538 9169 -2127 -7520 4898 4517 -4680 -3519 8446
1275 8446 -1146 -2354 1343 4794 391 -2164 3774 2617 973 -3164 5828 3398 -3119 420 6250
1290 6250 795 -5485 6179 2368 -2569 -109 5059 -1024 -2709 3582 -296 746 -1260 1501 -135
1305 -135 1151 -2106 -275 3151 -4317 -357 1474 165 -4698 1773 -341 -4196 408 -1227 -1634
1320 -1634 -2956 1113 -4389 -885 -91 -4796 -966 880 -2147 -4759 3689 -1872 -3319 672 866
1335 866 -1420 -2091 3202 -1204 761 -603 1310 1501 -84 -416 2175 3989 -4454 2767 4464 -1503
1351 -1503 -2415 5623 2852 -5070 3605 3732 -727 -2853 4764 1535 -1787 1159 1291 3349 -3259 -145
1367 -145 3485 1797 -5405 2316 6544 -5090 -2074 5182 2548 -8001 3414 5982 -4143 -2294
1381 -2294 4457 2448 -5757 1291 2482 298 -4326 -256 4076 -3090 -4831 568 4578 -8089 -3437
1396 -3437 5825 -1577 -8851 815 5299 -9181 -3052 3878 -134 -7286 112 3750 -3725 -3285 148
1411 148 4426 -3831 -2708 3357 3622 -4957 -2176 9110 -1614 -4744 4860 7122 -6028 -639 8540
1426 8540 -89 -3613 2876 6778 -3220 -729 4042 3044 -2092 -1836 5480 1076 -3494 -682 7207
1441 7207 -3287 -5134 5171 2706 -5471 -1896 7721 -3632 -4259 2881 2603 -4363 -1611 3966 -1168
1456 -1168 -1545 -1705 3509 -662 -3286 509 3179 -1375 -4984 4821 440 -4499 -1062 4516 -3303
1471 -3303 -4396 3492 -770 -3298 -2106 2151 -2892 -2480 -745 -227 -487 -3630 261 90 -1009 -3445
1487 -3445 2253 1029 -3634 956 2254 -716 -2689 4088 -127 -880 1905 1622 672 441 2481 -105
1503 -105 3036 136 1268 2489 2113 -8 1123 4057 -1875 1442 1979 313 -500 1212 398 -1263
1519 -1263 1103 -1911 466 -96 -708 -2082 1300 113 -4013 1874 350 -2109 -1547 2934 -1174 -1891
1535 -1891 1534 53 -47 -1580 1595 -388 -241 -1737 298 1284 -3315 -1251 1181 -48 -5354 1956
1551 1956 1087 -4601 -1444 2183 -559 -4778 1843 618 -1874 -1664 1290 982 -1872 -272 836 2998
1567 2998 -3545 84 4248 -577 -3128 3294 4363 -4971 1106 4998 204 -3695 4039 3489 -2837
1582 -2837 750 2771 2037 -2105 1021 3001 1540 -2124 930 5760 -2049 -1836 3422 3520 -4891 460
1598 460 5558 -2454 -3238 2795 2950 -5549 -178 2404 -1042 -3104 -384 2239 -2690 -2612 -588 2656
1614 2656 -3609 -3206 2848 279 -4764 -1028 5231 -4589 -3234 3916 1281 -5092 -134 3650 -3306
1629 -3306 -1823 617 1699 -2760 -1411 1186 710 -1898 -2687 3671 -470 -3014 553 4348 -2708
1644 -2708 -2512 5024 426 -2599 1044 4838 -1665 -466 2914 1289 -537 -234 3094 515 431 -735
1660 -735 2668 823 -2406 1361 2196 -802 -2590 4071 151 -2693 1025 2053 -1585 -1599 2729 -1090
1676 -1090 -305 -138 743 -580 -280 -290 -22 1087 -2594 589 891 -1038 -2210 1212 24 -3335 1096
1693 1096 -157 -1349 -1796 800 -1462 -1025 -14 -1575 384 -1393 -782 -1152 1080 -1760 -1116 1446
1709 1446 -994 -804 105 1641 -1686 718 649 -20 652 17 953 23 1408 -1022 1833 1472 -654
1726 -654 949 2336 320 -1655 3366 755 -970 1162 2549 -10 -655 1941 184 865 -1067 1200
1742 1200 772 -413 -1032 1177 1499 -3258 567 1835 -926 -2713 2025 619 -3219 169 873 -852
1758 -852 -2854 1178 -148 -1478 -1056 -215 1128 -2515 -910 750 271 -3702 240 2254 -2870 -2379
1774 -2379 1946 1315 -4318 969 1868 -1743 -2205 1531 1111 -2272 229 661 989 -1954 -217 2066
1790 2066 46 -1968 561 3722 -2702 -1017 3239 855 -2802 1689 4060 -2486 13 2755 1678
1805 1678 -1872 1321 2248 332 -24 261 2669 -420 -956 970 2841 -2085 -944 3686 -523 -2073
1821 -2073 976 2938 -3043 -573 2284 -809 -2086 103 1439 -2081 -712 -564 640 -1260 -1790
1836 -1790 458 238 -1552 -2401 2352 -1050 -2713 976 1448 -2633 -1682 2567 -1948 -1793 276 1018
1852 1018 -1921 -388 885 -425 163 -1683 850 426 -695 -1077 1576 453 -2197 1827 1075 -779
1868 -779 -674 2765 -740 -1037 2104 287 -81 192 1519 -270 1289 -42 470 1271 -184 644 835
1885 835 1678 -1444 1262 1376 -620 -208 1077 281 -1198 1456 -527 14 -126 254 -297 140 21 -1565
1903 -1565 1264 -753 -711 -396 725 -1694 -1144 897 -1576 -801 -496 50 -1487 -317 -379 -890 191
1920 191 -1449 53 -126 -324 -1819 1152 213 -1939 882 463 -637 -1193 1893 -525 -920 557 750
1937 750 322 -492 1111 262 793 -580 684 1447 -539 -7 1429 1273 -1718 1501 1541 -553 -234 2342
1955 2342 833 -1543 1612 633 390 -649 1317 1054 -100 125 481 1757 -1522 111 1597 192
1971 192 -1994 901 1898 -2294 -361 1236 -109 -2485 1248 397 -1576 -426 -117 217 -1833 -518
1987 -518 1 363 -1653 -829 1277 -1201 -1598 79 1448 -2873 -554 1470 -927 -1906 597 860 -2137
2004 -2137 496 391 254 -940 50 617 79 -83 -560 2105 -532 -928 1176 1406 -1215 -108 2737
2021 2737 -964 -505 1363 1669 -1473 749 1724 -534 314 -13 1137 -165 90 -47 1212 227 -1086
2038 -1086 1404 447 -932 -677 2179 -1105 -1256 1493 -40 -1123 -360 1279 -1062 -343 36 18 -451
2055 -451 -486 -301 -768 137 -1837 586 13 -1365 -660 369 -471 -2016 1094 -782 -1159 -594 539 -981
2073 -981 -728 457 -1074 219 -549 -30 26 588 -786 -247 1360 -1109 -16 668 618 -1047 1133 776
2091 776 -417 662 321 666 108 1409 -172 978 613 -312 769 639 417 -580 2081 -140 -96 714
2109 714 492 -353 98 1225 -884 568 -5 186 57 -276 -140 -70 298 -1335 650 330 -746 -825 878
2128 878 -364 -1511 1037 -185 -863 -894 442 -730 -887 -43 -435 28 -1079 129 -196 -11 -1490
2145 -1490 32 650 -1787 -299 247 -107 -1694 924 160 -1311 -98 712 378 -921 1038 26
2161 26 441 -183 409 1116 -158 53 427 1628 -1161 614 1568 -290 -509 1070 1375 -1267 718 1252
2179 1252 270 -395 1028 595 -411 602 -322 1164 -514 -166 395 516 -802 -275 1400 -747 -353
2196 -353 284 881 -1770 13 778 -1239 -478 42 225 -1099 62 -553 19 -481 -1078 535 -321 -984
2214 -984 -659 1010 -1034 -1123 906 134 -934 -562 1021 -1357 -287 306 -27 -533 -154 615 -284 332
2232 332 -618 461 163 -288 67 1000 249 -831 1475 379 -545 220 1506 -229 1 1379 201
2249 201 318 304 892 -55 606 226 247 1356 -460 537 471 304 -1001 1020 522 -908 339 442 -161
2268 -161 -656 1040 -600 -449 101 -204 -98 -424 -262 -893 406 -871 -386 399 -419 -827 -157 542 -1306
2287 -1306 -130 -113 -444 -548 129 -114 -1030 331 -505 222 -202 -4 -428 702 223 -977 879 33
2305 33 -159 -7 979 -711 -341 982 -406 186 215 706 -278 728 -64 254 926 -80 462 544 741
2324 741 -690 1084 784 -477 365 669 314 -579 1132 -103 248 223 415 138 -267 207 -207 692 -634
2343 -634 97 250 7 -699 54 525 -1222 -55 -1 -545 -901 301 -154 -1116 212 -464 -333 -884 -192
2362 -192 -470 -346 -379 -570 483 -878 -483 -203 340 -1131 -30 771 -621 -248 172 259 -767 491
2380 491 66 -101 -66 98 438 -178 36 -397 858 126 -490 626 363 -99 118 1366 -311 301 845
2399 845 333 -331 120 836 -184 766 59 542 235 269 -52 383 8 -547 712 116 -356 -226 667 -484
2419 -484 -502 706 -486 -403 -288 415 -817 -23 -137 -427 -191 -549 -50 -257 -19 -826 336 -103 -1141
2438 -1141 -152 245 -261 -883 629 -580 -700 144 -20 -327 -336 526 -533 307 -119 -179 26 -12 -161 258
2458 258 857 -389 362 410 210 -212 625 534 -262 766 377 291 134 791 -243 268 437 -227 642 86
2478 86 209 -16 755 -79 -286 691 -51 -41 -269 411 -685 153 133 -432 119 -73 89 -268 105 -779 -37
2499 -37 -345 -597 -243 211 -329 -917 106 -503 -517 -132 25 -509 -368 262 -449 218 -549 -146 -48 -163 -318
2520 -318 -239 406 -443 -25 93 14 -326 524 234 -563 536 304 172 -61 317 95 185 214 171 488 -43
2541 -43 11 77 820 -70 -32 876 -93 -128 402 452 -425 669 368 222 225 211 571 -113 475 -257 445 -137 -165
2564 -165 309 262 -109 -504 649 -160 -310 0 141 -755 65 413 -620 126 -174 26 -508 98 -206 -498
2584 -498 -61 -482 105 -333 -217 -423 422 -337 -415 564 -124 -256 -125 674 -399 10 397 -12 13 -258
2604 -258 278 -47 410 -87 70 270 -19 282 546 555 -218 734 0 -64 134 554 206 -139 936 69 58
2625 58 231 183 213 -3 20 -95 246 -287 166 296 -25 -239 34 96 -884 199 -76 -99 -391 302 -188 -382
2647 -382 -115 -374 -74 -322 -72 -460 132 -425 -336 168 -244 -322 -185 244 -651 -51 -235 -159 -173 -193 175 -518
2669 -518 279 -402 133 -145 100 189 264 310 -533 480 54 -215 131 620 161 -170 474 -82 471 206 525
2690 525 -245 368 254 82 472 -335 296 375 259 -12 314 302 -404 240 283 104 -32 584 92 -125 -39
2711 -39 -85 208 -190 235 10 128 -213 115 60 -323 -479 -186 330 -714 -94 -56 -324 -389 -138 -36 -616
2732 -616 204 -381 -161 -319 26 -332 -176 -87 -288 308 -287 8 -80 365 -312 21 398 -68 -108 47 392
2753 392 -242 488 125 -160 422 115 162 -95 172 51 340 -34 -166 276 196 -42 -129 760 -149 -156 257 279
2775 279 -158 90 405 -162 -56 -110 59 -180 -22 -31 -145 117 -335 382 -59 -208 -289 202 -151 -446 73
2796 73 -277 -285 -382 38 -462 -319 -119 -296 19 -487 -188 -355 47 -420 -267 112 -531 -77 -124 115 -427 403
2818 403 3 -382 148 -115 -52 -213 213 101 172 194 187 133 16 91 134 325 -88 121 338 294 155 7 557
2841 557 61 142 239 81 298 232 247 31 334 -71 538 -226 75 -49 282 -411 -230 491 -311 -304 7 427
2863 427 -422 -122 24 -30 -102 -280 112 -315 245 -251 -226 123 -405 -244 74 -217 -703 244 -133 -359 -141
2884 -141 24 -188 -470 178 -185 -176 -227 150 -50 -32 110 -61 112 -400 -48 163 -2 -143 74 288 -324
2905 -324 244 60 218 -165 136 332 41 402 71 283 -115 378 99 407 -76 -85 419 -19 -245 88 462
2926 462 -161 186 216 -237 -106 77 130 -282 119 -204 -11 -115 -6 29 -136 56 -475 262 -259 -23 68
2947 68 -76 -369 -252 299 -319 -107 -380 -49 -485 -191 -56 -206 -101 -5 -66 -218 -2 -103 -54 -119 -326 107
2969 107 159 -156 41 294 -68 211 140 -27 -98 160 222 -146 217 51 165 486 -76 249 171 203 -132 546
2991 546 200 -12 336 288 482 -112 102 -6 -7 -257 143 -124 18 94 -312 108 -365 -116 -177 -130 73 95
3013 95 23 -424 -24 -157 -198 -262 27 -127 8 -296 -341 -24 -248 -46 -391 24 -95 -239 348 -335 -584 80
3035 80 49 -161 34 365 -344 -199 -112 326 -106 117 -38 202 -5 131 80 213 134 29 252 15 11 256
3057 256 236 -37 -87 508 78 -128 42 376 124 113 473 -28 313 119 120 106 -115 -172 170 173 -486 262 27
3080 27 -87 -75 67 -4 -357 61 -205 -165 -319 292 -325 -121 -169 -261 -14 -327 71 79 126 -285 110 -276 -130
3103 -130 -238 93 109 -451 -68 -333 -107 -45 -81 37 -113 49 122 21 -242 259 5 0 252 17 397 -91
3125 -91 108 253 169 -38 76 115 -70 401 386 53 -44 277 -193 253 -50 -350 185 12 136 -150 522 -163
3147 -163 -118 137 113 33 -39 412 44 84 -68 -138 -86 -137 -141 -108 -26 -539 41 -343 -378 -143 -66 45 -625 376
3171 376 -129 -160 -181 79 -199 -238 100 -276 -163 -150 -16 -70 132 57 -63 79 -112 64 -91 -165 -268 272
3193 272 104 -116 -84 150 30 -263 357 82 -27 15 16 247 6 244 -62 247 243 50 559 -118 -63 79
3215 79 367 -150 138 146 -37 8 -86 248 -291 154 -319 493 -48 -179 2 6 101 -120 175 -361 -64 -210 31
3238 31 -402 132 32 -240 -267 -96 -172 -227 44 -40 -97 -109 -146 48 -257 -126 2 185 -259 -55 417 -53 -43
3261 -43 -292 452 -36 -299 169 -220 -6 -281 263 -130 476 -79 222 149 44 206 42 39 -44 356 186 147
3283 147 203 223 139 -16 208 10 -97 -120 99 15 312 98 79 76 -65 477 -28 -71 -118 271 41 -178 189
3306 189 273 -259 -396 78 146 -235 50 -20 -146 -148 66 -83 177 -204 55 -33 2 -164 -14 -53 -512 21 -108
3329 -108 -140 -289 265 -129 -16 224 -189 -83 197 116 -73 6 363 -80 144 97 35 -132 338 -72 -62 401
3351 401 28 335 61 -124 101 417 209 -32 321 -19 120 -33 30 120 -25 494 -413 144 236 -111 -433
3372 -433 277 -224 75 35 39 -9 -12 -145 -361 246 -208 -162 98 -5 -303 -147 -66 -366 -177 48 -229 -356 -120
3395 -120 37 -106 -54 -37 -71 -176 221 16 168 -35 -229 233 -113 -199 -93 15 -135 -317 332 -80 -152 266
3417 266 274 -184 176 -110 -19 428 -85 315 31 129 139 436 55 -252 352 136 -173 146 601 -266 99 255
3439 255 15 -186 318 276 -389 132 -96 150 -159 -51 -72 -73 10 -23 243 -86 -271 -112 -54 0 -146 -20 -227
3462 -227 -96 52 -183 -327 -58 0 -165 60 -233 -112 -265 -241 -141 -77 -73 -433 72 -30 -296 -33 651 -330
3484 -330 -202 265 -61 -174 140 336 -152 -24 33 20 310 171 140 -27 276 -227 111 298 254 -80 407
3505 407 53 -61 432 148 -55 98 271 -171 39 152 -23 78 355 164 -310 -14 33 156 118 -245 57
3526 57 -1 222 -339 56 -146 -289 26 -80 -225 -189 248 -68 61 29 -255 38 65 48 -262 -31 -188 -374
3548 -374 -20 -166 -59 -156 -151 -170 -98 -51 -188 -129 9 -182 -141 308 -127 37 197 161 -93 182 217 -318 352
3571 352 220 -158 21 223 84 61 289 -286 351 77 120 -199 169 -102 222 392 -29 -35 77 325 -255
3592 -255 317 152 -269 -292 160 -176 -196 281 -304 -130 249 -270 -178 8 -345 -240 460 -277 -380 118 -69
3613 -69 -223 -31 72 -343 -170 -114 -420 -293 -73 -104 -185 -140 -53 50 -123 -99 -29 225 -230 -175 178 -63 -38
3636 -38 -53 290 -513 161 176 -85 -58 156 311 60 69 -68 149 234 92 254 144 -212 33 342 -154 22
3658 22 279 270 -9 318 253 -93 -111 350 -370 -77 48 213 29 -71 -106 121 -29 -172 -120 151 -84 -32 305
3681 305 -250 -110 -148 98 -259 -177 57 -236 -189 11 -140 -343 -143 -163 -169 -152 -248 -220 -144 154 -172 -55 -176
3704 -176 -418 120 84 9 -183 -29 -253 -252 28 170 0 -39 -10 -355 266 262 -168 223 129 -8 193 302 -27
3727 -27 124 -107 -29 191 194 86 -28 162 -55 -51 297 238 -468 269 196 -288 102 115 41 102 61 42 -210 4
3751 4 -280 -1 -25 -70 -161 -80 -389 -147 289 -470 -154 -48 -21 -190 -10 9 -284 -10 104 -46 -108 108 -144
3774 -144 -84 23 -16 92 105 -56 -68 323 -98 -344 255 -143 -202 100 328 -149 39 342 10 -93 272 -14
3796 -14 -80 373 152 5 -16 488 107 16 -214 -280 201 -183 -147 244 287 -118 41 400 -286 63 308 221 -286
3819 -286 123 227 -281 148 166 -22 -218 141 -136 171 -20 -257 79 -47 -222 -83 154 -355 -343 430 -178
3840 -178 -295 250 16 -314 11 224 -115 -204 -169 3 -180 141 -25 376 -134 -27 109 50 -272 -101 178
3861 178 -142 -218 345 266 -243 78 144 -88 -40 65 282 31 313 354 236 261 172 279 135 7 -41 485 -155
3884 -155 -42 399 31 -28 -21 253 -110 -81 205 -105 104 83 161 -208 33 -69 186 -142 -159 -152 -101 -20 -234 379
3908 379 -452 25 26 -119 -451 -197 90 -363 162 104 89 -58 -102 -62 -285 -68 -305 -55 -269 -166 -191 133
3930 133 80 -86 44 -238 -246 -76 398 -156 34 98 -64 137 144 76 -198 -52 30 -86 58 297 -33 185 137
3953 137 -110 176 67 -233 2 -104 -263 251 325 -144 -24 181 26 -447 283 337 -119 118 -110 60 -113
3974 -113 32 -166 -52 87 -199 71 -213 -298 132 106 -483 -146 201 -134 78 23 -19 -540 43 23 -252 -78
3996 -78 174 32 -167 89 -126 -91 -211 130 -65 -151 -176 -197 73 -173 124 395 47 -165 169 210 -378 148
4018 148 331 234 169 208 127 -103 409 -143 126 -23 -6 237 381 -5 -118 211 -264 -365 57 211 16 -130
4040 -130 264 -130 -76 457 151 -120 -59 -6 -490 -6 -306 -36 -123 -188 -31 134 24 -311 307 -9 -328 -247
4062 -247 240 -471 -145 267 -170 -157 154 105 -448 60 49 -44 -107 -133 -63 -106 0 24 126 -101 -113 172 377
4085 377 -182 -54 275 -281 -198 249 -6 -469 264 186 -180 229 173 -25 66 369 -41 225 129 -58 303 5
4107 5 -163 31 280 -363 93 459 -27 -246 235 192 -294 3 151 -134 -98 -30 -33 -353 -201 -165 -8 -61 -107
4130 -107 0 100 -444 -224 515 -106 -39 318 24 -317 -77 217 -357 45 32 -223 -19 23 -168 -202 149
4151 149 106 117 67 -12 133 198 -95 104 275 -101 -186 -80 284 -200 340 300 -333 58 135 185 -178 101 70
4174 70 -61 50 -108 47 45 174 -97 501 -199 -123 238 172 -391 70 240 -302 -117 228 -12 -341 69 -75
4196 -75 -204 130 -69 -31 161 -282 37 99 -150 -153 164 -183 -149 135 197 -649 -142 169 -457 73 160 47 -328
4219 -328 -28 100 -295 -364 284 72 -207 130 -71 -36 -1 -184 275 -155 68 118 170 -253 -194 308 -22 -50
4241 -50 364 115 -456 81 202 71 -26 491 27 53 127 109 184 63 86 -12 133 -9 108 439 -123 -275 261
4264 261 107 -540 254 188 -280 -86 228 25 -307 -339 -64 -4 -35 -309 202 2 -96 -6 -28 -393 -158 315
4286 315 -140 -149 167 138 -245 282 265 -152 -337 119 -265 -245 200 -47 21 3 -22 23 170 -44 90 386 -142
4309 -142 -49 303 130 -264 263 419 -329 -67 142 60 -139 393 -234 -89 210 133 -194 77 174 162 22 -219
4331 -219 -162 248 -102 -279 191 172 -505 27 521 -336 -75 296 302 -377 30 39 -158 -105 -35 -130 -23 77 -107
4354 -107 244 -85 -174 162 149 -498 18 209 -436 -244 186 -144 -414 260 144 -118 135 243 -20 -212 125
4375 125 78 -36 124 51 165 4 -227 158 390 -315 -29 532 -247 -118 202 7 -127 -47 219 -176 -170 0
4397 0 29 -117 291 -89 96 105 -85 205 -103 -252 -14 473 -104 -405 319 24 -463 369 199 -405 -29 130
4419 130 -432 -177 62 -5 -210 287 -58 187 15 10 -21 -49 -119 108 454 -211 -340 87 -113 -551 -25 152
4441 152 -421 -56 168 -104 -326 189 3 -209 33 9 61 -276 -85 59 265 -56 -44 191 -50 -374 128
4462 128 354 -479 58 229 -414 19 174 132 30 27 272 208 79 161 39 12 183 -77 175 292 56 395
4484 395 47 -186 -103 289 -471 68 292 -151 -254 273 50 -333 106 37 -91 -161 -13 -24 14 -284 -28 -56
4506 -56 74 -396 -163 35 -280 -244 112 90 -298 310 -56 -294 21 275 -125 -77 251 149 -54 206 56
4527 56 81 -230 -229 203 -114 -179 -181 363 -57 -5 243 207 -434 63 280 -135 120 474 -110 -8 16 131 -73
4550 -73 -7 79 -23 -122 -48 17 41 -19 -231 300 74 -154 118 146 -583 133 250 -305 -288 170 53 -342 -45
4573 -45 -161 127 237 31 -118 -109 -136 38 323 -47 -234 121 259 -280 -39 174 -665 49 59 -135 -401 141
4595 141 -35 -163 121 -100 89 -177 81 -69 60 16 -252 64 103 4 210 313 -507 121 230 -277 -183
4616 -183 336 103 -112 423 121 -233 127 253 -31 -66 162 -151 166 -13 -145 41 2 -101 -5 190 -307
4637 -307 -166 446 -108 -472 272 332 -453 289 161 -496 -158 224 -146 -195 27 148 102 -119 -180 109 -131
4658 -131 -521 45 303 -300 -66 284 115 -343 293 416 -364 -136 309 -201 -57 183 188 -87 -35 65 132
4679 132 -107 52 -76 103 -303 -78 206 77 -299 319 288 -421 316 163 -268 -192 181 153 -164 137 262
4700 262 -118 -175 57 269 168 -1 -157 457 -2 -11 415 246 -364 142 347 -282 -95 322 -37 -398 72
4721 72 24 -219 20 -81 141 -161 -143 -65 41 -135 -11 278 105 -223 363 288 -267 -121 294 -238 -434 331
4743 331 177 -306 120 -78 -197 -69 47 176 -20 89 -189 261 57 -72 178 61 -240 -339 422 -316
4763 -316 -133 371 34 32 67 272 -145 95 15 -31 -75 238 116 -59 11 -196 132 33 29 47 527 -168 -191 327
4787 327 -146 -197 139 79 -278 330 -45 -196 -4 304 -56 -175 416 -234 -17 12 160 41 -136 155 -71
4808 -71 78 -295 -172 379 87 -396 -1 -9 -442 116 325 -114 -7 241 39 -243 51 133 -51 146 42
4829 42 197 15 -29 64 75 -73 -54 233 512 -288 298 303 -421 -11 586 58 -521 44 7 -301 -25 -25 54 -287
4853 -287 156 46 347 -171 -209 168 -45 -304 43 284 -428 231 222 -317 -243 206 147 -566 211 253 -16 232
4875 232 -18 -155 -28 9 -68 -18 -266 -430 97 50 -550 221 442 -118 -16 352 98 -403 76 42 -294 -104
4897 -104 165 21 -331 45 112 -6 -79 -191 100 -110 -399 91 382 -373 -144 293 13 -325 397 143 -361
4918 -361 220 398 -163 -166 161 -46 -209 117 76 317 71 -258 86 -85 -278 -195 140 -4 -207 315 0
4939 0 -281 69 291 -288 59 249 -93 -117 171 -47 52 197 -62 285 143 6 -61 261 -198 -93 184 -67
4961 -67 -187 -5 245 -423 -11 282 -335 45 304 -226 -264 522 -19 -266 61 -142 -25 -142 184 -101 297
4982 297 -20 -227 136 55 -159 -11 126 -448 -181 89 13 -106 224 134 -119 215 102 -23 -5 3 38 25 208
5005 208 75 237 -210 12 90 -131 -382 -215 407 -479 -161 261 53 -264 250 222 -302 112 192 -92 -310
5026 -310 186 11 21 -66 -79 186 -279 -229 54 219 -390 -52 249 -176 -337 433 148 -571 153 416 -337
5047 -337 -184 282 80 -91 -74 42 82 -209 -140 -52 44 -115 167 695 -157 70 517 90 -494 -17 637 -404
5069 -404 -33 273 100 -157 437 221 -119 169 99 -111 -66 14 63 429 -225 -210 517 -242 -346 8 281 -264
5091 -264 -9 268 -245 -423 255 -162 -84 5 312 135 -285 111 186 151 -241 45 250 -264 -286 280 377 -400
5113 -400 -63 349 -569 -245 398 39 -229 328 208 -239 87 228 104 -105 136 67 216 -216 -89 315
5133 315 -33 -295 4 324 -128 53 102 38 -264 144 463 -355 27 36 -228 26 200 -24 158 58 -105
5154 -105 4 -224 -148 107 86 39 87 135 -183 -212 177 42 -238 35 86 -249 128 9 12 -138 243 -254 -251 253
5178 253 -11 -155 154 74 -42 29 -310 -352 267 -148 -267 36 140 -439 91 248 -245 39 96 -234 -204 96
5200 96 97 19 54 174 -57 113 -180 -54 5 4 -191 251 88 -176 144 161 -231 -55 413 -163 -323 538 -82
5223 -82 -297 94 35 211 -139 85 -75 -18 7 -82 55 -134 -4 213 50 -439 10 331 -402 24 410 126
5245 126 -406 267 329 -661 -168 330 -37 -203 67 -138 120 -310 66 200 -186 -151 108 517 -394 -37 307
5266 307 -30 -390 287 221 -419 283 105 -8 28 128 20 88 20 183 208 -169 -23 125 299 -325 25 427
5288 427 -346 129 206 -150 -428 95 147 -362 -10 267 -93 -55 206 196 67 182 -52 -2 120 78 128 407
5310 407 -250 45 354 -157 -301 212 372 -157 52 106 -39 -138 206 -88 -146 98 -38 -73 -67 -46 13 289 -38
5333 -38 -330 284 -69 -296 232 238 -312 -71 162 -277 119 438 205 -418 261 -79 -182 28 154 -76 95
5354 95 129 -195 82 -162 -200 280 -9 -224 -89 -65 -299 -137 63 -120 14 165 -3 -253 81 47 -384 110
5376 110 384 81 180 -130 26 217 -81 -33 31 310 -95 191 153 -216 -124 270 -11 -79 551 -102 -79 269
5398 269 -103 4 -231 45 -6 -115 97 -288 163 -176 72 107 39 -76 110 416 -49 -149 64 -49 -543
5419 -543 301 -30 -404 3 185 15 -286 54 -53 -46 -204 272 58 36 -82 -13 -32 -229 -155 211 25 -385
5441 -385 397 282 -369 133 208 -268 -300 294 -20 -256 8 185 159 -26 172 48 107 -41 -137 388 -154 -269
5463 -269 245 118 -605 94 555 -184 86 446 110 -226 383 156 -203 -38 -92 -17 -91 210 -140 190 -235
5484 -235 -55 0 -66 -324 68 145 -358 76 287 -51 -329 77 123 -222 184 165 -228 -65 -113 -152 -51 136
5506 136 -178 116 226 -49 36 -31 -244 -191 247 -129 -149 139 -19 -419 200 68 -151 -89 190 15 88 298
5528 298 -236 -75 -55 -75 42 132 -187 34 523 -277 -325 180 86 -398 312 0 -149 248 159 -408 174 172 -205
5551 -205 -122 211 -278 14 47 -117 -135 236 30 -301 233 -17 -204 150 248 -234 123 238 -208 15 61 -93
5573 -93 -136 212 -253 -134 293 -209 180 -49 103 -175 193 -172 -133 426 104 -128 320 299 -210 248 305 -151
5595 -151 -134 226 104 -283 363 -108 -292 376 -92 -273 -128 177 13 150 -15 51 38 55 -124 27 436
5616 436 -668 -80 348 -247 -68 145 69 -237 73 324 -111 113 67 116 -95 -243 -117 -6 -22 -215 78
5637 78 52 -523 100 648 -368 -141 203 56 -296 300 -17 -205 -228 69 -95 -92 231 -14 155 -40 56 97
5659 97 -8 -101 148 422 -356 31 591 -91 -136 465 280 -392 1 370 -17 -396 154 165 -56 -11 -206 118
5681 118 -37 -187 67 207 42 -59 277 -23 0 -32 321 -181 -131 339 -85 -185 420 257 24 -87 23
5702 23 148 -140 17 72 -37 -179 -52 179 -264 -317 10 178 -193 367 505 -165 -140 132 65 -126 355 94
5724 94 -58 256 -331 -209 287 39 -315 -86 108 -49 358 45 40 -40 133 -103 66 152 -375 -77 201 68
5746 68 -88 407 11 -210 77 36 -24 -52 192 -190 -54 60 6 226 -16 -104 -237 -88 -253 208 102 -8
5768 -8 -35 127 -8 -210 321 124 -374 315 -101 -97 -377 51 -126 209 -3 -22 75 23 39 21 281 -269 102
5791 102 197 -230 -198 330 171 -381 294 252 -274 -184 259 -333 -62 272 150 193 -159 -52 -134 140 -197 -237
5813 -237 210 -69 -43 388 277 -290 46 208 -71 -26 314 -258 -443 223 -78 -72 78 45 127 -105 -179 29
5835 29 253 -240 135 327 72 -466 193 113 -231 65 77 -252 -105 330 379 -107 194 16 -343 53 22 -101
5857 -101 -219 -34 -2 76 -30 16 22 134 -424 72 351 -74 -267 172 234 -531 88 -34 -117 -34 67 -34 -148
5880 -148 237 -23 124 113 -213 152 316 -22 -115 354 -167 183 414 -22 -142 488 93 -367 6 42 69
5901 69 -223 102 -38 -111 171 11 232 -13 -121 30 233 -204 36 320 -196 -191 289 120 86 -220 71 -431
5923 -431 -185 -49 -155 -128 161 -25 104 81 -160 178 108 2 -324 210 96 -120 125 -30 -51 -122 87 -359
5945 -359 -35 93 72 -180 32 -360 -160 152 -46 -105 182 -75 -364 264 155 -41 260 307 -429 114 106 -168
5967 -168 39 416 -556 1 184 -107 -331 128 -190 -203 115 131 -126 76 -86 -104 300 -72 -349 107 44
5988 44 71 54 435 -160 291 239 -182 -186 369 -70 -425 379 53 -151 4 209 -228 -55 109 -259 -125 -110
6010 -110 -143 265 190 -403 -126 556 -223 15 250 -47 -209 362 179 -230 333 280 -65 -102 192 -173 -63
6031 -63 55 84 190 -118 -483 -5 269 -171 106 351 -198 27 224 -157 -283 220 234 -323 2 183 -89
6052 -89 -280 294 -60 -248 -78 72 51 130 -8 311 185 -151 -370 140 -60 -212 167 100 -364 145 289
6073 289 -64 69 -5 -19 84 245 157 401 128 -129 116 -80 -136 -151 369 88 -245 126 194 -288 -169 404
6095 404 -160 -144 62 -174 -159 -10 -73 27 -36 197 -124 -144 -264 -162 255 -112 -251 49 28 1 -42 338 -67
6118 -67 -113 -14 -105 -157 207 -113 -183 -139 37 -125 -87 -63 -113 107 115 -198 201 111 75 -205 265 -224 -71 202 -409
6143 -409 -42 27 -39 -184 223 40 -279 -1 100 -216 -321 142 -35 153 136 -45 -106 41 -113 -346 122
6164 122 10 179 -17 -319 -351 53 8 -433 130 4 -269 -230 319 -179 -51 124 -23 -184 165 130 -163
6185 -163 -13 -29 -125 178 -266 70 140 26 -274 179 198 -234 -49 220 -176 -371 300 -121 -155 145 -16 -55
6207 -55 -42 -33 63 125 -208 189 34 -110 -57 165 66 -199 292 178 -418 23 370 -45 -83 148 -34 -185 -110
6230 -110 170 107 -390 58 1 452 31 -8 320 144 -224 98 252 -383 2 151 -33 -114 177 -61 -313
6251 -313 138 96 -258 91 -49 69 -288 7 -70 -24 37 -167 -94 128 -407 -179 303 81 -212 72 56 -433
6273 -433 2 18 -188 -91 21 -13 -31 81 -250 132 -20 -269 245 183 -260 -13 185 -205 -43 111 56 -214
6295 -214 95 161 -138 40 149 170 352 72 -61 -217 181 -278 158 -210 32 11 153 -137 -183 305 105
6316 105 38 -42 288 -236 252 33 -460 112 18 -88 41 33 -94 -86 129 -9 -51 172 294 -222 227 -111 -155
6339 -155 279 -47 -18 -6 -83 -110 41 323 -413 -185 253 -275 -139 287 -101 -139 81 150 -223 52 146 -215
6361 -215 246 14 -108 -62 174 -96 -234 378 -338 63 58 -328 -190 187 -11 -196 206 21 23 -132 216 21
6383 21 283 151 -115 -115 -3 201 119 155 -463 237 36 -295 -149 375 -75 -361 54 190 -176 122 -29 -34
6405 -34 -207 -84 -12 42 -192 -214 187 392 -109 -152 467 -500 43 -48 -209 -153 103 365 -246 101 165 -97 -221
6428 -221 431 35 89 337 -78 191 102 -84 96 211 -190 60 248 -94 -117 -53 228 -306 188 212 -440 -129
6450 -129 405 203 30 95 29 2 8 -29 -105 94 -1 -166 256 -36 -359 -51 275 -246 4 111 -350 -59 134
6473 134 -219 -209 15 -30 107 413 -425 -216 80 27 -120 289 -165 -317 202 -269 -335 -204 203 -157 -59 174
6495 174 -72 243 25 -17 -189 232 -314 -42 451 109 -304 113 227 -187 76 43 -165 334 141 -120 -359
6516 -359 112 -4 -108 -183 -19 -245 49 150 -121 170 214 -167 129 225 -3 140 194 -29 85 189 119 -226
6538 -226 174 109 -114 14 -80 -165 169 57 -76 374 149 -218 -94 65 -269 -227 66 -256 59 -84 -196
6559 -196 -43 92 -94 -37 6 -133 -129 50 -33 11 126 245 -286 -131 169 -337 -186 348 55 -72 279 -10
6581 -10 201 12 -63 -169 -81 -35 -125 158 -4 -70 7 -39 -26 284 31 -218 225 112 -283 -413 422 94 1
6604 1 180 19 54 93 68 -58 39 21 -249 331 -69 -237 225 162 -412 -1 400 -191 124 -24 192 -239 218
6627 218 -124 -274 -11 36 131 -91 -68 -2 259 10 -107 4 77 -146 -124 146 -219 -212 199 -27 -196 326 50
6650 50 -199 139 1 -6 -76 139 56 98 184 -75 155 169 -100 44 284 -341 -255 278 110 3 -83 4 -62 93
6674 93 124 -95 71 165 -158 -32 232 -268 199 43 -178 126 -85 -240 -50 149 -100 52 159 103 -162
6695 -162 40 92 -65 87 -185 -137 196 85 -154 107 86 99 119 130 192 -141 -50 -162 -268 138 -146 -91 -47
6718 -47 248 -305 153 275 -343 43 148 10 -121 152 64 -16 77 -104 -120 187 119 -286 177 -220 -93 214
6740 214 18 -10 49 70 -117 364 215 -215 -132 171 30 -280 241 -59 225 363 14 -85 -59 205 -174 211
6762 211 -79 88 143 174 -104 83 229 18 -147 32 -69 -205 275 -159 -341 272 195 -6 -103 -90 -212 64
6784 64 119 -240 99 165 -40 112 211 -119 246 249 -219 51 166 -39 -362 23 -61 -226 84 55 116 -171 294
6807 294 -20 -226 232 46 -35 79 -238 -45 192 -273 168 -1 190 -449 238 281 -241 -10 165 52 63
6828 63 297 -260 8 -86 -276 123 201 -196 135 16 -71 -215 78 -128 101 305 184 -186 200 128 -172 -154
6850 -154 -12 -120 175 196 -172 -106 181 -24 -66 134 -174 -177 288 -170 -29 134 -37 -192 -14 2 -325 98
6872 98 60 -141 -3 100 113 178 65 -194 14 229 108 -202 -36 -18 -137 202 -271 7 183 106 -399 61
6894 61 73 -144 10 -138 -118 -253 186 118 120 214 270 -195 -142 3 -306 1 36 -269 179 20 -37 -113 441 -400
6918 -400 91 -57 -280 -200 148 46 -114 227 -242 -125 60 115 -354 55 237 -35 37 170 -18 -243 -5
6939 -5 -103 111 187 -325 15 -55 127 -86 125 80 -56 213 6 -200 58 196 -234 -76 -114 -40 -61 277 199
6962 199 -277 165 -199 34 422 -152 -44 96 -2 -250 192 183 -150 -148 65 90 -215 293 -143 -189 -80 -67 -164
6985 -164 92 6 -49 116 -196 -15 107 -31 -146 102 -87 -448 -35 181 -75 -132 183 86 -201 91 -89
7006 -89 24 285 -76 -252 94 -219 -213 -76 -67 -60 213 87 -18 80 96 89 3 210 -2 199 135 56 -271 -12 50
7031 50 -189 -236 -34 -319 27 -195 -34 102 35 91 74 325 -13 45 284 265 38 31 126 -519 -6 144 -196
7054 -196 221 93 -154 165 55 -154 123 -102 -297 -117 301 -174 37 274 -27 -213 212 309 -298 -27
7074 -27 53 -157 -45 51 -64 -101 71 -145 -18 20 -19 -222 295 -77 -16 31 -263 88 13 74 -71 -31 -149 -451
7098 -451 171 -280 -238 -11 243 -232 50 154 -271 -9 249 159 -94 267 -107 -68 106 -365 169 -102 41
7119 41 -57 127 -92 -149 36 -3 2 27 269 -214 210 189 19 -55 -132 350 -272 195 42 -239 125 -222 -68
7142 -68 -21 260 -105 204 103 -132 174 16 56 -133 335 -247 95 20 155 -128 208 108 -36 -63 -40 175
7164 175 -115 263 -215 127 -27 -196 -274 345 10 -139 85 70 -31 95 -64 148 -65 -66 -79 125 78 -58
7186 -58 379 -6 86 -22 91 -197 193 -30 -20 -173 300 141 -355 309 105 -107 -49 -210 -143 -232 -152 6
7208 6 37 -4 -70 65 29 14 -248 179 -70 -77 31 -252 -310 105 -171 -364 12 -8 31 194 124 -159 -13 69 -118
7233 -118 -223 306 -227 -128 185 -408 105 315 -47 -249 228 94 -252 104 -113 -85 -312 -74 -70 187 82
7254 82 -179 140 -30 -355 -151 295 -57 -129 413 -213 162 234 192 -18 126 211 -121 -8 -17 -183 80 286
7276 286 55 207 6 -152 97 108 -51 22 149 126 -85 103 140 -29 266 241 -269 41 -47 -164 -20 154
7298 154 -50 33 47 -146 145 225 -337 137 124 -93 -93 -37 96 -137 158 135 -80 -206 126 -87 -135 204 19
7321 19 33 -28 164 -40 354 -71 -134 -89 120 -211 -111 111 -61 289 157 -35 68 61 68 67 40 -77 213 319
7345 319 47 -114 131 -144 70 147 -29 -255 -1 190 -294 185 317 75 87 24 10 62 98 -105 105 -74
7367 -74 -249 -145 29 -41 -17 144 117 -114 -47 -146 80 170 135 -277 25 155 -51 2 169 -77 -51 283 -27
7390 -27 -72 123 124 -402 336 39 -9 91 109 -149 -39 205 29 -4 50 -191 -127 163 277 -42 -19 -168 -57
7413 -57 422 87 13 172 238 -132 96 96 -94 43 149 -61 -115 11 -63 -149 -5 -101 3 80 -57 -196 215
7436 215 -3 -287 -152 37 -165 77 -7 -140 -61 277 -14 -32 201 -82 -133 353 61 5 144 129 171 -219
7458 -219 -167 -496 293 190 -180 -228 75 -95 6 136 -4 -240 -134 -41 -140 278 -66 58 -48 22 83 -17
7480 -17 180 -352 -6 11 -223 -44 93 -7 -177 -30 55 86 -18 -232 -63 43 -159 -62 281 100 4 -40
7502 -40 38 -158 -141 184 -175 -42 29 65 -108 50 -160 101 -44 -46 -261 22 -135 -313 36 24 -70 -235 -142
7525 -142 -49 -108 -10 -273 92 -26 -117 -44 266 38 -272 93 -137 120 -57 29 -213 17 191 46 50 152 116
7548 116 -131 395 -13 -131 216 -114 -97 220 -54 16 379 66 -73 63 187 28 -137 50 -253 67 37
7569 37 -12 54 107 -82 -107 174 93 -150 58 15 -92 183 204 -100 -48 -106 -201 -71 89 -27 100 -92 -336 -7
7593 -7 27 -47 -125 153 -233 -322 7 -22 53 194 68 -68 75 130 -147 -91 -250 -38 -339 -116 -50 97 -74 -233
7617 -233 -126 129 -30 26 71 10 7 -51 113 -105 -177 -37 -127 168 413 -41 112 165 18 42 -35 -211 158 226
7641 226 -57 -27 87 122 -411 -18 -43 -219 -129 0 -84 80 145 -67 -109 107 -97 -32 383 57 -50 -96 -98 -160
7665 -160 55 -253 10 151 82 -78 78 -174 144 -92 -27 142 -155 286 54 -120 7 -44 -68 170 62
7686 62 -105 205 74 67 -127 32 -237 -190 145 -309 -46 43 -113 -49 358 -22 -35 225 253 -57 233 434 -143
7709 -143 270 101 159 -25 57 -68 -43 178 -223 -1 107 -49 110 144 87 -2 0 -42 100 -38 -7 -134 240
7732 240 113 -15 -17 79 -13 -42 -46 -77 55 172 306 -3 7 -181 -147 100 -197 -194 290 0 -187 -63 79 -234
7756 -234 -13 18 -113 -65 141 -84 150 -27 -161 -88 177 19 47 96 -60 -48 117 -37 -161 -36 243 -11
7778 -11 -154 217 -186 -189 117 22 -42 406 -123 -148 200 -5 9 141 -13 -51 144 -12 -195 11 85 -67 -118
7801 -118 253 -36 -130 159 -163 76 7 -188 -178 159 -230 -134 49 102 28 220 -133 -443 0 -107 -156 -244 76
7824 76 -26 86 98 -86 209 51 180 -333 -104 -56 3 236 -265 -31 -38 -277 -291 -290 139 -126 168 132 66 25
7848 25 67 38 19 9 7 -69 17 99 -61 200 -100 -62 163 -146 84 88 364 -172 -146 173 37 -120 31 -109 -169
7873 -169 -72 47 125 -202 373 -122 92 6 -151 124 13 -24 44 136 -293 53 180 19 -248 -128 -42 -177
7895 -177 -138 -215 -70 -171 118 -27 136 221 -161 140 190 192 7 27 -202 -96 97 225 169 -66 -302 -88 -37
7918 -37 -114 -102 214 -37 36 177 164 -93 76 138 141 58 202 -39 82 63 -212 -99 276 -6 208 87 247
7941 247 135 297 60 -185 94 294 -151 -35 57 -219 204 121 12 146 68 169 25 24 108 -42 180 -11
7963 -11 -232 35 49 -180 186 218 53 141 76 -118 -10 37 61 -238 53 -279 46 -142 -5 -11 -37 -63 -37 -289
7987 -289 -204 73 101 -42 -267 99 177 -68 -11 195 11 169 253 172 27 -153 260 -133 -92 251 -33 225
8009 225 59 -140 -131 399 -89 -78 280 -2 -66 110 -10 -112 -47 -48 20 28 118 -38 -170 18 -121 145 143 93 -27
8034 -27 77 -170 148 26 -289 -489 133 -47 -190 -33 -264 -194 -123 -283 -42 -174 -133 27 -73 138 46 -102
8056 -102 2 97 -53 72 -53 -146 13 -206 275 -39 229 -25 -49 -360 212 394 206 -165 7 355 -124
8077 -124 -112 379 74 -37 -80 -118 -73 248 132 -166 111 117 182 219 301 35 -154 -61 180 -96 -8 -71 137 112
8101 112 -36 -289 25 -50 -155 38 -123 -250 168 29 -105 -65 -142 -217 -117 -14 -38 90 -49 -64 -79 23
8123 23 -350 -173 -44 32 -169 -70 -89 -166 255 131 140 -10 187 -86 150 -211 -54 -188 143 -67 167 -42
8145 -42 86 -3 23 4 0 15 173 -95 111 40 -67 167 115 -127 223 -144 22 139 146 -55 -146 1 -177 -117
8169 -117 181 -129 65 156 -139 -34 -205 -106 16 -78 280 29 20 150 -140 0 322 -25 -148 136 -42 248
8191B48
$$ Imaginary data points
##PAGE= N=2
##DATA TABLE= (X++(I..I)), XYDATA
0 0 0 0 0 0 0 0 -8 8 -8 8 -8 16 -19 24 -32 40 -48 59 -72 88 -104 128 -147 176 -205 240 -276 322 -371 425
30 425 -484 552 -625 708 -797 898 -1007 1128 -1260 1405 -1562 1736 -1924 2129 -2354 2598
46 2598 -2867 3160 -3481 3833 -4222 4651 -5129 5658 -6253 6927 -7692 8574 -9599 10812
60 10812 -12273 14070 -16342 19317 -23391 29337 -38831 56369 -99353 418876 405864 -371362
72 -371362 431218 324204 -90868 103690 273678 83861 7931 -7158 167794 -17683
82 -17683 -133383 11471 49975 -62992 -177669 17234 24381 -206718 -74457 80098 -96795
93 -96795 -153420 31165 -4037 -52267 -95621 38080 41262 -101932 -4745 81670 -2623 -51903
105 -51903 48977 58606 12685 -54990 62972 103869 -70764 13446 103417 38308 -73882
116 -73882 39118 107366 -51611 -54659 104670 21607 -113007 58801 14058 -68231 -16629
127 -16629 -15351 -21590 -22491 -58356 -51019 39304 -97985 -79733 50471 -38313 -101273 11063
139 11063 39745 -83620 -21960 30732 1526 -42562 20432 52838 -11115 -3300 30282 65716
151 65716 -20777 25443 70394 11340 22956 47153 34758 9417 26724 11007 43970 -5809
163 -5809 815 29421 -23328 -89 -10096 -21938 -34207 1577 -31274 -40652 -12102 -32546 -45154
176 -45154 -30863 9756 -60509 -21886 11092 -27909 -26350 -1705 3585 -18846 2522 -9088
188 -9088 35062 -6862 -19274 37816 18000 -21255 -9715 64710 -7138 -31617 38955 40367
200 40367 -45563 -6701 62151 -15849 -19593 7986 46928 -17585 -37636 35624 25600 -36970
212 -36970 -22718 60732 -6233 -47087 4926 56935 -36305 -61250 65729 19669 -60427 -7670
224 -7670 75631 -28757 -58103 46902 45396 -45140 -27141 77064 2443 -36342 3734 56254
236 56254 6709 -56033 40446 70035 -42951 -49040 102648 8628 -80184 35268 73845 -37680
248 -37680 -52424 79417 15961 -63585 -3712 61796 -16699 -56129 21303 32866 -25543 -66150
260 -66150 38382 22897 -72076 -33759 60972 -12270 -101287 29498 42321 -70072 -60007
271 -60007 64703 391 -85733 11667 44136 -32004 -57940 41053 23754 -34920 -21597 46984
283 46984 28357 -55632 13313 58591 3301 -47638 49806 65594 -42016 -15904 84431 19648
295 19648 -74516 63620 56119 -40145 -2891 46941 12739 -29397 5068 24517 12367 -42063
307 -42063 10046 34321 -23155 -41207 15710 36655 -66595 -15009 49968 -23150 -58482 30287
319 30287 19168 -54308 -5957 22946 3180 -38068 13760 17128 -18534 -5492 4668 19640
331 19640 -11680 -9103 17213 20966 -33635 2220 30485 -21712 -7178 9003 14237 -26364 -2560
344 -2560 15599 -13294 -15912 7026 3386 -18466 11827 -13238 -2615 186 -8490 -2600 -320
357 -320 3338 -17952 9656 -2368 -9754 -6065 4305 -6136 -2770 7597 -16126 17331 -3813
370 -3813 -10226 12930 17741 -9653 2831 38995 -485 -1401 22378 34615 -10449 10295 42874
383 42874 6634 61 13720 30356 -5658 -4095 11962 22198 -15464 -21731 30492 -4511 -35463
396 -35463 -9810 29661 -31511 -36880 23476 2685 -43956 -18168 33426 -25890 -32548 6893
408 6893 19028 -23128 -29283 25036 7043 -31273 -17275 44429 -8289 -42065 19382 35635
420 35635 -29866 -36344 53482 6634 -44357 9567 46939 -24086 -32345 36479 16823 -24405
432 -24405 -18913 43876 7264 -36668 4453 39840 -10301 -45757 37678 31171 -40935 -22696
444 -22696 58526 -4878 -58504 27683 33893 -33919 -32486 45726 5166 -44008 -3420 34430
456 34430 -7710 -42368 22562 27005 -18822 -33161 38896 25268 -47660 1089 54916 -5230
468 -5230 -47653 45452 31699 -39403 -10975 46708 1971 -44941 20543 21727 -21985 -31174 16340
481 16340 7833 -34792 -23293 16872 5042 -56240 -2330 25232 -28761 -42075 26613 16135
493 16135 -50677 -454 32190 -11515 -36433 26822 16847 -24011 -383 18373 10261 -20225
505 -20225 2935 18709 6545 -22446 9684 30246 -17064 -12155 22021 20299 -30949 9490
517 9490 34598 -11268 -11083 26086 15553 -19216 14550 14916 5876 -2811 8825 14477 -1304 1277
531 1277 279 17893 -6311 -5418 12549 7561 -15569 -174 17869 -18801 -1700 8473 -2555
544 -2555 -11549 6496 -836 -14024 6474 -5497 -6387 -1478 5451 -16988 -1019 8207 -17373 -3966
558 -3966 2896 -462 -13117 4288 -2210 -3887 -4151 -5408 7223 -4542 -3741 -2724 14926 -10091
572 -10091 -10608 17169 2310 -15245 3114 24255 -16783 -6548 14960 4770 -14493 -323
584 -323 16685 -6612 -6422 -1652 15571 -8955 -15943 9806 12697 -14533 -16047 29314 -3536 -27083
598 -27083 9495 26205 -22253 -16117 32243 3386 -21513 -228 31221 -10049 -17248 19225
610 19225 18032 -11131 -13363 29095 8795 -22372 -2384 37217 -8881 -31166 28172 18541 -28646
623 -28646 -15864 36461 -7971 -33710 11926 19723 -24304 -24540 21587 -1659 -25061 -15674 20131
636 20131 -4006 -36076 3728 18982 -20823 -31812 27007 6708 -34311 -4831 32160 -10081
648 -10081 -35283 26505 15111 -21372 -8342 28073 5084 -20066 5641 23926 912 -23999
660 -23999 22168 22402 -14794 -13351 29917 14325 -33669 9948 32270 -11183 -25245 30764 12752
673 12752 -27827 2412 22769 -900 -22923 14960 15116 -9966 -13594 14452 13261 -19003 -4044
686 -4044 18922 7781 -29011 11634 24377 -21283 -12241 24334 6477 -27722 10216 15604 -10043
699 -10043 -15004 12306 5824 -16668 152 4044 3408 -15991 -3036 9640 -4885 -17812 3257
712 3257 13384 -21373 -6067 10310 -1858 -19488 5583 9330 -15989 -1530 5892 -292 -10780
725 -10780 5951 -579 -1017 2001 -3929 6461 479 -1009 -2153 10598 -3082 -2036 9806 1660
739 1660 -1957 2079 10584 -6680 6624 4983 -1804 6613 5208 -2459 1059 13356 -8358 2673
753 2673 9682 247 -4690 6161 8779 -10043 3920 4993 1776 -4242 2453 1587 495 -2194 -8022
768 -8022 11729 -5845 -10240 3846 6705 -14352 -9076 13679 -7283 -15696 2284 11688 -19154
781 -19154 -6033 10152 -5218 -9109 -5049 10800 -4771 -10235 1693 12160 -9735 -11515 14448
794 14448 5043 -13108 -6506 24864 -8010 -18549 16467 9995 -16926 -5674 20431 -3910 -13386
807 -13386 1221 16321 -9255 -13943 14233 6640 -9079 -10320 20211 4230 -20039 4192 24417
820 24417 -10770 -17435 26424 6634 -17023 -1018 25144 -4202 -17529 17452 13145 -10527
832 -10527 -6839 19834 3514 -10808 -1313 19368 2190 -20777 14140 15276 -14549 -13569 23078
845 23078 1723 -25146 5589 16322 -13528 -20221 16630 -304 -18448 -5392 9593 -3983
857 -3983 -19496 495 6944 -6758 -20815 9831 8322 -20116 -7184 16397 -945 -23884 11761
870 11761 13111 -12300 -8411 18375 3864 -15137 8437 10117 471 -8418 9523 10680 -4176
883 -4176 -5474 10365 10958 -14376 2918 13812 -667 -14025 10804 11210 -15858 -972 11843
896 11843 -643 -13174 8763 4686 -6211 -2219 4154 5406 -6493 1902 3644 5884 -6188
909 -6188 473 10283 -2106 -4866 5216 9801 -11432 2458 7611 -3807 -4515 4008 2397 -8307
923 -8307 3669 -2031 -1941 -2881 -1361 -3918 -779 -2 -8995 2787 -3172 -4756 -3113 1378 -5110 -4017
939 -4017 2913 -5689 99 -2269 -1576 -3244 4221 -3695 -4457 8079 -3662 -3867 3929 6882 -9760
954 -9760 2728 9534 -3549 -1490 4455 6186 -5122 4019 3520 3435 -1192 -955 8192 1667 -4083
969 -4083 -971 13550 -5552 -5741 11470 4857 -9325 97 15786 -7273 -5742 9051 7621 -8733
983 -8733 -812 11290 -1992 -4519 -343 10914 -3974 -7261 4650 7976 -8103 -10226 14856
996 14856 -1692 -14661 791 13080 -13317 -12618 11767 -1480 -13934 -4244 10384 -9142 -10225
1009 -10225 1781 4483 -7180 -11984 8553 3684 -10924 -7164 16057 -2923 -16045 9501 11182
1022 11182 -10653 -8350 19473 -349 -12002 5541 12350 -4954 -7527 11868 5284 -4534 -5454
1035 -5454 13687 2937 -10967 3361 11841 -1832 -12769 13012 7481 -11839 -3942 16841 -1260
1048 -1260 -14341 10536 7546 -6342 -6706 12422 2206 -8987 2370 8854 1080 -9754 5952
1061 5952 7880 -2805 -9507 10911 7506 -14172 2159 10997 -3543 -12949 10319 4101 -11340
1074 -11340 -1860 6820 -2589 -10491 3609 -604 -3006 -7497 329 3734 -8174 -6113 3213 2717
1088 2717 -13934 1278 6457 -6410 -7520 6460 3071 -11132 3925 3894 -1578 -2949 4749 2417
1102 2417 -1615 1561 797 5735 -2062 1150 3527 4296 -3330 579 8319 -4131 -66 4175 3319
1117 3319 -4457 4366 3349 -2635 2450 1222 1773 -142 4570 -2599 2938 3555 -2479 1702 2983
1132 2983 1051 -4027 5675 -633 -2452 596 150 -494 -1981 911 -4067 2981 -4025 -3395 1748 -1131
1148 -1131 -6164 -1209 5773 -8590 -2847 3271 -610 -8040 1224 3998 -6966 -1025 997 1754 -5243
1163 -5243 -454 1914 802 -3216 -2741 7210 -2892 -5304 2127 7324 -7943 -3854 10395 -2440
1177 -2440 -7380 3185 8095 -8404 -1788 6837 1294 -4205 -411 7861 -1236 -2329 1483 9197
1191 9197 -2091 -4823 9115 5765 -6803 -1898 14658 -3710 -7380 7935 6856 -8360 -2571
1204 -2571 10714 -2850 -5855 1250 7395 -4284 -5227 4330 3888 -4245 -6589 9842 1416 -8640
1218 -8640 63 10683 -5202 -9950 9394 2377 -9484 -3137 9947 -6000 -9902 3768 2171
1231 2171 -6513 -7150 4845 -905 -6172 -4494 5871 -970 -10366 3975 6483 -4799 -7943 10909
1245 10909 2487 -9123 2736 8525 -2978 -6190 9359 2130 -3666 -1449 5986 1564 -5045 1924
1259 1924 5189 1203 -7466 5215 5445 -4791 -3130 8292 3248 -8943 6004 6153 -3216 -3342
1273 -3342 8314 2100 -4615 3275 3541 1447 -3982 3399 1969 -596 -2479 2289 4255 -5578 -890
1288 -890 3525 1135 -7272 2981 3184 -5568 -909 2360 -488 -5821 2664 -642 -2043 -1633 -886 66
1304 66 -2324 -1222 -3332 2664 -3675 -2844 1722 -1199 -4245 -1116 2044 -5252 317 -76 -1110 -1869
1320 -1869 899 -310 -1989 3371 -2957 918 2904 1002 -1987 3739 3071 -3241 4000 2544 1437
1335 1437 -743 4719 1639 -76 2000 830 3131 -303 1117 1342 3990 -3077 -70 5870 -2605
1350 -2605 -2376 3155 3960 -6295 1017 4252 -2440 -2992 2007 2699 -4636 370 292 1428 -2782 -2486
1366 -2486 3027 340 -3988 -1097 6639 -5201 -3963 4474 1825 -7024 -663 7313 -5181 -3989
1380 -3989 3194 2131 -6048 -898 3475 -1779 -3589 -2107 4014 -3137 -4730 265 4021 -4724 -5139
1395 -5139 7050 -78 -6927 519 8070 -5783 -3852 7449 1731 -4367 479 7167 -1430 -1416 3003
1410 3003 5475 -470 -2548 5470 4141 -1742 -2502 9420 1225 -5921 4380 6809 -4316 -4109 8987
1425 8987 -469 -5189 1311 5741 -3148 -4063 3811 194 -2753 -3778 3812 297 -4857 -2007 4406
1440 4406 -1654 -8050 4388 2418 -5863 -3522 6205 -1915 -7213 3053 2219 -3654 -3332 4549 -981
1455 -981 -2892 -894 1590 652 -4406 807 2186 -759 -5229 3104 1981 -5469 -859 3814 -798
1470 -798 -5625 3791 1000 -3429 -858 2496 -212 -2565 2291 559 1184 -1542 1736 2765 224
1485 224 -136 2250 4152 -2194 1963 3768 814 -1571 3728 2905 -2211 2845 1307 887 -396 2143
1501 2143 -38 604 1138 -1328 1899 -502 -997 -1613 2226 -2199 -1960 1311 -2070 -1566 -1041 325 -3113
1518 -3113 398 -1547 -1458 593 -1854 -1232 -187 1437 -3553 1051 1962 -2247 -863 1854 345 -3208
1534 -3208 1833 -68 -572 -1301 289 351 -1682 -713 -830 1663 -2840 -1295 1693 778 -3749 368 3972
1551 3972 -3767 -271 3341 1771 -3164 2135 3637 -1507 291 2139 2756 -1268 1266 1881 2565 -1078
1567 -1078 -989 5318 52 -2484 2032 5117 -3833 -1086 5473 -262 -3647 1627 4460 -3983 -821
1582 -821 2248 548 -2464 -968 2353 -755 -2075 -1366 3783 -2298 -4503 2095 2016 -4494 -3132 5278
1598 5278 -3130 -5107 1126 2464 -5060 -2385 3689 -2020 -3054 -786 2583 -2342 -2352 333 1995
1613 1995 -1171 -3523 3828 1420 -3160 -1157 5912 -1506 -4507 5002 2514 -3796 -899 5591 -1690
1628 -1690 -2020 2326 2110 -634 -1459 2811 1107 -255 -1758 3950 1839 -2789 1207 4195 -160 -3093
1644 -3093 5579 1662 -2623 1138 3981 -775 -2584 3081 454 -1011 -1046 1916 83 -1380 -439 53
1660 53 1002 -3703 475 1174 -1319 -3483 1934 894 -4121 657 1489 -1274 -2690 2074 -236 -2037
1676 -2037 125 -402 -333 -1506 71 -717 798 -2105 -934 1345 -1710 -1405 307 1456 -3064 504
1692 504 1062 -1356 -1062 1110 488 -1060 1746 -445 679 292 -34 638 1254 954 -1183 2551 173
1709 173 -159 905 1989 -34 -29 2229 -217 1220 378 1081 182 967 -56 596 1992 -1378 350
1726 350 1402 707 -2348 1650 1383 -2342 488 851 -258 -2264 1246 -321 -888 -753 -670 687 -1947
1743 -1947 -1097 -652 1247 -3332 -797 2221 -1671 -2712 841 1660 -3532 -326 1525 -948 -2202 883
1759 883 1454 -1991 -306 -78 1566 -1557 -845 1540 579 -1874 -516 3559 -1897 -1347 2315 2461 -2841
1776 -2841 119 3866 -1447 -819 1746 2150 -1826 486 1813 784 -365 -506 3099 396 -907 511
1792 511 3806 -1175 -2121 3792 1089 -2328 66 4362 -2344 -1587 2416 578 -2038 -472 2305 -1160
1808 -1160 -880 -925 1287 -937 -2445 413 1116 -1638 -3299 2766 -630 -3749 32 1983 -2342 -2990
1824 -2990 2489 -1131 -2399 -410 1478 -1936 -1233 695 126 7 -1826 1307 563 -833 -1669 2192
1840 2192 896 -3123 1401 1738 -1101 -1826 3055 35 -1532 1446 1320 -528 -696 2303 -177 266
1856 266 -322 747 1350 -403 -32 1106 1655 -1803 1425 1918 -747 -451 2101 845 -2082 1994 427
1873 427 -467 -118 928 -133 -237 451 -905 1147 -547 -431 111 456 -1234 -591 1344 -1735 -1053
1890 -1053 279 292 -1996 296 -177 -1441 76 -1160 -246 -937 47 -1490 58 42 -1967 -223 91
1907 91 -434 -1461 1440 -952 -868 405 321 -325 -938 966 -682 701 -462 395 1033 -243 -346 732
1925 732 1940 -1785 1140 1579 20 -592 1814 854 -1327 1578 737 755 -563 980 349 146 190 34
1943 34 1862 -768 -213 1048 1010 -1689 444 2353 -1706 -538 804 848 -2263 438 1166 -1045 -801
1960 -801 -114 720 -1419 -345 -654 730 -1354 -1486 1205 -562 -2021 -483 1843 -2563 -1335 1501
1976 1501 -247 -2404 -104 1420 -1897 -348 467 548 -1047 -495 877 57 -523 -1059 2012 -240 -1145
1993 -1145 712 2132 -1343 -1062 2903 -350 -1004 1066 2146 -868 129 1965 305 44 -95 1863
2009 1863 89 276 -53 1532 514 -1396 1747 1137 -743 -1020 2849 -219 -1505 1387 896 -912
2025 -912 -609 1713 -978 -280 -46 375 -514 -1012 170 -296 342 -1939 532 240 -1683 -1102 1000 -256
2043 -256 -2386 1134 -20 -1484 -988 831 -934 -1322 630 -524 -575 -976 -83 -485 257 -788 -165
2060 -165 1042 -1156 -209 748 483 -1411 1161 877 -996 422 820 179 -543 1651 -74 560 852
2077 852 40 835 698 595 121 1852 -70 -44 1198 495 -208 389 1625 -1046 633 688 178 -333 319
2096 319 224 -620 971 -948 424 217 -301 -530 672 -50 -1401 725 -67 -733 -771 633 -1122 -623
2114 -623 265 -612 -215 -974 -88 -771 197 -919 -486 660 -1169 -593 118 396 -1644 787 426 -1005
2132 -1005 59 236 299 -1054 595 -420 154 -396 198 681 -137 19 -198 1704 -992 6 1427 401
2150 401 -618 765 1813 -1172 658 1120 715 -557 832 1010 -565 570 232 1064 -449 228 425
2167 425 836 -542 -625 1765 -545 -1002 253 1135 -1347 -438 1175 -689 -429 -242 451 -1138 -40
2184 -40 -285 -212 -674 -1252 148 -164 -914 -1116 977 -893 -1247 510 375 -1138 -845 1509 -1351 -639
2202 -639 283 -94 -697 -224 510 -216 272 -876 627 51 -256 -303 1041 230 -1177 1306 285 -533
2220 -533 -231 1624 -301 -582 1018 126 245 -10 1006 -126 322 302 535 967 -293 180 693 756 -874
2239 -874 1125 819 -801 170 842 -129 -952 1142 -22 -374 -79 206 -177 -441 229 -810 282 -709
2257 -709 -511 99 -260 -967 -269 509 -1691 -43 121 -414 -1168 76 -317 -963 241 -755 -252 -495 78
2276 78 -709 211 -102 -627 602 -306 -324 -453 945 -584 -130 1170 -229 1 351 846 -777 670
2294 670 133 -120 810 59 253 250 777 -498 882 596 -302 452 779 276 -788 1123 105 -24 238
2313 238 715 54 138 574 -416 528 -454 -105 218 141 -425 227 637 -945 221 453 -324 -807 594 -28
2333 -28 -924 54 -308 -90 -815 -228 -496 -267 -545 -684 406 -535 -693 -299 532 -1147 -212 315 -623 -373
2353 -373 47 441 -1102 177 100 16 -279 -36 352 -87 357 -217 853 8 -165 575 476 -259 -152 1358
2373 1358 -421 218 798 755 -361 402 944 -162 311 -131 512 158 31 12 282 363 -476 933 105
2392 105 -239 -386 703 -492 -702 784 -77 -350 -537 792 -636 -372 -154 -181 -72 -657 -114 -103 -84
2411 -84 -644 162 -242 -1050 -130 172 -293 -1047 541 -494 -617 -76 202 -371 -489 187 -667 32 -271 -39
2431 -39 14 193 -263 -63 617 -564 127 451 -118 -500 502 679 -660 376 297 447 -233 741 95 148
2451 148 567 -73 615 279 301 -29 870 -257 -253 596 93 -85 176 549 -517 410 357 -103 -97 80 -189
2472 -189 -262 613 -588 179 43 -461 -161 117 -154 -1103 551 -358 -407 -227 7 -637 -341 248 -698 -173
2492 -173 -274 81 -227 65 -379 -460 255 -807 -131 38 107 -578 300 70 -977 -71 229 308 -271 413
2512 413 -205 207 324 165 402 74 268 48 753 231 -13 803 105 -198 376 719 -415 457 425 186
2532 186 3 253 428 -244 475 43 204 -185 69 -79 67 -26 -171 625 -328 -211 64 404 -529 -198
2552 -198 359 -503 27 -287 177 -546 104 -156 -92 -100 -600 -9 -197 -163 -759 282 -396 -584 -12 -283 -305
2573 -305 -508 261 -644 -324 -18 -194 94 -203 297 -228 279 -351 238 456 -51 55 620 177 -389 628
2593 628 177 -259 219 794 354 -320 651 183 29 33 614 243 249 182 -16 553 -211 412 417 257 -434 363
2615 363 556 -528 432 283 17 -532 386 17 -309 -49 -321 -42 -148 127 -838 232 -180 -436 -311
2634 -311 -179 -133 -325 180 -805 -198 -121 -353 -303 -92 -106 -541 1 -287 -11 -95 121 -265 6 -132 -577 501
2656 501 -225 120 0 249 -202 9 543 -27 181 300 522 -325 446 503 61 562 90 333 75 746
2676 746 -228 431 383 -261 345 249 350 -246 298 159 -69 190 219 -146 -268 195 -322 181 -45 -207 -15
2697 -15 -276 -228 -345 253 -289 -122 260 -538 -395 15 74 -662 82 -360 -139 -308 -207 -388 -405 -171 -328
2718 -328 127 -298 -136 -78 150 -215 -318 381 -247 -49 -30 208 -270 16 411 -24 141 -284 189 -25 443
2739 443 45 423 365 -98 404 311 89 -55 964 -97 81 379 364 136 153 693 -112 165 47 359 -38
2760 -38 -89 91 59 125 -431 385 57 -72 -206 369 -190 -217 256 -327 -190 -442 100 -251 -174 -20 -95 -164 -232
2783 -232 -76 -57 269 -386 39 260 -389 97 -42 -11 -307 231 -185 -209 -33 96 165 -269 405 -256 128
2804 128 1 97 175 73 -37 50 349 33 321 297 460 89 328 351 -168 195 52 108 -171 109 298 -60
2826 -60 696 -173 369 169 -2 222 357 -19 -54 339 -204 18 147 395 1 177 66 -142 -186 -407 223
2847 223 -326 -64 -473 -64 -258 -66 -146 -194 -123 -557 106 -448 -284 -296 42 -91 -314 161 -418 -11 -377
2868 -377 -75 -152 -62 -109 -49 259 -391 206 127 -113 -129 -40 495 -328 300 10 151 -24 339 -44 42 249 37
2891 37 277 366 225 56 220 91 270 230 -42 135 140 280 -180 309 428 443 170 -212 166 -258 245 104
2913 104 15 42 146 16 259 -78 -265 363 -306 -187 -29 -133 -276 -64 166 -186 -325 -3 -19 -336 -90
2934 -90 -67 -298 -105 -360 106 199 -117 -95 56 -8 -249 183 -23 -38 -114 235 -246 1 334 43 199 234 477
2957 477 -191 260 -126 11 54 -155 453 278 539 -67 297 222 113 154 45 203 116 468 65 42 -59 181
2979 181 -24 178 203 45 468 -329 44 51 265 -219 119 401 -295 43 17 -74 -377 -3 -1 -84 -139 -341 71
3002 71 -321 55 -102 -168 -115 -385 33 -272 -302 -255 164 -344 -204 161 -318 -135 72 333 -280 146 215 140
3024 140 -141 144 249 -29 160 -135 131 -58 -134 61 251 5 18 345 52 275 39 329 -65 257 313
3045 313 -14 362 47 280 11 141 -132 31 277 -239 143 251 -61 -312 371 -96 -40 131 -20 -53 -366
3066 -366 -13 -89 -248 -67 91 40 -191 -161 -220 -216 -613 39 45 -221 -556 -316 2 -562 50 -99 -287 -249 105
3089 105 -192 5 95 -22 109 -283 208 137 18 -113 1 314 -164 103 116 -144 27 402 365 -86 176
3110 176 46 -60 -221 325 15 200 -148 109 46 233 336 86 188 -8 -34 151 201 -130 112 202 -251
3131 -251 -93 231 47 -139 -146 -155 -380 396 -145 144 -97 -51 -459 113 -141 -727 66 -206 -138 -236 -19 -293
3153 -293 -191 122 -221 54 -150 -78 -114 66 -140 -187 122 -352 -77 -151 -67 -282 224 -173 -208 -24 163 -46
3175 -46 -204 268 -38 160 171 -126 221 141 88 129 413 -23 141 311 247 196 102 282 -364 111 207 322 -272
3198 -272 400 181 -58 132 -95 31 135 -186 105 118 151 -139 375 -47 -102 -19 173 -401 -175 45 -249
3219 -249 90 -276 85 39 -214 -70 -37 -69 -61 3 -36 49 -429 262 16 -271 53 -204 -68 -261 273 -68 -257
3242 -257 9 24 -5 -181 53 57 77 -235 113 7 21 198 178 -20 -250 95 213 -3 -14 545 -20 144 271
3265 271 217 322 206 273 -118 41 309 -123 205 -124 -97 -183 -105 128 -6 76 -207 32 44 -6 -115 128 -19
3288 -19 -413 -70 190 -230 -383 103 -322 -2 -205 -30 -73 9 -247 96 282 -393 -279 -36 -89 -118 -103 -44
3310 -44 -421 -29 176 149 101 169 253 -185 -82 94 91 127 104 157 -65 77 -152 176 -136 19 243 72 15 154
3334 154 70 156 214 105 90 82 281 -17 43 175 -173 -38 -66 39 -98 387 -67 -159 133 72 -162 -273 113
3357 113 -219 280 -15 -215 -22 9 -309 -75 72 -201 -76 54 -145 -81 -119 -2 -511 -165 -11 -166 -167 -100
3379 -100 -350 -123 132 -274 -69 0 -142 -231 169 -397 -131 147 90 -3 -85 304 13 224 -3 96 153 98 60
3402 60 113 219 142 244 112 79 48 359 -28 -7 511 -29 329 307 122 113 -119 376 -267 9 241 206 134 32
3426 32 182 73 123 -222 195 34 -58 -297 -8 -123 -173 -19 -86 23 -124 181 -198 -389 30 247 12 -99
3448 -99 81 -220 -74 -201 -123 172 -92 -126 12 37 -269 207 122 61 65 10 -117 -308 199 10 -82 -29 -54 -24
3472 -24 61 146 173 301 -154 52 163 -39 114 314 -30 -278 139 138 -29 123 278 114 272 480 -133 6
3494 6 -71 240 -51 -145 -49 10 160 -295 166 -110 37 -147 225 40 -514 34 -87 -106 -581 -97 -421 -59
3516 -59 -256 -15 -50 -94 112 -379 8 -293 -164 -25 -104 -315 -106 40 -127 -9 -290 144 -247 44 9 -109
3538 -109 -32 -205 32 207 4 -152 56 327 -150 94 -27 52 243 59 -28 31 136 -53 203 206 82 53
3560 53 670 4 -25 319 161 -113 366 77 -175 142 181 -159 -91 -5 16 77 156 -48 47 -165 -297 -18 159
3583 159 -312 -69 305 -68 -272 116 188 -74 -208 42 -365 -209 -248 -43 -308 -136 14 -111 165 -81 -122
3604 -122 159 -41 -176 -47 -263 -488 46 -157 -189 3 69 -32 135 279 -54 -272 153 299 -194 252 -90
3625 -90 85 193 32 84 198 31 140 279 113 -21 377 -2 53 -35 183 -145 -161 427 80 -141 322 97
3647 97 -396 241 59 323 81 -28 -130 275 62 -233 -22 130 -144 82 199 -224 -132 140 -108 -401 -24
3668 -24 225 -313 -93 104 -190 -122 -207 -149 -153 115 -135 -60 130 -208 3 263 -125 -226 150 -355 -261 216 78
3691 78 -227 175 123 -356 -73 37 -35 188 125 44 203 251 162 269 188 -172 158 334 -105 -273 203 -18 34
3714 34 -1 246 -83 70 453 -231 12 -6 182 27 44 -46 -179 241 -33 -32 -135 -75 -252 258 -23 -431 254
3737 254 99 -155 116 255 -366 1 -237 -115 -128 15 -133 -261 -177 -114 -67 -237 -100 -270 -51 -5 -181 315
3759 315 -205 -272 5 -58 -190 18 349 -234 -215 312 245 -207 195 179 146 218 154 60 239 185 269 200 16 -127
3783 -127 115 105 -139 10 603 -160 -195 454 86 17 253 392 -329 -8 283 4 -78 -136 179 -234 67 -109
3805 -109 219 1 -475 235 249 -394 -118 208 -207 -125 -40 58 -269 -114 255 -337 -237 103 112 -278 -21 -137
3827 -137 64 -48 -290 233 166 -337 -28 234 -8 -454 273 115 -73 -29 290 -153 99 200 -74 17 207
3848 207 535 26 308 45 61 268 -205 257 287 55 -142 214 424 -210 115 178 -269 45 198 53 153
3869 153 157 -28 -31 15 -10 -79 376 -82 -36 138 -171 -52 148 -169 -164 136 -128 133 -223 109 -332 -244 132 -111
3893 -111 -139 158 -111 -237 -139 -240 -331 -151 -11 102 48 58 -194 230 -51 -419 294 -23 -9 39 588 -154
3915 -154 -176 292 -52 -292 73 210 -152 175 -20 1 94 -24 31 156 191 4 -41 -112 -219 84 187 -69
3937 -69 -272 322 86 -76 215 272 -191 -26 370 -158 169 55 -2 59 33 -362 121 -9 -269 92 87 -226
3959 -226 -21 -123 -117 -273 319 -60 -149 -104 7 -295 -70 131 -249 -32 -101 60 -228 -61 -111 70 84 -276
3981 -276 -139 37 -102 -186 253 -61 -441 236 181 -59 197 230 -87 73 6 -40 -75 -99 86 98 117 -233 103
4004 103 114 -90 45 214 86 1 377 91 -270 -45 379 -286 -204 497 56 61 127 -92 -282 60 138 69 -98
4027 -98 -90 -138 -298 -107 -185 176 -174 -379 64 -23 -177 -219 492 -344 -143 153 -156 -262 -79 222 -216 119
4049 119 -93 -3 -139 -68 -192 205 -60 -34 150 -81 -271 42 59 -193 -130 110 -134 -250 125 344 20 32
4071 32 221 -3 18 68 244 29 246 44 356 201 -217 338 156 -113 2 472 -109 -147 316 -53 -326
4092 -326 -69 344 -292 195 191 -48 -105 -7 24 -159 -95 -339 -15 -133 -24 -68 95 -42 -394 303 -26 -713
4114 -713 -22 117 -375 -38 -43 -348 -285 -159 -35 -436 -7 -67 -134 -78 -227 118 82 -411 -228 448 -75 -222
4136 -222 203 25 -392 112 198 -167 67 315 125 65 117 -19 -357 69 181 187 294 33 211 248 -18 -258
4158 -258 398 -87 -133 419 352 -68 -265 572 -224 -88 371 169 -6 47 525 25 96 15 -143 137 -191 41
4180 41 324 56 27 244 61 -160 14 285 -127 -124 165 121 -417 220 175 -254 124 48 -356 -190 -80 85
4202 85 -28 83 -195 241 -3 -336 185 -23 -162 -37 344 -74 -178 83 168 -189 -10 174 -94 -57 96
4223 96 -119 -83 67 -14 0 279 -88 361 -83 -85 -135 57 -260 -162 331 43 -129 160 206 -207 136 550 -7
4246 -7 34 -89 297 34 10 20 40 -37 -186 32 17 -368 -50 409 -202 -387 96 -96 -316 -144 265 -597 -34
4269 -34 55 -46 -336 52 112 -166 111 -291 49 -50 -18 25 105 -224 -115 346 -131 -256 117 366 -220 -179 580
4292 580 -338 -255 176 -60 -272 73 163 -2 -39 8 16 153 309 8 154 57 -215 250 -82 -371 -12 483
4314 483 -129 -251 409 187 -235 174 250 -292 231 424 13 130 -89 -5 80 90 34 157 -90 -101 298 281
4336 281 -102 -459 164 -135 -203 114 120 -16 -26 171 -101 -47 122 67 -112 18 8 -41 75 -190 290 106 64
4359 64 -188 243 -250 -167 539 220 -75 65 322 -122 186 420 -140 110 171 56 16 71 96 67 91 -141 26
4382 26 -136 -281 -44 421 78 -262 306 -96 -237 40 156 -226 -92 92 44 -194 -54 -33 -120 70 -279
4403 -279 149 101 17 -186 -76 -306 -147 210 98 -60 13 136 -230 -135 305 -202 -206 3 -96 -208 -164 83 -185
4426 -185 -82 -185 -161 -9 -257 -425 338 -116 -389 101 220 -198 64 181 -107 52 420 345 -65 174 233
4447 233 -377 60 160 45 29 8 -50 144 15 -240 261 -70 -208 47 471 29 -169 162 -151 -69 -205
4468 -205 342 -516 388 191 -215 46 -20 -29 8 9 -132 168 120 -232 87 16 -263 -45 214 -236 -37 52 100
4491 100 -172 -121 303 -396 -144 222 75 -183 -93 -34 -184 -107 -13 95 42 -385 83 206 -247 -298 231 13
4513 13 -364 254 353 -247 -126 391 -138 -203 181 192 -175 126 -99 -46 -90 30 48 -191 50 124 341 -146 -199
4536 -199 243 111 -292 -85 392 -31 -195 250 48 -221 53 350 -91 11 43 261 -59 -198 126 243
4556 243 -160 -470 105 -152 -267 160 113 -203 -133 395 -201 -176 -76 -63 -200 -4 -66 -239 6 114 -139 100
4578 100 3 -146 77 -15 -199 298 -162 -478 -63 178 -346 -40 243 -127 -324 476 254 -390 255 90 -206
4599 -206 65 7 -38 -49 125 -273 24 39 -125 183 295 -213 -63 302 -168 -547 325 77 -191 205 339
4620 339 -471 141 83 4 -208 77 127 -98 -175 -263 -105 -122 -28 -43 281 -171 -36 198 -92 -318 151 213 -376
4643 -376 -21 9 -435 -170 410 173 -400 218 26 -315 70 161 -7 97 -4 -42 178 -31 -291 158 -56
4664 -56 -370 -31 87 -482 -46 432 10 -164 216 202 -33 172 -363 178 -93 -111 -22 46 75 -242 208 -254
4686 -254 -254 281 128 -464 -194 511 -34 -270 510 274 -205 206 -204 -165 18 0 160 81 -5 -192 214 -78
4708 -78 -409 369 -148 -457 8 545 -225 -59 319 276 -300 -20 264 -392 -145 -163 59 -12 -310 68 -37
4729 -37 -132 -234 364 -179 -434 65 401 -300 36 520 -220 -292 -13 122 -158 8 199 170 -134 402 309 -2
4751 -2 -50 -59 -118 254 -23 142 92 35 -206 306 -38 -347 238 72 -90 167 -23 -363 63 306 -50 -85 362
4774 362 -101 -102 83 38 -153 113 -87 146 -33 62 -230 245 -192 -364 102 22 -202 -152 289 -400 56 215
4796 215 85 -255 10 97 -227 96 158 79 -62 -70 -141 320 170 36 160 -121 14 172 213 -174 63 196
4818 196 -171 -222 261 310 -86 188 32 -25 57 71 260 -75 -33 -110 168 83 -158 254 318 -184 21 598 -241
4841 -241 -151 566 -54 -204 232 305 -532 144 -93 28 -175 174 91 -117 -1 39 128 -19 -392 -19 306 -391
4863 -391 76 374 -407 -139 325 39 -160 -66 396 47 -105 346 -184 -186 -35 -19 -120 47 -254 372 225
4884 225 -292 -293 292 -188 -274 327 107 -355 88 644 -328 -25 234 115 -168 123 318 -10 -16 -111 -60 381
4906 381 64 288 217 -142 -240 150 -106 -303 161 251 -279 -198 138 -138 -179 264 237 79 1 46 97 1 -265
4929 -265 22 108 -75 -65 401 -113 -153 212 44 -147 -340 312 -336 -140 445 74 -350 19 173 -51 -39
4950 -39 82 -103 -2 -68 -42 147 -191 -104 259 14 -397 268 411 -259 -228 299 -186 -146 347 1 -134 157
4972 157 122 -76 257 -17 49 -208 -76 -193 106 -130 -264 65 191 -154 -143 289 -12 -101 273 -114 -259
4993 -259 -192 243 -435 -6 201 -34 8 238 -3 -4 196 -153 221 48 -222 85 20 108 109 166 -164 -118 261
5016 261 -4 -379 140 235 -196 -28 290 -158 -166 74 9 -183 -99 -195 -25 14 102 102 376 -277 90 250 -154
5039 -154 -43 199 252 -300 -243 288 -216 -222 218 9 -400 122 72 -37 -123 71 6 105 -28 -9 293 -12 -36
5062 -36 234 251 -521 279 661 -157 -315 298 66 -314 140 125 -263 87 173 -110 -12 -375 -177 185 33 -467
5084 -467 261 24 -396 25 423 -308 -38 400 -160 -331 320 220 -345 -57 241 -98 -246 177 75 137
5104 137 -100 -71 -68 -3 -220 111 240 -230 0 190 -183 -153 223 152 -335 67 183 -365 -128 74 -215 -137
5126 -137 -145 -15 261 -107 -179 66 110 -381 88 240 -110 -368 281 37 -194 -26 503 -192 -26 112 -125
5147 -125 79 166 -104 -1 182 -121 1 39 -151 33 -173 132 -30 324 173 -401 362 56 -228 -5 162
5168 162 -324 75 169 -250 -201 266 209 -190 257 -51 28 137 -118 179 91 -105 -204 350 25 -246 244 268
5190 268 -311 124 478 -109 -74 115 -41 -331 247 266 -132 108 213 -128 -6 -10 -49 372 99 -18 36 104
5212 104 -93 164 435 -192 56 530 129 -74 137 290 -143 26 116 -286 -156 185 -97 -35 138 134 -5
5233 -5 -147 -166 207 62 -450 88 315 -335 -253 431 -13 -373 212 80 -182 -13 86 -177 -226 88 -136 165
5255 165 -124 -240 160 48 -239 164 461 -158 -195 217 -23 -575 212 297 -644 45 197 -52 68 246 -20
5276 -20 -133 -127 77 197 15 -133 354 -56 -168 118 412 -36 -220 319 384 -544 -4 258 -300 -82 169
5297 169 47 68 176 222 -79 152 -182 -51 38 -349 115 289 -63 -198 462 -93 -196 13 383 -131 -106
5318 -106 524 -223 -324 -24 187 -446 5 55 -137 271 -333 -226 135 118 -175 306 11 -217 85 274 -94
5339 -94 -260 639 -104 -105 394 -101 -208 186 200 -271 147 96 146 -143 59 -290 -9 60 -155 227 130 -89 59
5362 59 310 -144 2 336 75 111 342 96 -249 198 336 -256 -4 135 -107 -73 304 3 -46 153 -287
5383 -287 55 -100 -123 -38 434 -244 -198 201 20 -337 113 179 -520 112 325 -142 -227 142 210 -254 187 54
5405 54 39 -97 -63 -77 -15 41 -56 200 -385 -418 227 210 -12 86 380 -468 10 339 -80 -249 114 32 -295 -115
5429 -115 36 71 -146 19 -130 199 -59 -263 38 -355 -112 75 132 -436 -1 400 -194 -289 -33 275 -349
5450 -349 154 5 -46 -274 -146 250 -132 -156 -18 11 -176 -194 165 188 -593 59 305 -209 -291 310 151 -248
5472 -248 27 223 14 7 283 66 153 40 -172 186 17 -54 148 84 -409 -67 468 -134 -284 481 -108 -393
5494 -393 89 167 -292 129 404 -101 -74 306 72 7 150 -142 118 305 -356 -146 193 57 -354 290 46
5515 46 -373 78 105 -391 -6 332 -160 -14 21 137 -180 261 -64 103 114 -114 182 68 -205 39 338
5536 338 -15 -277 122 195 -86 29 84 -268 -278 -8 -130 -233 189 66 -250 258 -123 -131 -66 -189 -1 106
5558 106 -52 -139 531 -96 -325 239 -53 -87 173 200 -209 -62 48 -329 -40 108 -50 -155 2 -6 -323 92
5580 92 153 -28 -173 -116 -109 131 196 -314 22 101 -152 109 329 -327 -137 242 -100 -139 -22 145 -255 1 435
5603 435 -312 -26 17 -19 185 -48 17 130 35 -147 187 173 -156 -209 322 -200 -430 239 209 -521 253 13
5625 13 -450 -141 100 135 -289 -55 39 172 155 -57 -296 263 -143 -171 361 -83 -150 558 318 -482 269 445
5647 445 -331 -187 254 181 -302 -128 107 -288 -134 -130 -96 206 -45 266 226 -11 -178 356 148 -504 223 480
5669 480 -423 -327 35 -333 -100 228 83 10 -5 -209 25 -286 88 150 191 0 -323 417 -42 -239 5 141
5691 141 -263 -137 75 -258 -111 134 179 -291 260 110 -48 160 -346 -71 176 20 -361 70 -16 -199 -8
5712 -8 -129 -185 -18 333 -94 -235 310 -60 -198 5 149 -302 -36 205 -28 57 68 -112 202 212 -170 168
5734 168 382 -265 -24 329 19 -170 176 -300 -278 327 -58 -294 176 350 -219 -31 -116 -35 -66 93 40 -149
5756 -149 76 -288 117 1 -96 -7 342 82 -64 245 -438 -194 -113 148 -39 179 182 -392 -239 108 -370 -93
5778 -93 117 -139 -191 31 91 178 -17 47 12 -14 -76 -220 354 -205 -43 215 270 -183 67 545 -77 -61 159
5801 159 51 -81 123 -79 5 -83 -5 -123 92 8 94 589 196 -70 395 231 -271 39 332 -243 60 261
5823 261 120 -296 -17 162 -262 41 51 19 188 173 -132 76 -172 -246 428 122 -315 -183 251 -312 -440
5844 -440 202 74 -82 72 -37 -267 139 62 13 -145 1 -47 -11 166 -309 313 100 -110 -134 184 -283 -197
5866 -197 326 -328 -407 -51 -141 -371 150 296 -91 154 68 -173 -13 -97 211 133 199 -376 150 138 -61 -23 398
5889 398 -249 -492 170 139 -123 -94 158 19 105 149 -129 188 -76 -156 -51 171 -155 -107 21 -448 48 273
5911 273 92 -208 228 -69 -117 45 36 -221 -175 242 -196 147 15 -12 -177 129 -211 -83 169 -113 -210 174
5933 174 31 -288 340 250 -189 387 2 -146 83 91 -381 -53 440 -78 49 282 108 -48 403 108 -255
5954 -255 167 -197 -203 -57 185 45 190 62 82 37 -186 -215 189 468 -305 403 286 -163 -293 321 24 -340
5976 -340 114 84 -225 -261 337 -26 -188 -22 -233 32 -31 -35 14 328 -364 144 163 -112 -283 276 -106 -215
5998 -215 150 148 -174 -93 55 -52 -95 21 -121 84 74 33 201 -137 7 -455 217 -321 -342 302 -150 -279
6020 -279 184 273 -369 141 110 -240 -66 -9 122 -178 208 -118 7 127 -6 221 81 96 19 327 124 -280
6042 -280 318 142 -472 70 123 -301 -103 240 -270 -374 133 104 144 -166 53 -11 92 87 -117 133 -124 -270
6064 -270 301 -250 -415 365 56 -226 -198 281 2 -46 76 -34 -207 194 263 39 126 -223 -146 77 95 -358
6086 -358 299 -199 -200 238 303 -472 -170 228 26 115 -271 -14 -45 247 -64 -145 318 -126 48 -45 -66 -232 88
6109 88 137 -315 310 84 -29 -68 203 92 -276 131 87 -94 13 277 -152 190 96 -263 320 203 -153 -89
6131 -89 143 0 -86 451 -11 73 107 -91 -202 519 -99 -145 21 32 -125 -23 -16 -220 223 155 -348 35 -3
6154 -3 -111 -376 62 46 135 315 136 -353 144 -24 -105 160 -125 68 -40 253 -226 200 337 -218 77 192
6176 192 223 -106 111 14 -148 0 20 -190 83 -160 18 69 -286 -27 -47 22 -86 251 348 -329 43 289
6198 289 -186 -109 207 112 -351 280 221 -152 -44 -165 32 -14 211 -204 124 -235 -173 -54 38 -407 41 403
6220 403 -266 -67 -92 151 -311 336 135 -186 159 -154 192 -173 -110 114 355 -96 -181 271 67 -157 143
6241 143 124 -41 -80 620 -25 -339 25 222 -252 100 128 -94 183 240 42 227 137 -264 218 -72 -133 46
6263 46 -106 2 -347 403 7 -169 276 191 -373 -97 129 -177 98 66 55 116 128 22 280 260 -167 123
6285 123 301 -53 -36 281 -222 -242 353 -3 -179 178 154 -273 -243 92 -49 -77 38 -88 -89 -31 -78 113 118 -37
6309 -37 182 -119 -44 -386 63 34 -172 -113 345 -133 -67 297 -287 97 85 36 307 162 -20 -369 169 115 -36
6332 -36 38 77 -412 -70 222 -286 209 -163 -54 -35 46 -116 -102 108 -237 7 24 -175 -384 51 -16 -287 179
6355 179 252 13 -76 115 -167 20 -96 -78 204 27 -94 13 288 -118 3 91 -5 -329 346 370 -342 -123
6377 -123 19 -62 8 -22 -33 -91 -9 -230 -103 83 125 -187 183 -123 47 363 -196 -166 102 161 -238 114 149
6400 149 -248 -252 229 112 108 100 116 -1 -79 -39 -115 -107 152 -103 154 -221 -127 357 -63 -275 -44 400 -247 53
6424 53 24 -93 -109 -188 106 -78 171 -234 164 -141 6 117 234 35 -196 332 -36 -163 59 -30 -226 -203
6446 -203 274 -116 -188 337 111 -46 58 221 -98 93 -13 190 63 -205 15 41 -317 -147 214 183 64
6467 64 -64 93 -352 269 189 -281 -4 -49 -44 -126 202 227 -14 50 221 -17 -11 81 -131 169 -93 -116 22 291
6491 291 -125 -71 459 62 -29 -16 53 -205 185 144 -138 -48 193 -37 40 237 -313 -64 294 -398 167 39
6513 39 98 -313 427 -182 -496 -50 84 -110 6 101 -428 45 -75 -352 -39 240 -110 -187 153 -149 93
6534 93 61 -168 -158 250 77 -351 157 -173 -16 47 70 -22 68 199 -406 233 151 -94 40 197 -130 -177 104
6557 104 137 116 77 129 -121 184 -108 -134 129 -100 25 216 -37 -167 25 206 -98 54 212 369 -51 339
6579 339 -67 56 -2 131 -15 -56 -138 -255 83 -37 19 88 130 120 -77 241 -361 15 60 134 40 250 73
6602 73 -312 -8 155 -43 -185 154 -206 -23 34 27 281 -181 -350 105 22 -320 0 202 -67 -232 230 134
6624 134 -501 130 47 -26 27 -125 184 304 -90 188 398 122 36 251 291 -75 -268 -140 -92 -255 453 -276
6646 -276 -289 5 16 -298 470 -77 -154 -65 -11 66 -24 127 -177 129 158 -67 -47 -13 213 -83 381 22 -267
6669 -267 -1 -106 -97 -54 60 -302 43 -44 -1 202 69 -208 -6 36 2 9 139 -85 -322 252 119 -130 320
6692 320 -79 -127 -83 173 47 -170 332 -257 74 118 -165 -371 43 -139 -179 137 -260 82 135 110 -161 214
6714 214 10 -158 214 -96 -109 -307 224 -21 30 18 -245 -147 198 -15 -96 182 -113 4 91 144 127 63 145
6737 145 -189 29 -42 -184 -182 187 -182 -44 231 -336 35 20 7 -3 312 -46 -568 62 243 -144 -125 167
6759 167 -154 173 104 -212 90 -157 -23 -80 36 -94 -2 108 -225 -187 185 112 -105 -24 173 219 -221 139
6781 139 115 9 244 -82 220 118 65 -165 45 -54 100 98 42 -84 105 -132 -284 58 90 -150 178 -100
6803 -100 51 -170 169 -56 -22 217 -135 175 13 -371 -184 143 -177 -198 54 -110 -78 -129 242 -132 -202 0
6825 0 -64 236 127 172 -242 148 110 110 109 42 -70 200 -28 -293 165 -39 28 -98 132 -52 21 385 -119 -301
6849 -301 36 -169 -33 -79 -343 15 152 -33 -136 -34 -124 -190 114 71 -121 145 -41 -98 108 382 -228 -42
6871 -42 138 -234 88 125 85 -32 420 -53 1 -37 -40 -22 -38 62 -231 175 -77 -71 -139 231 -275 -234 199 -372
6895 -372 -12 -11 -106 -207 -14 20 -246 -29 -113 -147 93 -99 -220 -76 182 -246 129 -37 57 27 194 -33 -151
6918 -151 1 -98 32 39 240 -146 175 -15 -292 26 105 -119 -107 -49 -52 148 -57 -62 -17 -29 130 -197 154 -94
6942 -94 -77 226 -15 -114 178 230 -546 130 185 -123 27 339 -142 -29 131 107 227 38 156 38 85 -158
6964 -158 -46 128 -236 43 -45 46 -278 46 143 -282 -152 -150 -10 -167 200 -8 -20 82 -9 -239 6 164
6986 164 -195 260 -14 -94 9 19 -236 72 158 -266 -152 43 32 -453 143 206 7 328 -13 -194 -196 342
7008 342 -9 44 -72 -298 205 34 76 -11 -64 -414 -330 130 -145 -84 275 -14 -216 190 85 -385 67 151
7030 151 -119 -54 81 12 157 149 -145 -135 76 -53 -295 271 -70 -163 189 47 -144 -220 -18 -317 17 -36 -209
7053 -209 -127 28 -126 -133 -78 -134 -143 -168 -360 -190 231 410 -144 57 -113 -311 -189 248 -135 178 313 -173 66
7076 66 82 -133 -83 -119 -74 42 372 -79 -68 -53 56 24 31 -203 -105 -43 -150 -102 -66 123 -138 166 -111 15 113
7101 113 148 67 -126 161 100 -175 -78 -153 -114 152 152 40 -43 -119 46 -12 45 -37 -47 -33 -134 160 179 150 -218 207
7127 207 -181 -212 324 -336 -133 -28 -7 -284 -57 76 -36 64 -125 -187 -222 70 -4 -56 70 -256 66 51
7149 51 -95 -76 313 -29 -29 -98 -29 -102 -176 27 -93 53 -50 71 -48 53 70 -163 347 -154 200 272 -164
7172 -164 -187 67 3 -61 127 -76 -46 198 279 -102 -77 18 -47 -258 -98 160 -43 478 -124 -31 317 135 -299
7195 -299 161 123 -342 -172 -42 -135 -28 150 9 -18 -170 -99 -10 -279 69 8 121 201 -116 289 -106 29
7217 29 8 -47 25 -79 147 -124 3 224 -216 98 18 -249 -150 -85 -127 -3 93 125 -230 217 -65 -206 88
7240 88 -118 -305 160 325 -21 -80 57 -44 -36 -49 -25 -96 320 -142 -100 47 81 125 122 29 -127 186 120 -234 89
7265 89 90 66 183 155 -255 -131 119 115 99 -13 87 -78 -81 -131 303 133 -132 44 1 91 -447 -13 -33 -158 -113
7290 -113 70 53 -169 269 -81 50 45 64 -95 114 107 -170 -37 -17 -114 100 209 -53 -109 188 74 50 164
7313 164 231 -31 338 -17 -308 -90 316 193 189 -105 -90 295 -121 -107 -71 187 -254 13 125 -80 -131 184
7335 184 -160 -126 -54 20 -88 102 -149 31 126 264 -69 57 -7 -198 116 -133 45 55 143 -86 -153 4 -233
7358 -233 -256 -226 -8 -118 269 -50 -301 175 -185 -112 -159 286 -206 228 12 -274 75 135 95 -298 -102 -49
7380 -49 111 -51 117 99 -189 17 -45 40 141 -40 6 185 211 -96 410 -141 44 113 -218 -14 152 -76
7402 -76 -342 90 81 -52 82 -253 -64 -114 75 2 165 -67 -160 22 253 -76 105 155 -328 -59 276 94
7424 94 -295 97 12 -23 -57 -110 -313 -30 -9 -141 -124 -179 -129 39 -12 -53 -124 226 -18 -51 231 81 -84 -177 32
7449 32 -95 252 73 0 144 176 -7 -106 224 -202 -14 109 -100 17 324 -229 -107 42 148 39 119 -40
7471 -40 -280 -306 -27 17 -21 -171 -179 17 122 113 -68 219 26 185 217 156 -132 113 192 -297 197 -142 -47 20
7495 20 196 77 24 90 -129 61 -159 -86 44 174 -149 -55 196 -149 -125 231 -80 -151 258 -117 107 37 -227
7518 -227 -69 -128 251 -343 84 42 -116 56 207 -3 -270 321 -196 -58 -183 291 -43 71 16 -145 66
7539 66 -63 95 5 97 120 -35 90 121 -171 -100 -111 -156 218 -125 -165 -39 -45 -64 55 -29 -85 25 271 -164 -45
7564 -45 -23 -85 -221 312 52 45 48 125 -39 111 86 81 47 -100 -95 65 100 -109 111 -7 -264 -74 81 -54 -99
7589 -99 383 -160 -204 215 37 -16 271 -78 -213 307 174 -60 -182 150 -81 -15 242 -331 -40 140 -88
7610 -88 234 134 8 -396 191 -4 -253 94 215 157 107 -147 -87 -118 -40 -162 -5 194 -118 70 66 -42 168
7633 168 44 -169 56 250 200 -94 184 158 -40 -84 -12 -131 257 259 -53 -28 98 -398 -141 -274 -8 -191
7655 -191 70 153 -102 -79 -127 -105 46 112 -341 139 -219 -92 -160 66 -8 26 -116 -41 -273 184 65 -57 260
7678 260 -105 -66 202 -90 -79 93 46 -151 230 201 -310 13 -27 67 -137 150 149 167 163 -81 19 325 -59 12
7702 12 150 289 -128 -56 163 -195 52 312 -36 -66 -108 64 -169 50 83 -19 342 -62 -69 253 -46 -235
7724 -235 9 -214 -220 -109 17 67 -106 2 -144 12 63 -162 -110 71 112 -268 79 -150 -205 200 -15 -213
7746 -213 135 169 76 214 61 -225 -14 219 -252 -42 190 6 70 120 93 149 58 -40 -80 -5 109 -244 119
7769 119 31 -217 -25 220 32 38 394 22 -219 94 185 -139 53 -61 29 158 167 -203 140 -31 112 -25
7791 -25 -12 -155 -30 -39 -217 -19 155 -140 129 -32 -223 -196 175 -113 1 91 412 59 -74 -195 -336 -40
7813 -40 22 -188 338 207 -161 -34 77 -131 -23 129 29 -71 102 -183 21 432 -178 -97 -112 115 -60
7834 -60 -4 -79 -25 -88 193 -71 123 166 -3 -11 68 -79 -74 87 6 -186 169 116 2 15 -24 -63 4 53 -179 -211
7860 -211 43 -88 -210 140 -167 36 350 -148 -153 -32 -103 2 168 -38 -23 -150 -87 -77 -22 59 -94 129 -30
7883 -30 -20 -76 -158 -20 54 300 -3 -26 238 -36 -261 17 92 -169 194 61 -159 -30 35 80 38 15 -20 124
7907 124 152 -22 -45 53 -75 10 90 30 -341 41 70 46 -19 164 99 109 120 -108 -132 -25 -65 -196 3 -102 137
7932 137 67 137 -42 112 -130 -56 -67 146 21 28 -63 -83 173 -81 -86 65 -171 -144 -32 325 4 7 -60 -173 -264
7957 -264 -149 -139 -203 -67 33 3 -17 186 133 131 180 -96 -257 168 22 -279 7 -47 -143 59 36 -105 245 56
7981 56 -89 -63 323 -256 -89 -107 155 66 61 156 39 309 -75 -25 169 295 -127 -34 -69 60 45 -71 -226 58
8005 58 73 -194 -199 149 -228 -73 124 131 -302 75 -203 87 -1 196 -98 8 -239 -118 90 -184 -58 81
8027 81 -74 126 11 30 48 86 204 -134 -78 305 -56 20 194 -73 113 -33 -28 -179 148 340 -39 -60 -9
8050 -9 -42 217 121 -115 -181 27 -189 72 227 48 -171 128 57 -22 121 117 208 -34 221 -217 169 36 -14 -342
8074 -342 142 62 111 22 -24 69 358 101 -167 53 -105 154 -139 -192 86 -199 152 66 -119 130 -127 -86 -39
8097 -39 56 -190 285 -240 -38 67 -139 -159 -88 -72 -9 2 109 -260 23 133 -345 -105 -149 -323 -16 143 -184
8120 -184 37 -24 68 -130 -41 -182 25 -2 277 150 -80 62 -117 -76 128 3 -17 278 -36 52 172 94 46
8143 46 -127 -31 -114 183 216 -255 95 139 38 16 -11 -90 -14 8 -121 54 -36 -51 -130 65 -42 199 25 -155
8167 -155 23 -37 -114 -31 100 -149 -177 -202 282 -230 -199 -49 113 -163 147 -34 101 -264 50 -278 -54 -199
8189 -199 185 159
8191A59
##END NTUPLES=NMR FID
##END=
