##TITLE=1H_TG-2291-B
 CDCl3, 8 sc, 
 24.9.2020
##JCAMPDX= 6.0         $$ Bruker NMR JCAMP-DX V2.0
##DATA TYPE= NMR FID
##DATA CLASS= NTUPLES
##ORIGIN= UXNMR, Bruker Analytische Messtechnik GmbH
##OWNER= root
$$ XWIN-NMR		Version 3.5
$$ Thu Sep 24 10:26:48 2020 Russian Standard Time (UT+4h)  she@DPX200
##.OBSERVE FREQUENCY= 200.1315066352
##.OBSERVE NUCLEUS= ^1H
##.DELAY= (6, 6)
##.ACQUISITION MODE= SIMULTANEOUS
##.ACQUISITION SCHEME= undefined
##.AVERAGES= 8
##.DIGITISER RES= 18
##SPECTROMETER/DATA SYSTEM= spect
##.PULSE SEQUENCE= zg30
##.SOLVENT NAME= CDCl3
##.SHIFT REFERENCE= (INTERNAL, CDCl3, 0, 15.7039)
##AUDIT TRAIL= $$ (NUMBER, WHEN, WHO, WHERE, WHAT)
$$ ##TITLE= Audit trail, XWIN-NMR		Version 3.5
$$ ##JCAMPDX= 5.01
$$ ##ORIGIN= Bruker BioSpin GmbH
$$ ##OWNER= she
$$ F:/spectra/data/she/nmr/H-F/1/audita.txt
$$ ##AUDIT TRAIL=  $$ (NUMBER, WHEN, WHO, WHERE, WHAT)
(   1,<2020-09-24 10:25:35.64 +0400>,<she>,<DPX200>,
      <created by zg, POWCHK disabled, PULCHK disabled
       configuration hash MD5:
       00 E9 B6 7A A2 85 ED C7 34 08 36 98 17 FE 4E 26
       data hash MD5: 16K
       77 2F 92 C6 85 38 51 AF A7 3B FD 62 A7 D9 15 54>)
$$ ##END=
$$ 
$$ hash MD5
$$ E9 D4 C8 A5 5A A8 A9 67 30 75 5F 3E 29 82 04 01
##$RELAX= 
##$RELAX= 
##$RELAX= 
##$RELAX= 
##$RELAX= 
##$RELAX= 
$$ Bruker specific parameters
$$ --------------------------
##$DU= <F:/spectra>
##$EXPNO= 1
##$NAME= <H-F>
##$PROCNO= 1
##$TYPE= <nmr>
##$USER= <she>
##$AMP= (0..31)
100 100 100 100 100 100 100 100 100 100 100 100 100 100 100 100 100 100 
100 100 100 100 100 100 100 100 100 100 100 100 100 100 
##$AQSEQ= 0
##$AQ_mod= 1
##$AUNM= <au_zg>
##$AUTOPOS= <>
##$BF1= 200.13
##$BF2= 200.13
##$BF3= 200.13
##$BF4= 200.13
##$BF5= 200.13
##$BF6= 200.13
##$BF7= 200.13
##$BF8= 200.13
##$BYTORDA= 1
##$CFDGTYP= 0
##$CFRGTYP= 5
##$CHEMSTR= <none>
##$CNST= (0..31)
1 1 145 1 1 1 1 1 1 1 1 1 1 1 1 1 1 1 1 1 1 1 1 1 1 1 1 1 1 1 1 1 
##$CPDPRG= <>
##$CPDPRG1= <>
##$CPDPRG2= <>
##$CPDPRG3= <>
##$CPDPRG4= <mlev>
##$CPDPRG5= <mlev>
##$CPDPRG6= <mlev>
##$CPDPRG7= <mlev>
##$CPDPRG8= <mlev>
##$CPDPRGB= <>
##$CPDPRGT= <>
##$D= (0..31)
0 1.2 0 0 0 0 0 0 0 0.06 0 0.03 0 0 0 0 0.0002 0 0 0 0 0 0 0 0 0 0 0 0 
0 0 0 
##$DATE= 1600928735
##$DBL= (0..7)
120 120 120 120 120 120 120 120 
##$DBP= (0..7)
150 150 150 150 150 150 150 150 
##$DBP07= 0
##$DBPNAM0= <>
##$DBPNAM1= <>
##$DBPNAM2= <>
##$DBPNAM3= <>
##$DBPNAM4= <>
##$DBPNAM5= <>
##$DBPNAM6= <>
##$DBPNAM7= <>
##$DBPOAL= (0..7)
0.5 0.5 0.5 0.5 0.5 0.5 0.5 0.5 
##$DBPOFFS= (0..7)
0 0 0 0 0 0 0 0 
##$DE= 6
##$DECBNUC= <off>
##$DECIM= 32
##$DECNUC= <off>
##$DECSTAT= 4
##$DIGMOD= 1
##$DIGTYP= 9
##$DL= (0..7)
0 120 120 120 120 120 120 120 
##$DP= (0..7)
150 150 150 150 150 150 150 150 
##$DP07= 0
##$DPNAME0= <>
##$DPNAME1= <>
##$DPNAME2= <>
##$DPNAME3= <>
##$DPNAME4= <>
##$DPNAME5= <>
##$DPNAME6= <>
##$DPNAME7= <>
##$DPOAL= (0..7)
0.5 0.5 0.5 0.5 0.5 0.5 0.5 0.5 
##$DPOFFS= (0..7)
0 0 0 0 0 0 0 0 
##$DQDMODE= 0
##$DR= 18
##$DS= 0
##$DSLIST= <SSSSSSSSSSSSSSS>
$$ [...]
##$SUBNAM2= <"">
##$SUBNAM3= <"">
##$SUBNAM4= <"">
##$SUBNAM5= <"">
##$SUBNAM6= <"">
##$SUBNAM7= <"">
##$SUBNAM8= <"">
##$SUBNAM9= <"">
##$SW= 16.880792210976
##$SWIBOX= (0..15)
0 0 2 0 0 0 0 0 0 0 0 0 0 0 0 0 
##$SW_h= 3378.37837837838
##$TD= 16384
##$TD0= 1
##$TE= 0
##$TE2= 300
##$TE3= 300
##$TEG= 300
##$TL= (0..7)
0 120 120 120 120 120 120 120 
##$TP= (0..7)
150 150 150 150 150 150 150 150 
##$TP07= 0
##$TPNAME0= <>
##$TPNAME1= <>
##$TPNAME2= <>
##$TPNAME3= <>
##$TPNAME4= <>
##$TPNAME5= <>
##$TPNAME6= <>
##$TPNAME7= <>
##$TPOAL= (0..7)
0.5 0.5 0.5 0.5 0.5 0.5 0.5 0.5 
##$TPOFFS= (0..7)
0 0 0 0 0 0 0 0 
##$TUNHIN= 0
##$TUNHOUT= 0
##$TUNXOUT= 0
##$USERA1= <user>
##$USERA2= <user>
##$USERA3= <user>
##$USERA4= <user>
##$USERA5= <user>
##$V9= 5
##$VALIST= <valist>
##$VCLIST= <CCCCCCCCCCCCCCC>
##$VD= 0
##$VDLIST= <DDDDDDDDDDDDDDD>
##$VPLIST= <PPPPPPPPPPPPPPP>
##$VTLIST= <TTTTTTTTTTTTTTT>
##$WBST= 1024
##$WBSW= 4
##$XGAIN= (0..3)
0 0 0 0 
##$XL= 0
##$YL= 0
##$YMAX_a= 661911
##$YMIN_a= -698847
##$ZGOPTNS= <>
##$ZL1= 120
##$ZL2= 120
##$ZL3= 120
##$ZL4= 120
##$ABSF1= 10
##$ABSF2= 0
##$ABSG= 5
##$ABSL= 3
##$ALPHA= 0
##$AQORDER= 0
##$ASSFAC= 0
##$ASSFACI= 0
##$ASSFACX= 0
##$ASSWID= 0
##$AUNMP= <proc_1d>
##$AZFE= 0.1
##$AZFW= 0.1
##$BCFW= 1
##$BC_mod= 2
##$BYTORDP= 1
##$COROFFS= 0
##$CY= 11.3945322036743
##$DATMOD= 1
##$DC= 2
##$DFILT= <>
##$DTYPP= 0
##$F1P= 16.9975609425685
##$F2P= -3.02152046262296
##$FCOR= 0.5
##$FTSIZE= 0
##$FT_mod= 4
##$GAMMA= 1
##$GB= 0.15
##$INTBC= 1
##$INTSCL= 1
##$ISEN= 128
##$LB= 0.24
##$LEV0= 0
##$LPBIN= 0
##$MAXI= 10000
##$MC2= 0
##$MEAN= 0
##$ME_mod= 0
##$MI= 1.114404
##$NCOEF= 0
##$NC_proc= 0
##$NLEV= 6
##$NOISF1= 3.799351
##$NOISF2= 2.8
##$NSP= 1
##$NTH_PI= 0
##$NZP= 0
##$OFFSET= 15.70392
##$PC= 1
##$PHC0= -9972.77
##$PHC1= 14.2009
##$PH_mod= 1
##$PKNL= yes
##$PPARMOD= 0
##$PSCAL= 0
##$PSIGN= 0
##$REVERSE= no
##$SF= 200.130013532006
##$SI= 16384
##$SIGF1= 3
##$SIGF2= 2
##$SINO= 400
##$SIOLD= 16384
##$SREGLST= <1H.CDCl3>
##$SSB= 0
##$STSI= 0
##$STSR= 0
##$SW_p= 3612.71676300578
##$SYMM= 0
##$S_DEV= 0
##$TDeff= 0
##$TDoff= 0
##$TI= <>
##$TILT= no
##$TM1= 0
##$TM2= 0
##$TOPLEV= 0
##$USERP1= <user>
##$USERP2= <user>
##$USERP3= <user>
##$USERP4= <user>
##$USERP5= <user>
##$WDW= 1
##$XDIM= 8192
##$YMAX_p= 0
##$YMIN_p= 0
$$ End of Bruker specific parameters
$$ ---------------------------------
##NTUPLES= NMR FID
##VAR_NAME=  TIME,          FID/REAL,        FID/IMAG
##SYMBOL=    X,             R,               I
##VAR_TYPE=  INDEPENDENT,   DEPENDENT,       DEPENDENT
##VAR_FORM=  AFFN,          ASDF,            ASDF
##VAR_DIM=   8192,          8192,            8192
##UNITS=     SECONDS,       ARBITRARY UNITS, ARBITRARY UNITS
##FACTOR=    0.000296,      1,               1
##FIRST=     0,             0,               0
##LAST=      2.424536,      0,               0
##MIN=       0,             -698847,         0
##MAX=       2.424536,      661911,          0
$$ Real data points
##PAGE= N=1
##DATA TABLE= (X++(R..R)), XYDATA
0 0 0 0 0 0 0 0 0 0 8 -8 8 -8 12 -16 17 -24 32 -40 48 -57 73 -87 103 -120 142 -169 198 -229 266 -306 353
31 353 -402 458 -521 592 -668 752 -844 947 -1061 1183 -1316 1462 -1622 1797 -1987 2195
47 2195 -2422 2672 -2944 3244 -3573 3934 -4336 4783 -5284 5847 -6485 7216 -8067 9064
61 9064 -10258 11712 -13538 15895 -19077 23635 -30772 44012 -130076 591974 -76891 -698847
73 -698847 227559 86741 -333616 -67034 184354 -55738 -138532 80439 290646 14124
83 14124 -119847 40901 177666 -89386 -61142 235010 -8217 -127961 95418 66300 -150265
94 -150265 -82521 65465 22290 -48671 -44062 199522 17876 -261514 74859 213980 -165619
105 -165619 11316 207709 -128029 32866 144746 -131221 -86748 118052 -47275 -29369
115 -29369 270208 -61759 -190431 253080 159982 -169710 127798 241846 39733 153022
125 153022 197512 119223 15839 101781 221692 107893 15805 163957 196948 -63782 27366
136 27366 149447 -14840 -60762 85734 127145 29651 -28844 22473 139228 -73031 -95842
147 -95842 237909 137202 -193587 81329 323091 -155347 -110842 240371 -22938 -102645
157 -102645 213799 90585 -133580 58429 83016 -16974 -17761 44756 45730 40812 64007 18037
169 18037 16278 -41303 -9183 47058 23223 -33157 -26803 40872 -25840 -117458 -97248 20228
181 20228 -91236 -137989 37266 -27208 -173711 -67260 -17769 -180255 -47988 -3078 -125915
192 -125915 -4601 7280 -134432 -57373 39883 -139571 -66886 99092 -37691 -85002 63921
203 63921 -4344 -132617 48556 30610 -78739 25310 88076 -11499 -54162 39265 563
214 563 -51676 -4037 70524 -9713 -27350 52152 -23996 -41092 -2287 -21536 -23219 74119 -798
227 -798 -48896 71114 -4537 -68106 34853 58630 -52198 60115 105511 -48052 16601
238 16601 68211 -46673 -8201 125143 -19159 -24082 117784 20920 -60616 19785 46120
249 46120 -54803 31019 84631 -17281 -25714 44495 -2702 -71784 27196 13325 -33551 15258
261 15258 49061 -32821 -50644 19126 -47283 -26493 41857 -1322 -36992 53623 -5490 -86752
273 -86752 57006 10917 -88800 37233 104022 -54130 -25565 57994 -58678 -38749 45218
284 45218 3654 -49584 33328 10850 -33425 6332 -49693 -56409 21030 36376 -48792 5935
296 5935 30352 -62676 -35642 42646 -17124 -95360 65815 73934 -76803 -18293 72394 -59796
308 -59796 -83987 96513 26869 -56100 26640 51297 -26347 -14407 17467 -22815 18688 12339
320 12339 12575 45778 3161 -84083 1840 69969 -77291 -36014 78446 -12138 -88044 51935
332 51935 26990 -133386 -29130 83765 -6281 -62963 55395 15306 -61619 12659 30646
343 30646 -12842 -10192 40884 30216 42119 -5820 -38802 27935 29605 -27627 11888 93141
355 93141 -42509 -53933 91195 13369 -113670 15754 92488 -54911 -3511 77057 -20932
366 -20932 -74614 27644 41921 -35057 2020 19994 24156 9855 -14752 -26430 12760 -6741
378 -6741 -42105 63223 43758 -63321 -22002 78899 -29961 -80293 72492 43670 -65454
389 -65454 24246 105544 -55627 -64033 55718 10080 -31105 18874 29612 -33793 -11132 -11623
401 -11623 -25730 -27599 -54701 -30853 27228 -474 -102941 -20580 15710 -92002 -58943 51169
413 51169 -26616 -97230 51130 33653 -93893 -48209 44771 -27375 -52216 48281 9474
424 9474 -41103 -17422 -96 -29366 -17497 -20174 -18493 29765 -19703 -38139 7014 -5232 -82332
437 -82332 -4163 73730 -43510 -46388 61142 14293 -84214 23254 39106 -61366 3531
448 3531 78165 7997 -43237 29842 12945 -7976 23116 23569 24948 48186 43868 10448 56600
461 56600 26737 1022 77546 91791 16112 43273 117986 20529 -1611 81682 65339 -6590
473 -6590 60821 98856 -2970 19131 57572 3614 -13996 49538 29020 5539 44134 5568
485 5568 -6136 21890 8781 -32198 32832 43733 -23162 23068 36613 -35002 -32650 46288
497 46288 -11508 -37651 37926 16498 -36579 -10487 9618 -54567 -20581 18322 -22068 -20845
509 -20845 13381 -21063 -53456 6562 -30953 -53405 10455 8666 -46897 -15906 10643 -65837
521 -65837 -38026 7777 -30694 -41732 21839 -3590 -52658 1219 -19946 -43703 385 18952
533 18952 -25914 4894 33230 -29440 -12949 19489 -11753 -22743 49759 22645 -28734 25378
545 25378 19632 -31416 -10273 33828 -15941 527 37851 -8613 -19533 8118 -6680 -36358
557 -36358 19508 8681 -22206 21580 16321 -50182 -21283 38731 -38546 -29788 38865 3711
569 3711 -37308 13909 8139 -64075 -8779 27376 -11944 -20940 11366 -4977 -15015 -5107 -37296
582 -37296 -9996 10669 -6613 -10402 20289 -18443 -48398 24513 5611 -57294 -5518 66255
594 66255 -22880 -47471 40513 -506 -55814 10127 42369 -33298 1683 46945 -5623 -29808
606 -29808 1446 15933 -2037 10830 -4654 18645 32539 -17372 -21716 20173 1626 -30187
618 -30187 44506 29720 -46169 -3878 57411 -23383 -65446 38181 28302 -27998 6448 33143
630 33143 -27573 -24339 24632 -6486 -15693 2249 21224 15150 393 -28781 -2860 32355 -21928
643 -21928 -19022 41733 26485 -41578 17966 37249 -54516 -17436 62475 5883 -52370 38680
655 38680 42279 -37114 -22532 20835 -553 -12473 26409 6339 -2703 -4292 -2332 9819 -6825
668 -6825 -26424 10815 59512 -15270 -38159 33995 22752 -48294 683 55867 -24550 -13231
680 -13231 58822 11141 -60197 11613 46345 -23645 -11565 27270 21399 -7915 -1911 -5903 -3081
693 -3081 842 -8763 21494 15177 -22243 -8061 42609 -23095 -57421 37781 39155 -37204 -10523
706 -10523 55182 -21299 -41667 33389 10805 -41518 10593 52229 -16767 -22362 7678 5570
718 5570 -10494 -10526 834 13284 13659 -23201 1382 7928 -33294 -20500 34737 670 -50732
731 -50732 26740 32570 -49791 -35146 35433 -10171 -38055 30396 16481 -29233 -8935 24378
743 24378 -18655 -21658 12656 10916 12228 365 -4654 5988 12643 -24867 -1386 37088 -6494
756 -6494 -12055 33632 13224 -49749 8049 35165 -30071 -17890 40886 8722 -39465 11453
768 11453 4837 -30185 -6849 15659 -5666 -8905 10027 -9285 -4166 -10031 -17337 3642 21397
781 21397 -9276 -9836 33921 -7697 -26240 19913 19995 -24672 15109 48252 -10662 -9769 26762
794 26762 8372 -23157 20034 24090 -7886 13613 15870 -7875 -9138 8035 -14494 2210 15565
807 15565 -12633 -1922 12348 -14938 -30289 16111 -2714 -25513 17329 20328 -23761 -9736
819 -9736 25782 -20777 -14379 24138 9396 -7904 17659 17003 -17705 6319 11873 -2835 8015
832 8015 24507 2974 3796 22003 -11240 -3468 17387 3421 -6697 25551 12291 -20740 10943
845 10943 5878 -24836 -6785 26857 -14020 -16849 22099 -10033 -29191 160 3917 -30720 3739
858 3739 19369 -15918 -11088 5920 -8063 -16973 12596 -3401 -2670 17515 4196 -5294 5433
871 5433 -524 -16842 20279 13340 -12931 8606 21877 -15931 -19418 24438 -9068 -23628 18897
884 18897 19761 -26028 -5736 17893 -26750 -17749 12767 672 -18376 6545 1027 -16481 -1862
897 -1862 -13707 -13304 2080 3304 -11961 9791 1097 -29813 2381 14542 -17724 -15265 32151
910 32151 3744 -20379 16571 10459 -24778 -4573 32854 -4202 -6997 17608 4951 -10687
922 -10687 1153 3556 -10990 7257 717 1270 9465 -7729 -24419 1630 11214 -28885 -1171
935 -1171 20891 -17093 -24650 20086 -4122 -45574 3694 17563 -16346 -14003 16082 -11170 -24405
948 -24405 1908 -2774 -8309 -7043 2543 2298 5557 -14513 -14029 11294 -7632 -13943 16284 21085
962 21085 -26908 -5596 30183 -11706 -27186 20099 21346 -26037 13209 31400 -17107 -21408
974 -21408 19695 13477 -12102 10002 9458 7329 5422 399 919 5851 -3703 754 35132 3739
988 3739 -19710 15734 24131 -20100 -6270 36405 -1255 -11447 27499 23121 -24721 -1882 28356
1001 28356 -4806 -5763 22278 18083 -11655 4038 9431 395 761 -4062 6100 14867 5386 -14316
1015 -14316 9865 1582 -25741 7422 23959 -16793 -19741 29683 -160 -28160 1283 5863
1027 5863 -17801 -1077 20980 -11878 -12190 1966 -1739 -8832 -3559 -2458 -22 12064 -6811
1040 -6811 -4611 6014 -4935 -17469 11361 19563 -17603 1133 23672 -5415 -24534 18762
1052 18762 12714 -22703 7725 24043 -2417 -11002 10332 -5181 -6194 7908 894 2704 3673
1065 3673 -2029 -3894 9108 -14920 -15034 17078 4513 -14579 4807 12771 -25184 -6708 16819
1078 16819 -10857 -18318 16886 15159 -20427 -592 8331 -9488 -9918 11424 4077 -5468 9088
1091 9088 -2674 -4250 191 -5843 -9754 11189 4210 -14843 9324 3863 -18476 -7748 12745
1104 12745 -12306 -7587 19254 -4550 -11868 6518 2009 -18296 5319 10964 -6269 4308 8157
1117 8157 -3075 -7339 6251 -6716 -1734 12185 1001 -3042 8932 5371 -17712 5538 12872
1130 12872 -5821 250 18444 3142 -8764 12947 -2728 -10220 9296 10421 -7218 5118
1142 5118 8063 -17515 -480 5878 -13139 -12572 12715 787 -11926 3837 -8086 -13140 1557
1155 1557 6235 -11143 2288 10686 -5219 596 1386 -6750 -6444 13134 1491 -3869 8808 -2200
1169 -2200 -10585 1067 4894 -17807 2213 15583 -9867 -10381 13178 -841 -24254 6953 10482
1182 10482 -6202 2429 9566 -7739 -5639 10166 -7713 -5020 3068 146 3842 8347 -11122
1195 -11122 -17455 9190 143 -8791 2535 5725 -9326 4817 14741 -15201 -11522 13916 13413
1208 13413 -6570 8477 10663 -6127 2412 7085 -1351 -3205 10399 695 3463 7334 -9243
1221 -9243 -5050 6771 -3682 -11765 19681 8043 -19301 1780 15521 -8062 -10086 15145 -1662
1234 -1662 -3721 16364 9955 -14764 -7356 10907 2209 1344 -3119 560 5777 3716 -5873 -3632
1248 -3632 1006 -10227 8253 17280 -6363 -16699 14798 10421 -21657 927 17391 -6578 -10292
1261 -10292 20316 1372 -21806 1732 6557 -10038 -6632 11301 -3347 -9163 -5958 -2865 612
1274 612 -7995 -10363 442 11049 -8985 -5019 4394 -13353 -13010 13619 8855 -23960 -1422 16573
1288 16573 -6407 -15789 3258 -2065 -14113 10172 8603 -9852 -8756 5525 -1008 -4243 -69
1301 -69 -4476 7434 6846 -3165 -2206 8512 -6619 -8910 16198 5188 -8981 6003 13876 -12189
1315 -12189 -4530 14554 -2823 -8681 7550 12761 -3671 311 -936 -3283 3331 3564 1671 2176
1329 2176 3692 -4008 8616 4463 -13294 -2420 17385 4367 -9923 14315 6143 -12492 4975
1342 4975 18009 -6371 -6712 22124 8539 -5175 4218 9625 -3076 1486 9997 5116 6395 706
1356 706 2398 5087 1787 -6972 4792 10752 -6706 2045 12306 -3152 -15162 9299 7068 -12726
1370 -12726 3665 11902 -6162 -9137 12299 -3699 -14538 3691 6890 -4186 -2411 4622 -6731
1383 -6731 -2786 -1166 -4350 -946 1727 -2604 -1502 6052 -9421 -7896 4012 -1289 -8704 3583
1397 3583 4634 -12119 -878 553 -11496 -8616 4563 -5016 -9274 4991 -5285 -11656 -2652
1410 -2652 -149 -12309 -1581 5501 -7246 -1703 3116 -5723 -8874 7832 386 -6363 7845 5986
1424 5986 -4090 363 7721 -5475 702 8530 2189 2446 6192 1001 -4036 6517 -600 -2766
1438 -2766 5993 4899 -2981 2268 6458 -9035 -1744 5782 -1498 -2189 7841 -284 -9118 7089
1452 7089 438 -9319 -32 7239 -5416 -602 8235 -8632 -7767 3664 571 -8551 2891 2380
1466 2380 -7501 915 1392 -6848 -7844 3187 -1135 -1029 1808 -3693 -3113 -1413 -2438 -5230 3424 -3512
1482 -3512 -6075 6487 1153 -12797 -4805 6720 -10282 -4558 10793 -2323 -12757 5619 8545
1495 8545 -12610 -1511 8693 69 -1494 10247 3489 -5786 2755 3685 4150 1652 802 2407 6177
1510 6177 -86 -4745 5431 -1867 -6984 4078 11299 -7186 -6637 9063 -1838 -8566 4261 7217
1524 7217 -10415 833 12606 -2719 -8529 1404 2495 -4281 4672 890 -2774 374 -1280 -1426
1538 -1426 1430 -2070 -7834 8733 7560 -6615 -732 8077 -3003 -5554 12523 4131 -4901 4576
1552 4576 10289 -1525 -2972 5035 -1389 -87 3678 4866 -722 -774 -2516 -483 5503 -3433 -2964
1567 -2964 6427 5793 -5371 5470 8419 -10355 -1052 16767 5632 -9853 9601 11059 -4894
1580 -4894 1322 8307 -67 -3487 9217 5810 507 -2413 -266 4554 1019 -2616 1420 8511 -3267
1595 -3267 -2330 7476 -370 -9899 1889 10353 -7688 -3577 9436 -1942 -14999 2372 7758 -11617
1609 -11617 -6051 5634 -139 -8459 145 -2061 -6757 -1930 -386 3226 -918 -5146 -2031 7445
1623 7445 -3607 -9589 5667 3447 -5507 731 7755 -8879 -6900 7053 -1163 -8651 576 5756
1637 5756 -6681 -3669 948 -3610 -6680 -1649 1312 -2887 -723 -3888 -1722 -1285 -5377 -4854 3600
1652 3600 436 -9988 3633 6101 -8446 -7384 7236 -809 -6823 7220 2814 -4642 174 5514
1666 5514 -3001 -1225 3005 744 4718 1741 -359 624 2791 -2744 1335 6674 -1799 -767 6468
1681 6468 3321 -8230 1890 7785 -3719 -2437 8607 4088 -7893 3981 4684 -4512 -1300 5844
1695 5844 1616 -1067 3882 -1388 1075 1226 -2184 1018 5374 -357 -1602 7578 -1572 -4691 3975
1710 3975 3550 -5012 2467 7754 -4261 -1903 3673 -934 -6021 2516 2960 -3666 -325 801 -1549
1725 -1549 -4369 -446 -3239 -853 2269 -3125 -2415 1712 -972 -7141 2080 1031 -5379 1797 4403
1740 4403 -4075 -4224 4242 -3479 -2651 2703 -1188 -2442 3721 1103 -6433 1030 643 -1950 1463 2643
1756 2643 -2592 -530 4673 -3391 -2856 1875 1455 -2532 3042 3373 -4457 -275 1780 -1740 -3421 3773
1772 3773 753 -2033 2094 -1792 -2379 1123 658 -5476 3327 4827 -4134 -536 2306 -2885 -2880 5667
1788 5667 -2307 -3766 4519 2307 -2985 -1441 704 -3661 2571 2465 -2210 -988 2081 77 -2507
1803 -2507 1330 -2710 70 4452 1708 -3884 803 4169 -4746 -753 4117 286 -2543 4873 1725
1818 1725 -5017 2037 1982 -1969 -1164 3235 -445 1163 735 -4647 502 2707 -1856 -2680 4383 -948
1834 -948 -2032 4017 -1477 -5949 1103 6788 -3576 -1940 4131 270 -2551 1003 1408 -4107 2308
1849 2308 3438 -26 -1763 17 517 104 786 -3104 2533 3944 -1426 -1934 4481 271 -4847 5243
1865 5243 3400 -3119 1921 7507 -2518 -3500 5631 1691 -1104 1159 3864 -530 1729 1385 -1642
1880 -1642 671 640 2169 2370 1905 -3219 2282 4598 -3402 -2540 4399 2909 -4344 3637 3155 -4737
1896 -4737 -1656 4256 -1368 -5722 3574 1557 -3444 -2041 -325 -2647 -2263 -405 -2903 842 -1381
1911 -1381 -2820 -359 -407 -5019 -1440 4472 -4136 -3581 3265 1096 -6815 -634 3167 -4341 -1245 3294
1927 3294 -121 -4639 1450 1096 -2775 -683 432 1663 666 1074 -1264 2325 926 -1779 2482 3380
1943 3380 -490 -643 6589 -756 -3409 4025 3401 -3045 605 6379 -1511 -928 2826 810 -2273 1575
1959 1575 2724 -848 1570 -381 382 524 -586 -2126 1650 2127 -3631 909 1999 -2809 -4220 2851
1975 2851 -926 -5550 1745 1376 -4236 -3466 1590 -3698 -4054 659 -1642 -2575 -1574 -743 -3651 -1067
1991 -1067 -2586 -2955 318 -1199 -3011 -819 1619 -5264 -2042 1856 -2171 -3209 2365 1635 -4800
2006 -4800 965 1433 -2594 -1379 2865 237 -1149 2958 -463 -93 743 850 -3 2771 1892 -670
2022 -670 3665 1629 -1220 730 4092 -602 -60 4889 462 -852 2171 2923 -1981 1844 3732 -51
2038 -51 1258 2433 979 -708 3280 -102 302 3328 1034 -81 2235 2133 -2737 1958 2400 -827
2054 -827 606 3183 -126 -2285 2682 -831 -1961 968 1175 -1386 236 1201 -2944 -274 -271 -1452
2070 -1452 -1128 1544 -1408 -2824 1975 -1579 -2751 -363 1517 -2843 -381 2222 -2361 -1709 648
2085 648 -51 -2580 1719 555 -1398 1142 153 -1125 -200 1293 -2073 1473 2177 -1469 -113 2272
2101 2272 89 -2373 2876 526 -1961 1912 2646 -1739 -1302 2716 -1132 -286 1296 406 -571 1141
2117 1141 461 -1768 806 -561 -302 882 1599 -2059 -233 2373 -2627 -1001 2092 742 -2906 1872
2133 1872 1554 -2809 53 401 -1319 -1635 2341 -870 -1415 -30 -1485 -439 -230 -1392 -2729 1756
2149 1756 -378 -2504 206 -411 -3126 -1362 3145 -2684 -2673 2046 1006 -3140 -951 1992 -2671 -232
2165 -232 1667 60 -1806 224 384 -801 434 -879 1243 979 -267 -707 2570 390 -3256 2661
2181 2661 2287 -1137 -51 3904 -1384 -2214 3520 1181 -2121 96 3548 -895 -247 1010 -539 -883
2197 -883 680 1615 -621 1069 -9 1031 1090 -900 -917 1703 2082 -2065 1732 1920 -1545 -1248 2510
2214 2510 404 -2608 2851 1338 -1174 -318 1548 -1125 -971 1212 -621 1252 77 -1033 -783 1224
2230 1224 -1271 -1381 1786 -844 -1019 1191 1869 -3343 -866 2726 -1031 -1397 1263 1352 -2530 1024
2246 1024 1418 -1837 -1343 853 1268 -687 574 -934 552 45 -1620 42 1236 -452 -1901 2831
2262 2831 -861 -2725 940 1666 -2415 -1215 3406 -1523 -1978 962 419 -2703 -114 1320 -1595 -213
2278 -213 348 274 -1872 -368 -160 141 360 -1436 558 654 -630 -2064 1620 468 -2483 1369 2088
2295 2088 -1263 -2050 2296 -877 -1737 890 380 -1067 -53 911 -2012 -88 91 -781 -99 572 -542
2312 -542 -835 1492 -1617 -679 787 15 -730 1321 1411 -2354 619 1812 -279 -1601 1745 1431 -675
2329 -675 1436 711 324 56 1335 75 1235 1131 -498 1768 1186 -610 -546 2538 192 -933 2059
2346 2059 604 -929 21 1416 -1876 399 1661 -880 -791 1177 1047 -1993 325 127 219 685 715
2363 715 -8 -583 897 -534 1014 457 -945 263 2636 613 -2065 1519 944 -57 568 1760
2379 1760 -648 465 2330 -425 -69 911 852 -545 1844 1050 -917 873 789 -312 -497 1515 -620
2396 -620 303 796 -457 -30 242 -259 -1792 1232 1153 -1132 -945 43 -18 -418 614 -1793 -411 666
2414 666 125 -1023 -315 -933 -2728 1065 51 -2212 -1345 890 -498 -2011 81 -1418 -858 39 -61
2431 -61 -2067 -639 -442 -2394 -788 -364 -947 -1421 75 -789 -1051 -75 -1378 -878 -217 536 -1218 753
2449 753 153 -1733 343 1795 -18 -1620 1409 932 377 580 -340 -287 814 1701 -604 998 591
2466 591 109 555 1267 -289 -1160 2033 926 206 614 859 -487 312 1350 -822 102 966 112 -825
2484 -825 1076 84 -1257 117 -19 262 51 -39 -1442 106 593 -1202 72 417 -427 -1235 1784 -212
2502 -212 -2271 83 810 -385 -1169 325 -1305 -588 68 -1003 -1600 -387 -54 -1028 507 -611 -1097
2519 -1097 -409 74 -855 -450 539 -1161 270 872 -898 -1314 794 478 -1369 986 1142 -330 -642
2536 -642 1418 193 -163 860 293 707 780 794 146 1129 654 389 1792 808 228 788 2146 132 232
2555 232 1552 288 308 1638 1419 -1105 939 1234 85 -44 1047 623 -511 994 -51 123 -87
2572 -87 -3 -156 472 243 -879 688 -187 -835 -581 594 -646 -970 937 -563 -1001 -373 202 -953
2590 -953 -376 546 -933 -298 -163 -64 -1157 174 -288 -662 406 -186 -652 -47 270 -1344 224 225 -1115
2609 -1115 0 967 22 -1220 1234 249 -472 510 663 -3 -214 799 -524 219 -33 237 508 524
2627 524 153 -402 1066 -363 -124 848 394 -924 480 1261 -905 -509 658 -260 -1449 542 325
2644 325 -1348 -346 0 -792 -1166 457 -876 -710 357 -766 -661 -604 -148 -832 333 -397 -938 265
2662 265 -216 -752 -837 444 -1400 -80 658 -36 -592 79 507 -802 368 30 31 83 771 288 169 1037
2682 1037 -385 576 908 888 -234 919 1188 -199 1041 590 301 46 1533 441 165 1105 48
2699 48 287 775 746 -358 827 677 440 887 64 -2 17 1331 -15 437 771 -150 -52 361 440 -1206
2719 -1206 273 546 -145 -397 385 -416 -1120 526 -408 -650 -300 -110 -1152 -479 9 -1325 -425 -694
2737 -694 -388 -499 -425 -1085 -992 284 -794 -989 -606 -212 -1043 -112 -131 -1537 -658 45 123 -932 105 -640
2757 -640 -608 95 -277 -684 -483 684 -452 125 449 -214 -500 147 383 -421 802 -128 -3 298 322 -147
2777 -147 -45 690 -474 564 653 92 -635 564 396 185 1001 -302 -55 591 1030 -721 -262 785
2795 785 -65 410 317 397 -969 399 457 -449 56 -23 105 -306 752 -378 -149 18 -407 -322 -77 247
2815 247 -629 369 -38 -414 90 -70 -483 -322 831 -568 -64 119 -320 -603 255 436 -780 428 409
2834 409 108 -257 247 133 107 1151 21 87 151 766 -317 227 760 -212 157 58 282 -547 363 -57
2854 -57 -119 411 -496 250 -51 448 -802 438 130 -494 443 261 -309 -178 783 -205 -273 428 147 -486
2874 -486 37 637 -738 105 122 23 -344 24 141 -364 325 -4 185 93 514 -63 280 617 -323 344 -94
2895 -94 -139 37 685 -99 -126 851 89 -153 -41 457 -521 273 734 -218 127 187 391 -376 708 4 -275
2916 -275 439 352 -32 -110 822 -389 -26 144 54 -305 278 197 -610 -2 -396 -240 -473 149 -447 -616 309
2937 309 -504 53 -428 -415 -268 198 -226 -961 290 -426 -704 -208 320 -427 -370 152 -732 -430 -61 230
2957 230 -1178 127 440 -220 -314 -138 -15 -349 542 -218 -281 6 -68 181 8 -248 -403 420 -108 -216
2977 -216 94 254 -147 100 879 -459 -53 331 296 -375 -5 526 -175 258 125 415 -105 392 4 86
2997 86 772 178 316 48 431 -162 583 65 -449 265 250 -36 -363 437 -49 -155 423 -143 -398 15 724
3018 724 -528 207 -107 -546 263 91 8 -617 72 -237 -64 -9 -49 -208 -239 112 -723 -35 -17 -279 -454
3039 -454 128 -59 -679 -1 -224 222 -166 672 -90 -120 143 -414 416 -398 -275 -287 522 -224 -594 33 -243
3060 -243 -62 175 454 -277 94 305 -16 -174 -24 71 -292 471 -120 -230 46 131 -96 -22 192 -392 -33
3081 -33 -234 -293 -319 -151 -215 -528 198 -338 -257 -234 -238 -269 -374 151 -630 -114 -195 148 -442 -157 -235 -609 79 -24
3105 -24 -262 -559 238 -160 -220 97 -309 -66 -93 172 -71 243 18 63 300 40 208 -289 478 196 89
3126 89 397 199 198 444 634 -96 496 447 -117 169 547 229 105 547 216 296 245 372 112 329 333 -192 342
3149 342 -49 324 126 489 -57 -162 344 -14 -39 -37 211 -506 105 299 -90 -78 10 -10 -601 -30 -243 -293
3171 -293 -206 -228 -33 -311 140 -431 206 31 -372 -259 -236 -45 -277 311 -408 -98 -40 96 -277 -335 244 -477
3193 -477 -136 79 -41 -223 95 349 -16 281 186 533 -85 344 -44 324 429 134 369 285 206 -173 485
3214 485 28 53 263 438 213 -75 426 66 126 458 204 112 48 366 269 313 -141 280 161 -85 204 202 99
3237 99 -486 205 91 -117 -230 122 243 -323 236 -260 164 -298 156 -330 -259 -21 -476 -152 -363 26 -272
3258 -272 -64 -225 -283 -16 -491 -372 -211 -25 -407 -103 49 -417 -150 24 164 -596 167 105 -230 -15 -106
3279 -106 363 -568 356 -84 -173 -135 -167 60 -30 113 -329 -35 -77 52 89 219 -40 -438 192 -385 175 -36
3301 -36 192 -73 -90 348 -441 72 -59 228 -64 330 -229 -202 215 44 -204 -97 -99 -398 -142 -179 -157 273
3323 273 152 -235 -332 228 -136 -259 54 13 -16 221 774 -335 11 208 331 146 66 172 83 307 14
3344 14 268 -95 79 126 210 18 -28 197 -79 48 -63 142 121 -368 233 211 -37 125 248 -258 32 391
3366 391 -34 -352 -97 69 65 -180 -224 -32 -252 -117 132 -221 -62 -262 238 221 -363 34 -94 -92 -362 273
3388 273 -113 -94 65 -60 -264 -111 435 -276 -206 -192 101 -118 -79 -353 -136 96 -292 -118 -195 -215 32 245
3410 245 207 -333 153 219 33 -381 262 53 -269 90 229 -33 -179 803 39 -250 39 354 360 15 262
3431 262 86 125 -39 196 90 -50 135 181 263 -244 319 256 -130 21 215 293 -296 96 92 -41 -290 169
3453 169 108 -442 422 -11 21 -169 126 22 -84 157 29 -5 -180 -220 -27 244 23 -158 278 4 -87 104
3475 104 32 -596 -30 318 -271 -17 180 149 -366 -250 274 191 -583 -158 -54 47 325 -334 -27 -168 54
3496 54 -52 250 -114 -118 472 -247 67 2 483 -92 -178 482 136 2 -9 165 -76 -334 213 -6 71 -244
3518 -244 151 -69 -117 -231 -64 -28 31 -17 34 -305 -299 212 3 -54 45 -10 -421 -331 259 -1 -182 169 174 -112
3542 -112 -384 45 -104 -61 -7 250 -174 -183 30 -141 24 -133 260 103 -201 -310 79 -138 -447 83 11 117
3564 117 -139 382 -175 -71 17 139 -175 -209 35 142 112 -249 -29 265 -159 34 -68 77 -82 375 195
3585 195 -232 -95 259 459 -549 -36 175 -142 -200 -223 115 -494 123 131 -48 -380 -217 228 -31 -180 -73
3606 -73 230 -225 -92 -114 11 -374 -178 105 -442 -132 73 178 -322 76 357 -302 -28 -137 -43 -92 -122 -115
3628 -115 -178 -13 234 281 -12 157 -44 431 -1 39 3 148 23 -81 204 -463 -220 158 217 -348 -92 338
3650 338 -127 -9 254 291 -105 139 123 -325 32 75 202 33 116 -81 -150 -111 65 246 -304 -84 -47 -114 -98
3673 -98 -31 99 106 -316 229 505 -80 -205 -28 244 -22 -359 210 -226 -12 78 -20 -236 -126 14 -76 -91 -265
3696 -265 368 2 28 67 -118 -8 -206 194 -102 120 155 274 22 25 20 57 -38 -37 312 52 -233 201 8 -61
3720 -61 -345 -83 27 69 -164 143 160 -300 -124 177 267 -144 75 286 -320 -88 121 95 -303 -17 257 186
3742 186 94 115 56 -302 65 212 23 -207 -2 209 79 -43 106 212 -131 -62 -47 51 -145 -301 319 -294
3764 -294 -202 163 180 -493 77 134 -227 -41 26 -10 -173 -12 -38 -31 -120 -180 -43 123 -71 -189 225 -123 65
3787 65 291 -371 -225 139 289 -250 -172 204 -149 -60 197 -5 -50 115 31 -105 -22 56 13 -27 31 4 234 82
3811 82 -173 70 -163 -196 -17 124 -78 -478 -184 -101 -60 -150 94 24 -191 16 191 116 30 -17 -211 -156 -148 -36
3835 -36 23 -13 -126 118 -229 -258 10 -51 -119 -306 335 -305 -25 17 174 -123 -67 255 118 15 -68 177 -264
3858 -264 -61 17 29 142 -119 107 126 -138 45 -34 119 28 333 -49 49 -112 233 335 67 142 194 58 -215
3881 -215 134 154 13 171 161 159 -177 122 -242 113 82 154 209 32 87 130 168 -9 -148 103 -142 103 257
3904 257 23 -194 -39 130 -4 -329 98 -124 -235 84 -20 -16 -106 183 -21 -424 118 173 234 -100 -90 90
3926 90 -17 -37 -88 56 -83 -87 115 -47 -374 191 -310 -186 137 68 -102 -96 328 -38 27 -176 -8 262 100
3949 100 -104 -99 167 -191 73 -15 86 -29 -59 -38 -115 -56 -160 -69 -164 141 -93 -233 102 136 2 242 277 97
3973 97 -88 -215 -89 -5 -399 -66 84 187 -140 -104 134 -196 -157 -316 8 -16 164 -48 42 -65 -180 176
3995 176 223 266 -269 252 -173 -109 235 136 -41 -53 -160 193 104 -34 45 104 -50 261 4 13 70 330 334 -256
4019 -256 359 99 -138 45 395 10 -243 19 142 88 -78 -8 -39 61 180 74 -2 -99 -9 14 -2 240 45
4042 45 158 -17 -59 -48 261 -17 79 70 -87 90 293 121 19 -79 51 292 -373 68 -55 -218 -136 211 -80
4065 -80 146 -25 -59 65 156 -128 -196 -210 -147 -49 9 -117 -107 0 -76 172 312 -353 -152 151 128 168 -237 234
4089 234 368 -265 33 266 -53 -194 -161 359 -31 -42 233 -97 157 -144 -168 14 -244 61 -90 -46 84
4110 84 -210 -44 -114 -344 79 -120 -60 -28 -62 -228 103 -46 -168 1 189 -39 -36 -147 102 121 86 -192 -66
4133 -66 -129 -113 57 93 -9 -56 -39 -88 -5 -92 12 -211 -90 290 -4 -122 49 -119 -337 149 89 90 -338 204
4157 204 154 169 -62 -59 60 -419 230 338 -4 -149 -49 -76 -42 -234 118 170 -90 138 -35 -78 -129 38 -23
4180 -23 -141 -77 13 -192 -40 207 -55 -88 -29 210 -30 -88 -106 222 72 145 -65 158 -65 -50 -56 172 52 3
4204 3 94 -218 -62 -143 167 -28 -61 -33 -28 146 -65 114 -123 188 63 69 231 8 117 -200 39 -34 178 91
4228 91 -150 -21 258 -131 -97 215 66 -15 -122 127 1 -146 -59 247 -26 -225 258 72 -11 10 14 56 166
4251 166 -160 -24 88 45 182 151 20 -66 195 231 -349 89 62 -71 -97 155 191 -148 90 300 -182 -82
4273 -82 -22 -110 19 -259 -27 -41 -121 64 183 262 -94 -179 16 -160 -44 141 -65 -271 -251 -101 -197 -211 33
4296 33 186 -98 77 -4 -34 -364 135 -17 -70 -171 155 -235 -328 -126 126 -141 -262 -74 134 28 -253 89
4318 89 -403 -306 -164 41 -248 -36 -117 -65 -14 -257 -47 214 71 -31 -79 -121 20 192 -51 -128 -163 -56 -48 -265
4342 -265 -28 -233 -9 24 -80 -162 -362 -104 -78 -152 -32 -153 3 76 -4 23 -25 284 27 -177 0 -46 -169
4365 -169 45 63 -129 120 -171 86 -30 -255 -10 84 136 89 142 151 -50 -43 265 64 186 -75 162 168 306 -57
4389 -57 193 85 32 38 120 109 85 -228 42 20 7 359 0 -57 -25 95 134 -35 7 103 -90 113 73 66 -50 68
4415 68 47 92 -241 97 149 -10 -71 16 46 -35 -7 -66 -107 -90 7 187 -171 -136 141 -3 -26 -49 -143 193 -58 115
4441 115 -84 -23 15 -156 -80 -98 400 -71 -154 13 44 114 10 133 125 -62 -1 77 179 -5 41 4 -80 -99 -1
4466 -1 107 -111 -68 34 -83 -209 -108 18 182 -72 88 -170 149 -303 38 -186 -141 101 -36 66 -124
4487 -124 -19 -250 93 -255 -101 267 -27 203 152 -8 -17 135 82 205 -226 131 -9 -133 -169 137 -253 -180
4509 -180 40 48 -136 -21 -125 93 145 50 -60 -24 148 -50 61 71 62 -80 327 -26 270 70 -59 -5 -17
4532 -17 -3 3 35 116 62 12 -98 -32 -41 -114 -67 178 142 -3 85 34 -41 -55 191 -46 382 -27 -104 -38 -149 29 97
4559 97 1 -80 250 94 -66 140 -55 -124 36 -21 -100 133 188 14 -143 -242 250 -140 56 4 -32 158 17
4582 17 -151 91 54 157 -31 77 -58 -66 -116 254 126 100 -61 53 183 86 -160 -36 187 -336 -60 -46 -30
4605 -30 17 99 -145 176 -69 -162 -70 10 -166 123 33 -170 210 169 -82 31 -10 117 246 -31 128 -55 -131
4628 -131 -91 169 82 -88 72 -354 -1 -120 -11 154 -3 20 -14 -132 127 38 5 -94 -119 17 48 21 172
4651 172 37 -149 -17 -84 -63 271 61 274 18 135 327 49 -25 26 -94 -168 -40 223 -5 -65 -78 98
4673 98 25 19 -19 51 -102 128 228 -103 -178 -184 132 169 57 150 -37 -232 154 -44 128 -188 -250 75 -200 45
4697 45 -99 126 -248 24 122 -4 -44 -62 58 47 63 134 88 -6 -82 33 -26 -105 -79 -130 -68 59 -92 217 -183
4722 -183 -70 69 47 -50 -151 174 4 -117 264 141 -118 -36 -27 -50 73 187 37 62 -48 175 68 94 27
4745 27 -51 27 -39 124 285 91 81 136 16 -184 395 105 -30 154 -4 -123 -82 160 -55 120 -331 62
4767 62 31 -255 19 -62 31 -140 -104 -26 -141 -239 117 151 -259 -283 -313 -174 -54 -27 -97 -83 63 -201 -30 -7 -88
4792 -88 -218 134 184 -63 -246 0 -91 39 120 -61 34 56 -112 92 -90 40 -76 7 -135 16 124 -53
4814 -53 21 -296 -6 -3 -162 45 -227 -79 -87 -167 414 265 294 -102 41 -23 -99 -39 26 -199 67 35 -160 71
4838 71 -83 55 287 131 -28 196 -81 -154 120 -66 172 3 -6 103 -303 340 -1 -148 -21 57 29 106
4860 106 33 -83 2 82 169 60 39 81 190 44 102 -167 -87 50 -147 150 -22 -52 76 163 73 -110 -10 -245
4884 -245 38 -57 163 -74 -56 221 -42 153 19 109 63 -85 91 146 -48 -119 172 176 104 128 369 -166 103
4907 103 208 -102 -249 88 333 93 -45 44 1 64 -169 -101 39 -66 95 -57 -74 -172 -218 26 -156 -488
4929 -488 275 42 -172 -115 89 -102 -191 -235 -229 51 -282 -81 57 -300 45 211 -58 -226 103 88 64 -344
4951 -344 72 132 -62 171 100 100 -214 -9 315 -17 -65 -9 389 -223 98 48 -138 -83 -61 220 -255 -230 277
4974 277 -57 -284 100 -3 60 -93 -95 161 -224 1 275 265 -28 -96 392 -26 -137 112 178 56 -153 109
4996 109 130 -63 -111 151 -21 -17 63 -12 -187 -236 18 -62 -187 -169 241 -165 -277 172 222 -88 -248 13 -137
5019 -137 -182 69 255 -12 -308 277 -63 68 128 83 69 -65 290 -8 -114 -325 209 107 -86 -225 -42
5040 -42 222 -214 -188 -68 167 -187 178 259 -214 -187 25 63 4 260 -9 -83 -189 28 26 40 -13 31 35 350 139
5065 139 457 183 126 50 98 37 68 319 -7 43 70 80 -106 -108 213 -12 26 28 -78 -156 39 8 -85 -70 -171 -34
5091 -34 -152 -62 174 220 -107 234 87 115 -135 -139 -34 -55 53 131 215 -104 35 -122 5 131 -55 225 -64
5114 -64 118 -135 -100 165 -4 -90 -35 107 -151 -281 -224 -86 -204 -130 140 -319 -168 14 139 -186 -56 12
5136 12 -67 315 -87 7 -98 -38 -134 -228 119 -34 31 -109 -108 -153 -143 149 -88 -357 -67 -37 62 133 34 -92 152
5161 152 -74 141 -222 -189 -200 -73 -193 80 15 85 -275 -69 105 -308 -276 113 -34 34 131 -100 -122 -30 168
5184 168 171 -117 -77 99 -1 150 -76 20 -358 -13 14 232 -127 -107 191 -81 -96 -192 56 -170 -63 89 119
5207 119 -59 -302 359 68 -27 -155 -120 -69 -240 -91 -61 -167 -147 42 -126 58 -131 10 215 -263 154 194
5229 194 -16 -8 87 -40 -235 94 75 49 -90 369 320 -251 -166 35 246 -203 19 257 37 -333 -128 504
5251 504 -348 -163 11 222 -334 352 153 -122 -27 214 -255 -311 80 -65 62 -346 -1 310 100 -222 201
5272 201 299 -419 -15 577 -126 -164 54 59 -159 6 121 109 -2 -214 223 -150 -18 19 99 -233 -23 260
5294 260 -119 -183 -299 -68 -330 -94 -72 45 -135 -174 82 62 -37 100 191 -25 16 188 -81 -221 -309 55 1
5317 1 51 -5 150 -283 -59 230 -193 99 13 109 127 -125 -131 18 34 -188 370 146 -21 86 323 -52 -25 261
5341 261 8 19 -80 -26 -216 -222 -34 -133 264 15 35 140 41 -28 373 209 -173 -32 215 77 -43 -95 242
5364 242 -83 -124 135 -101 -166 -72 99 -241 -246 -114 -167 16 -29 139 70 55 -203 233 -143 -60 -62 -269 -107 -158
5388 -158 122 11 -164 -58 113 199 150 184 243 -5 -98 269 3 -97 5 268 130 5 43 153 205 43
5410 43 31 -22 168 60 298 76 127 18 95 104 9 179 127 -6 3 -98 -147 -24 3 -16 -156 -104 -57 48 -11 143
5436 143 -274 158 -393 -12 -237 -33 -77 -361 138 -346 57 -49 -136 -25 127 126 -235 -149 36 -85 58 -169
5458 -169 -181 -12 18 -219 -114 198 197 -113 129 186 -47 -158 194 44 -98 33 201 -220 -49 -136 253 -3
5480 -3 -120 -103 83 -38 46 72 -109 -78 82 522 -49 210 256 351 47 49 357 7 133 320 120 132 -21 541
5504 541 8 -159 182 169 -248 -384 183 80 119 -90 56 -60 -181 -54 -18 -454 -346 53 -79 -405 -409 54
5526 54 -231 -65 99 12 -286 -285 -230 -128 -217 -237 25 188 -166 -141 137 -309 -189 59 71 -328 -354 275 -15
5549 -15 -346 -86 104 -119 -401 56 -21 -392 29 76 -248 -295 170 -75 48 -187 75 386 -294 -104 262
5570 262 54 -409 261 334 -347 -18 198 500 -189 108 373 -135 69 242 119 -179 16 103 -49 -273 -14
5591 -14 574 49 -16 -39 303 -195 24 483 37 -181 -42 359 -94 -165 278 149 -147 45 154 5 -112
5612 -112 -192 200 -44 -125 85 76 22 -91 265 -27 288 -139 273 -99 -38 189 155 -133 -75 320 1 -288 332
5635 332 310 -331 -263 349 -158 -408 -326 -106 -54 -474 -192 -89 -181 -182 164 -97 -115 -36 346 -104 -248 42 215
5658 215 191 -201 213 25 -463 103 253 -17 -239 280 255 -317 -60 57 -29 -141 93 -104 -74 -151 -180 174
5680 174 -363 -181 48 166 157 48 331 -76 17 49 -41 -71 355 202 54 93 5 208 102 -14 175 1 52
5703 52 199 189 -87 36 -144 307 -152 52 275 115 -509 9 491 -109 270 177 79 -37 218 269 -95 145
5725 145 -94 156 -159 348 -124 47 269 -22 -128 -335 183 189 159 21 5 290 154 26 -35 111 -271 15
5747 15 32 -20 -9 -119 -63 -263 72 186 -319 -195 -79 -246 -132 -14 -122 20 -253 -120 302 -185 112 104
5769 104 210 -185 -247 373 168 -126 -49 341 -89 -127 88 44 -190 -197 194 204 102 -171 240 -25 -200 -89
5791 -89 28 60 -148 26 -51 47 -1 460 196 -278 160 166 -192 -67 445 105 -289 163 345 -129 -211 421 217
5814 217 -255 89 403 -104 -26 -40 189 163 -64 514 68 43 76 493 159 -72 309 325 138 45 305 158
5836 158 -463 121 208 -202 -176 355 13 -119 290 200 253 -118 218 -107 -39 -43 323 271 -137 -96 299 128 -599
5859 -599 -100 337 -360 -345 67 126 -265 -115 -87 33 -518 -143 -107 -312 -402 -220 5 -436 -440 -126 -299 -435
5881 -435 28 77 -468 -201 -172 -194 -444 -382 -100 -411 -319 23 -47 -557 -348 18 -20 -377 -176 25 -239 -74
5903 -74 36 -13 -134 -128 90 -21 -172 -6 331 -115 -421 202 308 60 -95 330 131 -364 141 321 -149
5924 -149 -33 336 175 82 211 202 -19 213 388 404 -34 -70 212 332 -108 164 693 414 -236 269 320 -93
5946 -93 -188 129 210 -180 96 124 56 -188 199 -55 -137 -44 96 22 -198 -347 166 15 -228 6 -196 -213 -124
5969 -124 -128 32 -354 -17 243 -253 -201 367 146 -485 -131 157 -50 -90 84 -89 -196 190 56 289 -12
5990 -12 -11 108 164 -34 28 11 20 29 -49 353 -147 83 177 172 -36 278 234 -295 180 283 -79 168 180 135 -174 219
6016 219 -97 -7 188 97 71 147 15 -123 38 96 -3 151 24 -193 -77 276 -229 -163 100 221 -131 -2
6038 -2 -139 -132 -81 -198 -272 -75 148 -73 -294 188 -74 -441 -381 51 35 -117 -98 -59 117 -295 116 -15 -18 -346
6062 -346 -80 4 125 -225 -123 120 -62 187 135 -56 103 345 -33 -274 -87 148 113 32 88 109 -4 19
6084 19 73 105 -351 -50 225 168 -161 66 2 -207 -165 143 319 -493 307 165 -104 -99 52 200 -92 -148 74
6107 74 -91 -166 30 -7 -278 44 -229 6 -59 -175 -95 309 -209 -85 460 -62 -226 -125 -54 -261 -333 328
6129 328 35 -76 -37 -2 -172 -157 251 -250 -198 -83 30 57 18 -313 212 90 -328 -56 84 29 -352 362
6151 362 79 -327 -120 390 184 -181 398 247 -350 -61 206 339 -169 134 214 86 -58 -41 16 -17 -37 126
6173 126 199 -496 29 199 -336 -382 146 -70 -347 155 133 28 -177 80 -24 -412 162 -5 304 -345 48
6194 48 59 -100 -62 40 468 -316 -67 176 467 -344 -33 511 52 -250 -141 138 -485 -89 76 -176 -233
6215 -233 179 -77 -185 31 69 -166 -484 -211 -84 -72 -336 -214 307 -195 -242 56 -119 -287 -308 514 -111
6236 -111 -422 -144 216 -361 -248 105 -52 -139 199 230 -403 27 161 -30 325 -210 -2 -139 53 -151 8
6257 8 -80 -114 -29 130 -118 -316 -100 -26 -302 128 414 -202 -108 143 -378 -4 -118 3 183 69 -50 -65 -163
6280 -163 -247 -233 67 142 -192 -15 151 -159 96 316 9 -327 154 204 -178 281 149 41 41 342 6 -126
6302 -126 298 407 5 -170 241 -36 4 33 -44 -226 -13 -109 278 310 -229 -112 215 45 -173 -100 18 -42
6324 -42 7 195 81 5 -136 -200 -122 273 -239 181 -3 107 25 160 41 -119 86 59 342 -54 297 -178
6346 -178 51 169 -246 100 -29 42 -61 -156 130 -451 170 193 -134 -28 163 -28 -65 216 158 -316 85 379
6368 379 -21 27 -174 112 121 -68 -34 -69 102 -213 -214 -163 -54 -167 46 240 -54 141 48 16 -11 -28 -32 -138 -17
6393 -17 175 11 -477 70 -42 -172 -197 -22 276 -4 -66 -28 59 -349 -374 49 -64 -273 -167 413 -149 -257
6415 -257 208 -119 -401 -99 14 -331 30 -27 23 -135 55 233 -253 -3 -70 46 -134 -204 109 306 -29
6436 -29 96 526 -57 -413 163 466 -68 -184 573 193 -178 159 147 -124 -264 323 183 200 -43 275 281 231
6458 231 -138 323 167 -21 273 335 -174 -230 311 240 -24 -71 265 -291 -216 111 -8 -291 -92 408 -300 -258
6480 -258 299 -123 -204 -269 -6 202 -26 -214 -16 351 -260 -88 208 34 -215 42 28 -213 -146 190 -87
6501 -87 -394 50 -96 -128 -45 13 -187 -267 149 -50 59 -158 -29 203 81 -98 1 225 -406 -48 367 25
6523 25 -427 70 601 -366 -34 399 77 30 -169 235 -236 -192 178 53 -30 -104 313 -33 -77 40 146 -108
6545 -108 17 238 241 -272 -493 280 221 -316 65 541 -173 -312 84 40 -213 -28 224 7 -37 165 47 -30
6567 -30 -77 30 -156 29 -138 371 350 -102 -102 266 42 -257 107 81 -154 147 416 246 -236 184 74 -186
6589 -186 107 379 20 -153 8 -25 71 -250 -40 120 87 80 67 -56 -119 -210 193 164 -400 142 156 -252 -220 -167
6613 -167 157 -108 -74 -256 -291 75 34 42 -34 -54 -286 55 -55 -41 -136 -134 -125 -36 257 38 -242 58 98 48 -15 47
6639 47 -115 58 28 -173 -162 -232 35 -236 -100 -229 -37 -229 11 99 -44 188 -27 45 65 59 50 38 191 15
6663 15 129 163 271 37 107 -20 -53 301 129 -114 98 78 -151 145 3 -42 120 95 31 -28 80 41 81 189
6687 189 90 180 239 170 -149 20 -106 58 141 42 -203 -58 -64 -207 -176 77 63 -205 260 161 -111 -64 463 -32
6711 -32 -176 391 -194 -174 -131 -158 -237 44 185 -215 125 380 -37 138 93 -21 -87 533 -433 -33 170 59
6733 59 -261 -98 89 -473 -221 156 -22 -354 -79 213 27 26 -56 -129 -252 -543 -120 79 95 -305 174 218
6755 218 -219 -358 -18 -3 -85 25 -26 -302 -268 108 -417 -133 43 -214 -73 -145 21 -85 -101 -82 -225 -248 -238
6778 -238 -158 67 139 -240 105 69 -385 -83 328 41 -167 420 -93 -331 -365 -101 -139 -290 336 9 24 -123
6800 -123 105 -109 207 -5 132 346 8 -97 166 -38 -197 19 166 -58 -11 489 99 -357 154 296
6820 296 -403 -100 20 95 -429 222 177 30 -141 -91 170 134 46 -130 205 -57 -32 192 89 -262 -97 164
6842 164 -314 -284 -32 -234 -51 -8 259 -348 -77 -145 216 -197 -270 -51 -33 105 -204 34 -79 -143 -40 128
6864 128 148 -99 232 74 -378 -234 208 13 -118 11 169 -144 -102 -107 -253 -73 318 49 -72 254 -3
6885 -3 -300 13 -12 -83 101 39 9 110 211 -239 236 132 51 -126 193 120 -446 -6 -20 41 -88 162 31
6908 31 38 128 107 132 61 -148 -17 15 232 86 175 89 -248 -88 233 -183 -83 54 -165 -314 -147 -84 -386 -100
6932 -100 164 4 6 177 -308 125 -54 -390 -60 73 156 -73 -103 12 -226 298 241 138 154 -37 -179 -134
6954 -134 52 -230 -196 -211 -25 30 220 112 -146 99 312 65 18 136 -83 -118 -165 -216 -308 -12 155 -100 111
6977 111 -55 -410 25 -126 -31 -273 -3 -140 293 -165 -94 -116 -200 -6 -56 255 107 -250 -189 113 -89 -406
6999 -406 378 -77 -338 -44 -8 -327 -354 -246 -267 5 -271 -120 -178 -1 -25 -168 -109 145 -232 -50 -230 -165
7021 -165 -61 -17 -298 -110 23 -49 -269 44 78 -181 -65 81 -64 -129 180 -41 -4 75 39 -46 203 -53 282
7044 282 443 100 21 350 -36 -283 120 405 -142 -397 271 173 -69 168 306 -260 -3 216 -41 -203 244
7065 244 74 -69 12 -207 190 129 52 -249 17 -196 -220 -35 117 109 211 274 98 -105 -14 36 -140 -204 85
7088 85 26 -39 -9 -44 -128 14 31 -7 110 150 164 41 -40 -362 -227 -11 -312 -238 12 -472 -277 139 -152 -169
7112 -169 169 -16 -31 25 90 -75 -119 102 0 -82 -55 -80 -179 1 -121 -14 319 -130 -132 -51 23 -239 -28 280
7136 280 -190 -224 150 195 -189 64 15 -73 -170 -101 -110 69 -200 45 -68 -119 -164 170 119 -56 -8 95 -55 -117
7160 -117 312 372 -202 -76 369 -56 -118 59 108 -221 157 47 -24 172 -155 -35 51 -130 -26 -78 47 -329
7182 -329 265 315 126 -279 152 288 -87 239 339 -149 244 128 -60 -42 73 227 -14 335 237 -41 168
7203 168 -37 -141 138 124 -36 -8 640 -9 -11 343 112 -43 142 180 -188 -12 68 -318 105 168 -50 95
7225 95 235 3 47 -20 119 -233 206 -17 -453 186 -46 -30 -34 396 -6 9 270 44 55 254 -25 -38 5
7248 5 24 67 -206 200 -134 -171 172 36 -233 15 -13 -210 3 124 -115 220 31 -216 -142 110 -142 39
7270 39 63 71 -169 99 -136 62 -43 12 -226 146 175 301 -123 315 77 -30 208 -149 -18 7 95 -135 194
7293 194 180 -237 -287 7 145 76 109 10 -7 -140 -69 -149 -56 120 -78 -73 76 -59 -196 170 147 -169 32 -179
7317 -179 -228 73 364 -247 -335 -76 206 -86 227 5 -385 27 104 -426 126 -57 51 -226 103 -432 -61
7338 -61 75 -363 -192 136 -70 -249 69 150 -143 -11 -302 -74 25 237 -56 -219 -238 20 -166 108 91 -357
7360 -357 153 -143 5 110 -10 -48 -75 169 -50 223 81 -29 -123 176 229 -52 3 124 -56 80 -147 -153
7382 -153 62 182 -62 -190 314 162 -213 47 80 -148 41 237 97 -129 567 -291 -99 82 183 -71
7402 -71 421 323 -190 257 168 -73 -141 267 -60 -81 134 -74 108 296 145 -159 180 228 -112 42 239 -20
7424 -20 -95 43 206 -73 233 130 77 -111 51 -21 75 -41 -55 106 168 -28 -215 27 -60 -43 -123 32 -55 -135
7448 -135 140 -306 45 93 -394 -364 25 9 -240 -88 -102 -568 -345 150 -28 -166 -297 -243 -86 73 -234 -172
7470 -172 -43 88 -348 119 144 30 -126 64 192 -76 176 30 56 30 196 -291 132 92 8 107 151 -83
7492 -83 -145 305 63 71 300 -133 -88 -35 172 -319 96 -12 -206 189 192 -33 -256 210 -40 25 53 80 -182 85
7516 85 242 -272 -267 171 -127 -194 406 -154 -161 33 -112 73 -47 -58 -198 219 51 -460 -252 -110 -90 -359 45
7539 45 93 -181 -104 34 -348 -52 48 -113 -47 -7 -159 207 185 161 -125 59 69 -39 21 25 -18 132 83 -32
7563 -32 108 179 -54 181 61 369 -127 143 61 106 96 -34 30 242 170 -25 -95 400 68 84 220 23 -200
7586 -200 119 56 167 -148 97 -40 147 269 -91 81 116 204 -196 30 -92 -231 112 -77 2 -228 30
7607 30 102 -97 177 -82 -312 -217 -45 -267 99 74 -114 -106 170 -68 -445 -62 -56 -313 -4 141 -133 91 -84
7630 -84 -335 169 124 -96 -265 91 10 -230 141 -111 -275 -69 -29 -81 -107 8 -36 -345 -106 -28 -82 143 -226
7653 -226 -63 45 -12 -174 75 212 -87 276 42 -199 -125 182 140 213 61 -116 -96 -288 53 -84 -154 -187
7675 -187 -119 72 -55 -34 -333 -156 -83 232 30 -159 25 10 -67 -29 -169 302 11 115 97 76 -52 76 14
7698 14 -96 178 543 -299 2 316 -128 141 72 -57 -99 50 207 98 266 3 -226 120 188 -279 -137
7719 -137 243 -138 1 121 147 135 55 60 -108 -4 179 -25 130 100 -66 -154 225 87 114 88 226 -197 141
7742 141 44 -57 63 68 280 83 -18 -183 -6 229 367 50 -57 195 -357 36 -74 -40 207 104 -24
7763 -24 -199 46 -144 -54 376 337 -216 -234 97 -361 -60 102 -200 26 29 25 -34 122 60 39 2 196 -150 -14
7787 -14 136 -1 108 117 13 -400 316 118 23 54 -61 -232 178 -14 -63 53 -50 260 212 8 75 2 157
7810 157 -50 -102 216 262 -148 84 121 -149 -155 115 -148 -278 -112 -148 -65 -43 -95 -89 -93 -23 48 -80 181 -161 46
7835 46 -168 86 -110 67 -127 102 -51 -245 -48 -46 -71 -181 37 179 -157 -217 53 9 -252 56 89 20 44
7858 44 89 -206 41 177 -199 115 201 44 -36 -77 -280 -309 47 -45 -10 130 124 146 -118 170 -74 40 47 225
7882 225 -106 -94 97 -122 107 144 -145 18 78 -200 -65 335 -100 -60 -104 -135 -11 -90 147 -207 -76 80
7904 80 -93 57 435 -139 3 -49 113 -116 -10 -72 -163 -122 314 -19 -41 161 -107 -194 208 174 110 86 37 -88
7928 -88 72 228 55 174 263 209 10 261 121 -261 301 155 -67 -109 67 -211 204 53 -164 -35 332
7949 332 -14 -221 266 -174 -20 -62 -27 31 -62 39 -109 -281 -61 -190 1 -46 13 -386 249 -224 -438 -78
7971 -78 -293 -230 -258 -107 -361 40 116 -36 -180 -44 -112 -426 -157 62 -43 10 -194 -26 -32 -31 -90 6 -84 -3 -63
7996 -63 102 124 -383 81 47 27 20 63 273 -92 259 36 -1 34 247 -5 259 104 105 -17 316 272 97 126
8020 126 111 433 167 -14 -76 214 -17 -396 276 19 -109 42 228 2 38 -176 123 127 -308 -37 -157 -23
8042 -23 122 -171 -72 155 63 26 -19 -88 7 256 -189 27 135 -70 -158 -148 141 16 3 88 185 -171 231 -23
8066 -23 116 65 -51 -173 -72 19 -28 -93 179 -131 214 126 -8 -363 139 -21 -174 -28 -204 -262 74 15 126
8089 126 -77 3 -1 -88 217 111 44 149 -196 134 -102 -93 -61 65 191 -28 -146 -25 -275 -242 103 -17 -112
8112 -112 15 56 -125 -123 199 -78 34 54 -116 -58 35 -46 -263 169 -65 38 -95 -134 -64 -264 -30 -81 19
8135 19 104 17 -188 227 180 -133 52 -49 -151 -69 -75 -71 -149 108 -60 -5 280 226 119 -148 162 -113 135 202
8159 202 -85 -35 88 -148 143 172 -11 -72 -147 208 69 110 247 83 -164 145 -116 30 231 147 -13 87
8181 87 29 76 314 117 -259 113 -35 -2 156 95
8191I5
$$ Imaginary data points
##PAGE= N=2
##DATA TABLE= (X++(I..I)), XYDATA
0 0 0 0 0 0 0 0 -8 8 -8 8 -16 16 -24 32 -40 48 -56 72 -88 104 -128 152 -176 208 -247 287 -332 383 -443
29 -443 508 -580 659 -747 845 -954 1072 -1202 1347 -1506 1676 -1864 2070 -2293 2540 -2807
45 -2807 3096 -3417 3765 -4148 4570 -5031 5543 -6111 6745 -7457 8259 -9175 10227 -11459
59 -11459 12916 -14672 16835 -19577 23180 -28135 35393 -47056 68776 -122584 524675 661911
71 661911 -469642 534795 597767 -41529 124319 467976 146253 17997 176805 335668
81 335668 40729 -135773 54936 195338 -3770 -82556 216605 62493 -170213 83841
91 83841 90469 -122328 -84628 117387 27309 -57064 -64775 81118 -1598 -291775 -15779 221235
103 221235 -148994 -138935 194345 -107615 -114816 135885 -121330 -127595 119345 25981 -101812
114 -101812 151305 -41658 -294106 121350 131769 -273781 -65325 173152 -116069 -85613
124 -85613 17242 -91530 -140629 -66851 72171 -30127 -122901 -2767 77888 -139156 -109374
135 -109374 107631 -34660 -94067 63717 112283 -18370 -55860 1821 101219 -7191 -92633
146 -92633 207665 165837 -167728 3188 313926 -86034 -199693 256865 73799 -140850
156 -140850 156994 119370 -183034 -6398 104587 -53300 -46614 20546 32925 -14146 6420
167 6420 -33222 -40586 -39914 -25776 49744 9810 -36097 -37144 27042 -20941 -99024 -60040 43485
180 43485 -8847 -114630 41964 17114 -151919 -70845 41222 -102212 -55823 75601 -83018
191 -83018 -25932 38699 -101425 -69255 66746 -63786 -79418 116953 -8475 -114501 23688
202 23688 19180 -134522 6046 70764 -90337 -6782 66226 -31321 -91286 14867 17563 -48763
214 -48763 4065 65554 10184 -54954 39459 -4983 -52245 12265 10542 -10331 45474 14903
226 14903 -85280 27843 3910 -88266 10250 60188 -45582 -7565 88885 -68832 -48759
237 -48759 60567 -28668 -32539 105819 14295 -70248 93632 26588 -80141 8630 70283
248 70283 -20592 8492 95774 -16524 -41780 35645 23727 -54111 30092 60431 -21887 16828
260 16828 43685 -19739 -61228 27995 -2185 -26645 48756 8325 -47211 11293 10383 -95923
272 -95923 22927 45087 -81479 16445 100123 -45345 -74024 66502 -19590 -38452 70445
283 70445 38642 -28758 32453 53185 -29663 16976 3662 -15156 56576 68328 -17577 -8480
295 -8480 54570 -34341 -23997 56974 22349 -61538 48672 98667 -77006 -47552 68886 -20733
307 -20733 -86344 87335 59216 -82488 4112 45954 -31537 -42245 25305 -9633 6134 27143
319 27143 -3676 18900 -9310 -66024 -10069 86627 -39678 -52936 83713 8339 -89465 19543
331 19543 52738 -111969 -33117 102907 3104 -87245 12543 22670 -89471 -17029 22610
342 22610 -32446 -40563 9328 -3653 -30229 -42845 -78173 -7445 9356 -43749 -31731 43734
354 43734 -43231 -100677 55427 17475 -112608 -6823 111033 -36375 -46904 72282 -14402
365 -14402 -72810 26568 70003 -29009 -7341 35298 11638 -1444 -23019 -18483 9882 21509
377 21509 -25179 43655 51577 -60962 -27631 77062 12370 -70950 76100 84701 -46156 12359
389 12359 108738 -20321 -71176 87326 58011 -15202 30298 54748 -9446 -4053 30554 1416
401 1416 13418 2112 20599 58072 35743 -53046 -2838 77977 -25964 -20120 86955 35463
413 35463 -67601 49034 71798 -77675 -39462 67709 14227 -53713 41096 23642 -57217
424 -57217 -22725 7686 -15172 -18064 6251 -9047 26281 -4002 -41564 7836 11762 -42611
436 -42611 -2409 88344 -19789 -61061 51039 27144 -80531 -2593 64846 -50047 -14472
447 -14472 68436 -1177 -69522 6793 26550 -23429 15054 20239 11244 19018 21333 -14046 13385
460 13385 23339 -18363 45749 62492 -11804 -15409 64649 -3696 -55881 42511 41381 -32243 2932
473 2932 65494 -33484 -39781 32518 -10388 -33463 26502 29718 -24529 12868 -3885 -30512 5296
486 5296 5300 -27427 9160 44528 -35394 -13972 22541 -38390 -43988 35893 10698 -49730 27345
499 27345 20619 -43275 -21793 18742 -26778 -18664 42740 -3074 -18149 13354 -2865 -44262
511 -44262 8504 8175 -39359 19713 22590 -38003 -30263 15521 -45863 -44005 23362 -14220 -40172
524 -40172 6793 3081 -65717 -17840 -4663 -44693 -4481 15907 -26759 -27349 16958 -39794 -41504
537 -41504 8688 -14080 -33398 18369 14543 -59656 -12255 5729 -46076 -31282 21324 -13466
549 -13466 -32714 18558 -23857 -45021 -9808 -7446 -36916 1692 17016 -35075 -2707 5591
561 5591 -47437 -33365 40734 -13127 -39609 42894 14579 -36886 2714 28129 -37607 2280
573 2280 62331 11996 -5224 28096 27509 761 23878 9320 22679 54552 29595 17925 36921
586 36921 23887 -15172 47667 52904 -15150 20785 86959 15773 -43595 52146 37460 -32967
598 -32967 21572 68029 -7429 -9018 55214 -740 -30385 8757 31927 4353 6764 7670 5159
611 5159 25242 -19552 -26588 18377 17788 -23088 24888 34971 -48845 -17433 47393 -10540 -68160
624 -68160 32583 47137 -37726 -13084 22630 -25110 -41484 21758 -1643 -26645 -632 9599
636 9599 -3077 -23321 -31578 -17740 25086 -17662 -32014 26718 17550 -48790 -15549 37186 -44760
649 -44760 -28901 59948 14041 -57908 16952 49843 -43281 -30009 29825 16326 -13359 21272
661 21272 12608 -14915 -620 -2629 9494 -1308 -12266 10389 46890 -11170 -53578 24146
673 24146 27408 -41059 -13896 57197 -12551 -35742 42523 7959 -62591 -3111 58005 -19645
685 -19645 -24365 28843 16631 -16780 -12766 2832 -2151 11232 478 15904 16198 -19107 -11298
698 -11298 31882 -3328 -52490 36757 51661 -34872 -25582 45874 -7310 -55398 28556 22863
710 22863 -37610 -1805 47625 -20108 -44063 9068 6011 -10417 -10765 7096 8839 7751 -20672
723 -20672 -10906 16777 -18762 -10645 36710 19501 -40588 17768 46603 -37548 -29722 47946 22091
736 22091 -32427 31184 32401 -26579 -9315 29240 -1704 -22319 23869 17273 2944 -5263 -10738
749 -10738 -1678 4978 -16516 -13112 32612 -6785 -28328 13271 6613 -50189 -10820 41201 -25804
762 -25804 -28259 31515 10417 -48616 -3681 18533 -27348 -4847 21988 1881 -15487 8833
774 8833 -4548 -10208 185 -8387 9282 20295 -2182 -19046 22434 -327 -33756 14888 22949
787 22949 -19973 -3731 40370 -17199 -32143 15938 5824 -26874 4122 26555 -18371 -4725
799 -4725 8533 -14406 -15753 7731 -1096 -3127 21798 -6693 -5236 14319 -2656 -18405 21402
812 21402 24631 -14578 21724 30494 -12347 -9878 34524 2006 -13175 35444 20081 -6035 10058
825 10058 20592 -15383 292 21863 198 5773 18447 3372 -11338 12801 -9085 -13601
837 -13601 16505 3686 -11156 8345 9282 -31227 -5518 6900 -24640 -11731 20709 -7823
849 -7823 -32143 13013 -7114 -34767 -3347 10578 -21364 -6104 22847 -19020 -20789 2900
861 2900 -4322 -18442 6822 4203 -14144 8528 -4275 -18005 -8551 -3126 -19083 4503 11751
874 11751 -25488 -8719 7293 -20024 -32566 13509 -1779 -31988 9609 14303 -29493 -23467
886 -23467 16755 -20170 -23648 16905 4834 -19187 -1836 7721 -18910 -2581 -1001 -6101 10179
899 10179 11351 -3577 4148 12408 -19099 7054 29005 -1670 -6510 34588 20217 -21246 16152
912 16152 21594 -12162 214 39954 9013 -13964 19657 8373 -9714 341 12075 -4215
924 -4215 6662 10363 -2988 6376 -6394 -16989 2362 21337 -14812 -5671 28381 -8547 -22172
937 -22172 17235 12936 -34184 8494 36327 -6897 -11775 18794 5198 -19767 13309 14206 1212
950 1212 4785 11727 10260 4878 -2843 -9063 19292 8164 -6600 16265 21765 -18350 -14154 32408
964 32408 -3749 -26474 17051 28225 -22417 -3996 30167 -19361 -26566 17369 19597 -16914
976 -16914 757 11075 -3558 -948 -5940 -2509 1474 1281 -2552 21826 3298 -29334 6191
989 6191 20733 -16482 -16811 31925 2737 -23945 14876 15257 -28231 -16566 27336 -4780 -16999
1002 -16999 11922 9186 -21533 -12058 7328 -8896 -6191 -6708 137 5692 -3534 -19946 -4350
1015 -4350 6366 -22901 2400 23840 -12327 -24643 23326 9381 -32686 2557 16973 -6302
1027 -6302 -1578 24166 -4649 -15609 9827 5505 -1735 1147 8779 3779 11904 -1081 -7924 8638
1041 8638 416 -8386 9165 23993 -13699 -8097 21443 -4263 -24863 11078 21534 -22482 -67
1054 -67 23410 -6234 -19707 4484 1415 -11394 8748 1485 -3325 -868 -4807 -7871 2046 -6869
1068 -6869 -16425 16868 7898 -17124 -3396 11775 -18542 -13876 21201 -4740 -17594 12074 16509
1081 16509 -22824 -10041 12627 -8025 -9411 8637 7755 -12332 2062 -2162 -10782 -559 -3424
1094 -3424 -5387 6298 8674 -16323 1461 7724 -16257 -6551 16009 36 -11170 19563 961
1107 961 -15488 5355 6951 -12153 2335 18091 -6828 -1383 6227 -4091 -9704 4402 899
1120 899 -4805 12503 1088 -6568 2406 4732 -14489 32 18320 -5632 -4074 12440 2579
1133 2579 -16438 4958 2055 -13922 6973 9363 -8549 -6093 6818 -16106 -6832 10838 -7988
1146 -7988 -8413 13220 8765 -14487 3391 2207 -6969 8486 13524 -1856 500 16504 -2997
1159 -2997 -1921 5150 -1415 -1307 13063 8156 -8610 6318 425 -8880 1650 10535 -7047 217
1173 217 21519 -5114 -10334 12299 7439 -17591 7165 21815 -5028 -686 8057 -4526 -9547
1186 -9547 10367 -2239 -8331 6499 1176 418 1558 -8519 -16798 10774 8977 -8806 2782
1199 2782 7360 -4426 -1848 13955 -11233 -12530 16069 13915 -9464 -3800 8386 -11874 -5816
1212 -5816 3351 -4493 -8266 3644 -633 -9023 473 -12404 -10140 4008 -758 -11790 9611 8714
1226 8714 -23690 -4306 14608 -6327 -15536 11786 3757 -11509 9126 3409 -17743 -11786 13110
1239 13110 3355 -4641 -2545 -1925 5281 706 -5180 -4868 6161 -1531 6386 16739 -5976 -15439
1253 -15439 10267 16995 -18242 -2161 21669 -1838 -12675 14090 7294 -23384 2016 14360
1265 14360 -4217 -5184 12932 2893 -10215 1404 3073 6450 -168 -1517 7124 15100 -1186
1278 -1186 -7187 10369 -2432 -4895 16493 15614 -16441 -3195 23642 -1762 -14276 5706 10363
1291 10363 -7308 10199 13826 -9855 -7447 7727 5545 -4860 3502 -21 4860 6754 -6111
1304 -6111 -5450 3668 -2027 -11390 12108 5873 -14327 -1904 8627 -11365 -13459 12493 -2221
1317 -2221 -12611 3604 9217 -8475 -9513 -295 -5597 1974 2274 -1094 -2415 530 -4153 322
1331 322 4938 -12461 -2295 15937 5894 -13836 5991 9243 -14358 1346 16740 -2679 -11591
1344 -11591 17806 8766 -13296 -803 7414 -2081 -3683 9252 1801 -324 -1815 -2550 2173 -815
1358 -815 -4896 914 11704 -5639 -4106 9708 -3111 -14518 5582 13187 -12095 -689 12052
1371 12052 -4962 -11957 8366 2175 -15349 4695 10068 -4087 -6289 3679 -4440 -5797 2384
1384 2384 -3142 -463 1395 -1536 -4565 2228 -6938 -10981 4973 30 -8383 -1211 4685 -12332
1398 -12332 -6518 2759 -9661 -7496 4857 27 -10940 3141 -1159 -11237 -348 4056 -4984
1411 -4984 -1850 10635 -4049 -3512 5274 -1696 -5770 7635 7342 -6979 6464 6370 -5804 -2986
1425 -2986 6826 -2474 -3674 9133 25 -2386 1035 -890 -7042 1792 1648 -5967 4137 2534 -4667
1440 -4667 -3049 4505 -7260 -4907 8271 93 -3167 4368 1598 -9962 4105 4948 -8463 1002
1454 1002 9268 -1300 -4485 8485 -4626 -7907 7264 5312 -4746 2409 8184 -5409 1105
1467 1105 4968 -2751 -3515 6778 5898 -1078 3872 -1169 -1028 1754 1855 -1048 4189 2995 -4575 6936
1483 6936 3710 -8649 -2884 11881 -422 -4244 13702 2546 -9115 5159 14091 -7516 -2214
1496 -2214 14578 2823 -2197 6863 4649 -8737 1197 5190 962 -257 -2032 264 935 -1499
1510 -1499 -8031 2178 678 -6836 3338 8808 -6074 -10775 8789 1599 -8424 3683 8777
1523 8777 -6491 -3275 12699 -2855 -10283 1901 6706 -2585 2218 3910 -3902 1248 972 565
1537 565 2325 2016 -2860 7765 11128 -6426 -2067 8659 1605 -5823 10167 6807 -7843 1616
1551 1616 7300 -3025 -7993 3753 -545 -2795 2587 1730 -2880 -4593 -1071 -1495 4613 -1679 -3804
1566 -3804 5564 4694 -5419 -988 7965 -8500 -4199 13944 3706 -14211 998 9636 -10225
1579 -10225 -5715 4397 -2329 -8070 3336 2344 -7334 -6345 -4086 1510 -1839 -5170 -2360 3560 -4493
1594 -4493 -8588 3472 -2014 -10886 -1629 9283 -7036 -9211 6755 -1947 -13825 -367 11171
1607 11171 -8798 -6580 8955 2912 -6870 346 4107 -3683 2714 4727 4262 1387 -2979 543
1621 543 7130 1129 -8508 6383 7581 -4859 -1661 6485 -5229 -9114 8423 2060 -7902 59
1635 59 7120 -4895 -6066 3471 -1578 -4036 -23 4333 -1327 -1293 -1511 -2033 1201 -2550 -1613 3946
1651 3946 3818 -7268 1214 8299 -6673 -6530 7901 4909 -7149 5492 5251 -5884 -929 4794
1665 4794 -1296 -3388 4400 602 1437 265 -2941 -1273 844 -1629 -1391 5461 -1830 -3132 3947
1680 3947 1889 -7709 -1122 9080 -2538 -3877 6478 4219 -8163 259 7512 -4015 -1179 6228
1694 6228 3417 -3051 3141 529 -653 3135 -605 1895 5290 1937 -2866 5290 859 -5517 4203
1709 4203 5028 -3279 -297 7445 -3540 -4849 4084 236 -5067 1167 5426 -4299 -1302 1181 -1628
1724 -1628 -3402 342 823 -1243 3488 -1618 -2532 1151 377 -5195 626 4336 -4988 231 3696 -3839
1740 -3839 -6456 3210 -940 -5571 2554 -941 -3536 616 720 -7715 -1401 2215 -3166 -42 571
1755 571 -3045 -3833 2458 -3445 -5152 1534 631 -2545 -746 2305 -5673 -2700 1932 -1837 -2965 2288
1771 2288 2817 -3764 1266 -29 -2183 1525 2247 -2204 2339 7124 -3199 -1140 4332 48 -1312
1786 -1312 6433 2776 -3378 5962 4488 -1583 -657 4302 931 2976 5966 -659 1001 3798 2898
1801 2898 -705 3114 2318 1314 6387 2668 -2189 388 6226 -1769 -1177 5915 1447 -2230 2536
1816 2536 3042 -5967 636 3105 -2374 -1849 2475 238 -2630 355 -5060 -1031 2651 -2037 -3543
1831 -3543 2137 299 -5543 1776 -1207 -5990 275 5741 -3180 -6051 3443 -488 -3939 -1412 1625
1846 1625 -3745 -365 3414 -2223 -3034 -1455 600 -967 816 -1800 833 4301 -2145 -2810 2650
1861 2650 2253 -4594 3645 5048 -3617 -14 5773 -1376 -5870 5691 2957 -2351 1025 3194 -524
1876 -524 -725 2255 -1811 745 1415 1544 1877 694 -1983 -84 4778 -3170 -3127 4029 2958 -4618 -35
1893 -35 3456 -5748 -2956 3363 -201 -6362 2018 2386 -5076 -2389 -228 -1011 -2354 783 -1743 -27
1909 -27 -38 -3426 -110 -103 -2493 -2068 4594 -2122 -5204 3127 1259 -5890 -2489 4738 -2848 -2115 3258
1926 3258 -222 -4716 216 3077 -3234 -407 1448 1288 133 -30 -1403 -113 1651 -2659 1488
1941 1488 2940 -1055 -2159 3747 130 -5778 2946 3482 -2777 -1648 5165 -1484 -3734 2375 440
1956 440 -1860 372 3195 -1275 82 400 -940 652 -485 -843 974 3068 -3016 -789 2815 -2282
1972 -2282 -3026 2561 2461 -4524 2021 3424 -2995 -2576 2797 203 -3193 2929 1166 -662 260 1534
1988 1534 -1101 167 1704 -907 2526 1199 -839 91 2567 -1974 -1445 4885 -44 -1350 2202
2003 2202 2810 -3572 38 3582 -1668 -514 2919 1752 -2437 1803 242 -1634 999 350 -53 872
2019 872 1758 -2636 1032 597 -2587 -169 2321 -203 -2579 3490 -333 -2930 547 1854 -1999 -523
2035 -523 3973 -1183 -302 1132 80 -1289 1512 1162 -1090 2765 761 -758 748 1855 -2472 338
2051 338 3707 -1500 -185 2287 421 -3079 2023 1192 -2044 1435 1492 -529 -553 2231 -1724 -289
2067 -289 1796 -482 63 1447 834 -2572 2048 357 -2450 815 2322 -829 -1221 2996 -1989 -2019
2083 -2019 1008 738 -1730 310 1728 -2340 208 -252 -1585 -1280 355 -1847 -932 1627 -3322 -2180
2099 -2180 328 -1033 -4033 436 588 -3966 -177 323 -2826 -3994 1145 -1064 -2724 78 -897 -1837
2115 -1837 -1342 81 -2923 -540 -86 -1315 232 464 -1567 -1915 2137 -1791 -1628 2694 963 -1984
2131 -1984 496 2898 -2421 -58 1892 -228 -455 2583 1036 -1761 1310 156 966 1293 618 -51
2147 -51 2736 2749 -1761 1329 1668 -93 274 4757 866 -2051 3883 2631 -1392 -45 4267 50
2163 50 295 3452 1008 -681 216 2311 -524 843 511 810 1586 -867 -642 877 789 -3533 1336
2180 1336 2400 -2280 -1574 2018 -1092 -4535 2129 630 -3441 -1294 2539 -1212 -3085 430 -1435
2195 -1435 -1087 -286 717 -1362 -693 -247 -966 419 -1678 -1052 846 1586 -2311 -704 2115 -2078 -1596
2212 -1596 1519 1071 -2817 1300 1948 -2116 -633 1048 73 -1532 1831 233 486 934 -973 -169
2228 -169 972 1065 -1328 2046 398 -870 1682 1381 -2208 -1842 3959 127 -1384 1147 1803 -1743
2244 -1743 -280 2278 -1821 -1041 1261 1541 -1197 -360 -224 -489 557 -1788 -107 562 -331 -2165 1416
2261 1416 0 -3641 437 1431 -2009 -2406 2660 -1210 -3481 623 577 -1955 -1029 2053 -1390 -964
2277 -964 688 117 -1182 -535 1139 106 972 -870 630 1294 -114 -979 1206 2332 -1983 1349
2293 1349 2600 -383 -1550 2357 1476 -1391 1931 1600 40 314 2298 -211 569 2273 323 1255
2309 1255 1443 1135 221 2233 766 -234 2485 966 754 1175 2230 -1142 335 2774 8 -277
2325 -277 1273 2301 -1041 618 814 -601 -240 508 93 -548 745 -1659 -142 152 -1786 -1963 617
2342 617 -185 -3228 378 -636 -2374 -1492 261 -2020 -1612 1054 -1791 -1548 207 555 -2637 -831
2358 -831 439 -912 262 -333 -259 -1204 385 -426 -17 692 -1284 145 1543 664 -2467 534 1617
2375 1617 -325 423 1161 53 -640 2203 -220 -941 952 737 -240 1044 1530 -1363 420 821 -191
2392 -191 -189 1231 566 -915 1575 -167 26 393 155 -794 1150 1958 -1295 -636 95 270 -705 33 -1006
2411 -1006 -723 992 -620 -1285 -1050 -223 -1791 437 462 -2538 -1365 618 9 -2509 -268 -654 -1430
2428 -1430 -225 -492 -1607 -1397 350 -2118 -918 83 -684 -1152 -177 66 -1328 244 -686 -568 517
2445 517 681 -399 112 853 -1354 449 1799 -61 -1425 780 1640 -559 151 -477 217 746 1462
2462 1462 -383 -244 1289 -325 921 703 226 -1029 1790 1483 -631 448 759 152 13 1953 -290
2479 -290 93 1485 348 -328 830 1290 -1098 499 1113 794 450 349 152 291 1745 -559 194 1169
2497 1169 207 -213 1436 925 -2099 673 1174 -31 -778 738 -144 -553 1007 -727 -597 93 1162
2514 1162 -406 71 280 -817 330 265 20 -450 1138 -568 -61 1085 -547 -774 485 1377 -1561
2531 -1561 824 1348 -728 -840 799 904 -1126 375 363 307 257 94 -335 -109 516 -476 834 126 -652
2550 -652 -250 996 -359 -1287 732 -368 -703 163 509 -1698 -819 1011 -807 -701 178 162 -1401 205
2568 205 -2 -1074 -180 -272 88 -269 50 -935 395 296 -1053 -326 457 -105 -1045 984 -150 -941 -14
2587 -14 199 -361 -346 1222 -490 -290 340 244 -481 214 536 -336 1047 124 -72 411 738 -581 33 1575
2607 1575 -685 77 809 530 -1250 618 949 -1000 368 594 259 -689 828 -75 -530 127 124 363
2625 363 -233 -174 -543 292 -429 -855 217 -195 -889 -590 1151 -1211 -1198 372 -122 -1167 -72 970
2643 970 -1660 -290 485 -258 -821 379 -250 -595 917 -282 -381 -264 63 -152 446 328 -963 621
2661 621 317 -507 -348 639 -298 -143 1367 76 -334 206 1055 -265 55 553 -211 185 642 122 -510
2680 -510 635 -245 -255 575 230 -365 -412 819 -930 -190 279 -491 -312 464 248 -1057 589 -425 -348
2699 -348 103 377 -400 -457 650 -453 148 -565 -398 10 585 -500 -787 676 -514 -541 286 462 -900
2718 -900 -356 1216 -472 -699 43 159 -892 468 344 -565 -9 157 60 -497 748 -440 -206 363
2736 363 290 339 -159 -528 -472 931 99 -376 53 314 87 163 702 -1156 -72 525 606 -650 -36 270
2756 270 -586 493 25 -509 -406 660 -60 -357 444 -520 -381 -175 52 -686 -181 -159 -1041 7 -411
2775 -411 -226 -830 63 -411 -97 119 -724 -674 -230 344 -555 30 -313 -931 327 329 -565 -879 606 -84
2795 -84 -387 316 197 -559 -85 938 -390 144 262 527 150 582 484 -169 967 457 441 822 991 216
2815 216 716 808 291 970 530 534 365 1274 526 -122 941 431 750 931 1250 -230 774 1323 252 403
2835 403 485 825 73 1096 130 -170 148 524 -169 -505 466 -618 -66 243 -336 -528 -279 -59 -472 -136
2855 -136 -858 -439 -208 -66 -730 -389 -17 -1121 -345 -92 -652 -804 239 -530 -1377 244 -217 -865 -612
2874 -612 261 -664 -925 202 -311 -462 -254 331 -518 48 -94 -319 -63 8 226 -104 475 -401 -17 217
2894 217 -236 35 218 185 -335 737 277 -8 61 400 -275 -50 1020 -216 24 215 302 -202 383 234
2914 234 -439 366 182 -77 -343 146 -238 -299 513 -440 -241 7 412 -479 -310 103 -536 2 -180 5
2934 5 -409 295 -275 -278 177 -271 125 8 -42 -557 296 160 -417 -1 502 -477 -556 418 -163 -445 232 -186
2956 -186 -553 -234 830 -367 -213 15 102 -152 257 133 -372 272 201 119 -275 -93 -257 460 325 -562
2976 -562 35 154 56 -362 264 -155 -170 707 142 -204 -133 307 -346 -49 242 51 162 16 192 -419 275
2997 275 -132 -272 -95 126 -249 -179 248 -933 -191 124 -315 -919 -343 180 -494 82 -388 -685 -369 425
3017 425 -255 -395 107 -527 32 -243 -151 -594 139 109 -534 -11 -151 -38 -93 541 -280 -110 634 62 46
3038 46 274 737 -59 460 13 59 172 312 184 -377 359 -14 213 204 -88 97 612 306 -366 530 97
3059 97 337 196 199 60 -242 647 -30 74 251 405 -208 17 495 -453 265 107 -117 -56 190 -46 -352
3080 -352 62 -210 -58 -222 30 -423 -163 119 -367 -227 -349 -197 -325 460 -327 -186 18 -151 -124 -36 152
3101 152 -245 336 129 -283 -131 267 387 -160 443 -123 334 185 274 30 -30 279 -186 574 -74 113 6
3122 6 503 236 -317 422 21 48 12 589 -232 179 359 -236 88 304 160 -381 158 230 216 98 257 305
3144 305 66 556 -22 11 -122 -155 15 217 11 -154 444 122 96 -42 190 51 21 434 -188 -84 -14 28
3166 28 -278 -120 337 -270 184 -156 129 20 253 78 20 243 -141 34 205 -44 -570 347 -68 -682 4
3187 4 11 39 -400 509 -480 -107 184 -141 105 -56 340 -150 70 28 -205 181 -130 -227 -152 151 -309 -23 135
3210 135 -178 -261 -158 199 -513 79 44 -14 -410 -209 -229 -483 -27 -259 18 -305 -55 -196 -233 -188 -165 114
3232 114 -88 -292 -454 8 -181 -63 167 -249 -448 -15 168 -342 166 385 -252 142 231 399 -139 551
3252 551 -73 -84 93 177 234 138 337 -193 377 145 -7 150 189 35 -235 322 -70 -97 284 92 -122 26
3274 26 578 -47 55 237 77 -31 139 278 68 61 -188 118 -255 163 -8 66 -136 -308 16 -113 -214
3295 -214 -426 -6 -161 -184 -47 -149 -295 -448 224 -422 -152 -28 -144 -211 -232 96 -326 22 -134 -211 -184 -69
3317 -69 -79 14 -30 -172 207 131 -141 -294 202 187 -178 225 215 246 215 374 119 -104 440 147 -38 -47 336 -38
3341 -38 415 342 20 77 214 303 -224 -15 139 47 354 3 -47 41 117 -297 85 -110 -63 199 244 -86 -282
3364 -282 528 -314 -84 -107 143 52 -209 277 -491 -39 -14 74 -232 -118 -46 74 245 -285 21 204 131 -146
3386 -146 131 109 -299 216 49 87 -264 155 23 -138 163 -120 24 -318 257 -25 246 -99 -65 241 -139
3407 -139 -1 251 338 -239 131 447 -72 -145 244 493 -262 50 135 -123 -394 -70 116 -335 202 185 37
3428 37 -132 85 46 162 166 47 207 -97 87 -28 235 -291 174 381 -290 -25 155 210 -437 -2 367 -70
3450 -70 -15 319 398 -491 -58 174 -58 -173 30 277 25 -57 139 -61 -66 -250 129 54 -33 -236 371 -271 -190
3473 -190 101 92 28 -60 396 -104 -222 -26 155 -172 -159 465 -14 165 -166 221 15 -183 84 199 144 -316
3495 -316 174 -172 11 -359 46 85 87 -188 -90 9 -125 229 -254 -157 120 85 -187 -462 155 42 -147 -233 13
3518 13 -163 -274 -92 47 -105 -590 -16 96 -85 -436 -82 139 -266 -325 15 -253 -329 117 12 -399 168
3539 168 -104 56 -422 198 -6 -301 -206 -33 281 -144 73 229 -103 -287 111 410 -225 -176 289 290 -112
3560 -112 277 255 79 15 259 415 39 76 106 218 42 373 173 37 35 143 312 -27 68 194 75 -37
3582 -37 139 -74 -152 156 131 412 138 34 368 -185 -199 -174 -48 -99 -132 219 -385 -55 36 -6 -59 -66 -48 30 -97
3607 -97 -64 -8 140 -44 -12 518 -50 -172 84 178 15 -330 396 -180 -17 29 296 -343 126 110 -111 -284
3629 -284 147 255 -228 -182 23 167 -123 -156 57 273 -51 -76 240 27 49 278 12 -40 -92 161 95 19 -79
3652 -79 54 54 -126 201 -163 -168 -92 163 -52 6 316 25 -46 -36 93 -93 -45 -48 -75 77 -125 171 -53 -265
3676 -265 -139 314 80 -224 -36 85 159 -170 135 -260 -42 -152 5 128 -46 91 184 -120 -138 -40 -2 46
3698 46 190 116 105 -242 237 522 -60 47 22 83 -68 224 -7 -44 116 203 172 -196 -274 -116 40 17 40 -98
3722 -98 -16 -94 -153 171 -142 -205 139 12 1 25 102 -169 -238 228 231 -187 -110 37 85 20 175 -30 -95 -40 327
3747 327 -133 -83 -39 -63 20 -385 29 -46 -90 -67 154 -118 -434 -313 133 -122 -269 287 -52 -449 -39 310
3769 310 -325 -261 7 324 -146 109 -52 68 95 -199 57 -202 57 225 -172 -87 347 70 -133 -35 -95 311
3791 311 -113 -231 28 18 -219 -160 -5 51 -146 199 39 99 22 -1 -120 -175 -20 235 42 -44 -271 -128 285
3814 285 -50 142 68 -403 -141 -5 230 -14 188 -34 -7 -58 -246 -291 -166 118 175 -135 -334 224 67 135
3836 135 28 -169 1 -100 8 -36 -303 58 -30 137 -236 260 -52 217 -158 175 173 38 58 96 48 -139
3858 -139 -64 24 24 -136 -244 100 -50 5 274 83 -121 110 -92 -52 245 301 251 -103 35 318 -15 -257 -9
3881 -9 365 -149 227 104 90 59 199 196 -281 -81 92 111 279 124 -19 -53 -40 138 179 31 -224 -160 112 -236
3905 -236 204 94 -410 -202 -94 222 -32 14 149 -56 37 51 223 -292 -168 43 -31 12 -60 60 126 73 -40
3928 -40 -158 -29 -141 24 -101 -144 72 495 -14 -48 99 207 -60 -112 18 -248 145 20 383 67 -195
3949 -195 -31 61 -344 -62 172 72 -82 -98 83 -22 -13 5 2 -12 -122 145 -73 29 4 10 -28 -93 -19 -122 -202
3974 -202 -215 99 -342 -119 87 -134 -124 -75 250 183 -103 -21 218 85 -217 411 282 -155 58 18 -13 -53 -31
3997 -31 193 -95 33 449 -185 35 149 228 90 153 93 -174 140 47 99 88 -60 -82 38 114 -270 -19 117
4020 117 -176 -115 141 -28 -428 -90 -63 -31 -227 -24 71 -258 -151 129 128 -30 100 81 119 -84 16 144 -191
4043 -191 -120 121 -84 -210 -35 15 -304 145 216 -248 -215 127 112 -170 -264 28 -215 -279 127 46 -85 70 94
4066 94 54 84 39 -5 -187 85 -34 249 137 -85 -170 -118 -214 15 -40 136 131 86 -66 -302 35 191 -9 -139
4090 -139 -65 71 -316 110 176 182 -231 -196 -113 111 59 -64 99 -285 -10 -91 23 16 67 -7 43 32 166 190 -241
4115 -241 -223 107 12 -235 53 316 -80 -100 18 -7 -3 30 356 -55 -105 129 90 37 59 -98 157 -240 -26 91
4139 91 20 -13 -108 64 -148 -134 91 140 -196 -85 49 103 -182 27 283 -115 -136 70 300 -86 89 31 -88
4162 -88 -19 116 15 -175 -219 18 217 -29 63 130 -22 -117 313 80 226 185 122 -201 -171 123 -112 -95 9
4185 9 353 70 -265 101 -94 -40 148 67 7 86 -42 190 37 -69 -61 120 80 -86 191 258 -17 8 443 1
4209 1 -146 531 211 -139 30 -17 67 -337 30 -115 227 -147 137 121 33 -15 -149 51 -137 25 106 72 5
4232 5 128 9 -30 24 -171 210 -95 -62 253 -112 -84 -56 78 3 -207 87 212 269 11 208 -113 -331 30
4255 30 -88 151 -96 130 -105 -218 -19 61 33 -134 166 121 -6 -358 381 1 -146 -70 112 -115 -112 -96 68
4278 68 -226 -52 337 -123 -120 96 -130 119 -139 223 4 -133 -160 -104 85 -9 378 -92 -75 116 161 -14 -43
4301 -43 -46 61 42 272 189 3 -118 7 223 -78 -47 228 48 41 116 81 233 -157 -197 224 -11 -151 87 -178
4325 -178 101 69 -182 -3 12 56 212 -96 -39 250 145 -93 161 24 75 29 -36 -131 110 -145 158 15 68
4348 68 -127 123 -108 -156 507 -98 84 62 364 -109 9 -55 176 -135 45 102 137 79 24 27 -20 -32 64 85 -10
4373 -10 -26 171 109 -269 71 -42 -14 -130 -162 175 -3 48 70 285 -74 -17 -140 -169 444 58 85 -95 147
4396 147 48 -153 -137 102 226 85 261 150 -81 -127 -31 75 -162 -253 204 34 107 19 -261 -264 74 80 -131 -203
4420 -203 -110 117 172 96 -166 -54 -50 194 -83 -32 132 -87 96 -25 92 -177 -114 -25 -48 270 59 -138 -126
4443 -126 221 -94 -97 -31 94 4 227 -63 -11 -197 -252 172 40 -24 24 111 -144 -101 177 -87 52 162 163 -273
4467 -273 117 -109 92 -39 3 -96 -89 -4 -64 63 -224 88 155 65 -68 191 53 -33 -13 290 -202 -134 139 228
4491 228 14 -27 -338 130 -2 -80 -115 -115 119 191 95 -232 -171 -53 110 180 42 103 13 16 45 -83 -114 129 -43
4516 -43 -47 68 213 134 38 141 -185 124 91 62 119 63 78 60 -135 176 49 10 60 22 -65 84 92 -73 -26 -7
4542 -7 159 -192 7 21 -17 -47 -87 74 -140 47 -16 -33 3 204 110 94 269 200 -76 3 118 -3 -143 -60 141
4567 141 151 126 7 -62 -77 -13 64 -36 157 119 118 56 151 -224 237 -144 -110 4 -50 -40 252 50 5 259 -22
4592 -22 -144 -273 -181 -135 11 153 143 197 -24 52 94 -10 86 -37 -129 -87 186 41 121 -116 -116 375 63 -175
4616 -175 -31 145 -59 -49 -61 -356 -465 236 -50 99 107 -56 120 109 121 -6 -248 -203 -26 1 164 -33 40
4639 40 -175 -115 -135 186 152 62 -208 -64 -69 79 174 140 -120 179 -166 -101 -96 117 -68 -79 199 -26 31 124 -72
4664 -72 61 29 -117 163 192 -70 6 -103 14 15 82 88 59 25 229 -163 -120 61 235 -24 -47 -14 87 67 -229
4689 -229 118 -47 -27 -37 2 -9 -257 -93 19 -219 -79 -88 -181 -96 -6 232 194 -132 -11 90 -119 -89 42 -100
4713 -100 -105 82 -6 -67 -115 15 97 -80 11 -100 44 -175 133 163 31 -231 123 -22 -147 72 -36 245 291
4736 291 -85 222 -54 -162 -26 138 -179 -12 155 -8 -109 -94 148 -231 -54 -7 129 -40 -41 23 -121 44
4758 44 -145 -99 -172 -97 4 62 -49 -118 55 -63 -157 259 73 -84 -90 128 126 -146 -132 47 353 -118 -46 -33 99
4783 99 -121 -153 26 -182 155 -10 -87 -234 28 48 -120 84 -117 -58 -31 -40 -15 0 147 -57 -15 141 -36 -9
4807 -9 165 15 -129 -27 -5 137 116 57 -68 225 -207 18 -48 14 51 91 144 119 9 -46 152 -46 -138 -179 271
4832 271 203 -49 -49 -24 149 45 65 -92 -192 117 -112 -79 255 165 -16 18 74 35 -66 -65 -122 6 17 144 74
4857 74 -85 73 -115 -101 -5 163 200 -165 -161 -175 114 151 73 186 -102 -6 -58 255 -199 -96 34 4 105 -219
4881 -219 61 71 -221 171 72 -142 -73 171 326 -25 -56 228 23 -256 -58 127 -31 -305 9 106 -57 -13
4903 -13 -134 130 -312 -17 165 -185 -187 -22 66 -403 126 169 -97 -174 187 -276 -193 -151 75 -38 -252 129 -96
4926 -96 -307 -256 7 237 147 -260 -5 131 -30 -19 157 87 62 -138 263 -71 -43 259 151 -105 6 150
4948 150 -237 196 36 382 -200 -239 154 -105 -46 -45 258 126 -189 23 -7 -158 -39 335 -14 -461 -28 28
4970 28 0 -153 209 189 -23 -70 262 -151 140 42 97 -161 -90 84 44 -257 -45 375 -88 -299 -133 -55 -204
4993 -204 -213 147 -10 -210 -201 253 237 -92 107 79 -207 113 285 99 -127 65 235 1 -61 253 406 123
5015 123 -150 17 230 -270 179 294 42 -184 437 173 -219 -141 70 -109 -98 -53 169 -88 48 167 422
5036 422 -161 -36 -111 -31 -218 11 278 -120 -52 125 248 -143 37 205 -16 -289 125 86 -264 -250 -63 28
5058 28 -139 -114 219 -55 -121 140 280 -325 -25 91 -62 -31 18 137 -80 -173 -31 -66 -113 33 181 251 -125
5081 -125 -14 -69 -35 -107 151 120 60 -75 192 -130 156 116 200 74 117 144 84 25 10 123 111 -12 196 233 -81
5106 -81 -64 147 43 260 116 -6 60 -91 47 -101 60 -195 82 -66 126 56 -59 53 -243 -4 -38 112
5128 112 -344 -15 46 -70 346 -91 -12 -63 156 -148 -405 37 16 -39 160 -33 44 180 -224 36 -132 141
5150 141 100 -349 25 -43 71 25 -70 -100 -163 -87 -41 -6 -9 -61 174 192 253 -174 147 -10 -118 -151 192 203 138 97
5176 97 -160 27 169 199 -63 69 124 223 10 -78 -130 57 94 11 11 21 -198 208 79 -62 -121 338 182 -171
5200 -171 168 53 -4 -192 38 63 17 90 263 101 -162 199 105 20 -329 216 -36 -303 -99 12 81 -76
5222 -76 17 142 -132 -93 288 34 -392 -179 41 -48 -267 279 261 -214 -195 128 148 -306 31 50 0 -126 -125 -72
5246 -72 -4 -103 132 209 -324 -42 153 218 -191 106 187 -141 -285 118 57 -366 -357 106 -2 74 136 -54 -363 -248
5270 -248 38 358 -20 -97 194 246 -365 -144 168 -299 -326 358 75 -52 -151 179 27 -266 -34 47 -456 -170
5292 -170 33 -57 -274 -46 -22 117 -153 87 192 -99 -379 102 218 -74 62 435 -129 -407 346 360 -192
5313 -192 127 114 -194 -124 312 345 -180 157 328 270 -254 -96 68 82 -74 148 202 127 -109 228 347 -137
5335 -137 -96 198 346 -187 -21 233 -69 -1 168 139 -64 312 -130 -145 -51 146 368 43 151 189 223 -264
5357 -264 82 72 -82 -188 -82 72 -586 -171 -194 122 -61 -119 50 -176 -152 -73 -37 -243 -235 53 -154 -8 -210
5380 -210 317 -343 24 -240 39 144 -75 225 -120 -104 -100 343 20 -150 30 256 -245 -104 428 79 -182
5401 -182 144 142 137 -11 158 445 58 -89 114 324 132 3 91 244 -154 -296 265 103 34 288 -73 -174
5423 -174 76 -162 -124 -166 -30 167 -5 -163 -268 16 154 230 -159 -17 11 -107 11 -192 267 113 176 -17
5445 -17 132 -30 171 62 -95 -50 13 317 -78 -392 113 272 -104 142 15 -48 -285 91 -29 -187 -269 5
5467 5 -161 -43 -321 -389 -123 -90 -73 -136 -63 -291 27 -107 5 -58 -6 -136 -218 92 -48 -206 152 128 10 -146
5491 -146 274 -435 -234 -89 96 -212 -216 9 -168 -389 -297 -67 -36 -334 -111 -38 -80 -142 175 -295 -259 -117 205
5514 205 -89 -219 -216 111 29 -368 554 284 -75 139 409 40 -81 343 406 126 -81 156 314 7 247
5535 247 240 264 -315 75 119 54 20 234 76 -35 -160 382 194 -310 147 112 -143 -96 -85 146 -39 -221 355
5558 355 -99 -209 -65 245 182 -200 76 299 -187 -13 228 -64 -528 135 250 -185 -103 182 145 -350 95
5579 95 102 -174 -263 250 98 -249 -455 141 49 -341 -76 210 -322 -338 31 168 -80 -462 61 49 -236 -150 208
5602 208 -72 -294 208 187 -46 -18 372 114 -23 241 63 -13 107 293 90 -146 -108 397 45 -291 89
5623 89 90 -57 -199 377 266 -23 -170 329 0 -227 11 -74 -135 -118 239 146 178 9 169 112 -163 206 59
5646 59 -121 -337 230 287 61 -30 251 -9 -261 -10 399 -161 -6 100 -147 -548 19 195 -180 -265 46
5667 46 -5 -344 93 -212 -141 -123 -10 -14 -72 -24 -156 349 -207 50 86 162 -92 -111 329 -236 90 111 17 -227
5691 -227 81 160 156 -120 191 32 -209 67 -5 140 229 -59 -11 76 -235 -63 184 -65 -25 251 -164 -125 -137
5714 -137 161 -133 100 392 -68 31 -60 31 -123 -159 142 339 -227 -30 -136 -296 82 -36 26 -89 38 73
5736 73 73 41 -331 -104 -25 -163 -140 197 -144 -173 325 -211 -5 -24 220 23 -40 232 155 51 36 250 56 301
5760 301 219 290 -159 -117 248 241 280 -88 293 53 44 133 208 -72 96 476 -73 -154 503 233 -204 -301 14 -188
5784 -188 -12 85 358 -205 22 94 57 -124 -154 29 -77 -103 -87 -151 97 -279 129 144 -2 -189 114 -183 -421
5807 -421 -30 -27 -80 -380 424 15 -85 91 -62 -72 -165 2 -214 -101 -260 -93 -163 -254 -46 -168 272 -188
5829 -188 40 -126 -111 -187 79 112 -108 44 210 97 -203 53 -97 -289 12 212 269 -272 111 -31 -273
5850 -273 -208 -12 216 0 -189 323 124 -487 -206 310 -221 -413 -94 150 -593 -109 303 -99 -210 -101
5870 -101 59 -393 -155 -53 -188 -418 -268 74 -81 -311 -87 213 -178 -386 -93 102 -157 -108 304 -244
5890 -244 88 27 156 -175 -139 287 -148 -453 136 250 -334 -169 137 68 48 -126 164 18 42 -64 358 79
5912 79 -368 153 252 80 -66 548 120 -209 260 317 -80 33 329 265 213 148 337 34 -14 226 238 10 263
5935 263 -72 212 19 -213 229 217 -240 564 144 194 -102 164 262 -254 2 212 210 -214 278 149 57 -50
5957 -50 152 108 -152 66 257 201 -318 50 293 -5 -146 -56 519 -161 38 -8 22 28 392 397 -429 -1 162
5980 162 -159 -63 -23 -49 -505 -219 -220 -41 -127 -266 192 -300 -119 -241 -8 -255 -91 105 207 19 -308 281
6002 281 40 53 -335 345 -216 -188 84 59 -173 -63 -37 47 186 20 35 -93 -101 -194 -85 149 -133 90 53
6025 53 -253 64 -164 -99 -246 80 -208 -67 -37 119 46 -326 98 -172 -38 -14 18 103 144 182 -136 184 -34
6048 -34 -2 -94 406 414 64 377 -5 -3 -16 199 -138 252 159 -149 5 -85 -302 185 559 -106 167 478 -72
6071 -72 -210 -110 -6 -190 -82 239 -167 -3 -56 -134 -319 162 86 115 15 -40 46 16 -173 -279 45 -152 -218
6094 -218 264 -12 -147 -240 126 39 -366 111 164 -114 -187 138 -93 -133 -33 148 -105 122 -115 -60 38 -77
6116 -77 17 338 -60 34 329 191 32 364 223 -99 -240 244 103 -229 46 250 98 -49 269 -86 13
6137 13 -6 203 150 -124 33 215 203 -117 332 316 -95 -186 215 147 -285 117 175 -65 -297 152 173 17 -65
6160 -65 196 -83 -50 157 65 119 -252 -56 -37 -232 -104 -55 291 -277 -295 271 -194 -426 -28 332 -374 27
6182 27 152 -68 -394 191 389 -296 -93 244 -52 -321 -19 78 -26 262 -136 455 125 -19 255 311 -46
6203 -46 -137 445 -78 -154 15 197 -378 -193 166 -149 -72 51 220 -320 -315 -134 -202 -239 -385 -73 -153 -237 -10
6226 -10 9 76 -451 -195 -64 1 -48 -5 74 -127 94 279 164 -368 62 208 -79 80 480 45 24 77 -83
6249 -83 207 22 -42 257 -3 -285 48 63 -43 -171 -171 -86 -278 274 180 -354 374 340 -23 -242 435 36 -167
6272 -167 196 300 314 71 337 -94 213 61 28 441 -25 58 -210 511 7 159 424 268 165 112 280
6293 280 -275 -55 370 -14 -71 287 -14 -309 138 215 -150 -243 312 165 49 -48 -188 86 153 -123 -211 197
6315 197 -181 -73 240 -58 -144 -72 235 -136 -3 240 -261 -17 68 -177 -531 129 71 -298 241 1 -264
6336 -264 -285 -180 -307 -210 -212 -299 -92 -280 -79 -432 33 -201 -243 -45 10 -263 -145 96 -260 -35 -7 56 -173
6359 -173 82 -39 -220 120 -100 -197 38 112 346 -142 27 30 94 -137 54 162 184 -23 -38 176 -97 43
6381 43 -192 221 -60 182 213 -142 -202 209 232 -316 327 276 202 -78 245 -1 29 273 130 202 74 58 285
6404 285 257 60 -230 396 110 -252 177 89 -88 -76 200 32 -67 -114 175 -94 -89 305 44 -34 -30 108 -33
6427 -33 271 -23 237 -74 150 70 307 130 -320 146 148 -159 95 403 -173 -394 450 225 -302 30 326
6448 326 -32 -302 -76 -58 -197 -212 -124 -25 -5 47 -156 -57 50 -173 155 -149 -49 158 205 -356 9 435 -140
6471 -140 -442 21 188 -511 -50 197 130 -334 86 222 -147 102 88 43 -116 -73 102 104 -94 -368 352 -69
6493 -69 -345 -230 292 -175 -220 256 163 -335 -150 382 -375 31 173 -168 -328 318 236 60 97 39 312 89
6515 89 -91 266 144 -31 101 578 86 -109 -357 162 50 -364 335 33 -362 -153 355 41 55 181 28
6536 28 151 -183 109 49 94 59 50 255 -149 153 204 -43 -403 24 317 -247 -103 306 214 -174 149 335 -203
6559 -203 -162 354 181 -55 -56 133 168 -140 4 297 50 -68 118 334 3 10 129 60 -232 265 368 -128
6581 -128 75 260 333 -387 -177 56 -371 88 123 -20 -184 -61 -85 -49 -173 -73 -74 90 -48 -496 261 5
6603 5 -141 116 84 -61 50 242 -355 -275 31 -28 -132 69 4 -263 155 -30 -17 -291 -184 -112 -48 151 -193
6626 -193 -34 181 20 -70 220 108 -66 84 57 231 -162 31 138 59 316 214 -50 -191 113 -74 -176
6647 -176 54 -41 -55 93 -25 -219 222 -20 317 154 107 73 -208 177 -195 153 -44 -89 -21 -94 154 -123
6669 -123 199 -115 176 -205 -65 135 97 161 -2 192 -165 -88 -52 178 -74 -194 121 108 -308 -219 154 124
6691 124 79 -6 -95 -124 -154 -106 -382 262 -266 43 85 -60 -179 -125 208 -168 -238 103 16 -144 -80 71 -237 -30
6715 -30 -145 -75 55 207 -21 -48 93 -323 32 -10 158 27 236 17 -244 72 -35 -185 -260 314 -70 -5
6737 -5 28 -185 -311 -204 211 -109 -175 34 51 -23 -117 -32 -82 29 -259 86 265 -104 -130 44 88 -326 367 231
6761 231 -387 -49 372 44 -141 232 76 -234 117 206 -133 37 70 -15 135 -307 38 -9 62 -38 40 473
6783 473 -98 28 234 201 -248 81 206 -92 -192 374 127 -227 199 256 -19 187 -117 204 -34 111 124
6804 124 198 55 -78 207 304 3 -5 413 4 -13 175 86 -278 -79 428 13 -54 268 16 -196 85 392
6826 392 -179 149 72 128 175 -86 7 -46 -65 -200 84 360 -184 -77 357 164 -358 199 -189 -81 57 144
6848 144 -258 -5 85 -150 -3 -109 30 -186 -78 -105 -12 75 -114 -213 -27 -70 -130 94 117 11 120 282 126
6871 126 -265 85 97 -234 15 211 155 -153 330 269 72 -86 -146 260 -8 6 167 6 -213 126 73 283
6893 283 -202 -67 317 150 -101 114 139 -290 -48 187 47 167 252 32 -229 160 -83 -178 158 89 -373
6914 -373 -26 52 -227 -114 -36 -136 -76 190 -164 -113 344 -50 -216 -28 -56 -231 -62 178 -158 -17 -289 -148
6936 -148 -73 171 105 -33 185 -25 -102 53 -141 -347 52 84 -319 84 132 -159 -355 150 21 131 117 44
6958 44 -129 -119 116 -221 -249 152 -94 -37 158 -58 130 158 -122 -143 16 71 -152 108 109 54 -5 57 82 -87
6982 -87 111 -181 -57 -9 9 -169 175 113 17 289 60 -143 42 157 143 -157 73 45 22 -54 -26 44 -125 83
7006 83 -101 -126 52 15 112 133 248 -34 190 -76 8 -106 -156 -174 -81 597 -26 10 189 120 -123 10 98 -1
7030 -1 138 71 119 -228 61 110 -57 238 69 -28 185 62 -58 266 78 -119 27 225 -148 -100 396 -214
7052 -214 -103 192 61 -489 -105 105 -174 58 -29 166 -324 -157 -199 -315 44 -323 -106 239 -113 -141 36
7073 36 147 -386 198 61 -204 -213 170 -38 -178 174 -159 -180 0 60 -38 -79 261 26 -19 -120 143 -189 45
7096 45 -122 -81 167 -40 -58 147 -310 -43 132 129 -212 -76 -91 48 -96 194 176 -192 -219 245 179 -27 258
7119 258 53 281 -99 -62 -100 76 -60 -106 129 -153 -172 -77 106 -231 -44 374 -43 -274 6 -226 -191 28
7141 28 260 106 118 -51 -12 23 247 36 94 153 82 197 198 251 -71 289 130 -392 157 12 -35 309 464 72
7165 72 -240 -55 302 17 212 212 -52 253 30 139 5 155 66 42 196 -145 22 217 22 -275 224 290
7187 290 -258 49 117 -118 -352 98 -63 -71 295 153 54 38 -121 -55 144 169 -75 67 -143 -308 -261 92 -341
7210 -341 -100 81 -62 -98 59 223 -199 -109 130 -160 -133 -96 -159 -115 150 -4 -270 -187 -4 -66 -23 18 -294
7233 -294 -1 -45 -191 -63 87 -104 -197 44 -150 -355 -46 -194 -205 -2 132 -137 -265 186 -51 -314 -6
7254 -6 -125 11 1 -282 -117 237 -114 -259 33 173 2 -50 -10 189 -310 -12 -41 -208 174 25 56 -250
7276 -250 153 -380 -354 66 186 -131 93 45 -225 -22 -119 -231 -145 309 117 121 79 -41 55 215 -22 -157 384
7299 384 314 -266 19 153 22 -366 8 276 20 213 -313 6 -117 155 -180 -25 188 14 32 198 160
7320 160 -84 270 -30 -42 145 -89 -47 -90 -21 -242 -129 214 136 179 312 38 -49 183 -36 -131 192 237 38
7343 38 -15 185 11 -119 193 124 -138 40 263 -148 71 59 -14 46 309 89 139 59 -223 169 84 -38 33
7366 33 337 53 45 250 227 -109 193 142 -227 109 10 228 -275 163 -14 -155 120 -169 -262 -55 220 -308
7388 -308 -52 260 -183 66 297 151 -127 97 274 57 138 132 -119 21 262 -34 39 228 -153 -26 190
7409 190 399 66 251 409 -98 -34 -101 7 84 420 -255 -293 225 -163 -385 214 251 -115 3 38 -107 -117
7431 -117 33 -207 -115 127 -164 147 -33 -90 -247 -132 -164 -138 -154 -164 24 -141 -218 -187 -197 32 -90 -414 -256
7454 -256 63 -266 -231 -65 -51 -241 -102 -29 -326 0 -138 -95 -92 179 -68 79 -7 -63 -218 -18 -132 -35 290
7477 290 -103 -193 45 -72 -80 228 296 -102 -209 451 -95 5 46 45 -23 140 183 59 260 -56 115 119 58 -457
7501 -457 -60 415 -64 90 222 146 -11 188 220 -157 296 118 61 186 243 -43 -16 74 -131 17 -173 27
7523 27 201 130 -21 -224 153 110 -8 52 333 -280 100 -136 133 -38 177 43 -266 220 74 14 25 -36
7545 -36 7 260 88 -193 157 117 -60 -3 21 223 -129 -39 -86 -297 -125 27 -337 107 158 225 -292 -3 48
7568 48 -447 -292 32 -116 -98 -129 -213 -101 -78 -410 -271 159 53 -269 -74 424 -436 86 91 -146 -86 -132 -189
7591 -189 -71 13 -55 -144 103 190 -211 -21 251 15 15 51 5 11 403 -23 86 348 176 109 59 47 -84 149
7615 149 143 -102 51 31 -37 -300 485 -323 -64 219 28 -206 -205 110 -163 -71 113 -24 -101 324 -48 113 130
7638 130 30 108 -1 299 -85 -11 -15 -140 3 122 -30 -47 52 45 -88 64 10 -262 -89 133 -153 37 43 -36
7662 -36 -193 112 63 7 238 426 -35 114 76 -42 -36 72 121 -356 195 -111 -231 34 -167 -81 329 -71 89
7685 89 -30 226 -5 28 168 164 10 325 43 -43 269 20 52 166 126 146 -106 71 -146 175 138 53 51 192
7709 192 77 11 140 -74 -179 79 100 -5 415 35 -192 50 -23 -77 -59 179 301 -13 -38 -93 -212 -19
7731 -19 163 -6 -227 165 152 144 189 97 -173 8 182 -11 188 290 -172 -80 1 286 -88 -39 97 11 -132
7754 -132 86 -42 -135 121 47 73 173 66 -32 69 165 -366 16 -63 -5 -126 415 -245 -174 26 132 -321 -31
7777 -31 156 -102 255 -92 -34 129 211 -25 77 263 -201 -44 -225 -6 -241 -57 157 -218 -109 -102 -190 -153
7799 -153 -114 -122 20 -109 -178 -284 -137 -108 -396 155 -163 -5 144 -23 -80 -420 0 -98 -329 124 183 -189 33
7822 33 98 -442 -417 1 24 62 210 -60 -106 134 -3 -168 217 112 77 71 101 -61 113 170 -99 -92 236 -81
7846 -81 102 149 -73 22 363 163 -43 116 263 25 249 316 130 56 254 467 99 60 183 222 49 33 238
7869 238 167 232 185 139 109 -39 47 52 -57 -246 52 86 -38 -145 -201 -221 -28 -3 -280 -192 -1 -301 -277 -69 -1
7894 -1 -167 30 234 -204 -337 65 -271 -125 96 97 -132 29 110 -367 91 25 -160 11 -21 -72 -68 66 -30 -22
7918 -22 235 -185 -120 183 30 -305 164 -135 19 155 351 -60 -39 131 136 70 156 383 118 71 7 -211 110
7941 110 30 -58 19 101 -31 -306 296 68 -251 164 -24 -243 -199 45 -159 41 -76 -236 -396 -126 -212 -245
7963 -245 96 107 -56 26 -29 -206 -48 117 -132 76 -178 -269 -71 1 -94 86 67 203 -10 170 69 9 -76
7986 -76 -68 -52 133 212 -96 18 26 -68 -11 239 245 -151 -43 153 63 8 60 33 -121 271 -84 63 242 115 2
8011 2 -229 193 -40 -175 174 -21 110 91 189 -73 119 -169 -43 90 119 23 106 247 -211 -210 34 201 -112
8034 -112 166 151 48 297 289 -266 49 275 -82 -165 137 -288 79 -160 71 -9 195 184 100 88 70 66 5 98
8058 98 -283 -204 117 -76 -142 32 -23 -54 327 204 -43 6 106 -133 167 110 154 -186 379 -233 -202 -144 149
8081 149 -135 -155 51 -89 -20 -27 -251 -175 -139 -136 -165 73 114 -1 -186 -97 -4 -177 -250 -4 -203 78 -92 -102 -51
8106 -51 -54 -303 96 185 -344 -36 -58 -41 -154 127 170 -90 26 -23 159 -311 282 -124 -32 340 110 179 19
8129 19 -121 -62 -29 -109 15 258 -34 91 -15 95 -35 -112 98 -61 174 58 97 -246 9 58 36 258 -43
8152 -43 82 69 348 -72 -29 279 44 -101 125 72 -208 244 -286 114 -58 272 -70 67 199 112 -9 -31
8174 -31 135 -51 5 21 28 57 151 -65 -53 -246 2 117 229 -318 -120 46 -69
8191f9
##END NTUPLES=NMR FID
##END=
