##TITLE=1H_TG-2291-5
 CDCl3, 8 sc, 
 30.6.2020
##JCAMPDX= 6.0         $$ Bruker NMR JCAMP-DX V2.0
##DATA TYPE= NMR FID
##DATA CLASS= NTUPLES
##ORIGIN= UXNMR, Bruker Analytische Messtechnik GmbH
##OWNER= root
$$ XWIN-NMR		Version 3.5
$$ Tue Jun 30 11:43:36 2020 Russian Standard Time (UT+4h)  she@DPX200
##.OBSERVE FREQUENCY= 200.1315
##.OBSERVE NUCLEUS= ^1H
##.DELAY= (6, 6)
##.ACQUISITION MODE= SIMULTANEOUS
##.ACQUISITION SCHEME= undefined
##.AVERAGES= 8
##.DIGITISER RES= 18
##SPECTROMETER/DATA SYSTEM= spect
##.PULSE SEQUENCE= zg30
##.SOLVENT NAME= DMSO
##.SHIFT REFERENCE= (INTERNAL, DMSO, 0, 15.7039)
##AUDIT TRAIL= $$ (NUMBER, WHEN, WHO, WHERE, WHAT)
$$ ##TITLE= Audit trail, XWIN-NMR		Version 3.5
$$ ##JCAMPDX= 5.01
$$ ##ORIGIN= Bruker BioSpin GmbH
$$ ##OWNER= she
$$ F:/spectra/data/she/nmr/H-F/1/audita.txt
$$ ##AUDIT TRAIL=  $$ (NUMBER, WHEN, WHO, WHERE, WHAT)
(   1,<2020-06-30 11:42:45.29 +0400>,<she>,<DPX200>,
      <created by zg, POWCHK disabled, PULCHK disabled
       configuration hash MD5:
       00 E9 B6 7A A2 85 ED C7 34 08 36 98 17 FE 4E 26
       data hash MD5: 16K
       E3 7E 1B 3B FB 1E 67 62 37 79 68 65 26 A6 EE A3>)
$$ ##END=
$$ 
$$ hash MD5
$$ 0F 15 BF 28 DC 1E 6B 63 B1 13 26 7E 85 18 0D A6
##$RELAX= 
##$RELAX= 
##$RELAX= 
##$RELAX= 
##$RELAX= 
##$RELAX= 
$$ Bruker specific parameters
$$ --------------------------
##$DU= <F:/spectra>
##$EXPNO= 1
##$NAME= <H-F>
##$PROCNO= 1
##$TYPE= <nmr>
##$USER= <she>
##$AMP= (0..31)
100 100 100 100 100 100 100 100 100 100 100 100 100 100 100 100 100 100 
100 100 100 100 100 100 100 100 100 100 100 100 100 100 
##$AQSEQ= 0
##$AQ_mod= 1
##$AUNM= <au_zg>
##$AUTOPOS= <>
##$BF1= 200.13
##$BF2= 200.13
##$BF3= 200.13
##$BF4= 200.13
##$BF5= 200.13
##$BF6= 200.13
##$BF7= 200.13
##$BF8= 200.13
##$BYTORDA= 1
##$CFDGTYP= 0
##$CFRGTYP= 5
##$CHEMSTR= <none>
##$CNST= (0..31)
1 1 145 1 1 1 1 1 1 1 1 1 1 1 1 1 1 1 1 1 1 1 1 1 1 1 1 1 1 1 1 1 
##$CPDPRG= <>
##$CPDPRG1= <>
##$CPDPRG2= <>
##$CPDPRG3= <>
##$CPDPRG4= <mlev>
##$CPDPRG5= <mlev>
##$CPDPRG6= <mlev>
##$CPDPRG7= <mlev>
##$CPDPRG8= <mlev>
##$CPDPRGB= <>
##$CPDPRGT= <>
##$D= (0..31)
0 1.2 0 0 0 0 0 0 0 0.06 0 0.03 0 0 0 0 0.0002 0 0 0 0 0 0 0 0 0 0 0 0 
0 0 0 
##$DATE= 1593502964
##$DBL= (0..7)
120 120 120 120 120 120 120 120 
##$DBP= (0..7)
150 150 150 150 150 150 150 150 
##$DBP07= 0
##$DBPNAM0= <>
##$DBPNAM1= <>
##$DBPNAM2= <>
##$DBPNAM3= <>
##$DBPNAM4= <>
##$DBPNAM5= <>
##$DBPNAM6= <>
##$DBPNAM7= <>
##$DBPOAL= (0..7)
0.5 0.5 0.5 0.5 0.5 0.5 0.5 0.5 
##$DBPOFFS= (0..7)
0 0 0 0 0 0 0 0 
##$DE= 6
##$DECBNUC= <off>
##$DECIM= 24
##$DECNUC= <off>
##$DECSTAT= 4
##$DIGMOD= 1
##$DIGTYP= 9
##$DL= (0..7)
0 120 120 120 120 120 120 120 
##$DP= (0..7)
150 150 150 150 150 150 150 150 
##$DP07= 0
##$DPNAME0= <>
##$DPNAME1= <>
##$DPNAME2= <>
##$DPNAME3= <>
##$DPNAME4= <>
##$DPNAME5= <>
##$DPNAME6= <>
##$DPNAME7= <>
##$DPOAL= (0..7)
0.5 0.5 0.5 0.5 0.5 0.5 0.5 0.5 
##$DPOFFS= (0..7)
0 0 0 0 0 0 0 0 
##$DQDMODE= 0
##$DR= 18
##$DS= 0
##$DSLIST= <SSSSSSSSSSSSSSS>
$$ [...]
##$SUBNAM2= <"">
##$SUBNAM3= <"">
##$SUBNAM4= <"">
##$SUBNAM5= <"">
##$SUBNAM6= <"">
##$SUBNAM7= <"">
##$SUBNAM8= <"">
##$SUBNAM9= <"">
##$SW= 24.9337058887773
##$SWIBOX= (0..15)
0 0 2 0 0 0 0 0 0 0 0 0 0 0 0 0 
##$SW_h= 4990.01996007984
##$TD= 16384
##$TD0= 1
##$TE= 0
##$TE2= 300
##$TE3= 300
##$TEG= 300
##$TL= (0..7)
0 120 120 120 120 120 120 120 
##$TP= (0..7)
150 150 150 150 150 150 150 150 
##$TP07= 0
##$TPNAME0= <>
##$TPNAME1= <>
##$TPNAME2= <>
##$TPNAME3= <>
##$TPNAME4= <>
##$TPNAME5= <>
##$TPNAME6= <>
##$TPNAME7= <>
##$TPOAL= (0..7)
0.5 0.5 0.5 0.5 0.5 0.5 0.5 0.5 
##$TPOFFS= (0..7)
0 0 0 0 0 0 0 0 
##$TUNHIN= 0
##$TUNHOUT= 0
##$TUNXOUT= 0
##$USERA1= <user>
##$USERA2= <user>
##$USERA3= <user>
##$USERA4= <user>
##$USERA5= <user>
##$V9= 5
##$VALIST= <valist>
##$VCLIST= <CCCCCCCCCCCCCCC>
##$VD= 0
##$VDLIST= <DDDDDDDDDDDDDDD>
##$VPLIST= <PPPPPPPPPPPPPPP>
##$VTLIST= <TTTTTTTTTTTTTTT>
##$WBST= 1024
##$WBSW= 4
##$XGAIN= (0..3)
0 0 0 0 
##$XL= 0
##$YL= 0
##$YMAX_a= 181250
##$YMIN_a= -97379
##$ZGOPTNS= <>
##$ZL1= 120
##$ZL2= 120
##$ZL3= 120
##$ZL4= 120
##$ABSF1= 10
##$ABSF2= 0
##$ABSG= 5
##$ABSL= 3
##$ALPHA= 0
##$AQORDER= 0
##$ASSFAC= 0
##$ASSFACI= 0
##$ASSFACX= 0
##$ASSWID= 0
##$AUNMP= <proc_1d>
##$AZFE= 0.1
##$AZFW= 0.1
##$BCFW= 1
##$BC_mod= 2
##$BYTORDP= 1
##$COROFFS= 0
##$CY= 11.3945322036743
##$DATMOD= 1
##$DC= 2
##$DFILT= <>
##$DTYPP= 0
##$F1P= 16.9975609425685
##$F2P= -3.02152046262296
##$FCOR= 0.5
##$FTSIZE= 0
##$FT_mod= 4
##$GAMMA= 1
##$GB= 0.15
##$INTBC= 1
##$INTSCL= 1
##$ISEN= 128
##$LB= 0.24
##$LEV0= 0
##$LPBIN= 0
##$MAXI= 10000
##$MC2= 0
##$MEAN= 0
##$ME_mod= 0
##$MI= 1.114404
##$NCOEF= 0
##$NC_proc= 0
##$NLEV= 6
##$NOISF1= 3.799351
##$NOISF2= 2.8
##$NSP= 1
##$NTH_PI= 0
##$NZP= 0
##$OFFSET= 15.70392
##$PC= 1
##$PHC0= -9799.645
##$PHC1= 22.60087
##$PH_mod= 1
##$PKNL= yes
##$PPARMOD= 0
##$PSCAL= 0
##$PSIGN= 0
##$REVERSE= no
##$SF= 200.130013532006
##$SI= 16384
##$SIGF1= 3
##$SIGF2= 2
##$SINO= 400
##$SIOLD= 16384
##$SREGLST= <1H.CDCl3>
##$SSB= 0
##$STSI= 0
##$STSR= 0
##$SW_p= 3612.71676300578
##$SYMM= 0
##$S_DEV= 0
##$TDeff= 0
##$TDoff= 0
##$TI= <>
##$TILT= no
##$TM1= 0
##$TM2= 0
##$TOPLEV= 0
##$USERP1= <user>
##$USERP2= <user>
##$USERP3= <user>
##$USERP4= <user>
##$USERP5= <user>
##$WDW= 1
##$XDIM= 8192
##$YMAX_p= 0
##$YMIN_p= 0
$$ End of Bruker specific parameters
$$ ---------------------------------
##NTUPLES= NMR FID
##VAR_NAME=  TIME,          FID/REAL,        FID/IMAG
##SYMBOL=    X,             R,               I
##VAR_TYPE=  INDEPENDENT,   DEPENDENT,       DEPENDENT
##VAR_FORM=  AFFN,          ASDF,            ASDF
##VAR_DIM=   8192,          8192,            8192
##UNITS=     SECONDS,       ARBITRARY UNITS, ARBITRARY UNITS
##FACTOR=    0.0002004,     1,               1
##FIRST=     0,             0,               0
##LAST=      1.6414764,     0,               0
##MIN=       0,             -97379,          0
##MAX=       1.6414764,     181250,          0
$$ Real data points
##PAGE= N=1
##DATA TABLE= (X++(R..R)), XYDATA
$$ [...]
2467B03J687l079L5K431j699j313K202L03k411J020J559j697N18J453k295n34
$$ 203 1890 -1189 -1154 1277 -422 -1735 467 770 -1641 -621 938 -759 -241 1212 -1083 -1617
2483a617L234m32l454J945K431k565q70J805n71q48J406m78k373K422J334k745
$$ -1617 1617 1185 -2269 -324 2107 -458 -1328 477 -94 -942 464 -14 -2387 35 1369 -1376
2499a376n13L121r79j542J726L78k139J084J177j842k97K438j314j699K509j65
$$ -1376 -1889 1232 253 -1289 437 815 -1324 -240 937 -905 -1202 1236 -78 -1777 732 567
2515E67k314J389K109k328j096K190N1j272J102K31k066K279J389l144m27L030
$$ 567 -1747 -358 1751 -577 -1673 517 568 -704 398 629 -1437 842 2231 -913 -1340 1690
2531A690J6l035J113J830j801k9J509j736n13L035j150k341K209J074k501N70
$$ 1690 1706 -1329 -216 1614 -187 -216 1293 -443 -956 2079 929 -1412 797 1871 -630 -60
2547f0K602k349j475K716l1k122J040J466j958N07J141j807o94L191o77k986J851
$$ -60 2542 193 -1282 1434 1403 -719 321 1787 -171 336 1477 -330 -1024 2167 1490 -1496 355
2564C55J699j908m15J925j502n57K109m13k666J643J803k434l19K517j183j949
$$ 355 2054 146 -269 1656 154 -403 1706 1293 -1373 270 2073 -361 -680 1837 654 -1295
2580a295K227o4j951J073J528j863k12J634r93j053K377M1k755J153K102k225
$$ -1295 932 868 -1083 -10 1518 -345 -557 1077 84 -969 1408 1449 -1306 -153 1949 -276
2596b76j085K068j99j173J314m32k103J985J669k827p50L247m99k499J104J155
$$ -276 -1361 707 508 -665 649 217 -1886 99 1768 -1059 -1809 1438 939 -1560 -456 699
2612F99j861O74J574j846o17K102j073j488J694Q65k633N34K247j624j185K285
$$ 699 -1162 -488 1086 -760 -1377 725 -348 -1836 -142 723 -1910 -1376 871 -753 -1938 347
2628C47j07j666J022P66j660P03J492j775o64K657o58k524J896J036j726j48J674
$$ 347 240 -1426 -404 362 -1298 -595 897 -878 -1542 1115 457 -2067 -171 865 -861 -1009 665
2645F65j489k69J972p64k010J976J084k670O10K514j375j604K182j42j450Q87
$$ 665 -824 -1093 879 115 -1895 81 1165 -1505 -895 1619 244 -1360 822 680 -770 117
2661A17J212k214L98J931j586j436K605L63k410J084J785k133l30J903o77j236
$$ 117 1329 -885 -487 1444 -142 -1578 1027 1390 -1020 64 1849 -284 -614 1289 612 -624
2677f24J613j02j811J977Q58k863l1L124j278k123J981P47j750K15J149j376J62
$$ -624 989 887 -924 1053 1911 -952 -983 2141 863 -1260 721 1468 -282 -67 1082 -294 -132
2694a32K060j286j737K184J07k090J157J165j362j342K520o0k073J342N29j628
$$ -132 1928 642 -1095 1089 1196 -894 263 1428 66 -1276 1244 1184 -889 453 982 -646
2710f46R40J002k070k03K447r18j832J465J422j952j32J376j130j10J492j159
$$ -646 294 1296 -774 -977 1470 552 -1280 185 1607 -345 -477 899 -231 -341 1151 -8
2726hk170K483J389l039j52K455j315r75J504M4j564J840L71k199K25J997j549
$$ -8 -2178 305 1694 -1345 -1497 958 -357 -1332 172 216 -1348 492 863 -1336 -1111 886 -663
2743f63o46K226o43k550K000J547k374j92J901p50j443K181j014j509K123Q55
$$ -663 -1309 917 274 -2276 -276 1271 -1103 -1295 606 -144 -1587 594 -420 -1929 194 1049
2759A049k530j34L002j190j700J639L03j524P15J166k044K78J545m39j371J289
$$ 1049 -1481 -1615 1387 197 -1503 136 439 -1085 -370 796 -1248 -970 575 136 -1235 54
2775E4M93j778J204J337k111l97K086l10j681J447M93j624J358J020k509j36K869
$$ 54 547 -1231 -27 1310 -801 -1198 888 578 -1103 344 837 -787 571 1591 -918 -1054 1815
2792A815j173k144J760J281j790qJ237j442M60J673j238j849K210J319k408k24
$$ 1815 642 -1502 258 1539 -251 -259 978 -464 -4 1669 431 -1418 792 2111 -297 -521
2808e21K517j805j037K324l98j954J634M89j959J001J267j890k65K239m71k534
$$ -521 1996 191 -846 1478 1080 -874 760 1249 -710 291 1558 -332 -597 1642 1171 -1363
2824a363J631J474j961l36J872j076n78J559r01j655J821J369k898P0K316r77
$$ -1363 268 1742 -219 -555 1317 241 -337 1222 321 -1334 487 1856 -1042 -972 1344 367
2840C67j662J915q6j501J125J172k328O63J685j392j577K521l0k153Q42J693j987
$$ 367 -1295 620 534 -967 158 1330 -998 -335 1350 -42 -1619 902 872 -1281 -439 1254 -733
2857g33l40J743q34j008J677j64j992J632J120j810o30K462n92k158J922J53j723
$$ -733 -1073 670 -164 -1172 505 341 -1651 -19 1101 -709 -1339 1123 531 -1627 295 448 -1275
2874a275N66J310j561Q4J763j246j832K618K37k228K34K199j256q82J891q38j041
$$ -1275 -709 601 -960 -876 887 -359 -2191 427 664 -1564 -1330 869 -387 -1269 622 -216 -1257
2891a257J519L23j990Q38J412j557q25K349n79j920J651J197k322L25J911j202
$$ -1257 262 585 -1405 -567 845 -712 -1537 812 233 -1687 -36 1161 -1161 -836 1075 -127
2907a27q18J591m19j633J812O83k322L60K412j124j919K116M6j247O90M18j581
$$ -127 -945 646 227 -1406 406 1089 -1233 -873 1539 415 -1504 612 658 -589 101 519 -1062
2924a062O13K070j715j324K447k4j552Q37J118j595j17J657j396j008K023m40
$$ -1062 -449 1621 -94 -1418 1029 1005 -547 290 1408 -187 -304 1353 -43 -1051 972 532
2940E32j523J463J001k293Q4K504j297j834J924O93j946P98Q58j273J51J596j116
$$ 532 -991 472 1473 -820 -736 1768 471 -1363 561 1254 -692 106 964 -309 -158 1438 322
2957C22j644K403P57k849M86J875j559k09J606j029j469J887P52k200M01J672
$$ 322 -1322 1081 1838 -1011 -525 1350 -209 -418 1188 159 -1310 577 1329 -871 -470 1202
2973A202j877k0K084r14j786J737R12k005K17J211j278n03J728o76j523J988M26
$$ 1202 -675 -695 1389 475 -1311 426 1338 -667 -450 761 -517 -1020 708 32 -1491 497 923
2990I23k525M01K490j157r21J256n36n99J094K39k090P58K040k034r28K033j37
$$ 923 -1602 -1201 1289 132 -789 467 -69 -668 426 665 -1425 -667 1373 -661 -1589 444 307
3007C07k088J492J292k118L5J931j239p31J635o34j188J651N86k214L83K396j394
$$ 307 -1781 -289 1003 -1115 -1080 851 -388 -1119 516 -118 -1306 345 931 -1283 -900 1496 102
3024A02j831J983N89j701P92N17j460M96J789j550j278K149L59k119R40J264j778
$$ 102 -1729 254 843 -858 -66 451 -1009 -513 1276 -274 -1552 597 956 -1163 -223 1041 -737
3041g37M8J493o11j281J688J47j719J022J305k043k17K156n91j630J426Q43j887
$$ -737 -689 804 193 -1088 600 747 -972 50 1355 -688 -905 1251 660 -970 456 1299 -588
3058e88O44J106j257j70J914j482j064K060L58k402P23J304r14q54J916n59j384
$$ -588 56 1162 -95 -265 1649 167 -897 1163 1521 -881 -158 1146 232 -622 1294 735 -649
3075f49J426L66j747Q83J207j236q15K103q00j834J596J048j877lJ490q96j231
$$ -649 777 1143 -604 279 1486 250 -565 1538 738 -1096 500 1548 -329 -332 1158 262 -969
3092i69J801l07j427J590N75j901M94J811j333j577J900K50j514P67R95j627M4
$$ -969 832 525 -902 688 1263 -638 -144 1667 334 -1243 657 907 -607 160 1155 -472 -428
3109d28J763j657j039J939K26k035P47J476j842j29J653r08j220J981l29j482
$$ -428 1335 -322 -1361 578 804 -1231 -484 992 -850 -979 674 -234 -1454 527 198 -1284
3125a284J421J086j767m83K010r58j663J614O94j891M91J099r91l0J108j160j027
$$ -1284 137 1223 -544 -1027 983 25 -1638 -24 670 -1221 -730 369 -622 -652 456 -704 -1731
3142a731K509Pk484Q89J936j639q78J784l40q64J179j6j714R94J251j702l15J817
$$ -1731 778 785 -1699 -810 1126 -513 -1391 393 53 -811 368 352 -1362 -368 883 -819 -1134 683
3160F83m84j629J496N76j469K63J725j478o91J740o68j000J382O90k438N93J772
$$ 683 199 -1430 66 642 -827 -564 1161 -317 -1008 732 64 -936 446 1136 -1302 -709 1063
3177A063j052j087J871l17j405J342M17j507P32J517j990o29J968J9j637O01J181
$$ 1063 11 -1076 795 478 -927 415 832 -675 57 1574 -416 -1045 923 942 -695 -94 1087
3194A087j559K54J100p98p45J317R3j351Q17J009j669K10J694q90j390J321P72
$$ 1087 -472 -218 882 84 -661 656 749 -602 215 1224 -445 -235 1459 569 -821 500 1272
3211A272j815M64J060j160K65J131r10j439K238r7k028Q33J334j111n12J307p07
$$ 1272 -543 -79 981 -179 86 1217 307 -1132 1106 1009 -1019 -186 1148 37 -475 832 125
3228A25n01J197m5j609Q34R02j156n42J854p17j507J862J5j824N80J224j001p50
$$ 125 -376 821 776 -833 1 903 -253 -795 1059 342 -1165 697 712 -1112 -532 692 -309 -1059
3246a059J645q60q32J463K82j599L75J497j196n63J478m07j013P53L02j336O97
$$ -1059 586 -274 -1106 357 639 -960 -585 912 -284 -847 631 224 -789 -36 266 -1070 -373
3263c73J083j488o79K096l94j668J216R60j719L26J195q89q13J503k62j136J089
$$ -373 710 -778 -1457 639 245 -1423 -207 753 -966 -640 555 -334 -1147 356 94 -1042 47
3280D7Q65j814J13J829j392r05J504L72j228N09P21j445J92J610j380l29J294
$$ 47 912 -902 -789 1040 -352 -1257 247 619 -609 -100 621 -824 -632 978 -402 -731 563
3297E63J13j862Q76J587j386n52J615n72j362J616J49j873J162J281k012J98J457
$$ 563 676 -1186 -310 1277 -109 -661 954 382 -980 636 785 -1088 74 1355 -657 -459 998
3314I98o50j304J352P30j595O24R96j461J84Q45r34n72J519r0j509O30J256q21
$$ 998 348 -956 396 1126 -469 155 1151 -310 -126 719 -215 -787 732 642 -867 -237 1019 198
3332A98q47J506m47j095J605k54j174P08J091j854l10K099n73j262Q85N99j293
$$ 198 -649 857 410 -685 920 666 -508 200 1291 -563 -873 1226 653 -609 276 875 -418
3349d18K40R02j110k34J622n81j535J392O51j743O00J196j186o25J795k96j370
$$ -418 -178 724 -386 -620 1002 421 -1114 278 929 -814 -214 982 -204 -829 966 670 -700
3366g00N49P39j282M84J292j822k42J973l29j915Q43J515j259o32J301j064j04
$$ -700 -151 588 -694 -210 1082 -740 -982 991 662 -1253 -410 1105 -154 -786 515 -549 -653
3383f53J470n83j400R64J110j509m84J612n87q11J130r0j233N95J307j340k88
$$ -653 817 234 -1166 -202 908 -601 -1085 527 -60 -871 259 169 -1064 -469 838 -502 -790
3400g90J497q62q64J507l8j840P22J507j088p79J235j20j010J102r3j111J082
$$ -790 707 -155 -1019 488 450 -1390 -668 839 -249 -1028 207 87 -923 179 86 -1025 57
3417E7J079j826k33J847l85j406J000N41j516N78J054j149j97J208n56j038J072
$$ 57 1136 -690 -923 924 539 -867 133 674 -842 -264 790 -359 -556 652 96 -942 130
3434A30N64j437N94J426j416p94J700Q9j443N96O99j110N10Q77j252l50J367K0
$$ 130 694 -743 -149 1277 -139 -933 767 856 -587 9 708 -402 108 985 -267 -617 750 770
3452G70j704Q52J049j405J67R74r11o4J428n86j887J711P90j530J43J065n39q89
$$ 770 -934 -82 967 -438 -271 703 -208 -272 1156 570 -1317 394 1184 -346 -203 862 323 -566
3470e66J249M0j074L55O76j269L71J121j105n53J658j66j836J290R77r81m54R16
$$ -566 683 723 -351 4 680 -589 -218 903 -202 -755 903 737 -1099 191 1168 187 -267 649
3488F49k11q89J086pj406O18J114j445j44J158k59j062J050N21j571P53P58j203
$$ 649 438 -451 635 628 -778 -160 954 -491 -635 523 264 -798 252 773 -798 -45 713 -490
3506d90j68J558q75q18J122N5j680R06J344j218m87J187k02j203J097J49j220
$$ -490 -658 900 25 -793 329 384 -1296 -390 954 -264 -751 436 234 -969 128 277 -943
3523i43N83R74j177o23J605l1j770J329N39j018q9Q38r02n6J033m54r84J455P50
$$ -943 -360 614 -563 -1186 419 388 -1382 -53 486 -532 -621 217 -685 -741 292 -162 -1146 309 1059
3542A059k060L87J257r30p17J399m77n32M67Q30j074J98Q01p64o82J460J82j796
$$ 1059 -1001 -614 643 -287 -1004 395 -82 -614 -147 683 -391 -193 608 -156 -838 622 804 -992
3560i92R32O62q06l33J213n04q03J256l46j089R87R12j558k05J642m79j250J048
$$ -992 -60 602 -204 -537 676 172 -631 625 279 -810 177 1089 -469 -674 968 489 -761 287
3578B87K06r67P11R02j507j94J612q09j069J314L9j108P39R55j315q8J545r02
$$ 287 493 -474 237 1139 -368 -562 1050 241 -828 486 525 -583 156 1111 -204 -292 1253 351
3596C51r06J013J44j087M31J148j523l90J747n06j210J081O31j483L72J136j411
$$ 351 -555 458 602 -485 -54 1094 -429 -819 928 422 -788 293 924 -559 -187 949 -462
3613d62r3J489o94r97J129P94j631R3J129r20k18P57k93q87O81P34j202J95J115
$$ -462 -555 934 240 -757 372 1166 -465 -372 757 -163 -381 376 83 -804 -123 611 -591 -396 719
3632G19j165k32J370l62j186Q86P69j113l95J054o09n55J118m02o30Q41O96j802
$$ 719 -446 -678 692 330 -856 30 799 -314 -709 345 -264 -819 299 -103 -733 108 804 -998
3650i98j63J511m61p13R56j81p86O58P36r72M8J006q20p37J340P8j393N33Q63
$$ -998 -1161 350 -111 -824 132 -49 -835 -177 559 -413 -365 641 -179 -916 424 502 -891 -358 505
3669E05q48n30J203k73q14P30%p47R00R22j864j94K008l68j507J063O35j222J25
$$ 505 -343 -873 330 57 -757 -27 -27 -774 126 1048 -816 -1010 998 630 -877 186 821 -401 -276
3688b76R68j160l31J456p19p76J262N43j663Q65O83p88n81J365O9j228O49J40
$$ -276 692 -468 -799 657 -62 -838 424 967 -696 169 852 64 -517 848 917 -311 338 478
3706D78r08N72P65r88j88J060m5j283Q94O07j132m3J211r16j12Q35n06j130J182
$$ 478 -430 142 907 -81 -269 791 746 -537 357 964 -168 -211 1000 84 -28 807 301 -829 353
3725C53O54j424MJ308p81p84J200J89j108P61N66j180oJ101q29m63J274k74j385
$$ 353 1007 -417 -413 895 114 -670 530 719 -389 372 938 -242 -248 853 24 -439 835 561 -824
3744h24Q55J037j333j68R62l63n23J018l65r31O33R26j138j19R89k40r73J084
$$ -824 31 1068 -265 -433 529 166 -357 661 296 -635 -2 924 -214 -333 656 416 -557 527
3762E27J06q40M3P14q82j45J010m52p98J253J87j221L04P93j044k76J120n78n79
$$ 527 633 -207 -164 550 -332 -477 533 81 -717 536 723 -498 -194 599 -445 -721 399 -179 -758
3781g58R52k9p99N53L80p05n12J349j6j268Q54M28r63q9O59p64m0Q67m63n04R66
$$ -758 194 165 -634 -81 299 -406 -918 431 415 -853 1 429 -534 -623 36 -728 -768 99 -364 -868 98
3802I8K01j064J40J198n28n97J216l41p56Q86l21n50J96R58j127l60J196j18j183
$$ 98 299 -765 -625 573 45 -552 664 323 -433 453 132 -418 -222 736 -391 -751 445 327 -856
3821h56O52R95j032k41J465p20p76R51K06j149J001K83j485K66J348p39r63J244
$$ -856 -204 791 -241 -482 983 263 -513 438 644 -505 496 779 -706 -440 908 169 -794 450
3839D50M27j150M03O04r95J64R59o15q63J165L74j336N22L70o78j69J136o92n24
$$ 450 877 -273 130 734 -261 -97 862 247 -616 549 923 -413 109 479 -199 -368 768 76 -448
3858d48R66l9q91O92O65j438QJ368m86q82P38M45j201M68N33l93l82Q60p63o20
$$ -448 518 479 -412 280 945 -493 -485 883 397 -485 253 698 -503 -35 498 105 -277 583 -180 -800
3878h00J144M44j320K80Q51o72q46J256j24q97J065k2r90L89P33o63l17J037m46
$$ -800 344 788 -532 -252 599 -73 -919 337 213 -684 381 359 -631 -242 491 -172 -489 548 102
3897A02j303J353N33j119k07J192o52o75J268m66o27Q32R7j213J37J413o47o34
$$ 102 -1201 152 685 -434 -641 551 -101 -776 492 26 -601 231 328 -885 -748 665 18 -616
3915f16Q53J22j422Q50O45j206M21O54n25m48O53N68j573P81N55q77k86J267k11
$$ -616 237 359 -1063 -213 432 -774 -353 301 -224 -672 -19 549 -1024 -243 312 -565 -851 416 205
3934B05j087R84K08j190P75R11j532J22J396n70j056R48M50r02J88O98o07j26
$$ 205 -882 102 310 -880 -105 806 -726 -604 792 222 -834 114 564 -338 -150 548 -59 -185
3952a85R15o41o53J213L9j219M51R31r40k71P13P5r18Q28J33q33j1J099r41R6
$$ -185 730 89 -564 649 688 -531 -80 851 -89 -360 353 428 -490 338 471 -362 -373 726 -215 -119
3972a19Q70o21q48P92O36j036L35M30o37Q1J121r92l81O69N82j548N28J250j242
$$ -119 751 130 -718 74 710 -326 9 439 -198 -117 1004 12 -369 300 882 -666 -138 1112 -130
3991a30n46J355k33j169R42K72r81N63O39n98o59J369q08p38P19Q21j255K34R65
$$ -130 -676 679 446 -723 219 491 -490 73 712 114 -545 824 16 -722 -3 818 -437 -203 762
4010G62o53o84Q68K7r29J118J77j164l9J232m34q23J205k64j000K38P08o47j3
$$ 762 109 -575 293 320 -609 509 686 -478 -517 715 281 -542 663 399 -601 -363 345 -302 -315
4029c15Q66o89o26J202q3j426R00M55n34k32P78p41l05J197k72q47K40Q04r50
$$ -315 551 -138 -764 438 355 -1071 -171 284 -250 -482 296 -445 -750 447 175 -672 -432 372 -578
4048e78J1R85n40o00N50O39j393O71N47p27n2Q76n42n34J230j99j285M59J241
$$ -578 -567 418 -122 -722 -172 467 -926 -255 292 -435 -487 389 -153 -687 543 344 -941 -482 759
4067G59j004m98J066r4o47O47p3j037P74P45r23o33J277k7r15O89L46q66K01J033
$$ 759 -245 -743 323 229 -418 229 156 -881 -107 638 -285 -918 359 332 -583 106 452 -414 -213 820
4087H20p81n17J063l73o02M95M73p79J3J034p97n27J107n8q43K59N38p65K21Q54
$$ 820 39 -478 585 212 -390 105 578 -201 -188 846 49 -478 629 571 -272 -13 525 -240 -19 835
4107H35p73o20J291J99j118L08O34p22k75J155r13n15J120j68r82L47R98p42k57
$$ 835 62 -558 733 932 -186 122 756 34 -241 914 1 -514 606 438 -544 -197 801 59 -198
4126a98J037o02p82P59L00j031K14P05p76K7Q92o18o81R91L66j295L42Q98q22
$$ -198 839 237 -545 214 514 -517 -303 402 -374 -347 545 -73 -754 237 603 -692 -350 548 -274
4145b74l94J041k28o43Q03j64p55P22L07p04k18J057m25q77O79M50p55o7P29p96
$$ -274 -668 373 145 -498 305 141 -614 108 415 -289 -507 550 125 -752 -73 377 -378 -445 284 -512
4165e12m60J124J32r82O10K01r37J15J303p38o45R21l1r03K70J004r02K5Q24p25
$$ -512 -972 152 284 -698 -88 113 -824 -709 594 -144 -789 132 101 -802 -532 472 -430 -405 419 -306
4185c06q56J457J1j050P31M73j029K45N65l14j91O81l54r88J073M21p88r4J164
$$ -306 -1162 295 306 -744 -13 460 -569 -324 241 -73 -264 417 63 -925 148 569 -219 -313 851
4204H51p68q03R24o4o47M65L10m68m75J497o58r20J396L2j061M27R31j322l7J182
$$ 851 83 -720 204 140 -507 -42 268 -200 -675 822 164 -756 640 672 -389 38 969 -353 -390 792
4224G92o06j29M65k12j38K51L10j152L89Q16m26q55P00K80o56J67O57p71j87M28
$$ 792 186 57 522 310 172 423 733 -419 -30 786 360 -495 205 485 -171 -4 653 -118 -305 123
4244A23L6p81J028J06q17K56P42o95p17J162j39n53L76O1p06M29Q38p61m15Q61
$$ 123 159 -622 406 512 -305 -49 693 -2 -719 443 304 -249 127 188 -518 -89 749 -12 -427 434
4264D34J16j205O90M97p62l9O93n12n10R36l1j182R13O36j253K52O12J65j158
$$ 434 550 -655 35 532 -230 -269 424 -88 -598 338 307 -875 38 674 -579 -327 285 450 -708
4283g08Q44J15p94M12M95q01p8J013o96l64N87L95j287N27J106j058m57P60J1
$$ -708 136 251 -543 -131 364 -437 -515 498 -198 -562 25 420 -867 -340 766 -292 -749 11 22
4302B2n59P44oj283Q60N23r21k48J259o59o55O26O74j000N43O18j005k59J144
$$ 22 -537 207 201 -1082 -222 301 -620 -868 391 -268 -923 -297 377 -623 -80 538 -467 -726 418
4321D18n85l44J003p0j046J13J239q58m02O37J53j049R68J29q00J00J024p11m79
$$ 418 -167 -511 492 422 -624 -511 728 -130 -532 105 258 -791 177 306 -494 -394 630 -81 -560
4340e60R93j26o62P40P5p27J92O00m36j82P60l15q89R03L01j319M69Q52p21l15
$$ -560 433 307 -355 385 460 -267 -75 525 89 -93 667 352 -537 366 667 -652 -183 669 -52 -367
4360c67J001k61p29N82M12p84J01P08n12m69R95l3j233Q03M84n08n45O46o86J15
$$ -367 634 373 -356 226 638 -146 -45 663 151 -318 677 644 -589 214 698 190 -355 291 -395 -280
4380b80O67j72o01N83N93j027k19Q76N2j097P51o1m27O77K79o80l68J092n63o97
$$ -280 387 215 -386 197 790 -237 -456 420 472 -625 126 65 -362 315 594 -86 -454 638 75 -622
4400f22J160j71o88PQ74q08j97O45k2o95O85Q3r72M62P86r27j73J106m11q46O67
$$ -622 538 367 -321 -314 560 -248 -445 200 178 -517 168 251 -721 -259 527 -400 -573 533 122 -724 -57
4421e7L19j087J42R28m24l58N66j38m93P70L66j111J83P18l77n98Q75j07o16K23
$$ -57 262 -825 -683 245 -179 -537 29 -109 -602 168 534 -577 -394 324 -53 -651 224 117 -499 -276
4441b76O51o41j6O82q41o7J159n41o25N68K37n92n5Q29p52k46Q36k34p75Q38M38
$$ -276 375 -266 -282 400 -441 -508 651 110 -515 53 290 -302 -357 472 -280 -526 310 76 -699 139 577
4462E77r92k6J238r61m51J282n51p15O80M91o62q7P77m56p53J145r7j157O97O79
$$ 577 -415 -441 797 -164 -615 667 116 -599 81 572 -90 -177 600 144 -609 536 439 -718 -21 658
4482F58n98l41Q60m63n73P84J11p72P35L22j059J09R04j84q58O83K57p98J25O38
$$ 658 60 -281 579 116 -457 327 438 -334 401 723 -336 -227 677 493 -365 318 575 -223 -98 540
4502E40o78k27J010m16p29R49Q7p02o9O20n64l20Q99k91n69Q07J54j028L54R62
$$ 540 -138 -365 645 229 -500 449 536 -166 -235 385 -179 -499 400 109 -460 347 501 -527 -173 789
4522G89p59m37R37m16n27L57P00p26l3N79n67l50Q54m27l84M79L30r35Q3J127
$$ 789 30 -407 530 114 -413 -56 644 -82 -115 464 -103 -453 401 -26 -410 69 399 -536 -453 674
4542F74p02m33N97K38j037L73O79n47P4M65n59m20J170m41q03P64L09n61l54P44
$$ 674 -28 -461 136 374 -663 -290 389 -158 -84 381 -178 -598 572 131 -672 92 401 -160 -514 230
4562B30k80m46L87J26n76R26j9r31n2Q74l49k22K71O48r05J02M62p28M88J31l72
$$ 230 -50 -496 -109 17 -559 367 348 -583 -635 239 -110 -332 -61 587 -318 -216 246 -482 6 137 -235
4583b35m24Q58J50r47K27Q34p97p29J462k5p89P76J00q68O09K58o58k63J135o24
$$ -235 -659 199 349 -598 -371 463 -334 -1063 399 374 -415 361 461 -407 202 460 -198 -461 674 50
4603E0n24Q19K26o95QQ26q19k60R12j46q74R30J36j148M15P92m57m08Q29M8q06
$$ 50 -474 345 571 -124 -116 710 -109 -369 543 397 -477 453 589 -559 -144 648 191 -217 612 660 -146
4624a46M01M25q62K62N84m21n84J168m41q88P87L32r05o4O71k00l50J026m27p63
$$ -146 255 680 -182 80 664 243 -341 827 386 -502 285 617 -288 -352 319 119 -231 795 368 -395
4644c95K20J059r59R2M82k85p60J050p2r73O84K03n74L3N29l06n54J016k02q75
$$ -395 -175 884 -75 17 499 214 -546 504 432 -541 143 346 -228 -195 334 28 -526 490 288 -587
4664e87N00L79n89k0L59J11n01K54K93p92O99K85q13Q7R10n64m86L08M34q93M58
$$ -587 -87 292 -297 -317 42 153 -348 -94 199 -593 106 391 -422 -335 575 11 -475 -167 267 -626 -168
4685a68N65p04k79P63k72n14Q04L48j103M93L60j69p35P91j65p07P50l8p03M67
$$ -168 397 -307 -586 177 -95 -609 195 543 -560 -67 293 124 -611 180 15 -692 58 20 -683 -216
4705b16P25n13l84Q61j82r57L64P77j134P17N05o40l47Q79k64q00P02L07j107
$$ -216 509 -4 -388 473 291 -666 -302 475 -659 58 563 -77 -424 455 191 -609 93 400 -707
4724g07N05P37n83n18O27O06r18M64L49o55L3O23k75p60Q89Q6o77M41N16j081
$$ -707 -202 535 -48 -566 61 667 -251 213 562 -93 -60 563 288 -472 417 503 -174 267 783 -298
4744b98L07M47l02o02P84P3o50L46M33p44j40R94k29p40M80L05n83J00N14k12
$$ -298 9 456 154 -448 336 409 -241 105 538 -206 -346 648 419 -321 159 464 -119 -19 495 283
4764B83m71R39q33q38J224J40o74K47L09o67M33J90k00l60N72o2l75J86M64o61
$$ 283 -188 751 -82 -920 304 444 -230 17 326 -341 92 282 82 -278 294 232 -143 43 507 -154
4784a54K5M80k63n76M99O18r40k0P50m38l27P06m45n23L72M51p58L31O50n42o44
$$ -154 -129 351 88 -488 11 629 -311 -331 419 -19 -346 360 -85 -608 -236 215 -543 -212 438 -104 -748
4805g48J319k69m74L74J64j147L61O93p48J55O96m89m29N93J95o57k8P22k35m81
$$ -748 571 302 -172 202 366 -781 -420 273 -475 -320 376 -113 -542 51 246 -411 -439 283 48 -433
4825d33M26j0n06M78L05q82K51M99j01q44O66M59p65N50K85o06J13N53l78m91
$$ -433 -7 -17 -523 -45 260 -622 -371 128 27 -817 -151 308 -457 93 378 -228 -115 438 60 -431
4845d31O67j9n61J67Q11q15m09Q21O4m82K77N56q55M12K89q14j54R82l15n08O04
$$ -431 236 217 -344 -177 634 -181 -590 231 295 -187 90 646 -209 203 492 -322 -476 506 191 -317 287
4866B87K8l05k77P48p26K67M71k55n56M65N28r49L29N33n14p02J139l58m87L83
$$ 287 315 10 -267 481 -245 22 493 238 -318 147 675 -274 55 588 74 -628 511 153 -334 49
4886D9M96o40J45M38o74k78P65N6o59L27M00p00L10M79o95L4N42l42n90Q50N8
$$ 49 545 -95 50 488 -186 -464 301 357 -302 25 425 -275 35 514 -181 -147 395 53 -537 313 371
4907C71l85O5K51N4q84Q78l38m00L50J57n69J09Q10q65k4P79J01r35L94K42l47
$$ 371 -14 51 302 356 -528 350 12 -388 -38 119 -450 -341 469 -396 -420 359 460 -475 -81 161 -186
4928a86j37N04n3n30L25M93r62N70N52q43n95J023k09l50M55K86q95L26M02m40
$$ -186 -323 181 128 -402 -77 416 -546 24 576 -267 -862 161 -48 -398 57 343 -552 -226 176 -264
4948b64k3N39l67l51M97K31q01L24P42q40k37R59n54m20M12L06o36L06O27n28
$$ -264 -287 252 -115 -466 31 262 -539 -215 527 -313 -550 409 -145 -565 -153 153 -483 -177 450 -78
4968g8l80P17P9p98M30N09o84J8N11n61j26Q63k89o45O95Om54o1P27m33l35O80
$$ -78 -458 259 338 -460 -30 479 -205 -187 324 -237 -363 500 211 -434 261 267 -187 -248 479 46 -289 391
4990C91j52l58K29L25l64o0N49n08m12P18k4p81M66M38o98J42Q13n25l73N10J57
$$ 391 239 -119 110 435 71 11 560 52 -360 358 334 -447 19 457 -241 -99 714 189 -184 326 483
5011D83p82K03L97l73R2O91p22l3L50p3l71L09M36p44Q9L51m75k71Q27L07r66
$$ 483 -299 -96 301 -72 20 711 -11 -44 306 233 -138 171 607 -137 -48 303 -172 -443 384 691 -275
5032b75J0P65m12k21L43k71K4J66M67q22k8P97n32k68O91n30m51Q47J14o98R3
$$ -275 -265 500 88 -133 210 -61 -37 129 596 -226 -254 543 11 -257 434 -96 -547 300 414 -284 -191
5053a91K86j77k18O29m16n64P96R0o54L35J47k94r4K92K5l55L95k13ok03N14m58
$$ -191 95 -82 -300 329 -87 -651 145 235 -419 -84 63 -231 -325 -33 -8 -363 32 -181 -187 -390 124 -334
5075c34JM46p8n37M25J61k95j56O57p19l5N38j03l58O90j43p64L91N32m03n61
$$ -334 -333 113 35 -502 -77 84 -211 -367 290 -429 -464 74 -29 -387 303 160 -604 -213 319 -84 -645
5096f45R27Jn95K38M56n20m90J224p87j79O05J23o80N30J5j81k54M54j56j86L09
$$ -645 282 283 -312 -74 382 -138 -628 596 -191 -370 235 358 -322 208 223 42 -212 242 86 -100 209
5117B09j73j98K62M90r24k5Q08o55r1M12M15o51L1O08p23L21M0k57j42M01M59
$$ 209 36 -162 100 590 -334 -359 449 -206 -297 115 530 -121 -90 518 -205 116 156 -101 -243 158 617
5138F17r64L48L35m78k31P44L6n59M28q6o11L87L40n18L9P49m92m87K12N84m01
$$ 617 -347 1 336 -142 -373 371 407 -152 276 190 -421 -34 306 -212 -173 576 84 -403 -191 393 -8
5159hmM16l28j02K78m07j91M98K38r18M55O08o45m70J020n11j89l1M49l80N6M25
$$ -8 -12 404 76 -26 252 -155 -346 152 390 -528 -73 535 -110 -580 440 -71 -260 -291 158 -222 -166 259
5181B59q3m11L79K23p54K93K19l71j51P68j90m70N89j72n67O38N8n76K35J39r0
$$ 259 176 -235 144 367 -387 -94 125 -246 -397 371 181 -289 300 128 -439 199 257 -319 -84 55 -35
5202c5l22N11l3n30L89J25l20Q7K22o9k29K61J77o42N17J97m14m73N81J85o29
$$ -35 -357 154 121 -409 -20 105 -215 -128 94 25 -204 57 234 -408 109 306 -108 -581 0 185 -444
5223d44O64l65p01J102k3m22k61Q24l25n41N09j17m80N18L66m71J51N20l77m29
$$ -444 220 -145 -846 256 233 -189 -450 374 49 -492 17 -100 -580 -62 304 -167 -16 504 127 -302
5243c02L71J7K4j97M41l45l57Q19l02n01L35K91l05Q7J84k92l35Q27k01m35L65
$$ -302 69 86 110 -87 354 9 -348 471 169 -332 3 294 -11 76 260 -32 -367 460 259 -176 189
5264A89k6j79n5N77o35j22P21K5p21M18J70l59k79R14n50l51N83Rm56K89K49p31
$$ 189 163 -16 -71 506 -129 -251 470 495 -226 192 362 3 -276 638 88 -263 320 329 -127 162 411 -320
5286c20m1O51m49j04M32J00n28J11M90m27j05P14m41m78N87l0k36l32O35k25m
$$ -320 -361 290 -159 -263 169 269 -259 -148 342 -85 -190 524 83 -395 192 162 -74 -406 229 4 0
5307@R7j8k15R0M24p26J06P34q08J27N16j81p46R17J55m91k38M19n56NN49Qn54
$$ 0 97 79 -136 -46 378 -348 -242 492 -316 -189 327 146 -600 317 472 -19 -257 162 -394 -389 160 168 -386
5330c86L55J11k84K39J73n12j64M84J0m89M43M7l66K70K57l78l23P88l03l63N12
$$ -386 -31 80 -204 35 208 -304 -468 16 26 -463 -20 27 -339 -69 188 -190 -513 275 -28 -391 121
5351A21M33j004M90J81k54k19L24j11j15K97J08n68J03N62m52j84N30q3k32j33
$$ 121 554 -450 40 221 -33 -252 72 -39 -154 143 251 -317 -214 348 -104 -288 242 159 -73 -206
5371b06J62P5l32Q23l16m44N80k0l79K86J48m06M3M98m22j88L58J14l80K99L67
$$ -206 -44 31 -301 522 206 -238 342 322 -57 229 377 -29 14 512 90 -98 260 374 -6 293 660
5392F60m75k63M83k54l43P40j72l11m8N15l80k0K10m35J6q1M49n08L2O43n53Q7
$$ 660 185 -78 405 151 -192 548 376 65 17 532 152 132 342 -93 -77 -158 291 -217 -185 458 -95 -8
5414hJ61j03j91J39K39l19K33K74n64K3N34m99m00N05Q2j14L21L62q11m55P35
$$ -8 153 50 -141 -2 237 -82 151 425 -139 -116 418 -81 -481 24 106 -8 313 675 -136 -591 144
5435A44r9l55L91L4m91K86K93l98k11Q05j06n62L17L65o91j87O95k0p46R55k53
$$ 144 45 -310 81 115 -376 -90 203 -195 -406 399 293 -269 48 413 -278 -465 230 210 -536 419 166
5456A66p16O02K59n87k51P27j51k59J76K7k26J5K91l15pL52j88m76O58K40o91
$$ 166 -550 52 311 -276 -527 200 49 -210 -34 -7 -233 -218 73 -242 -249 103 -85 -561 97 337 -354
5477c54j9O44m56j86M82m9m02K89K38m77j67J024q19K1N77k26n11R03k37q01N43
$$ -354 -373 271 -185 -371 111 62 -340 -51 187 -290 -457 567 -252 -231 346 120 -391 512 275 -526 17
5498A7L69m82o9N01m82l82R45p0p25M45M35o09l25N09K57o00pN59n00K65L06n89
$$ 17 386 -96 -165 336 -146 -528 417 347 -378 67 502 -107 -432 77 334 -266 -273 286 -214 51 357 -232
5520b32P3O49k66m35K86k3J5j19N68n63m6L72j70m60N60L65r09L37K82k62k93
$$ -232 -159 490 224 -211 75 52 67 -52 516 -47 -93 279 109 -351 209 574 -335 2 284 22 -271
5541b71M25j22r7O16J3o47j49N91j96m46O10Q6o81J20L85o36K51M65l60j88N00
$$ -271 154 32 -65 551 564 -83 -232 359 163 -283 327 413 -268 -148 237 -399 -148 317 -43 -231 269
5562B69j88k36l8O16m38j49M56l28m02N11n4l98L99K5m96j03Q84n05k15P02K3
$$ 269 81 -155 -193 423 -15 -164 292 -36 -438 73 19 -379 20 45 -451 -554 330 -175 -390 312 335
5583C35p30k4P56o62j31N50j43j76J49o8Jj52M93l04m27O57Op63Q35L8o82L14
$$ 335 -395 -419 337 -325 -456 94 -49 -225 -76 -144 -143 -295 198 -106 -533 124 130 -633 202 240 -442 -128
5605a28M51m43n5L84k25r0M9K6k93J35N45l03m98Q96m54k60L78K80p81L9P11m58
$$ -128 323 -120 -175 209 -16 -106 -57 -31 -324 -189 356 53 -445 451 -3 -263 115 395 -386 -347 364 -94
5627i4j88N72J59p73J21N58n39J62L62j44l96N62l05k73N90k08l10rK25J21n43
$$ -94 -282 290 449 -324 -203 355 -184 -22 340 196 -200 362 57 -216 374 166 -144 -153 72 193 -350
5648c50L54M23o26K75L76n26k22Q22o35pn1K69o18O17m9Kk27M02k03k97K52L71
$$ -350 4 427 -199 76 452 -74 -296 526 -109 -116 -167 102 -516 101 52 54 -173 229 26 -271 -19 352
5670C52q21M73L08j34k10K97k73k71K89M04o69P2M91k79Q1J45j1n46N11K40l92
$$ 352 -469 4 312 178 -32 265 -8 -279 10 414 -255 -183 308 29 110 255 244 -302 209 449 57
5691E7k19P30o11k17K67k71j6L84J41j36m7K32k69o9P1K81n51J95J98k55P1J01
$$ 57 -162 568 -43 -260 7 -264 -280 104 245 109 62 294 25 -44 27 308 -243 -48 150 -105 -34 67
5713F7J0n65N81j70o40P26K32m74k13N23M7l73M07k09J53m1L33o05oO45m05l00
$$ 67 77 -488 93 -77 -717 9 241 -233 -446 77 124 -249 158 -51 102 61 394 -211 -217 428 23 -277
5735b77L70j46l66K13M69o39J63L20k90J3J75J58m30K79N65q19j11O14n21j21
$$ -277 93 -53 -419 -206 263 -376 -213 107 -183 -170 5 163 -267 12 577 -242 -353 261 -260 -381
5755c81P02k37k42J19M40n25j51L84j74m1L25o0m82K46L91l60k73N00Q5n58L84
$$ -381 321 84 -158 -39 401 -124 -275 109 -65 -106 219 159 -323 -77 314 -46 -319 181 266 -292 92
5776I2J48l02J08q2M3j14M17m72k09L92K13l44j06N77k39k06P8j68k84O34K81
$$ 92 240 -62 46 -36 7 -107 310 -162 -371 21 234 -110 -216 361 122 -84 -6 -174 -458 176 457
5797D57n54N7M03k24n18P57k16l44N45j03o35K94O82o87J04M09k63m72M36L67
$$ 457 -97 -40 363 139 -379 378 162 -182 363 260 -375 -81 601 -86 18 427 164 -308 128 495
5817D95p83m1Q12m71j87L06m5m44O14J24p64n8P53j36m45M53j20m41L51J74j80
$$ 495 -288 -329 483 12 -175 131 86 -358 256 380 -384 -442 311 175 -270 183 63 -378 -27 147 -33
5838c3QJ02m03q4M48J56n06L32K42L6n55M92l35r1K36n9l45N84J40m42L5N16m93
$$ -33 -25 77 -326 -410 38 194 -312 20 262 298 -257 235 -100 -191 45 -14 -359 225 365 -77 -42 474 -19
5861a9l17O07l96j17m9N64l70l11M46o9o27P50K59p76M70K43l25j60L03j06j16
$$ -19 -336 271 -125 -242 -291 273 -97 -408 38 -31 -658 92 351 -425 45 288 -37 -197 106 0 -116
5882a16P7L18n98O2R00r01j10P21r9m42K58j0k19k00O85n83m9Q36j85n55K19K94
$$ -116 -39 279 -319 -257 643 -258 -368 353 254 -188 70 60 -159 -359 326 -257 -306 530 345 -210 9 303
5904C03n80J60L46k81k42N04l3k67J43L56o61kO11k44j91L05J27m14P6L80k01
$$ 303 -277 -117 229 -52 -294 210 177 -90 53 409 -252 -254 357 113 -78 227 354 -60 16 396 195
5925A95j26K69l63R3P37n44n52K92K43j57n27Q97m33k31J62K51m07K5N72l32j58
$$ 195 69 338 -25 68 805 261 -291 1 244 87 -440 457 24 -207 -45 206 -201 -176 396 64 -94
5946i4M08K2l40L22j86l42m1K16l3n9L17j98k22J19K10n56R0N42j55l32N74k62
$$ -94 314 336 -4 318 132 -210 -251 -35 -68 -127 190 -8 -230 -111 99 -457 -367 175 20 -312 262 0
5968@j98J32L32n57K4O00m03LK71n1k83J60m23K49j74O09l92l49N27j16k12M00
$$ 0 -198 -66 266 -291 -267 333 -70 -67 204 153 -130 30 -393 -144 -318 291 -101 -450 77 -39 -251 149
5990A49j30n78K78O03j74m47N1K51K6l4L08l39L8N00n00m66N07L93o55M94l14
$$ 149 19 -559 -281 322 148 -299 -248 3 29 -5 303 -36 2 502 2 -464 43 436 -219 275 -39
6011c9N8j82L23k56J00N6K63o03L32L87l18k3L01k17k05nL62n15J2M21p16K22
$$ -39 19 -163 160 -96 4 60 323 -280 52 439 121 98 399 182 -23 -28 334 -181 -169 252 -464 -242
6033b42M98k59m74M26L14k00Q0K90o50rO45o9o49M63J14m82L75J24k90p6K96J60
$$ -242 256 -3 -477 -51 263 63 143 433 -217 -226 419 350 -299 164 278 -204 171 295 5 -71 225 385
6055C85k90k40L59k72p8M47p6m35N62J08q39L65M39p29N30J61m82N1O19o23j15
$$ 385 95 -145 214 -58 -136 311 235 -200 362 470 -369 -4 435 -294 236 397 -85 -34 585 -38 -153
6076a53J57M26p21j1M24J4k30J99k6j75J72L88m26k72J90J10m18O41l6l24L47
$$ -153 4 430 -291 -302 122 136 -94 105 79 -96 76 464 38 -234 -44 66 -352 289 253 -71 276
6097B76Ql89l2L56l61l83O82J86o12N03l11k32lO22m98QK60mm24K1M37r8l75M40
$$ 276 284 -105 -137 219 -142 -525 157 343 -269 234 -77 -309 -312 310 -188 -180 80 76 -348 -327 110 12 -363 77
6121G7k85j51L40O6k24m7N33l80n18P52l17j38L95M3k15k58M10j19k37L68j51
$$ 77 -208 -359 -19 47 -177 -224 309 -71 -589 163 -154 -292 103 146 -69 -327 83 -36 -273 95 -56
6142e6l07L74J62k91K25J97o64P4O02kl13L59P0m31k27N50l62k57N56l41m5L42
$$ -56 -363 11 173 -118 107 304 -360 -286 316 314 1 360 430 -1 -228 322 -40 -297 259 -82 -127 215
6164B15R0k12K5J57n38j59O68P4n60K35J02k09L30P3j85l19L40J4l12m6N61k28
$$ 215 305 93 118 275 -263 -422 246 320 -240 -5 97 -112 218 291 106 -213 127 141 -171 -217 344 116
6186A16n07P09m07q8K18K15l24J29K89n30OM48l30m3L26j44k49k8N67o98j65P91
$$ 116 -391 318 -89 -177 41 256 -68 61 350 -180 -174 274 -56 -99 227 83 -166 -194 373 -325 -490 301
6208C01m47l28L35L50l53lL21m80RO93m53j26L28j78l91K71K73l80J37N9J72k94
$$ 301 -146 -474 -139 211 -142 -145 176 -304 -295 398 -55 -181 147 -31 -422 -151 122 -258 -121 -62 110 -184
6230a84P0N94p07j93O45l23K08P1m68j59M54L7k11jL13L9n22N64k11k17J49J34
$$ -184 -114 480 -227 -420 225 -98 110 181 -287 -446 8 45 -166 -167 146 185 -337 227 16 -201 -52 82
6252H2m66J29O54j86l94L36j04k3k39L18l95l7M84k55M0L9j38j67M40K35k24l47
$$ 82 -384 -255 399 213 -181 155 51 28 -211 107 -288 -325 159 -96 -56 -17 -155 -322 118 353 129 -218
6274b18M34N7j29l09M59m03j51N01n39K02M05o61K43L41M8k48J07K4k58k39M56
$$ -218 216 273 144 -165 294 -109 -260 241 -298 -96 309 -352 -109 232 280 32 139 163 -95 -334 122
6295A22J70k34K10k56l69L92J74n09L62J75O7p49N27K50l44OM36l45j34K67p0
$$ 122 292 58 268 12 -357 35 209 -300 62 237 304 -445 82 332 -12 -6 430 85 -49 218 148
6316A48j70K50K93q93L27M93m66l31J36P2R4J98J9j35k64O73m08l09L79r1l75
$$ 148 -22 228 521 -372 -45 448 -18 -349 -213 -141 -47 151 170 35 -229 444 36 -273 106 15 -360
6337c60M36K7m00K52J10J56l59J98K64o63P5L02k73P2M30l34K10q3L41p10J91
$$ -360 76 103 -297 -45 65 221 -138 60 324 -339 -264 38 -235 -163 267 -67 143 60 401 -309 -118
6358a18j0o4J54j0j30l11O38R5n80K87J26k82J99M7k09k76O05k01m68M44M79k95
$$ -118 -128 -192 -38 -48 -178 -489 149 244 -336 -49 77 -205 -6 41 -168 -444 161 -40 -508 -64 415 120
6380A20k12M34k49k16J66K90k96q7J58l21j90P37k90j37K34r2Kj48M36k55k80
$$ 120 -92 342 93 -123 43 333 37 -50 108 -213 -403 334 44 -93 141 49 51 -97 339 84 -196
6401a96K12j52k0L67N1k07j79K34l12M3L20k60l13N00M43o95RM27j39j0J04k3
$$ -196 16 -136 -156 211 262 55 -124 110 -202 -159 161 -99 -412 88 531 -164 -155 272 133 123 227 204
6423B04m24L00L75l71k7L06n3m44L25j81r8K54l7k62j4L76j7r5J47j00k93J23
$$ 204 -220 80 455 84 57 363 310 -134 191 10 -88 166 129 -133 -147 229 212 117 264 164 -129 -6
6445fK35l8l30K74q3k20O28k35l88K5K59p4K03k96K02j58L14j41m48L29K37k16
$$ -6 229 191 -139 135 52 -168 460 225 -163 -138 121 47 250 -46 156 -2 312 171 -277 52 289 73
6467G3r4J43m4n2j79L22l38L15K26k66n8J5r5j37J10M3m03L19M45m88n3O7K15
$$ 73 -21 122 78 26 -153 169 -169 146 372 106 48 63 -32 -169 -59 -16 -419 -100 345 -143 -196 -129 86
6490H6m73L00L04m83L00J40n00J39J98l43j0N43L77n47l45M69n0l06L96N5l80
$$ 86 -387 -87 217 -266 34 174 -326 -187 11 -332 -342 201 578 31 -314 155 105 -201 195 250 -130
6511a30J99j20n8O4M50m34j68O95m39l43J72L45n14J14K68l8l31J69J80k96j15
$$ -130 69 -51 -109 -45 405 -29 -197 498 59 -284 -112 233 -281 -167 101 63 -268 -99 81 -215 -330
6532c30O21m02Q7L95l74O3N0k1k86L94L04m99j38L72j18k40M46k69k7K71q2J34
$$ -330 291 -111 -24 371 -3 60 110 89 -197 197 501 2 -136 236 118 -122 324 55 28 299 217 351
6554C51o06M51m40ML75M7l03J81K69k20k51K39K7k29L29J28k46j42N03p77K65
$$ 351 -255 196 -244 -240 135 182 -121 60 329 109 -142 97 124 -105 224 352 106 -36 467 -310 -45
6575d5O66n00m02L12j04l34J71N18n98Q8L33J6m00M91j67j59J56N0j98o6L70k67
$$ -45 621 121 -281 31 -73 -407 -236 282 -316 -228 105 121 -279 212 45 -114 42 92 -106 -172 198 -69
6597f9j31J61J40m35K09L99m50j84L96n5o50N76K29l58j67O92n53P7L94k31K1
$$ -69 -200 -39 101 -334 -125 274 -176 -360 36 -19 -669 -93 136 -222 -389 303 -250 -173 221 -10 11
6618A1J96k99j10j86O88k11j90j9O2l10N76O5m36Q2M3J61k33L31k81j96L38J82
$$ 11 207 -92 -202 -388 300 89 -101 -120 -58 -368 208 273 -163 -81 -38 123 -110 221 -60 -256 82 264
6640B64m70N4L81l91k31M23K41m94J59J51n12N43K38m47K03K06l61j94J63J77
$$ 264 -206 -152 229 -162 -393 30 271 -223 -64 87 -425 118 356 -91 112 318 -43 -237 -74 103
6660A03j64J57J87k07m04L16J43k06L57K8j15l07K53p6l13M95J81l24k92L20j11
$$ 103 -61 96 283 76 -328 -12 131 -75 282 310 195 -112 141 65 -248 247 428 104 -188 132 21
6681B1N8Q3J02m29M44p4o44M26K56j82m07M97L61n84kK86q7m88L66R3q1L43k85
$$ 21 79 162 264 -165 279 205 -439 -13 243 61 -346 151 512 -72 -74 212 125 -363 3 96 15 358 73
6704G3l63N78j56k51j22M89k93j63M20m2m61N78j18l94J45K11l33p0N67j95n24
$$ 73 -290 288 132 -119 -241 248 -45 -208 212 170 -291 287 169 -225 -80 131 -202 -272 295 100 -424
6725d24P69j90j75j05N32l40l22N62m10j15J33J61l17J01L62k66j57L54k74j03
$$ -424 345 155 -20 -125 407 67 -255 307 -103 -218 -85 76 -241 -140 222 -44 -201 153 -121 -224
6745b24K39M21n22j73L51q5n5N0J11m06L3K07pj20K48j26j76L18j91k66L98J56
$$ -224 15 436 -86 -259 92 7 -48 2 113 -293 -260 -53 -60 -180 68 -58 -234 84 -107 -373 25 181
6767A81m26K30J64o8r4K07r4j57mK16l05M6L05j4m25J21J13k85K36L23k41k57
$$ 181 -245 -15 149 81 -13 194 100 -57 -61 155 -150 -104 201 187 -238 -117 -4 -289 -53 270 29 -228
6789b28L14k6O8k34M83n61J82K93l52J97p6O6j43r0J17j26L01l0j10l46N83q3
$$ -228 86 60 128 -106 377 -184 -2 291 -61 136 60 126 -17 -107 10 -116 185 155 45 -301 282 199
6811A99k12LK36k12o2K99k4k86J75P1m99K68M5j4m2L49j54j94M56j75j74m4K76
$$ 199 -13 -10 226 14 -48 251 227 -59 116 187 -312 -44 1 -13 -55 294 140 -54 402 227 53 9 285
6834B85m51r7K03m6k08M43n1k40o3KJ42K11k93J85m5MM54o82L66lj83k61K79K01
$$ 285 -166 -263 -60 -106 -314 129 78 -162 -225 -223 -81 130 -163 22 -23 -19 435 -247 119 116 -67 -328 -49 152
6858A52l57L98L24o91k6M07r8m40K69j15j93O86l40j0j75K78j89k07L77j07n8
$$ 152 -205 193 517 -174 -200 207 109 -331 -62 -177 -370 316 -24 -34 -209 69 -120 -327 50 -57 -115
6879a15J99K6k15j6K18m34L18J35J60j86k64N26m57J16L48m78j90N89n01J93j21
$$ -115 84 110 -105 -121 97 -337 -19 116 276 90 -174 352 -105 11 359 -119 -309 280 -221 -28 -149
6900a49J73k18L2L18j0n34K94q4R6KJ00l76K75K45o5j44K13K0n05M76Q5l2m89
$$ -149 24 -194 -162 156 146 -388 -94 -178 -82 -80 20 -356 -81 164 99 -45 168 188 -317 159 244 212 -277
6923b77N49k25l10M52K3k13J45J30j70j70o8O24p11L11j52K04j98K78m35J21J63
$$ -277 272 47 -263 189 212 -1 144 274 104 -66 -134 490 -221 90 -62 142 -56 222 -213 -92 71
6944G1K68m73r0N51n87K04J62k08M7K16n8k09j07L43k43L39j33p5J24P9l50n4
$$ 71 339 -134 -224 327 -260 -56 106 -102 -55 161 103 -106 -213 130 -113 226 93 18 142 221 -129 -183
6966a83q3K77k52L36K60n94m6N48k19k95L60N9j63Q7J68m42l53M10M74n33J79
$$ -183 -266 11 -241 95 355 -239 -285 263 44 -251 109 168 5 92 260 -182 -535 -125 349 -184 -5
6987eL89k37l56L76j51O5pk09j90m6L71j99J24n9J64l25M05k97k39J52M50k64
$$ -5 384 147 -209 167 16 81 74 -135 -325 -371 0 -199 -75 -134 30 -295 110 -187 -426 -274 176 -88
7009h8k49M64p4j57K76L8m62K92Q4l68L14k19L09l03J35K06l21J44K73l08m17
$$ -88 -337 127 53 -104 172 210 -252 40 124 -244 70 -149 160 -143 -8 198 -123 21 294 -14 -431
7030d31K11K2J89L4n4j55J58L76j03k78j22J70k57K58P8q3oJ46q8l88N28J7m73
$$ -431 -220 -198 -9 25 -29 -184 -26 350 247 -31 -153 17 -240 18 96 13 7 153 65 -323 205 222 -251
7053b51L71j69O6J4k09J12J10K78j28k40K12K54q68K56K61j28k39O29l42j66K40
$$ -251 120 -49 17 31 -178 -66 44 322 194 -46 166 420 -448 -192 69 -59 -298 331 -11 -177 63
7074F3N4l47K31J22j56j73K93j88q7M42J13k34q0K16l46J76R1k67p2j4K26Q8k50
$$ 63 117 -230 1 123 -33 -206 87 -101 -188 254 367 133 53 269 -77 99 190 -77 -149 -163 63 151 -99
7097i9K48M2l23M7J37l28N99l45j67p4K61j36J63J68J02j30J9j56p3j27K79k22
$$ -99 149 191 -132 -85 52 -276 323 -22 -189 -263 -2 -138 25 193 295 165 184 28 -45 -172 107 -115
7119a15j46J96j17j79K16L64l74k87N32j60l3L48k93k69L6L79n0k39J36K5l90
$$ -115 -261 -65 -182 -361 -145 219 -155 -442 90 -70 -103 245 -48 -317 -281 98 48 -191 -55 -30 -420
7140d20J63L55j3k13O2l9p8K52Q8n85J47M72l58k56O28r9r1J73r4q0K27j07j64
$$ -420 -257 98 85 -128 -66 -105 -183 69 157 -428 -281 191 -167 -423 205 106 15 188 94 14 241 134 -30
7163c0RL61n37k1N50m85n8M01K8o42K17O1L44o35M94l71q0L77n4j58n5M81j66
$$ -30 -21 340 -197 -218 332 -153 -211 190 218 -424 -207 -146 198 -437 57 -314 -394 -17 -71 -229 -284 197 31
7186C1k12L53l41o2K35J38j12j32M3j59J29L13J8m97K21J38j85r6J81k58K55m3
$$ 31 -181 172 -169 -231 4 142 30 -102 -59 -218 -89 224 242 -255 -34 104 -81 -177 4 -254 1 -42
7208d2J00r4m0K08jj78L17m52J91P7q3k14K88j44J01j69L25j94O9j99K57M4k44
$$ -42 58 -36 -76 132 131 -47 270 -182 9 86 3 -211 77 -67 34 -135 190 -4 65 -134 123 167 -77
7231g7L35j82m16N42Jj93J1L10k76j95N20o51L00p8Qj59J20J77k82j35O11p3l93
$$ -77 258 76 -340 202 203 10 21 331 55 -140 380 -271 29 -49 -41 -200 -80 97 -185 -320 291 218 -175
7254a75K92k34j48N22j42J19k06K42m81j02L72k29L7R3J60k48k01L99J24k67J73
$$ -175 117 -117 -265 257 115 234 28 270 -211 -313 59 -170 -133 -40 120 -128 -329 70 194 -73 100
7275A00m9m14L87M7k51K61J55l83j14J77J70m31K53K63k01q7K21J2k25R6J50j30
$$ 100 51 -363 24 71 -180 81 236 -147 -261 -84 86 -345 -92 171 -30 -117 104 116 -109 -13 137 7
7297GJ40p7m3K6j07J60j59J46J21l55j40J69J64j80L61j19j64K83J19r37O27Q
$$ 7 147 70 27 53 -54 106 -53 93 214 -141 -281 -112 52 -128 233 114 -50 233 352 -585 42 50
7319E0j62J16rK99o31L42K29k44p5J61k76J67J30L65n00N32l00l13K8M02j42j11
$$ 50 -112 4 -5 294 -337 5 234 -10 -85 76 -200 -33 97 462 -38 494 194 -119 -91 311 169 58
7341E8J37j21J50l53O2J78l61O89o75M4N69l18k54J13J64l38J27M05l54Q3J96
$$ 58 195 74 224 -129 -67 111 -250 439 -236 -192 377 59 -195 -82 82 -256 -129 276 -78 5 201
7362B01M3k16n9m1j06k3K22j4n1P5k4j64Q3L54n80J81L11m47Q6N96m06j73K46
$$ 201 244 28 -31 -72 -178 -201 21 7 -44 31 7 -157 -74 280 -300 -119 192 -255 -169 427 21 -152 94
7385I4J00q6k95K95j44K75k2k98J76k69M59n21L35J39l8m60L82k84K19j82K66
$$ 94 194 108 -187 108 -36 239 217 -81 95 -174 285 -236 99 238 200 -260 122 -162 57 -125 141
7406A41k34J10j73R7l59O65q7k19K76k30k12M7K60k76J91J29j4l75O0M43k36l76
$$ 141 -93 17 -156 -59 -418 247 160 -59 217 -13 -225 -178 82 -194 -3 126 112 -263 -203 240 4 -372
7428c72N62j96k47K6K49K3j61L52k80j35M25r6j34k8J13j55j88M67P2l60k7L90
$$ -372 190 -6 -253 -227 22 45 -116 236 -44 -179 246 150 16 -12 101 -54 -242 225 297 -63 -90 300
7450C00j80l45L20k84N7L48j80k6j2j18J83K67j94j24J0R4j44K48n9k50j98L44
$$ 300 120 -225 95 -189 -132 216 36 10 -2 -120 63 330 136 12 22 116 -28 220 161 -89 -287 57
7472E7J42j17j97L90k29l63J43M64k44O4j61j53N9N12j37k36J88q3l98K61M01
$$ 57 199 82 -115 275 46 -317 -174 290 46 110 -51 -204 -145 367 230 -6 182 99 -299 -38 363
7493C63n29j08M12j1j37K02k40k44L01L25m46P6R1K66p23K16K86l43O6L12l78
$$ 363 -166 -274 138 127 -10 192 -48 -292 9 334 -112 -36 55 321 -402 -186 100 -243 -177 135 -243
7514b43o9M94P0k29R6%j07J19r2%j60N56j87m28K99m7k6l63K97j14l20L50j47
$$ -243 -312 182 252 23 119 119 12 131 39 39 -121 435 248 -180 119 72 46 -317 -20 -134 -454 -104 -251
7537b51R1P9L0k14L2L76j41j52J30K12l94J41K05K7m62J69J3n9K95N8k58K28J16
$$ -251 -160 -81 -51 -265 -233 143 2 -150 -20 192 -202 -61 144 171 -291 -122 -109 -168 127 185 -73 155 271
7560B71k97l25M49J07j57j19N9K21m43L00j71q3L79n9k03L69k84J75k99L09k28
$$ 271 -26 -351 98 205 48 -71 -12 209 -234 66 -105 -188 191 132 -71 298 14 189 -110 199 -29
7581b9L02n7p9r1l7N2k7J22L2j95j57l4L77k54J6J82l32L05k48K50n1j01M7J30
$$ -29 273 216 137 46 9 61 34 156 188 -7 -164 -198 179 -75 -59 123 -209 96 -152 98 47 -54 -7 123
7605A23j79J94j16P1J43m53J75K32l4k73J84%j18K6L66l66p5L42J55o08N2K51
$$ 123 -56 138 22 93 236 -217 -42 190 156 -117 67 67 -51 -25 341 -25 -100 242 397 -211 -159 92
7627I2j41J01J51K0Q3J92l41l86K06K23k38k05L69k76m3M52r0o09N18j45m6jK61
$$ 92 -49 52 203 223 306 498 157 -229 -23 200 -38 -243 126 -150 -193 259 169 -440 78 -67 -113 -114 147
7650A47m12J01J98r9P5O1L89o88m8M54j09k64K60J43k25J00K14l02mJ97j63l69
$$ 147 -265 -164 34 -65 10 71 460 -228 -276 178 69 -195 65 208 -17 83 297 -5 -9 188 25 -344
7672c44J82M54m80j7K54J38m27K70j33j76J76K31K6j81j31K91j95K70k72q8N28
$$ -344 -162 292 -188 -205 49 187 -240 30 -103 -279 -103 128 154 -27 -158 133 -62 208 -64 -152 376
7693C76k84r0M8K10l41r2M08q2l54L61J80m92q5K66J13n75R44k96k05K40j08k26
$$ 376 92 2 50 260 -81 -173 235 153 -201 160 340 -152 -237 29 142 -433 511 215 10 250 142 -84
7715h4m07P28k11k29L45p7m34L64j58r0K49N2R5q9q3J5LJ76J53k64m6m0k00J69
$$ -84 -491 237 26 -203 142 65 -369 -5 -163 -253 -4 48 143 54 -29 -14 -11 165 318 54 8 -32 -232 -63
7739f3K72l59Q3NlK30k80M43l79J21L8J51m48J85J05k84J77j03K82k76L51j48
$$ -63 209 -150 -67 -62 -65 165 -115 328 -51 70 108 259 -189 -4 101 -183 -6 -109 173 -103 248 100
7761A00p7R8J30j16m66M45j01j72M31m90p1K68p6J39j75M09r3k78J06K95k04k73
$$ 100 23 121 251 135 -331 114 13 -159 272 -218 -289 -21 -97 42 -133 276 183 -95 11 306 102 -171
7783a71K97j19Q5m0J45k04O1j74K78k70J03K69k95P1O6k75K15L63m10O7J84j04
$$ -171 126 7 92 52 197 -7 54 -120 158 -112 -9 260 -35 36 102 -173 42 405 -5 62 246 142
7805A42l78L00m6n3N1M42n21k1J08r2J44M7k8O4M2P9n66L99M9pj17J11j31j45
$$ 142 -236 64 18 -35 16 458 -63 -84 24 -68 76 123 95 159 201 280 -286 113 162 155 38 149 18 -127
7829a27J06K96l00l6M3P3j59K29k5n92M55K81n7m2p6K70j28j06P8k94k8N21n34
$$ -127 -21 275 -25 -61 -18 55 -104 125 100 -492 -37 244 187 145 69 339 211 105 183 -111 -139 382 -152
7852a52p1M30j21nk8Q5k31k0O49m83j07j98N48k25j5N9k01K75L6R8m21J96l09
$$ -152 -223 207 86 81 53 138 -93 -113 536 53 -54 -252 296 71 56 115 -86 189 225 323 -98 98 -211
7875b11J5K28N0m00J47J01Jr7K84J06j82L46J37p17J06K00J40n76O87j70j42m2
$$ -211 -196 32 82 -318 -171 -70 -69 -166 118 224 42 388 525 -192 -86 114 254 -322 365 195 53 11
7897A1J11l7j41K48l51L19m58N76m62L30r8K31m17N44k15k88K07n2j50Q2r8K9
$$ 11 122 85 -56 192 -159 160 -298 278 -184 146 48 279 -138 406 191 -97 110 58 -92 -10 -108 -79
7919g9m7N5J56o4j5J3J03j37R7K4j62J13J13j56J65J15l05J70j48r7J38pJ26m17
$$ -79 -126 -71 85 21 6 19 122 -15 82 106 -56 57 170 14 179 294 -11 159 11 -86 52 45 171 -246
7943b46N79l22n6K23m7r4j28K45m92L67N5J31j79l4L72o60L57j02K45m04p1J81
$$ -246 333 11 -45 178 131 37 -91 154 -338 29 84 215 36 2 374 -286 71 -31 214 -190 -261 -80
7965h0OJ01L64k79j44j57k9K79N6k7l2Q8J23m8j99J33K41o61M39k25q2q4M36j53
$$ -80 -74 27 391 112 -32 -189 -218 61 117 90 58 146 269 221 22 155 396 -265 174 -51 -133 -217 219 66
7989F6j24J14K41j93j36J45j01j0K73o4n33M46j55l06P42k43J00k79j4L21j61
$$ 66 -58 56 297 104 -32 113 12 2 275 211 -322 124 -31 -337 405 162 262 -17 -31 290 129
8010A29k19L51l98m5L54j24r0L24k47k03P5J00k79j92P61l92R7K40k02k05J24
$$ 129 -90 261 -137 -182 172 48 -42 282 35 -168 -93 7 -272 -464 297 -95 2 242 40 -165 -41
8031d1k36J31K2K29p8J00j11k3K6O4j17k21K09K33k55K70o18L01j58J17M41n11
$$ -41 -277 -146 -124 105 27 127 16 -7 19 83 -34 -255 -46 187 -68 202 -416 -115 -273 -156 285 -226
8053b26K53J63q0m88M88m0r4l87N06O5l1k25J61q1N9L80m33k57N6L15o9J69l99
$$ -226 27 190 110 -378 110 70 -24 -411 95 160 129 -96 65 -16 43 423 -10 -267 -211 104 35 204 -195
8076a95P8N93n69J09J27k09j66KL62k67RP8m21M10J97n4L00m20K10j41j30L33
$$ -195 -117 476 -93 16 143 -66 -232 -230 132 -135 -126 -48 -469 -59 138 84 384 -36 174 33 -97 236
8098B36j88k33MK92n1J11n0r4N6M0lr0P9J07m22LM59j90N4N7l5j26j8R2K5m76
$$ 236 48 -185 -181 111 60 171 121 27 83 123 120 30 109 216 -206 -203 256 66 120 177 142 16 -2 90 115 -361
8124c61L96Kk23N6M44m83R9M39P3q03N44m07J79J34j60M59n85M98O8m02q7K01
$$ -361 35 37 -186 -130 314 -169 -70 369 442 -361 183 -224 -45 89 -71 388 -197 301 369 -33 -120 81
8146H1j30j51J62l17K93K02l73N9K52J19k30J90j19j98J61L16l08J16k55N27l42
$$ 81 -49 -200 -38 -355 -62 140 -233 -174 78 197 -33 157 38 -160 1 317 9 125 -130 397 55
8167E5R8j84J03J28k02P6q6j02k57J78K39J09p1p04O69J3n15N17K12r6m26L95
$$ 55 153 -31 72 200 -2 74 -12 -114 -371 -193 46 155 84 -620 49 62 -453 64 276 180 -246 149
8189A49j47l0
$$ 149 2 -28
8191b8
$$ Imaginary data points
##PAGE= N=2
##DATA TABLE= (X++(I..I)), XYDATA
0@%%%%%%%qJ6j6J6k4L2l3M1n6O4p2Q8j04J23j46J69j94K24k57K94l35L79m29M83
$$ 0 0 0 0 0 0 0 0 -8 8 -8 8 -16 16 -17 24 -32 32 -40 48 -56 67 -79 90 -104 120 -137 157 -178 201 -228 255
31B55n42O11o84P62q51R46j050J166j295J435j585J755j946K156k390K654k955
$$ 255 -287 324 -360 402 -449 497 -553 613 -682 753 -832 923 -1023 1133 -1257 1397 -1558
48a558L299l696M163m722N403o253P354q840J0968j4291K0255l4217J24194P9191
$$ -1558 1741 -1955 2208 -2514 2889 -3364 3990 -4850 6118 -8173 12082 -22135 102059 181250
62A81250k41731L041J40681L3979j06345j8582M4935K8073l1588k2546Q319J9966
$$ 181250 -60481 -57440 83241 117220 10875 -7707 37228 65301 33713 11167 19486 39452
74C9452k7726j3012M3170J6789o3837j7933M6049P656l1202J3540O544k8158R868
$$ 39452 11726 -1286 41884 58673 -5164 -23097 22952 30608 -594 12946 19490 -8668 1200
87A200L0816k8179k9810K6584J7245j8337J68l337j7460J7487K6081k5591j7927
$$ 1200 32016 3837 -25973 611 17856 -481 -313 -3650 -21110 -3623 22458 -3133 -21060
100b1060L4103M008l6256R320L2589j5500k7270J0046J7683M604j2029k6055J0105
$$ -21060 13043 17051 -19205 -9885 22704 7204 -20066 -10020 7663 12267 238 -25817 -15712
113a5712M2639j3269n4477J8226N0257k7697l2823L5054J1931l8927J1781M1763
$$ -15712 26927 13658 -40819 -22593 27664 -33 -32856 2198 14129 -24798 -13017 28746
125B8746k4443l4935K6641L0707j8100k7720k521K3357K4498k1196l6788K4464
$$ 28746 4303 -30632 -3991 26716 8616 -19104 -21625 1732 26230 5034 -31754 -7290
137g290L6534k9246k5658L9026J4207l9003j22L1513q956j7696J1514J928m443
$$ -7290 29244 -2 -25660 13366 27573 -11430 -11552 19961 11005 -6691 4823 6751 2308
150B308J5697o037k6311J2552K2811j9202j3701K0440m020j7675J6510R642k1762
$$ 2308 18005 11968 -14343 -1791 21020 1818 -11883 8557 4537 -13138 3372 13014 -8748
163h748K93K1903o377r331R996o163q270J4833L514j8251O297J0440j7847M434
$$ -8748 -8455 13448 7071 -2260 7736 1573 -6697 8136 11650 -6601 -304 10136 -7711 -3277
177c277K5924k1100k9577L3036K8249l7785k0366L3056J2153k1041m376Q369M624
$$ -3277 22647 1547 -28030 5006 33255 -4530 -24896 8160 20313 -728 -5104 3265 7889
190G889O543p959j4316J3977J1272k1923l861K5836r945k6412K2581J9828k8280
$$ 7889 14432 6473 -7843 6134 17406 -4517 -8378 17458 7513 -18899 3682 23510 -4770
203d770j0697K9627J638k1049O191Q010o421M063L64j2161J0240J8177k2074j6893
$$ -4770 -15467 14160 15798 -5251 940 8950 2529 6592 6956 -5205 5035 23212 1138 -15755
217a5755K6449P921k4445N41J6378j1211o277J4129n299q805J2132K235j2957
$$ -15755 10694 18615 -5830 -5289 11089 -122 -6399 7730 2431 -6374 5758 7993 -4964
230d964R421Q965j8863M33J9021j1577j6230J9402N762k3821N059J8407j4904
$$ -4964 4457 13422 -5441 -5008 14013 2436 -13794 5608 11370 -12451 -7392 11015 -3889
243c889r618J9819j168k0567Q487J5060q870o543K381j69J0439P468k3790p925
$$ -3889 -13507 6312 5144 -15423 -6936 8124 -746 -7289 -4908 -5077 5362 12830 -10960 -18885
257a8885L4404L585l9088N44L4008p481k3705J0077R303p496L223K942q107O143
$$ -18885 15519 19104 -19984 -19440 14568 7087 -16618 -6541 2762 -4734 -1511 1431 -6676 -533
271e33Q439j4750o44J9223q752j8921J7296J5042k1794o236J9840l530j2845P158
$$ -533 7906 -6844 -7488 11735 2983 -15938 1358 16400 -5394 -11630 8210 4680 -8165 -1007
285a007J277p691Q849L441j6608M937J8445j0110j0966J5334J099j4283J1458
$$ -1007 270 -7421 1428 4869 -11739 -6802 11643 1533 -9433 5901 7000 -7283 4175
298D175Q611k0294r68K2423p641j9499J3103J0082j2445n87P022o052J631Q939
$$ 4175 12786 -7508 -8476 13947 6306 -13193 -90 9992 -2453 -3040 3982 -2070 -439 8500
312H500j0724n688J7826j656j6263J2365J1674k0309k424K5039o846k4179J1069
$$ 8500 -2224 -7912 9914 8258 -8005 4360 16034 -4275 -6699 18340 11494 -12685 -1616
325a616J6834j1406r852M664Q5O666O516j6380o115K2991K845k5102O466K0432
$$ -1616 15218 3812 -6040 -1376 -1291 5375 11891 -4489 -10604 12387 15232 -9870 -3404 17028
339A7028j3196j2674J6244K892j5474N042Q482q206O42M318j0491P86J4526r524
$$ 17028 3832 -8842 7402 10294 -5180 -138 8344 138 780 5098 -5393 -4607 9919 395
353C95j4319J8129R236k0073j317J7474m765r006J1030k113j3199J0301Q274j5294
$$ 395 -13924 4205 13441 -6632 -7949 9525 4760 -4246 6784 4671 -8528 1773 10047 -5247
367e247l446J3597l838o779Q465l946q174J2201L444j7543N081J8105j3851j3516
$$ -5247 -8693 4904 1066 -5713 2752 -1194 -9368 2833 6277 -11266 -6185 11920 -1931 -15447
381a5447J9914P159j8939J69J3222n794m517N618o290k552J0526n099j2007J3526
$$ -15447 4467 11626 -7313 -7144 6078 284 -4233 1385 -4905 -7457 3069 -2030 -14037 -511
395e11P640j9613J804K1771q305j9254J3255J3407j2845m102P177l403M80O354
$$ -511 7129 -12484 -10680 11091 2786 -16468 -3213 10194 -2651 -6753 424 -2979 -2499 3855
409C855r078m119J5419k455j7213J0185J3531j6834p359J9284P54j4164O843O583
$$ 3855 -5223 -9342 6077 3622 -13591 -3406 10125 -6709 -14068 5216 5970 -8194 -1351 5232
423E232q719K759R501r142m530J2221m568q641R523J775j3603N687J3661j1516
$$ 5232 -3487 -728 8773 -369 -4899 7322 2754 -5887 3636 5411 -8192 -2505 11156 -360
437c60p090J3853j903j0783J0608O153j5555R66J6548n258j0926O436L595l760
$$ -360 -7450 6403 4500 -6283 4325 10478 -5077 -4111 12437 7179 -3747 2689 6284 2524
451B524N917l528j2951J0136J3215j7652j0513K0630M481j8546L514J2877p256
$$ 2524 8441 4913 -8038 2098 15313 -2339 -12852 7778 12259 -6287 -2773 10104 2848
464B848m596P640k345m231P317l261q084R550K632j5235M803J6310j3134j4154
$$ 2848 -1748 5892 3547 -684 6633 3372 -4712 4838 7470 -7765 -2962 13348 214 -13940
478a3940J6558P137j6330k049J1140l515j438N899o978l908J3975p7j4358N410
$$ -13940 2618 9755 -6575 -8624 2516 -999 -2437 3462 -3516 -7424 6551 6474 -7884 -2474
492b474R953j0202k833J0449p196q530J3299L928j5592L277J2545p795n846R863
$$ -2474 7479 -2723 -5556 4893 -2303 -10833 2466 6394 -9198 -5921 6624 -1171 -7017 2846
506B846k352p115R376K853j1247L292Q469q021j265J0355p863r672J4285M390
$$ 2846 494 -6621 2755 5608 -5639 -2347 6122 -1899 -3164 7191 -672 -10344 3941 8331
520H331j9465pJ8219l802j1707N784M059k561L958l095p828R901R100j6123n239
$$ 8331 -11134 -11141 7078 3276 -8431 -2647 1412 -1149 2809 -286 -8114 1787 10887 -5236 -10475
535a0475J7429k084j5261Q155J0491j2437l330J2061l747p842N321J317l632O981
$$ -10475 6954 4870 -10391 -2236 8255 -4182 -7512 4549 802 -7040 -1719 -402 -4034 2947
549B947k20j2532P763J3811j1654j0559J4054M639j2695K442O189q831O03R757
$$ 2947 2727 -9805 -2042 11769 115 -10444 3610 8249 -4446 -2004 4185 -4646 -4043 5714
563E714o812p262J1543K447j1248M490P127o885m34R152o606n447J2980l85j3613
$$ 5714 -1098 -8360 3183 5630 -5618 -1128 5999 -886 -1320 7832 1226 -4221 8759 8374 -5239
578e239P238J0490j0792n284J2200k548j1062O659M919o772J066M382n645K960
$$ -5239 1999 12489 1697 -3587 8613 6065 -4997 1662 6581 -191 875 5257 -388 2572
592B572P505j0221n692J5709K557j8500K443J5700q363j0774Q675M034o520K242
$$ 2572 10077 -144 -5836 9873 12430 -6070 -3627 12073 3710 -7064 1611 5645 -875 1367
606A367j94n952O314M331j1366k72J3864m556j2215J0592P004j2128L5J1116n052
$$ 1367 1173 -4779 1535 5866 -5500 -5772 8092 3536 -8679 1913 8917 -3211 -3176 7940 2888
621B888o824P253j259p039O335K370r763K743J0357q146o513J1542J87r086N230
$$ 2888 -3936 3317 2058 -4981 1354 3724 -6039 -3296 7061 -1085 -7598 3944 4131 -4955 275
636B75M961q846J598R419q615o003J2403J358j2727K357Q590n648k352M893n700
$$ 275 5236 -3610 -2012 7407 -1208 -7211 5192 6550 -6177 -3820 4770 -878 -3230 1663 -4037
651d037p60R988m094j1124J1085Q564j3576k575J4925k763j1330O902N203p940
$$ -4037 -4797 5191 1097 -10027 1058 9622 -3954 -6529 8396 5633 -5697 1205 6408 -1532
665a532K7M594m272J427M134p376j950J2930l248j5430Q734J3597j0776r146J0488
$$ -1532 -1505 3089 -1183 244 4378 -2998 -4948 7982 4734 -10696 -1962 11635 859 -8287 2201
680B201L639o273L403J37n976N674N519j0620l214J1159l342q313P304K910q745
$$ 2201 5840 -433 2970 3107 -2869 2805 8324 -2296 -5510 5649 2307 -6006 1298 4208 -4537
695d537L051Q721p534m244J0140j017p832N666L044q619K971Q431q084m431R129
$$ -4537 -1486 7235 -299 -4543 5597 4580 -3252 2414 5458 -3161 -190 8241 157 -4274 4855
710D855p2p993M446J807q219N459Q063j1212n658J4320L276j3329J782Q829k974
$$ 4855 4783 -3210 1236 3043 -5176 283 8346 -2866 -8524 5796 9072 -4257 -2475 6354 3380
725C380k246J853m151N63Q237o485q632J0759N372j3471J88J2897o004r187J0185
$$ 3380 1134 2987 -1164 -601 7636 1151 -7481 3278 8650 -4821 -4633 8264 2260 -6927 3258
740C258M551j0181n39P703k342n62K548n910J80J0784m520j2942P340J0142j0452
$$ 3258 7809 -2372 -2911 4792 2450 1888 4436 -1474 -1294 9490 4970 -7972 -632 9510 -942
755i42n211Q725j084n237O158M34p829N468O233q267k660Q854k485o403P001Q76
$$ -942 -6153 2572 1488 -3749 2409 2843 -4986 482 6715 -1552 -4212 4642 2157 -4246 2755 3631
771C631q781M390P082p932m269Q832j338p448O307K177r086K953R209n601n752
$$ 3631 -5150 -760 6322 -1610 -5879 2953 1615 -5833 474 2651 -6435 -3482 5727 126 -5626
786e626O705J509l031M490l194p615Q458P407j3328n879J5023J249j2694K628
$$ -5626 1079 2588 -443 4047 853 -6762 1696 9103 -4225 -10104 4919 6168 -6526 -3898
800c898Q301n004k633N211k246j854M703k576l544Q055M99j0784M686J0589q812
$$ -3898 4403 -601 -3234 1977 -269 -2123 2580 4 -3540 4515 5014 -5770 -1084 9505 693
815F93q102J0369L205r523J430M760n393J201O152n886l048R139l59r269N510
$$ 693 -7409 2960 6165 -3358 -1928 2832 -2561 -1360 4792 -1094 -4142 4997 4638 -4631 879
830H79O652q239j665P957k882o007O875N67p422M542N481q459k219Q584k564n459
$$ 879 7531 -708 -2373 5584 2702 -3305 3570 4137 -3285 1257 6738 -1721 -3940 4644 2080 -3379
846c379N824J033o349M906L964p870J246R694o527p622R627L105j1525J69J0359
$$ -3379 2445 3478 -2871 2035 5999 -1871 -625 9069 2542 -5080 4547 7652 -3873 -3704 6655
861F655m189o562M483J752k877L058j468m329O722K466j0836N33J3528m514j2169
$$ 6655 2466 -4096 387 2139 -738 2320 852 -3477 3245 5711 -5125 -4592 8936 4422 -7747
876g747Q010Q071q632l729N867j593j594M213m462n652Q044L442r424J775Q264
$$ -7747 263 8334 -298 -4027 1840 247 -1347 2866 -1596 -7248 796 4238 -5186 -3411 4853
891D853n259m903Q866l65q486M277N426n447j493M335n049j212R420l614r724
$$ 4853 -406 -5309 3557 3192 -5294 -1017 4409 -1038 -2531 1804 -3245 -4457 4963 1349 -8375
906h375N845P130p317k233N776l448j375Q052l081r227P263Q040r092l324Q086
$$ -8375 -2530 4600 -2717 -4950 826 -2622 -3997 4055 974 -8253 -990 7050 -2042 -5366 2720
921B720j201o493L589K167n121K943K299n999K314N859n481l261R948q45j1458
$$ 2720 1519 -4974 -1385 782 -4339 -1396 903 -5096 -2782 3077 -2404 -5665 4283 3438 -8020
936h020N606R177p561n777R253J529o123J753M05l101M553K098q802J7J0490l815
$$ -8020 -2414 6763 -798 -6575 2678 4207 -1916 -163 242 -2859 1694 3792 -5010 -4993 5497 1682
952A682q638P251N153o024K83M607n197r01P783l416o304N924K185o455K391N419
$$ 1682 -6956 295 5448 -576 -293 4314 -883 -1784 5999 2583 -3721 2203 4388 -2067 324 5743
968E743p616k274J0117j167r077L381M889n097K024M944p058k256R792K14r557
$$ 5743 -1873 -4147 5970 4803 -4274 -893 3996 -1101 923 5867 -1191 -3447 6345 6559 -2998
983b998K430O107m256o67K276m574k01P318m208p703Q885M402j0442p10J0493
$$ -2998 -568 5539 1283 616 2892 -1682 -1883 5435 1227 -6476 2409 6811 -3631 -4341 6152
998F152k816p695N484K470n649K330L122m983M16M900m932k526P414k143r100
$$ 6152 3336 -4359 1125 3595 -2054 276 3398 -1585 -1169 3731 -1201 -3727 3687 1544 -7556
1013g556N804P081q052l959P833J15l552L311p47n197N477M386q550j423Q992
$$ -7556 -1752 5329 -2723 -6682 1151 1266 -2286 1025 278 -4919 558 4944 -3606 -5029 3963
1028C963l110o905N535K270o735K809N101o353j885O943j877n316N729J897o754
$$ 3963 853 -6052 -517 1753 -4982 -2173 2928 -3425 -5310 1633 -244 -5560 169 2066 -4688
1043d688K725N306n386k290P052j678n034M915o5o282L756N767p983l066J0245
$$ -4688 -1963 3343 -2043 -4333 2719 1041 -3993 922 857 -5425 -1669 4098 -3885 -6951 3294
1058C294q83q743L795O281m569j320L829k991r5M660l981m126Q090K147j0356
$$ 3294 2411 -6332 -2537 3744 -825 -2145 1684 -1307 -1402 3258 -723 -4849 3241 5388 -4968
1073d968Q53R718n194o014O098J887n874K761K626m293K142M625n033k161P687
$$ -4968 -4115 5603 409 -5605 493 2380 -3494 -733 1893 -2400 -258 4367 -666 -2827 4860
1088D860j788p776N550N426p513k283O705j550m287M734l40m895M478K966p259
$$ 4860 3072 -4704 846 6272 -1241 -3524 3181 1631 -2656 2078 1738 -3157 1321 4287 -2972
1103b972o1P856l279n153N623J624n493L060L061n706K60P285n520o302P572K617
$$ -2972 -3033 4823 1544 -3609 2014 3638 -1855 1205 4266 -1440 -1180 6105 585 -5717 1855 4472
1119D472p583M61N813l705j463N443k897l206N205R03n403L166L878p949j52R284
$$ 4472 -3111 -2650 3163 -542 -2005 3438 541 -2665 2540 3443 -1960 1206 5084 -2865 -3017 6267
1135F267k712r185N254N937n728k068L254k119L62L881m642l841Q257K020r040
$$ 6267 3555 -5630 -376 5561 -167 -2235 1019 -1100 -738 3143 -1499 -5340 2917 4937 -4103
1150d103J400Q299l718n327N410j48n020L826K415n874P23N098m034j950O267
$$ -4103 -2703 5596 1878 -3449 1961 1813 -3207 619 3034 -2840 -2117 2981 -1053 -3003 3264
1165C264l106n658O318M622p942k181O837r29k076L323k015m950O425L330r058
$$ 3264 158 -5500 818 5440 -2502 -4683 2154 1225 -851 2472 457 -4493 1932 5262 -3796
1180c796j052Q032k258n345L737J099l717L517J721n764K422O146n132m621O934
$$ -3796 -4848 3184 926 -4419 -682 417 -3300 217 1938 -3826 -1404 4742 -390 -5011 1923
1195A923K052p260K654M904m922j989N503r95m180L406K5l026L846J883p830R74
$$ 1923 3975 -3285 -631 4273 -649 -2638 2865 1870 -2310 1096 1121 -1905 1941 3824 -4006 -3032
1211c032R885l204p714M752N237m539q45L061l625m9N336m246l965N674J534o683
$$ -3032 6853 3649 -4065 687 5924 1385 540 3601 -24 -73 5263 1017 -2948 2726 4260 -2423
1227b423K023N707n132k105O022p44n503M161K478n290J714M555m705j412N967
$$ -2423 -400 5307 175 -1930 4092 3348 -2155 2006 4484 -806 908 5463 758 -654 5313
1242E313k128o030M508M027o312o38M151k635j282N259k726n250O810L108q208
$$ 5313 3185 -2845 1663 5690 -622 -1260 2891 256 -1026 4233 1507 -3743 3067 6175 -2033
1257b033l44P629k686m938L666P62l337K593J068n281K011M865n218l100O649
$$ -2033 -2377 5252 2566 -2372 1294 2056 -1281 1312 2380 -2901 -890 3975 -1243 -4343 2306
1272B306l40p081L526N584n911j865O371j675l245L465j87m203L987K317o947
$$ 2306 1966 -5115 -1589 3995 -1916 -3781 2590 915 -2330 1135 948 -3255 732 3049 -3898
1287c898K13P009l685n688N502K941n691J185L844m325p6M819l012m138O342J417
$$ -3898 -3685 3324 -361 -6049 -547 2394 -3297 -2112 1732 -2593 -2669 2150 -862 -5000 1342 2759
1303B759o549J645N372m407k019N381k260l900M616M42n924K438N616m759k373
$$ 2759 -3790 -2145 3227 -1180 -3199 2182 -78 -3978 638 1080 -4844 -2406 3210 -1549 -3922
1318c922O595j067n170L918K755m857P51L896l495q19M319l836l932P474K047
$$ -3922 2673 1606 -3564 354 3109 -1748 -997 2899 -596 -1415 2904 -932 -4864 2610 4657
1333D657q589L34P944l806m515M182J350l411K545J435m183K308M388n196k455
$$ 4657 -3932 -3598 4346 540 -3975 207 1557 -1854 691 2126 -2057 251 4639 -557 -3012
1348c012O619k70o726L445L454n725J72N836l278l481N705O6m203K630J815m935
$$ -3012 3607 3337 -3389 56 3510 -2215 -2043 3793 515 -2966 2739 2805 -1398 1232 3047 -1888
1364a888J478O248m485m915O139K284n358O64L097m014N06N026m600m079O227
$$ -1888 -410 5838 1353 -3562 2577 4861 -497 167 3264 -750 -244 4782 182 -3897 2330
1379B330J938o395J511M546l612j149M508k838k814N244J40n942K947L876n734
$$ 2330 4268 -2127 -616 3930 318 -831 3677 839 -1975 3269 3409 -2533 414 4290 -1444
1394a444j189O363k257n538M739L327n899r46M047j788K73K602l498k585P553
$$ -1444 -2633 3730 1473 -4065 674 4001 -1898 -2844 1203 -585 -312 2290 -1208 -3793 3760
1409C760R5q491J984P265l754m575M300l59l791L315J183m791J972M541m372k056
$$ 3760 3855 -4636 -2652 4613 859 -3716 584 225 -3566 -251 932 -3859 -1887 2654 -1718 -3774
1425c774N738j349m737M007L205n970j88N795k575l292L886r70l146M287J473
$$ -3774 1964 615 -4122 -115 3090 -2880 -3068 2727 152 -3140 746 -224 -3370 917 2390
1440B390p070J030O381l154m070M344J834l425K010J298m882K123N777m499m186
$$ 2390 -4680 -3650 2731 -423 -4493 -149 1685 -1740 270 1568 -3314 -1191 4586 87 -4099
1455d099N809J120o279K155L685l321p02L928j935l140M299m48m192L826K968
$$ -4099 1710 2830 -3449 -1294 2391 -930 -1632 2296 361 -2779 1520 1072 -3120 706 3674
1470C674n828J92P088k880n853N317K701m981l18L409k733m27L560l437k594O021
$$ 3674 -2154 -1962 5126 2246 -3607 1710 4411 -570 -888 2521 -212 -639 2921 -516 -3110 2911
1486B911P62o501J830N632l668k465M448j047l043L385J196n161K089L953m603
$$ 2911 3673 -2828 -998 4634 966 -1499 2949 1902 -1141 2244 3440 -1721 368 4321 -282
1501b82q71M779k045m781M303K383n284L90M224l081j242M779j864m182M653K046
$$ -282 -1153 3626 1581 -3200 1103 3486 -1798 -1408 2816 -265 -1507 3272 1408 -2774 1879 3925
1517C925n774P31M901l236l428L701K59k997K728O49m193J978M642n582l010O858
$$ 3925 -1849 -1118 3783 547 -2881 820 1079 -1918 810 1459 -2734 -756 3886 -1696 -4706 2152
1533B152M42n790K056L945m009p47L948k072k234L503p84l913K824K277n333N06
$$ 2152 2594 -3196 -1140 2805 -1204 -1951 1997 -75 -2309 1194 410 -3503 -679 1598 -3735 -3229
1549c229N593l065m124N470J474n056J837K868l550M9L608k918k177N080m32n689
$$ -3229 2364 -701 -4825 645 2119 -2937 -1100 1768 -1782 -1733 1875 -1043 -3220 1860 1428 -4261
1565d261L062M358m513k114M775j518l079L678L90m443K510M307m376j618N508
$$ -4261 -1199 3159 -1354 -3468 1307 -211 -3290 388 778 -3665 -1155 3152 -1224 -2842 2666
1580B666j719l689L763P39m541J699L958m260j763M727j190l251M030J285n977
$$ 2666 947 -2742 1021 1760 -2781 -1082 2876 -1384 -3147 1580 390 -2861 1169 2454 -3523
1595c523J863O000m162l756M498J685k955J587O56l688K877L525n938j733O464
$$ -3523 -1660 4340 178 -3578 920 2605 -350 1237 1893 -1795 1082 4607 -1331 -3064 3400
1610C400k14o097K594L207l444M95L024k748j492M278k85l914K662J951m438P18
$$ 3400 3186 -2911 -317 2890 -554 -59 2965 217 -1275 3003 2718 -1196 1466 3417 -1021 -303
1626c03N012m172l351N160J280m963P98K421k798P03K875l578j929O221k41n874
$$ -303 4709 537 -2814 2346 3626 -1337 -539 1882 -916 -213 2662 -916 -2845 3376 3135 -2739
1642b739J846M570l461j091L183k576j815M143j71n201K472L915m380j576M298
$$ -2739 -893 3677 216 -875 2308 -268 -2083 2060 1889 -3312 -840 3075 -1305 -2881 1417
1657A417j550l174L768Q66m211J364L420l075n91L251k622j911M992K9o572K002
$$ 1417 -133 -3307 461 1327 -2884 -1520 1900 -1175 -1766 1485 -1137 -3048 1944 1973 -4599 -2597
1673b597N646l474l516L773J19k193K353J09l377L234K981m832j579N871o38m912
$$ -2597 3049 -425 -3941 -168 -49 -2242 111 220 -3157 77 3058 -1774 -3353 2518 1880 -3032
1689c032L216J754l932M21M012l130j880L550k66l192L135P82m447J439M370l124
$$ -3032 184 1938 -1994 -1573 2439 -691 -2571 979 713 -2479 656 1438 -3009 -1570 2800 -324
1705c24l115M705N37l602J964J595l365J075L235l886k285N376M16n406J852L373
$$ -324 -3439 1266 1803 -1799 165 1760 -1605 -530 2705 -1181 -3466 1910 2326 -3080 -1228 2145
1721B145k923l80K689j908j050L841j518l953L860K819m781n04M916j890l854
$$ 2145 -778 -1158 1531 -377 -1427 2414 896 -3057 803 3622 -1159 -1663 3253 1363 -2491
1736b491L427J445l940J077K222k611K29K678k805j441N020J7n410K339M608m209
$$ -2491 936 2381 -1559 -482 1740 -871 -642 2036 -769 -2210 2810 2827 -2583 -244 4364 155
1752A55k726M398J84k787K257K99l613K747K431m612o5M733j672m260L362K209
$$ 155 -2571 1827 2011 -776 1481 1780 -1833 914 3345 -1267 -1332 3401 1729 -2531 831 3040
1768C040l662O93K909k899o28M129j880l733L414J514m183L88L623l593j411M154
$$ 3040 -622 71 2980 81 -547 3582 1702 -2031 1383 2897 -1286 -898 2725 -868 -2279 1875
1784A875m98l817K311J194k656J509K921m466j885N960o85n035K089L498k821
$$ 1875 1377 -2440 -129 1065 -1591 -82 2839 -1627 -3512 2448 1763 -3272 -1183 2315 -506
1799e06j183K212k055n93L492j886l562M167K015n425K04N093j814k786L287N27
$$ -506 -1689 523 -1532 -2125 1367 -519 -4081 86 2101 -3324 -3120 1973 159 -2627 660 1187
1815A187l314J626J900l420O20K654k278j439L763q40m364K925M070m364j870
$$ 1187 -2127 -501 1399 -2021 -1401 1253 -1025 -2464 1299 459 -3905 -980 3090 -1274 -3144
1830c144L680l90j979K658l89k960K814K684m324j255N141j220l267K447O38l200
$$ -3144 536 146 -1833 825 436 -2524 290 2974 -1350 -2605 2536 1316 -1951 496 1134 -2066
1846b066K068K251l915j43M279j216l201L067J367l661J327K734l073j593L991
$$ -2066 2 2253 -1662 -1805 2474 1258 -1943 1124 2491 -1170 157 2891 -182 -1775 2216
1861B216j40k836J344Q85k769J683K331m497m52N319r38n364K471L187k481m14
$$ 2216 2076 -760 584 1469 -1300 383 2714 -1783 -2235 3084 2146 -3218 -747 2440 -41 -455
1877d55K251j643o99L021j899l024L493J895l861q5L581k879j952L960M55l505
$$ -455 1796 153 -546 2475 576 -2448 1045 2940 -921 -1006 2575 -304 -2256 1704 2159 -1346
1893a346J146K028k263o3K469k410n96M237j150m646K970L048l251j458K926j151
$$ -1346 -200 1828 -435 -498 1971 -439 -1035 3202 2052 -2594 376 3424 173 -1285 1641 490
1909D90j458K626j045l317K971K899m334q10M422j455k476K235N01k789J988J868
$$ 490 -968 1658 613 -2704 267 3166 -1168 -1978 2444 989 -1487 748 1249 -1540 448 2316
1925B316l415j18L392k073k249L524k19m460J978L792l327k201L549n7k103K367
$$ 2316 -1099 -1217 2175 102 -2147 1377 1158 -3302 -1324 2468 -859 -3060 489 432 -1671 696
1941F96Lk417K141J875l969p18M465j361l603K675J791l195l25K940j918o74L364
$$ 696 699 -1718 423 2298 -1671 -2389 2076 715 -2888 -213 1578 -1617 -1942 998 -920 -1594 1770
1958A770j481l172L045J403l635J313L703l249j807L449l61k449J403J563k825
$$ 1770 289 -2883 162 1565 -2070 -757 2946 -303 -2110 1339 978 -1471 -68 1495 -1330
1973a330Q76K274l139j001L877J13l819K396K280l049l49L063j896j111K678p46
$$ -1330 -454 1820 -1319 -2320 1557 1670 -2149 247 2527 -522 -871 2192 296 -815 1863 1117
1989A117k649L017J676m702J55M334j287l490K707M20k558J911J173k722Q73L206
$$ 1117 -1532 1485 3161 -1541 -1386 2948 1661 -1829 878 1298 -1260 651 1824 -898 -25 3181
2005C181k364k295L800N33m304J624L038l415r66K833n33j990J921L28k564J873
$$ 3181 817 -1478 2322 2855 -1449 175 3213 -202 -1168 1665 1132 -858 1063 1391 -1173 700
2021G00J728l734L05L892j519l344K678K063l387N00J994k026l76K714k069k397
$$ 700 2428 -1306 -1001 2891 1372 -1972 706 2769 -618 -118 1876 -150 -526 2188 119 -2278
2037b278L260Q77l979P10L483k426j561L207r56k169K466J174l341O76K650k642
$$ -2278 982 1859 -2120 -1410 2073 -353 -1914 1293 337 -1832 634 1808 -1533 -857 1793 -849
2053h49j036L489r63l639K338K819l165r08K141j011m79K275j578k608L745J494
$$ -849 -1885 1604 641 -2998 -660 2159 -1006 -1914 227 -784 -1263 1012 -566 -3174 571 2065
2069B065l783n07M293j442k322J813L14k099J761R26l307Q53K591j952j299K935
$$ 2065 -1718 -2225 2068 626 -1696 117 431 -1668 93 1019 -2288 -1435 1156 -796 -2095 840
2085H40l14l311K714K250l534o38L284o58k012J989o5k437K725Q66l440j28L785
$$ 840 526 -2785 -71 2179 -1355 -1993 1291 633 -1379 610 545 -1892 833 1699 -1741 -1869 1916
2102A916k050k561K994J186k885J098J398k247K23L052j732k818L445Q66k545
$$ 1916 -134 -2695 299 1485 -1400 -302 1096 -1151 -928 2124 392 -2426 1019 1885 -660
2117f60M14J795k409k39L650j499k675K062R57k168J388J670l648J67M211q81
$$ -660 -246 1549 -860 -1099 2551 1052 -1623 439 1396 -772 616 2286 -1362 -1195 3016 2135
2133B135l797J962K083j649l59J404j705n30K934j581k752L086J135l395L45L522
$$ 2135 -1662 300 2383 734 375 1779 74 -456 2478 897 -1855 1231 2366 -1029 -684 2838
2149B838k445k170L082J07k335J825O62k616P19K449k173j242K858j21l611K190
$$ 2838 393 -1777 1305 1412 -923 902 1564 -1052 -333 2116 -57 -1299 1559 1438 -2173 17
2165A7J976l162n12K734j075j372K028m66k183K472J135l260j47L540j580k000
$$ 17 1993 -1169 -1681 1053 -22 -1394 634 168 -2015 457 1592 -1668 -1815 1725 145 -1855
2181a855J841M95k366J255J489k788N76K650k030k118L355J77l384J647K278k215
$$ -1855 -14 481 -1885 -630 859 -1929 -1353 1297 -733 -2851 504 681 -2703 -1056 1222 -993
2197i93j017K658j160j387K516r8k676J878J638k818p18L502j006l087K342K080
$$ -993 -2010 648 -512 -1899 617 519 -2157 -279 1359 -1459 -2177 1325 319 -2768 -426 1654
2213A654k742l95K259j027p26K058j588j387L236L68l647N36L374j980j592K371
$$ 1654 -1088 -1483 776 -251 -977 1081 -507 -1894 1342 1710 -1937 -1401 1973 -7 -1599 772
2229G72m27k020J606Q51k531R74K379k360q71K920n73k547K253J460l047J51K645
$$ 772 345 -1675 -69 782 -1749 -775 1604 -756 -1627 1293 720 -1827 426 1886 -1161 -1010 1635
2246A635j224j534J973p11j763K352J194l368p0L357j583k296K602K98j530J174
$$ 1635 411 -1123 850 139 -1624 728 1922 -1446 -1516 1841 258 -2038 564 862 -668 506
2262E06L36k096J133K574k714j530L591L34l900Q30K110j981QK336j584j647K498
$$ 506 842 -1254 -121 2453 -261 -1791 1800 2134 -1766 -936 1174 -807 -799 1537 -47 -1694 804
2279H04r5j970J659J373k754K52L178j437k989K672J786k762j6J379j416k51K378
$$ 804 709 -1261 398 1771 -983 -731 2447 1010 -1979 693 2479 -283 -299 1080 -336 -587 1791
2296A791k010j292K832M28l331Q75K742j707j621K214k34j843J930R2k462P92
$$ 1791 -219 -1511 1321 1749 -1582 -707 2035 328 -1293 921 687 -1156 774 866 -1596 -804
2312h04K153k139p47K427p88k397K406R54k577j83K296j348o90K263j229j665
$$ -804 1349 -790 -1537 890 102 -2295 111 1065 -1512 -1695 601 -747 -1437 826 -403 -2068
2328b068K851M61l416K05L828j723k449J770M39j437R70O20k195J242K243k614
$$ -2068 783 1244 -2172 -1967 1861 138 -2311 -541 -102 -1539 -569 51 -2144 -902 1341 -1273
2344a273j359L132K59k619J211J805k439k24K222m79k077K462R3k383J926N41
$$ -1273 -2632 500 759 -1860 -649 1156 -1283 -1507 715 236 -1841 621 714 -1669 257 798
2360G98k579M20K979j213k591K700Q68k300Q45J353j566L52K139j932j915L204
$$ 798 -1781 -1361 1618 405 -2186 514 1382 -918 -73 1280 -286 66 2205 273 -1642 1562
2376A562N05l208Q60K314j867j029K590j304j189K115L1k151J010J591k061l43
$$ 1562 2067 -1141 -281 2033 166 -863 1727 423 -766 1349 1380 -771 239 1830 -231 -574
2392e74K811j132k432K396Q07k312K40J865j692n52J894j185j678L012N08l791
$$ -574 2237 1105 -1327 1069 1876 -436 -196 1669 -23 -575 1319 134 -1544 1468 1976 -1815
2408a815J018K810j483j600K375k49k042J512M62k295J148J781k446q72L105m84
$$ -1815 -797 2013 530 -1070 1305 1056 -986 526 988 -1307 -159 1622 -824 -1696 1409 925
2424I25k953J703J523k180j38K195j314q67J604r1j864J659J202k660P0K752j898
$$ 925 -2028 -325 1198 -982 -1120 1075 -239 -1106 498 407 -1457 202 1404 -1256 -1186 1566 -332
2441c32j853K576J67k348J309J030j948L16K031j904j087K593L49k985J380J810
$$ -332 -2185 391 558 -1790 -481 549 -1399 -1083 948 -956 -2043 550 899 -2086 -706 1104
2457A104k135k41J645n04j216J832m78k529K102J926k911o37K838q95k226K124
$$ 1104 -1031 -1272 373 -131 -1347 485 7 -2522 -420 1506 -1405 -2042 796 -99 -2325 -201
2473b01O77k036M13K480j918o69J911j364j064K591J29l453J179L214k458j270
$$ -201 476 -1560 -1147 1333 -585 -1254 657 -707 -1771 820 949 -2504 -1325 1889 -569 -1839
2489a839J675O89j646J026N08j943J494J549k207p55L173n60k499J567P40k125
$$ -1839 -164 525 -1121 -95 413 -1530 -36 1513 -694 -1449 1724 1164 -1335 232 972 -1153
2505a153M57K311j575j678K865k55k153J551R84k412P34K656k172j707K429P09
$$ -1153 -696 1615 40 -1638 1227 972 -1181 370 1354 -1058 -324 2332 160 -1547 882 1591
2521A591j662O32M14j557R38K080l078j225L646R0l330R71K257j536q69J594j013
$$ 1591 -71 561 975 -582 356 2436 -642 -1867 1779 1869 -1461 -490 1767 231 -638 956 -57
2538e7m01K078l72k634J543K155k916Q1K223j407j837K070R44k551P40J306j433
$$ -57 -458 1620 1248 -1386 157 2312 -604 -523 1700 293 -1544 526 1470 -1081 -341 965 -468
2555d68P4J509j563j170K801p0k605M71K589j674j368J905m56j357J392Q39k563
$$ -468 -394 1115 -448 -1618 1183 1113 -1492 -1021 1568 -106 -1474 431 -25 -1382 10 849 -1714
2572a714R44K006k514q36K494l53j945J962M42k391O33K380j787r93K185n41j727
$$ -1714 -770 1236 -1278 -2114 380 27 -1918 44 486 -1905 -1272 1108 -679 -1672 513 -28 -1755
2589a755J816O41k481J59K875j795j390J714M9j069P80M98j766J379J748k325
$$ -1755 61 702 -1779 -1620 1255 -540 -1930 -216 -167 -1236 -456 42 -1724 -345 1403 -922
2605i22q08K993m25k559J189J668j720n19K032j147r49J806k44j983J641J125
$$ -922 -1730 1263 838 -1721 -532 1136 -584 -1103 929 -218 -1167 639 395 -1588 53 1178
2621A178k463J43K771j390j743K152O81k029P42J174j611MJ684j630j098K677
$$ 1178 -1285 -1142 1629 239 -1504 648 1329 -700 42 1216 -395 -391 1293 -337 -1435 1242
2637A242k36k442J305J905j535j174K073r25j085K036J27k093J134J440k052o73
$$ 1242 1006 -1436 -131 1774 239 -935 1138 213 -872 1164 1291 -802 332 1772 -280 -953
2653i53K856q48j929J689M43j618O35J240j979k33K292j040k078K230J000k612
$$ -953 1903 1055 -874 815 1258 -360 275 1515 -464 -697 1595 555 -1523 707 1707 -905
2669i05N24K269j887p73J888l80j731J116M89j599Q08J636k415k80K652o16k580
$$ -905 -381 1888 1 -772 1116 736 -995 121 610 -989 -181 1455 -960 -1240 1412 796 -1784
2686a784J283J817j989O0J538r07j030J975o65j970J681J177k272J47K134j715
$$ -1784 -501 1316 -673 -613 925 18 -1012 963 298 -1672 9 1186 -1086 -939 1195 -520
2702e20j315K349L61k515J232J504k007m4J773j514j012K376j06k636J562J490
$$ -520 -1835 514 875 -1640 -408 1096 -911 -955 818 -696 -1708 668 562 -2074 -512 978
2718I78j943l73J820j017l98J350o72j816J877J499k680m11K575p33j816J836
$$ 978 -965 -1338 482 -535 -933 417 -255 -2071 -194 1305 -1375 -1786 789 56 -1760 76
2734G6K11j446J424R50k319k5K091o58j656K121k4k603J237K298j954j300K330
$$ 76 287 -1159 265 1215 -1104 -1129 962 304 -1352 769 745 -1858 -621 1677 -277 -1577 753
2751G53k61j178N94M91j292J310J201k284l31K523m75k185J353Q90j651K33J315
$$ 753 492 -686 -92 399 -893 417 1618 -666 -997 1526 1051 -1134 219 1109 -542 -309 1006
2768A006j405m76K587p73j975J750Q41k307Q16J888j821j268K452L02k310J067
$$ 1006 -399 -875 1712 939 -1036 714 1555 -752 64 1952 131 -1137 1315 1617 -693 374
2784C74J168j770K51J462j380j107K310M0k871J526J749j791l83J161m50q85K346
$$ 374 1542 -228 23 1485 105 -1002 1308 1348 -1523 3 1752 -39 -422 739 289 -596 1750
2801A750j092j948J766J541k645m79K569r85j585J608J80j815R43J755k007k77
$$ 1750 658 -1290 476 2017 -628 -1107 1462 477 -1108 500 680 -1135 -192 1563 -444 -721
2817g21J609j071j038K058J09k621J501J721j609j220J452k97q46J084o2j792
$$ -721 888 -183 -1221 837 946 -1675 -174 1547 -62 -1282 170 -127 -973 111 49 -1743
2833a743J439J382k096l13K308q06k154J889R12k095O74J406j567n91K333j039
$$ -1743 -304 1078 -1018 -1331 977 171 -1983 -94 818 -1277 -603 803 -764 -1355 978 -61
2849f1j841K221N23k319O40J792j808o07J827K83j803J110O21j627J032J373j844
$$ -61 -1902 319 842 -1477 -837 955 -853 -1460 367 650 -1153 -43 578 -1049 -17 1356 -488
2866d88p38K129k15k389J436J238j746j8J509p36q11J302m02j452J470J434k675
$$ -488 -1226 903 688 -1701 -265 973 -773 -791 718 -18 -829 473 71 -1381 89 1523 -1152
2883a152J41K435q92j640J553N35j963J071R57j872M31J761j498j062K129J06
$$ -1152 -1011 1424 532 -1108 445 980 -983 88 1045 -827 -396 1365 -133 -1195 934 1040
2899A040k339J505J754j946n71J807k89j706J545p3j505J470J011k243j32K301
$$ 1040 -1299 206 1960 14 -557 1250 961 -745 800 727 -778 692 1703 -540 -672 1629
2915A629j225j421J225J022j690N47Q89j088l77K027j057j822K339O70k191N45
$$ 1629 404 -1017 208 1230 -460 87 976 -112 -489 1538 481 -1341 998 1668 -523 22
2931B2J349j249r90J949n59j968J704P68j845O66J515k255K19K232q97k013J336
$$ 22 1371 122 -868 1081 522 -1446 258 1026 -819 -153 1362 -893 -674 1558 661 -1352 -16
2948a6J404j549m92J106j008k82K033j389j804K015J146k459j2K074j150j036
$$ -16 1388 -161 -653 453 -555 -837 1196 -193 -1997 18 1164 -1295 -1307 767 -383 -1419
2964a419J799j23j589J441R49k012M09J035q11j021J837k18k087J232J679j892
$$ -1419 380 257 -1332 109 1058 -954 -545 490 -321 -1342 495 277 -1810 -578 1101 -791
2980g91n91J875m51j197J367k15j491J449R08k244Q5K344o41j784J474O02k033
$$ -791 -1382 493 42 -1155 212 -3 -1494 -45 863 -1381 -1296 1048 407 -1377 97 699 -1334
2997a334J182P04j915J66K230j290j513K045O21k013O08J543j709k74J943l86
$$ -1334 -152 552 -1363 -1197 1033 -257 -1770 275 896 -1117 -509 1034 -675 -949 994 608
3013F08j501J378R3j491J237Q69j861p8K186o56k058J519P65j298k15J728j019
$$ 608 -893 485 578 -913 324 1193 -668 -746 1440 784 -1274 245 1010 -288 -503 1225 206
3030B06n35J419q59j462J812J054k507O48J668j332r10J846k82j444J192R79k028
$$ 206 -329 1090 231 -1231 581 1635 -872 -224 1444 112 -798 1048 766 -678 514 1493 -535
3047e35N45J241j460j87J525k11j910J307J564k192L48J237j121p25J731p79j519
$$ -535 10 1251 -209 -396 1129 918 -992 315 1879 -313 35 1272 151 -574 1157 378 -1141
3064a141J801P16k210q1K120j128j015J286M79j816J444M62j474M46J353j472
$$ -1141 660 1376 -834 -915 1205 77 -938 348 827 -989 455 917 -557 -111 1242 -230
3080b30q04J708j32j806R51J532j689q32J945n90j387J393L70j682J021R00j624
$$ -230 -1034 674 542 -1264 -313 1219 -470 -1302 643 53 -1334 59 429 -1253 -232 668 -956
3097i56j95K204r32j552J476M20j506M63J271j601j26J823j226j407K134J05j904
$$ -956 -1151 1053 121 -1431 45 465 -1041 -578 693 -908 -1034 789 -437 -1844 290 395 -1509
3114a509M75J787j051l94J036k22j408J525M35j895Q57J760j866q52K083n60j590
$$ -1509 -1034 753 -298 -692 344 122 -1286 239 674 -1221 -364 1396 -470 -1322 761 201 -1389
3131a389J582Q85j702L1J764j198p87J391l70j129J730M81k280M91K367j386j604
$$ -1389 193 1078 -624 -593 1171 -27 -814 577 207 -922 808 1289 -991 -500 1867 481 -1123
3148a123J345O04j169P00O30j704L54J969j515r62J639K91j627Q76J212j878K99
$$ -1123 222 826 -343 357 987 -717 -363 1606 91 -871 768 1059 -568 308 1520 -358 -59
3165e9J424j197q06J403j3j556R66J041j707L64J696j048j476J584L66j356N69
$$ -59 1365 168 -638 765 752 -804 162 1203 -504 -140 1556 508 -968 616 982 -374 195
3182A95Q06j350K0J725j274j333K207L40k104K32J652j507k31J494n45j018J078
$$ 195 1001 -349 -329 1396 122 -1211 996 1336 -768 -536 1116 -391 -622 872 327 -691 387
3199C87Q06k128O11J276j814L57J256m89j667J166J395k034J96J272r54l41J218
$$ 387 1193 -935 -324 952 -862 -505 751 262 -1405 -239 1156 -878 -682 590 -364 -705 513
3216E13q08r27J454N54k117L85K079j345j197J802k52j523J351P33k109N83J546
$$ 513 -295 -1222 232 786 -1331 -946 1133 -212 -1409 393 141 -1382 -31 702 -1407 -824 722
3233G22j270p40J628k31j734J230J273j744j56J600q28j117J668l88j258J476
$$ 722 -548 -1288 340 109 -1625 -395 878 -866 -1022 578 -250 -1367 301 -87 -1345 131
3249A31O70k030L58J706o19j592J557L00j474P15P44j118Q1J420j070j128J857
$$ 131 801 -1229 -871 835 216 -1376 181 481 -993 -278 466 -652 -571 849 -221 -1349 508
3266E08L41j784K83J560j058m87J650j006r36J354M86j728J038Q30j353n18K010
$$ 508 849 -935 -652 908 -150 -637 1013 7 -929 425 911 -817 221 1051 -302 -820 1190
3283A190p93j466J324R24j726M90J084j024j54J451q70j225J599L25j811N28J656
$$ 1190 397 -1069 255 1179 -547 -57 1027 3 -151 1300 430 -795 804 1129 -682 -154 1502
3300A502j661o29J587k96j000O98P21j696P14J434j332o62J784k94j525J302O53
$$ 1502 -159 -788 799 503 -497 201 922 -774 -60 1374 42 -620 1164 870 -655 647 1300
3317A300j660J59J167j122m60J128l33j319J409O04j351j0J439p13j545J751p0
$$ 1300 -360 -201 966 -156 -616 512 179 -1140 269 873 -478 -488 951 238 -1307 444 374
3334C74j231J001N92j446J23J504j367m91J869m08j878R08J415j369o39J748j077
$$ 374 -857 144 736 -710 -587 917 -450 -941 928 520 -1358 -450 965 -404 -1043 705 -372
3351c72p41J581k32j446J121Q99j523k40J813r60j299J433O14j792O93J071j276
$$ -372 -1113 468 236 -1210 -89 810 -713 -953 860 -100 -1399 34 648 -1144 -451 620 -656
3368f56l91J432p67o37J230J19j750O98J878j123r53J109r5r82J289J24j693Q66
$$ -656 -1047 385 -382 -1019 211 330 -1420 -722 1156 33 -920 189 94 -888 401 525 -1168 -302
3386c02J156j398m34J516l39j231J177L93j134J58J591j518l7J019j36j277J125
$$ -302 854 -544 -978 538 199 -1032 145 538 -596 -438 1153 -365 -402 617 481 -796 329
3403C29P67j794J84J668j143q97J169L97j121P39K51j214Q29J039j484n77J976
$$ 329 1096 -698 -514 1154 11 -886 283 680 -441 298 549 -665 164 1203 -281 -858 1118
3420A118p2j971R65R07j164n3J469j176n85J503k05j153P69P90j443K74J313j220
$$ 1118 1046 -925 40 947 -217 -270 1199 23 -562 941 736 -417 352 1142 -301 -27 1286 66
3438F6j159J700N31j384K63R72j326K87R61r41q93J745J84k012P49J512j352n45
$$ 66 -1093 607 1138 -246 17 989 -337 -50 911 -30 -923 822 1006 -1006 -257 1255 -97 -642
3456f42J260m34p11J311l77j464J219Q41j080n35J490p12j374J526L41j361J88
$$ -642 618 184 -527 784 407 -1057 162 1003 -77 -612 878 166 -1208 318 659 -702 -514
3473e14J287j076j85J272r92p13J406K41j588K70J686j215j276J561M8j355Q78
$$ -514 773 -303 -488 784 -208 -921 485 726 -862 -592 1094 -121 -1397 164 212 -1143 -265
3490b65O05j496N35J248j052p45J484J55j357N09J096j235k15J183l53r43J122
$$ -265 340 -1156 -621 627 -425 -1170 314 469 -888 -379 717 -518 -733 450 97 -846 276
3507B76k41j045J124K98j250J26J602j090r08J168l1p94O50O15j247K47J463j257
$$ 276 35 -1010 114 412 -838 -712 890 -200 -1108 60 29 -765 -115 500 -747 -500 963 -294
3525b94o26J681l85j319R30Q08j247k22J240n21m88R04l01q92R92P84j300p04
$$ -294 -920 761 376 -943 -13 795 -452 -674 566 45 -443 461 160 -732 260 1044 -256 -960
3543i60K082p38j403J632K33r67kQ99j003J59J012p68m94J170J17j668P01J066
$$ -960 1122 384 -1019 613 846 -121 -123 776 -227 -68 944 176 -318 852 969 -699 2 1068
3561A068j211l32J600l46j059R73J62j484N76J077j409j40J563k30j634Q05Q64
$$ 1068 -143 -475 1125 779 -280 693 855 -629 -53 1024 -385 -525 1038 808 -826 -21 843
3578H43j132O0J138j475j16J360o4j459J011P34j610m4J595r47o03J422n29q51
$$ 843 -289 -229 909 -566 -682 678 614 -845 166 900 -710 -754 841 -106 -709 713 184 -667
3596f67N85N01q12j78J161j104o67J644K60k005R79J243j469j47J003l52p17J004
$$ -667 -82 419 -393 -571 590 -514 -1181 463 723 -1282 -303 940 -529 -676 327 -25 -742 262
3614B62j71r69N01J064j285k40J467r38o89J453n59r45P34Q21r62j06J048q33
$$ 262 91 -878 -377 687 -598 -838 629 -309 -998 455 -104 -1049 -315 506 -456 -562 486 -347
3632c47m62J123l02j033M81J449j403p47J545m18m07O89j78q25P78P52j362n27
$$ -347 -809 314 12 -1021 -540 909 -494 -1241 304 -114 -521 168 -10 -835 -57 695 -667 -1194
3650a194J829l11j458J050M26r76K93J150j056m70J286l99p29Q72Q6q32K54J104
$$ -1194 635 324 -1134 -84 342 -634 -341 809 -247 -717 569 170 -559 313 399 -433 -179 925
3668I25r58l49J004o8r36N60N68j137M95R15j140q65K063k94j739N98J252q88
$$ 925 -33 -382 622 554 -382 178 746 -391 104 1019 -121 -986 1077 783 -956 -358 894 6
3686Fk30J161j284m09J751p12q40J070L73j052K76M97n08q91J237K56j311N12
$$ 6 -224 937 -347 -756 995 283 -557 513 886 -166 110 607 99 -792 445 701 -610 -98
3704i8J233j578J38J215j001q68J377J17j378P89P80j026j28J098m37r61J047
$$ -98 1135 -443 -305 910 -91 -959 418 535 -843 -54 726 -300 -428 670 233 -728 319
3721C19J75j525R33J156j725N1J293o75p91J045L24j311J1J061p86Q9R49q47n32
$$ 319 494 -1031 -98 1058 -667 -616 677 2 -789 256 580 -731 -720 341 -445 -356 593 -254 -786
3740g86Q90K50j052M25R67j057o61J278j36q50R14r8r93O79R47r34o60J397m07
$$ -786 104 354 -698 -273 694 -363 -1024 254 118 -732 182 84 -909 -230 717 -217 -877 520 113
3759A13j117N90Q60j185L56P88q37j24Q08n16o51P45Q53j633M41J085q13q00J525
$$ 113 -1004 -414 446 -739 -383 405 -432 -556 252 -264 -915 -170 683 -950 -509 576 -237 -1037 488
3778D88o1j058O94M92j241j7J472p51p29J081J84j506N38J428j466Q4Q55k95q33
$$ 488 427 -631 63 555 -686 -703 769 18 -711 370 554 -952 -414 1014 -452 -368 487 192 -641
3797f41J063j60r18Q93N56j348J09J285p31q00R70N51j097K51R92q84k30J010
$$ -641 422 262 -656 237 793 -555 -446 839 108 -692 278 829 -268 -17 975 91 -139 871
3815H71o49p15Q22M19j439N77J212j091j02O07L5j067J032n0q39M46O81r28l57
$$ 871 222 -493 329 748 -691 -114 1098 7 -95 512 547 -520 512 462 -377 69 750 -178 -535
3834e35J296n20j240J072Q16j338O15K95q27k0J087n33r45J078K84p98k50R82
$$ -535 761 241 -999 73 889 -449 166 461 -366 -386 701 168 -777 301 585 -213 -463 519
3852E19n53q35J073r0r38R01K31q82J99J209r66p57J390m11j243R42J028j492
$$ 519 -34 -869 204 114 -824 77 308 -574 -375 834 -132 -889 501 90 -1153 -211 817 -675
3870f75N2R39m55k70P46n18p83Q65K61q85j73J530p34o63Q40m3m79L25M54r66
$$ -675 -623 316 -139 -409 337 -181 -964 -99 162 -723 -896 634 -100 -763 77 34 -445 -120 334 -632
3890f32Q3J073o02r14J585j87j350O14J124j036l87R01j81o42O69J03p28M68O96
$$ -632 -549 524 -78 -992 593 406 -944 -330 794 -242 -629 272 91 -551 118 221 -507 -39 657
3909F57r51n20J601n30q07L39R76q61j79P04r96L28Q34k93r29Q26K63r75N51N39
$$ 657 -294 -814 787 257 -550 -211 765 -96 -275 429 -567 -239 595 302 -627 199 462 -513 38 577
3929E77m69l67P30M1r85Q91J03q51N35N32j022k5J027j94j161R55O46j326J75
$$ 577 108 -259 471 512 -473 418 521 -330 205 737 -285 -310 717 523 -638 317 963 -363 -188
3948a88P12o35m9P67l30o30P06O03j584Q0J280o12r10J369k01q34P92N48j157
$$ -188 524 -111 -160 607 277 -353 353 956 -628 -548 732 120 -790 579 378 -456 336 884 -273
3967b73L5Q23o89k34J165l75j112J86J398j228rP88m87n61J341o16r60Q34N84
$$ -273 -238 585 -104 -338 827 452 -660 -474 924 -304 -313 475 -12 -573 768 152 -808 26 610
3986F10j390J87J410q14p93R25K56r94M22M95p75j21R23n22o75Q11O71j189L13
$$ 610 -780 -593 817 3 -790 135 391 -603 -181 314 -461 -582 341 -181 -856 -45 626 -563 -250
4005b50P88q44k63P90p9n67O88L7j019P77L38q49k2R29k46j331J348L19j138M54
$$ -250 538 -306 -569 221 142 -425 263 300 -719 58 396 -453 -475 454 208 -1123 225 544 -594 -140
4025a40P03q22j70O94j95q06R75L09j425N01J408j214n84J144j05q08Q39L51j110
$$ -140 563 -259 -429 265 70 -736 239 548 -877 -376 1032 -182 -766 378 273 -535 304 655 -455
4044d55j2J300n75p09J100k83j094R02M84j100O8R53l93m22R37k85o65M63N37
$$ -455 -467 833 258 -451 649 366 -728 174 658 -442 -374 579 186 -236 701 416 -249 214 751
4063G51r42l9J157o75n99Q49L71p71L05L68q44M5R03q34p51J301J77j361Q75O81
$$ 751 -191 -230 927 252 -347 502 873 102 407 775 -69 -24 879 45 -706 595 772 -589 286 967
4083I67r61k72Q79j3j030R34k60q61P00Q58j347K12P32l08p98J077J71j052K8
$$ 967 6 -266 613 600 -430 504 244 -617 83 941 -406 -194 538 230 -568 509 680 -372 -344
4102c44P77p40k57J123n29j106J396L84j310J22R65p80l19J144l36p02N13L81
$$ -344 433 -307 -564 559 30 -1076 320 704 -606 -484 481 -299 -618 526 190 -512 1 382
4120C82q12R3P89o12m25R54m51q17J115L01r57j50J091n10o42J156r07l20P29
$$ 382 -430 -337 452 -160 -585 369 -82 -899 216 517 -440 -590 501 -9 -651 505 -402 -722 7
4139GN42r46l69J368o24q59J096O7q43L17N96j249N06O97m06n79J115k25p94N82
$$ 7 549 -397 -766 602 -22 -881 215 282 -561 -244 352 -897 -391 306 -100 -679 436 211 -583 -1
4159aO40o65m66Q81m05m81P88j20o03P28K08j085M3J289r13m96P34K13o81L46
$$ -1 639 -26 -492 389 -16 -497 291 171 -432 296 504 -581 -538 751 -162 -658 76 289 -392 -46
4179d6Q21j024k83J112n16o02J209J63j361M66R39j045k01J106m73q92J046m4
$$ -46 775 -249 -532 580 64 -538 671 834 -527 -61 878 -167 -368 738 265 -627 419 375
4197C75n23K43L84o00j17P71j75r69J028O16j274K77R11j141j33Q75n07n53R09
$$ 375 -148 95 479 -121 -238 533 358 -611 417 1033 -241 36 947 -194 -327 548 41 -512 397
4216C97L91j162J12J004o25p43J142k29o85N57L06j024Q4J364o80r63J419j10
$$ 397 788 -374 -262 742 117 -626 516 287 -398 159 465 -559 -475 889 209 -754 665 555
4234E55j287N86P40j124J60Q90k50p72Q44j03p06M78M22r52J13Q60k75o31N44
$$ 555 -732 -146 594 -530 -370 520 270 -502 342 239 -467 11 433 -519 -406 454 179 -452 92
4253I2j33k27l4R45j099J76N22l20o63J148l43r28O81P96r49m45P71k2m29Q01
$$ 92 -41 -268 -302 643 -456 -280 242 -78 -741 407 64 -864 -183 613 -336 -781 -10 -32 -461 340
4273C40j61j084Q06O58r61k38J345p35o68P22J78o25J29P11o23k91J061n35q35
$$ 340 179 -905 -99 559 -402 -640 705 -30 -698 24 202 -423 -294 417 -206 -497 564 29 -806
4292h06J026L31j500O58Q72m95n93Q44l58o19J158j99r83N57M43k37o77J212o17
$$ -806 220 551 -949 -291 581 86 -507 337 -21 -640 518 319 -664 -107 336 99 -578 634 17
4311A7n75P45O50j356L65R58r55l86J226l26q00R34l6j151L66J258o53q67J091
$$ 17 -558 187 837 -519 -154 804 -151 -537 689 363 -437 497 461 -690 -324 934 281 -586 505
4330E05nn21L02M16j083N12Q18q50o27J249K57j362J30Q76r29K68O83o74m60J304
$$ 505 500 -21 281 697 -386 126 944 94 -533 716 973 -389 -259 617 -312 -44 639 -35 -495 809
4350H09m03r98Q46O14q59m95J258n92q32J045J25q58K03M32k33l86P36m56o11
$$ 809 406 -592 254 868 9 -486 772 180 -652 393 518 -340 -137 295 62 -324 412 -44 -655
4369f55Q65M13j364M44Q42r74M3P40j91o81N69K37q69K26J103j092l59R45j50
$$ -655 210 623 -741 -297 545 -429 -386 354 163 -518 51 288 -581 -355 748 -344 -703 242 92
4388I2p81Q04M90j272J93Q88m09o72P61j88o15P97J88q29J63Q19q95n28J119J59
$$ 92 -689 115 605 -667 -474 414 5 -667 94 -94 -709 88 276 -553 -390 429 -466 -994 125 284
4408B84r34N79M31r57J89J115j145l61J332m65q13O99O44j301M07O18m27o42J340
$$ 284 -650 -71 360 -597 -408 707 -438 -799 533 68 -745 -46 598 -703 -296 322 -105 -747 593
4427E93k44m38L04N95j162j28J075n94r36J147L14j018L94P79q89l32R45j23n91
$$ 593 349 -89 215 810 -352 -480 595 1 -935 212 526 -492 -98 681 -208 -540 405 282 -309
4446c09P19L81r45J00R06r81k10O72j81n17O75K00q99O41L54n93l53Q69o0q93
$$ -309 410 791 -154 -54 852 -129 -339 333 152 -365 310 510 -389 252 606 13 -340 529 469 -424
4466d24K13O36o30L43Q28q69k43O82k76o61P98j41m51J34Q86p24n38J160j33r09
$$ -424 -211 425 -205 138 966 97 -146 536 260 -401 397 256 -195 -61 825 101 -437 723 590 -319
4486c19K68P22r54K8R96p66k85Q66q0q42L90O84r56p3L82o0m74R31l71n61L51
$$ -319 -51 671 -283 -255 741 -25 -310 556 476 -366 24 708 -248 -321 61 1 -473 458 87 -474 -123
4507a23P88j207K53Q41m93o88J113j37j133P20K92n94k6P36k84o13P49M8q87K97
$$ -123 665 -542 -289 552 59 -629 484 347 -786 -66 226 -368 -394 342 58 -555 194 242 -645 -348
4527c48O09n26m74J127m70o23R12N6o54J37Q45j240k02J180m34l85O54L71p19
$$ -348 261 -265 -739 388 -82 -705 207 263 -391 -254 591 -649 -851 329 -105 -490 164 535 -184
4546a84J61K38l99n55J358o79p99J167j15p07N06Q87r90n07J107k81o12L99K16
$$ -184 -23 215 -184 -739 619 -60 -859 308 193 -514 -8 879 -111 -618 489 208 -404 -5 211
4565B11n44J56R23j013o82J421J21q68M75N15r81J42M50l82l55R16k24p36O75
$$ 211 -333 -177 746 -267 -949 472 593 -275 200 715 -266 -124 326 -56 -411 505 281 -455 220
4584B20L89r51J43R02q95L2N18J96q21N98L49j172L92O25l69m53R59j03j138J95
$$ 220 609 -342 -199 703 -192 -160 358 554 -267 331 680 -492 -100 525 156 -297 662 559 -579 -384
4604c84J164r72j44Q92n47n89J263l38r70N22Q33j046k73J036n46l60P56K10q46
$$ -384 780 -192 -336 556 9 -580 683 345 -625 -103 730 -316 -589 447 -99 -459 297 507 -339
4623c39M17O54r60O5M99m01o07Q63O9q49M98Q42j042O2M69j78o06Q08jj017R87
$$ -339 78 732 -228 -163 336 -65 -672 191 260 -589 -91 751 -291 -229 240 62 -544 264 263 -754 233
4644B33M16j063k13J110l66q44P49J84o50Q7N76n19l89J227m83n69O83J73p90
$$ 233 649 -414 -627 483 117 -727 22 206 -444 -357 219 -300 -689 538 55 -514 169 342 -448
4663d48K08O62m34n70J022m5j017O05q4j07K32M12o30k87R21K69j403N26M61o88
$$ -448 -240 422 -12 -582 440 395 -622 -17 -101 -208 24 436 -194 -481 440 709 -694 -168 293 -395
4683c95n9J030n38l73N61P6n25K16K30o99K65O56m47n36R07J37q51O80j55m48
$$ -395 -454 576 38 -335 226 302 -223 -7 223 -476 -211 445 -2 -538 369 506 -345 335 180 -268
4703b68P8J158p69o92J122j61q55K97P79o82J2P35l96r28J024j7p23L95M78p92
$$ -268 -190 968 199 -493 629 468 -387 -90 689 7 19 754 358 -570 454 437 -286 109 587 -205
4723b05p9Q07m10p82J034K50q43L81N43q09l76J218n69o63M27O29q37J52P65o84
$$ -205 -284 523 113 -669 365 615 -228 153 696 -113 -489 729 160 -503 -76 553 -284 -132 633 -51
4743e1q6O57o13n61Q17L24p11K84L71n44j89P55l08p30N19L95o14PP63m68j82
$$ -51 -137 520 -93 -654 163 487 -224 60 431 -113 -302 453 145 -585 -66 329 -285 -278 485 17 -165
4764a65M87k01o97R09J65q68q3R71n70o82P59P3m96P19Q5q89J55M80l22n52R98
$$ -165 322 121 -576 333 498 -370 -453 518 -52 -734 25 98 -398 321 406 -483 -328 152 -170 -722 276
4785B76q4r79M92Q50j072n3R52l51m70O69m65l85L27Q06r61l40J077l13l84N62
$$ 276 192 -787 -295 555 -517 -570 382 31 -439 230 -235 -620 -293 513 -448 -788 289 -24 -408 154
4805A54L1q19P39L41o60R8N31l50q13J042m8o38L05N06l18n40Q54k34o21O58l4
$$ 154 185 -634 105 446 -214 -116 415 65 -748 294 246 -392 -87 419 101 -439 415 181 -440 218 184
4826A84l93J4Q30p01k78R08k26q24P18j16l34J80L37l12m41Q86k55m27M61J02
$$ 184 -209 -195 635 -66 -344 564 338 -486 232 116 -218 -38 299 -13 -454 432 177 -250 211 313
4846C13n89R8Q60m84o06P46j09m88L25N76q22M98L51q41k0P92k48r38P29O01o66
$$ 313 -276 -178 682 198 -408 338 229 -259 66 642 -180 318 669 -172 -192 600 352 -586 143 744 78
4867G8m91O35L6m77Q00l50q02O15N91r25J33N02o6j049R79K77o69M36J26n22k13
$$ 78 -413 222 258 -219 581 231 -571 44 635 -290 -157 345 279 -770 209 486 -183 253 379 -143 -356
$$ [...]
8191B9
##END NTUPLES=NMR FID
##END=
