##TITLE=1H_TG-2291-4
 CDCl3, 8 sc, 
 30.6.2020
##JCAMPDX= 6.0         $$ Bruker NMR JCAMP-DX V2.0
##DATA TYPE= NMR FID
##DATA CLASS= NTUPLES
##ORIGIN= UXNMR, Bruker Analytische Messtechnik GmbH
##OWNER= root
$$ XWIN-NMR		Version 3.5
$$ Tue Jun 30 11:04:57 2020 Russian Standard Time (UT+4h)  she@DPX200
##.OBSERVE FREQUENCY= 200.1315
##.OBSERVE NUCLEUS= ^1H
##.DELAY= (6, 6)
##.ACQUISITION MODE= SIMULTANEOUS
##.ACQUISITION SCHEME= undefined
##.AVERAGES= 8
##.DIGITISER RES= 18
##SPECTROMETER/DATA SYSTEM= spect
##.PULSE SEQUENCE= zg30
##.SOLVENT NAME= DMSO
##.SHIFT REFERENCE= (INTERNAL, DMSO, 0, 15.7039)
##AUDIT TRAIL= $$ (NUMBER, WHEN, WHO, WHERE, WHAT)
$$ ##TITLE= Audit trail, XWIN-NMR		Version 3.5
$$ ##JCAMPDX= 5.01
$$ ##ORIGIN= Bruker BioSpin GmbH
$$ ##OWNER= she
$$ F:/spectra/data/she/nmr/H-F/1/audita.txt
$$ ##AUDIT TRAIL=  $$ (NUMBER, WHEN, WHO, WHERE, WHAT)
(   1,<2020-06-30 11:03:43.62 +0400>,<she>,<DPX200>,
      <created by zg, POWCHK disabled, PULCHK disabled
       configuration hash MD5:
       00 E9 B6 7A A2 85 ED C7 34 08 36 98 17 FE 4E 26
       data hash MD5: 16K
       30 6C 99 CC 00 84 18 08 B6 89 68 7A D3 BD D5 E7>)
$$ ##END=
$$ 
$$ hash MD5
$$ A0 5F E5 3B CF 96 3A 2F 6F 61 FC 68 66 78 5A 00
##$RELAX= 
##$RELAX= 
##$RELAX= 
##$RELAX= 
##$RELAX= 
##$RELAX= 
$$ Bruker specific parameters
$$ --------------------------
##$DU= <F:/spectra>
##$EXPNO= 1
##$NAME= <H-F>
##$PROCNO= 1
##$TYPE= <nmr>
##$USER= <she>
##$AMP= (0..31)
100 100 100 100 100 100 100 100 100 100 100 100 100 100 100 100 100 100 
100 100 100 100 100 100 100 100 100 100 100 100 100 100 
##$AQSEQ= 0
##$AQ_mod= 1
##$AUNM= <au_zg>
##$AUTOPOS= <>
##$BF1= 200.13
##$BF2= 200.13
##$BF3= 200.13
##$BF4= 200.13
##$BF5= 200.13
##$BF6= 200.13
##$BF7= 200.13
##$BF8= 200.13
##$BYTORDA= 1
##$CFDGTYP= 0
##$CFRGTYP= 5
##$CHEMSTR= <none>
##$CNST= (0..31)
1 1 145 1 1 1 1 1 1 1 1 1 1 1 1 1 1 1 1 1 1 1 1 1 1 1 1 1 1 1 1 1 
##$CPDPRG= <>
##$CPDPRG1= <>
##$CPDPRG2= <>
##$CPDPRG3= <>
##$CPDPRG4= <mlev>
##$CPDPRG5= <mlev>
##$CPDPRG6= <mlev>
##$CPDPRG7= <mlev>
##$CPDPRG8= <mlev>
##$CPDPRGB= <>
##$CPDPRGT= <>
##$D= (0..31)
0 1.2 0 0 0 0 0 0 0 0.06 0 0.03 0 0 0 0 0.0002 0 0 0 0 0 0 0 0 0 0 0 0 
0 0 0 
##$DATE= 1593500623
##$DBL= (0..7)
120 120 120 120 120 120 120 120 
##$DBP= (0..7)
150 150 150 150 150 150 150 150 
##$DBP07= 0
##$DBPNAM0= <>
##$DBPNAM1= <>
##$DBPNAM2= <>
##$DBPNAM3= <>
##$DBPNAM4= <>
##$DBPNAM5= <>
##$DBPNAM6= <>
##$DBPNAM7= <>
##$DBPOAL= (0..7)
0.5 0.5 0.5 0.5 0.5 0.5 0.5 0.5 
##$DBPOFFS= (0..7)
0 0 0 0 0 0 0 0 
##$DE= 6
##$DECBNUC= <off>
##$DECIM= 24
##$DECNUC= <off>
##$DECSTAT= 4
##$DIGMOD= 1
##$DIGTYP= 9
##$DL= (0..7)
0 120 120 120 120 120 120 120 
##$DP= (0..7)
150 150 150 150 150 150 150 150 
##$DP07= 0
##$DPNAME0= <>
##$DPNAME1= <>
##$DPNAME2= <>
##$DPNAME3= <>
##$DPNAME4= <>
##$DPNAME5= <>
##$DPNAME6= <>
##$DPNAME7= <>
##$DPOAL= (0..7)
0.5 0.5 0.5 0.5 0.5 0.5 0.5 0.5 
##$DPOFFS= (0..7)
0 0 0 0 0 0 0 0 
##$DQDMODE= 0
##$DR= 18
##$DS= 0
##$DSLIST= <SSSSSSSSSSSSSSS>
$$ [...]
##$SUBNAM2= <"">
##$SUBNAM3= <"">
##$SUBNAM4= <"">
##$SUBNAM5= <"">
##$SUBNAM6= <"">
##$SUBNAM7= <"">
##$SUBNAM8= <"">
##$SUBNAM9= <"">
##$SW= 24.9337058887773
##$SWIBOX= (0..15)
0 0 2 0 0 0 0 0 0 0 0 0 0 0 0 0 
##$SW_h= 4990.01996007984
##$TD= 16384
##$TD0= 1
##$TE= 0
##$TE2= 300
##$TE3= 300
##$TEG= 300
##$TL= (0..7)
0 120 120 120 120 120 120 120 
##$TP= (0..7)
150 150 150 150 150 150 150 150 
##$TP07= 0
##$TPNAME0= <>
##$TPNAME1= <>
##$TPNAME2= <>
##$TPNAME3= <>
##$TPNAME4= <>
##$TPNAME5= <>
##$TPNAME6= <>
##$TPNAME7= <>
##$TPOAL= (0..7)
0.5 0.5 0.5 0.5 0.5 0.5 0.5 0.5 
##$TPOFFS= (0..7)
0 0 0 0 0 0 0 0 
##$TUNHIN= 0
##$TUNHOUT= 0
##$TUNXOUT= 0
##$USERA1= <user>
##$USERA2= <user>
##$USERA3= <user>
##$USERA4= <user>
##$USERA5= <user>
##$V9= 5
##$VALIST= <valist>
##$VCLIST= <CCCCCCCCCCCCCCC>
##$VD= 0
##$VDLIST= <DDDDDDDDDDDDDDD>
##$VPLIST= <PPPPPPPPPPPPPPP>
##$VTLIST= <TTTTTTTTTTTTTTT>
##$WBST= 1024
##$WBSW= 4
##$XGAIN= (0..3)
0 0 0 0 
##$XL= 0
##$YL= 0
##$YMAX_a= 247534
##$YMIN_a= -138029
##$ZGOPTNS= <>
##$ZL1= 120
##$ZL2= 120
##$ZL3= 120
##$ZL4= 120
##$ABSF1= 10
##$ABSF2= 0
##$ABSG= 5
##$ABSL= 3
##$ALPHA= 0
##$AQORDER= 0
##$ASSFAC= 0
##$ASSFACI= 0
##$ASSFACX= 0
##$ASSWID= 0
##$AUNMP= <proc_1d>
##$AZFE= 0.1
##$AZFW= 0.1
##$BCFW= 1
##$BC_mod= 2
##$BYTORDP= 1
##$COROFFS= 0
##$CY= 11.3945322036743
##$DATMOD= 1
##$DC= 2
##$DFILT= <>
##$DTYPP= 0
##$F1P= 16.9975609425685
##$F2P= -3.02152046262296
##$FCOR= 0.5
##$FTSIZE= 0
##$FT_mod= 4
##$GAMMA= 1
##$GB= 0.15
##$INTBC= 1
##$INTSCL= 1
##$ISEN= 128
##$LB= 0.24
##$LEV0= 0
##$LPBIN= 0
##$MAXI= 10000
##$MC2= 0
##$MEAN= 0
##$ME_mod= 0
##$MI= 1.114404
##$NCOEF= 0
##$NC_proc= 0
##$NLEV= 6
##$NOISF1= 3.799351
##$NOISF2= 2.8
##$NSP= 1
##$NTH_PI= 0
##$NZP= 0
##$OFFSET= 15.70392
##$PC= 1
##$PHC0= -9797.791
##$PHC1= 22.00087
##$PH_mod= 1
##$PKNL= yes
##$PPARMOD= 0
##$PSCAL= 0
##$PSIGN= 0
##$REVERSE= no
##$SF= 200.130013532006
##$SI= 16384
##$SIGF1= 3
##$SIGF2= 2
##$SINO= 400
##$SIOLD= 16384
##$SREGLST= <1H.CDCl3>
##$SSB= 0
##$STSI= 0
##$STSR= 0
##$SW_p= 3612.71676300578
##$SYMM= 0
##$S_DEV= 0
##$TDeff= 0
##$TDoff= 0
##$TI= <>
##$TILT= no
##$TM1= 0
##$TM2= 0
##$TOPLEV= 0
##$USERP1= <user>
##$USERP2= <user>
##$USERP3= <user>
##$USERP4= <user>
##$USERP5= <user>
##$WDW= 1
##$XDIM= 8192
##$YMAX_p= 0
##$YMIN_p= 0
$$ End of Bruker specific parameters
$$ ---------------------------------
##NTUPLES= NMR FID
##VAR_NAME=  TIME,          FID/REAL,        FID/IMAG
##SYMBOL=    X,             R,               I
##VAR_TYPE=  INDEPENDENT,   DEPENDENT,       DEPENDENT
##VAR_FORM=  AFFN,          ASDF,            ASDF
##VAR_DIM=   8192,          8192,            8192
##UNITS=     SECONDS,       ARBITRARY UNITS, ARBITRARY UNITS
##FACTOR=    0.0002004,     1,               1
##FIRST=     0,             0,               0
##LAST=      1.6414764,     0,               0
##MIN=       0,             -138029,         0
##MAX=       1.6414764,     247534,          0
$$ Real data points
##PAGE= N=1
##DATA TABLE= (X++(R..R)), XYDATA
0@%%%%%%%%qJ6j6J6k3L1l2M0m8N6p2Q5r7J15j35J53j76K03k32K64l00L40l84M33
$$ 0 0 0 0 0 0 0 0 0 -8 8 -8 8 -15 16 -16 24 -24 32 -40 45 -52 63 -72 81 -95 108 -124 140 -160 180 -204 229
32B29m86N44o10O82p59Q46r40J041j153J276j412J565j733J920k131K368k638
$$ 229 -257 287 -323 359 -400 446 -494 547 -606 670 -742 823 -910 1010 -1121 1247 -1391
49a391K947l306L732m245M873n665O704q133J0234j3665K0503n7857J74659M7027
$$ -1391 1556 -1750 1982 -2263 2610 -3055 3649 -4484 5750 -7915 12588 -45269 129390 176417
63A76417k75531l8915J64084O4819j13100m0030O9118O9756k6473m8651j032K4880
$$ 176417 -99114 -138029 26055 90874 -22226 -62256 6862 76618 50145 1494 462 25342
75B5342k0422j47N3558J9873n5346k8056R397J606K4647M1213m6718p1210M5936
$$ 25342 4920 4773 58331 78204 22858 -5198 4199 5805 30452 71665 24947 -46263 -327
88c27P9519m8766q6842J9401P7057K7159m5552p8516j1862R2160N4549p6956o1893
$$ -327 79192 30426 -56416 -37015 40042 67201 21649 -56867 -68729 23431 77980 1024 -60869
101f0869N2902M7180l5862l1847J8965K3623o89j6498m103J9302p201m1091K2417
$$ -60869 -7967 39213 3351 -28496 -9531 14092 13403 -3095 -7198 12104 4903 -36188 -13771
114a3771P4177j9863r0809L935P2383J945l2990N481q903k0974L5478K9625n1530
$$ -13771 60406 40543 -50266 -46331 26052 27997 -4993 488 -8415 -29389 6089 35714 -15816
127a5816l7314N3660N0075l5590o4294n657O2702M4764m3064n1065L4288L5962
$$ -15816 -53130 530 50605 15015 -49279 -54936 7766 52530 9466 -41599 -7311 28651
139B8651m2594j8340N5544J1600m8561L936M0029j4392l7106L682K6243K8589
$$ 28651 -13943 -32283 23261 34861 -13700 -9764 30265 15873 -21233 -17551 8692 37281
151C7281O605m5354m0024L6335M3190k4756k6699J6655O518r519K820r513j9937
$$ 37281 43886 -1468 -41492 -5157 38033 13277 -13422 3233 9751 232 3052 -6461 -26398
164b6398J6989K7973j1548k1672n818n498J0223K4854j0727k7687J3053J5616
$$ -26398 -9409 18564 7016 -14656 -20474 -25972 -15749 9105 -1622 -29309 -16256 -640
176f40k0508L267K6125k0192k6456L9070K6915m5990k7940L9210L1976j3151k4428
$$ -640 -21148 -17881 8244 -11948 -38404 666 27581 -18409 -46349 -7139 24837 11686 -12742
189a2742j0393J6760K6230r191k6061J1544J7279j4464j046J8984j6835k0758
$$ -12742 -23135 -6375 19855 10664 -15397 -3853 13426 -1038 -2084 16900 65 -20693
201b0693L2165K0638l5126j5576K6255L208j2937R466K054j5873J249J0148l03
$$ -20693 11472 32110 -3016 -18592 7663 10871 -2066 7400 9454 -6419 -5170 4978 4675
214D675N684j001k2088N844L2158j5324m0251K0654M4573j3413l3598O88J3136
$$ 4675 10359 9358 -12730 -6886 25272 9948 -30303 -9649 34924 21511 -12087 -11399 1737
227A737P254M076j1419m496J9534k677k9617R985L0155j8688k1049L1111J5679
$$ 1737 8991 13067 1648 -2848 16686 14009 -15608 -5623 24532 5844 -15205 15906 31585
240C1585l5773j5082K2823R803k982P91j2478q325J6845O727j5452r01Q340l317
$$ 31585 -4188 -19270 3553 13356 10374 11165 -1313 -9638 7207 13934 -1518 -2419 5921 2604
254B604N303M240k4448q702L5596R692l3164m041K2685r095j2693J6595N257j5651
$$ 2604 7907 12147 -12301 -21003 14593 24285 -8879 -12920 9765 670 -12023 4572 9829 -5822
268e822J621O872p320N42L906q486P388J8714j6075k4734J5901J7757j3686j708
$$ -5822 -4201 2671 -4649 -4107 -201 -8687 -1299 17415 1340 -23394 -7493 10264 -3422 -5130
282e130J2948j2040j1646J7841O013j7225J021J1740j409L34l405j6160P961K8508
$$ -5130 7818 -4222 -15868 1973 7986 -9239 -8218 3522 2113 2447 -958 -17118 -9157 19351
296A9351j1415l0190J5735K2930k0497j1667K3400L534j9959K34J0635k40j850
$$ 19351 7936 -22254 -6519 16411 -4086 -15753 7647 11181 -8778 -8544 2091 1851 1
309Am760n391J6728R987k7703j2751L0511J0210k5378o13J5914r713p188J4357
$$ 1 -4759 -10150 6578 16565 -11138 -23889 6622 16832 -8546 -9159 6755 -2958 -10146 4211
323D211k188j2402J0980Q722j2674k132O232o235L651J2715j0327j2248J4372
$$ 4211 2023 -10379 601 9323 -3351 -5483 749 -5486 -1835 10880 553 -11695 2677
336B677M380j4994P505J4867j5605r681J8099J704j6173O092J1353q647k430O280
$$ 2677 7057 -7937 -432 14435 -1170 -10851 7248 8952 -7221 -1129 10224 1577 -853 5427
350E427n954j025J0679n116q229J3651o29k1427P628K3100j2930j7691J6973R652
$$ 5427 -527 -1552 9127 4011 -4218 9433 8804 -12623 -4995 18105 5175 -12516 4457 14109
364A4109j6880l066J0172k162q18K454p942P74J1842q188j1586J7024Q033k3759
$$ 14109 -2771 -5837 4335 2173 1355 3809 -4133 -3359 8483 295 -11291 5733 13766 -9993
378i993r23K4751o320k0719J0356J4018j0452n988N068K21N125M097j3312m084
$$ -9993 -10916 13835 7515 -13204 -2848 11170 718 -5270 -202 19 5144 9241 -4071 -8155
392h155J7831k627j8093J1412J5891j6821r290J7105L49j4029P297Q915r337j661
$$ -8155 9676 7049 -11044 368 16259 -562 -9852 7253 7602 -6427 870 9785 448 -1213
406a213M212p883P72J2306n645j0125J0348K288j4476M862J2477j2137n720J5329
$$ -1213 2999 -4884 -4112 8194 2549 -7576 2772 5060 -9416 -4554 7923 -4214 -9934 5395
420E395l864j6901J0136J1812j1184l121J0449m451q244M904O60k149R713k406
$$ 5395 1531 -15370 -5234 6578 -4606 -7727 2722 -1729 -9973 -5069 -4409 -6558 3155 749
434G49j5245Q128J4094j4895r539K0419N161j8802L95J1294o653l115R973j047
$$ 749 -14496 -6368 7726 -7169 -16708 3711 8872 -9930 -9535 1759 -4894 -8009 1964 917
448I17n486M501k377n015J0829K068j4975O893J7314j4491j6818J9381J3879j7466
$$ 917 -4569 -68 -2445 -7460 3369 5437 -9538 -2645 14669 178 -16640 2741 16620 -846
462h46m930J2450p48n070K266j505J536J0083p149j3014J2054J0382j6519k455
$$ -846 -5776 6674 5926 856 3122 1617 3153 13236 6087 -6927 5127 15509 -1010 -3465
476c465J9767m274j8045O807J0143r766p30Q375o027l983P281n031p492R854L779
$$ -3465 16302 12028 -6017 790 10933 1167 437 8812 2785 -1198 6083 1052 -6440 3414 7193
491G193j1746K414P786j0966m113J3726k812j0459R468M894j5573K40J6162m694
$$ 7193 -4553 -2139 5647 -5319 -9432 4294 1482 -8977 491 5385 -10188 -9948 6214 1520
505A520j0130P360L201o517K677J422n938Q898Q512j4372o604J6726r0j5154Q993
$$ 1520 -8610 -1250 1951 -4566 -1889 -467 -6405 2493 11005 -3367 -9971 6755 6665 -8489 504
520E04J2835j2641p462J2009O40q313M515L183l746L662k722j0595P091J3437
$$ 504 13339 698 -6764 5245 5885 -2428 2087 5270 1524 5186 2464 -8131 -1040 12397
534A2397j3214r694J6929L717j9576J013J5849m719r039N957O81n054L549j157
$$ 12397 -817 -10511 6418 10135 -9441 -8428 7421 2702 -6337 -380 301 -4753 -1204 -2361
548b361m186Q724L918j4405k77J5063o277j2734J2947P715j4259k047J1118l801
$$ -2361 -6547 2177 6095 -8310 -8587 6476 199 -12535 412 8127 -6132 -8179 2939 -862
562h62n495Q285p41o285N166J73j0569N465J0263q502m906J0057l248r982R354
$$ -862 -6357 1928 1187 -5098 68 241 -10328 -4863 5400 -3102 -8008 2049 -1199 -11181 -1827
577a827N450j2251J681J2447p821j0043J0054M686p163L109M303o632R11O047
$$ -1827 3623 -8628 -6947 5500 -2321 -12364 -2310 2376 -4787 -1678 2625 -4007 -3096 2951
591B951n781o54J1749l890j1538R778P861j3566k08J6438l243j3495O620O666
$$ 2951 -2830 -3484 8265 4375 -7163 2615 10476 -3090 -3298 13140 9897 -3598 3022 9688
605I688o364j003M003k779L512L165j1826l062J6271q43j6024M550J2734j0599
$$ 9688 3324 2321 6324 3545 7057 10222 -1604 -4666 11605 10762 -5262 -712 12022 1423
619A423r266J0388K746p255K802J719n773K960K564q134K270J1577p953j0554
$$ 1423 -7843 2545 5291 -1964 838 2557 -3216 -256 2308 -5826 -3556 8021 68 -10486
633a0486J0873N394j3329K214J2952n904q306O634P98n797N689L031p444J527
$$ -10486 387 5781 -7548 -5334 7618 1714 -6592 42 840 -4957 732 3763 -3681 -2154
647b154N604p659j937R828k449p735Q288J942j3165J874J2741o527p441J1176
$$ -2154 3450 -4209 -6146 3682 1233 -6502 1786 3728 -9437 -7563 5178 -1349 -8790 2386
661B386P82j2306L073Q703m931j843N613l101l060M995l077l638J0047L540j3152
$$ 2386 3168 -9138 -6065 2638 -2293 -4136 1477 -1624 -4684 311 -2766 -6404 3643 7183 -5969
676e969K168J2338r020j0280J4345Q446j2634m678P290j300n00L245m410k22Q977
$$ -5969 -3801 8537 -483 -10763 3582 12028 -606 -5284 2006 706 206 3451 -959 -1181 7796
691G796n483j3655Q149J1130r136m836J0294k167j1200M208O867l568K47J933
$$ 7796 2313 -11342 -3193 7937 -1199 -6035 4259 2092 -9108 -4900 1967 -1601 -1354 579
705E79o642J234P031p800m633J4460L680j5267J83J1310n543n865J0142K456q408
$$ 579 -6063 -4829 2202 -5598 -10231 4229 7909 -7358 -7175 4135 -1408 -7273 2869 5325 -3083
720c083K064L601n931J762P261l199j779N078n594o486R375L902r678M261Q271
$$ -3083 -1019 2582 -3349 -1587 5674 2475 696 5774 180 -6306 3069 6971 -2707 1554 9825
735I825j0135p536J1983K693r782M332O975r054n248P823p39k783O596Q48q124
$$ 9825 -310 -7846 4137 6830 -2952 1380 8355 -699 -5947 1876 1137 -1646 4950 5798 -2326
750b326P08J333l573N968P368j0788o105J2035O66j3679M337J3728m768o986K938
$$ -2326 -1618 -285 -3858 2110 9478 -1310 -7415 4620 5286 -8393 -4056 9672 4904 -2082 856
765H56k668l048P746J697o087M188K424j1347m18J3841k842j0174P000O620r627
$$ 856 -1812 -4860 2886 4583 -1504 2684 5108 -6239 -6657 7184 4342 -5832 1168 7788 -1839
780a839m842N057J577K581L707p366n316P781k57q830P459J0290j0687p920R672
$$ -1839 -6681 -1624 -47 2534 6241 -1125 -6441 1340 1083 -7747 -288 10002 -685 -8605 1067
795A067N05r394N724Q274o088k579M426o191l721R316K852o025R79J41n774L618
$$ 1067 1572 -7822 -2098 6176 88 -2491 1935 -4256 -7977 1339 4191 -1834 -855 -714 -6488 -2870
811b870O265o244k045J0639l483j1590N799P628q082k47J0320m962r167N595M590
$$ -2870 3395 -2849 -4894 5745 2262 -9328 -3529 4099 -3983 -4230 6090 1128 -8039 -2444 2146
826B146m087K229K249n774J296N261o789l911J1922K304j0276J176O164p160j693
$$ 2146 -1941 288 2537 -3237 -1941 3320 -3469 -7380 4542 6846 -3430 -2254 3910 -3250 -4943
841d943J0202l44p831K153J780l682L976K461o599L093Q524r240r794J1609Q144
$$ -4943 5259 4915 -2916 -763 1017 -2665 1311 3772 -2827 266 8790 -450 -10244 1365 9509
856I509j1087j387Q920m103p059M331L429n27K918l279p273N730O023q690k365
$$ 9509 -1578 -2965 5955 1852 -5207 -876 2553 2026 4944 1665 -5608 122 6145 -2545 -4910
871d910J1572K6r941K177L070n403L819P876p084o084P342O71p041M066N617n513
$$ -4910 6662 6688 -3253 -1076 1994 -3409 410 8286 1202 -4882 2460 3131 -3910 156 5773 260
887B60Q8N103n967m982Q015J565n268M337K100r572l2J0291l264o328O325J983
$$ 260 348 5451 -516 -5498 2517 4082 -1186 3151 5251 -4321 -4353 5938 2674 -3654 2671 4654
903D654p292P26L307m205K507O762o070n968P326k20p656O919P595j0746n324
$$ 4654 -2638 -1912 1395 -2810 -303 6459 389 -5579 1747 1527 -6129 790 8385 -2361 -7685
918g685R987Q37q063L493N300l786j255J047l783J742N670m642l272Q675j907
$$ -7685 2302 3139 -4924 -1431 3869 83 -1172 -125 -3908 -2166 3504 -1138 -4410 4265 2358
933B358j2173N692J1710o283p632O599K136n372J360J213l401M466N435q052n163
$$ 2358 -9815 -4123 7587 1304 -6328 271 2407 -2965 -1605 -392 -3793 673 6108 -1944 -7107
948g107P454N31m970N678K762q299p74O255l243l289P273L39n991K955J299p507
$$ -7107 347 878 -4092 1586 4348 -3951 -4725 1530 -1713 -5002 2271 2610 -3381 -426 873 -6634
964f634K506R367l716n589M667j324o349O396N958o931j042P086m729o155P219
$$ -6634 -4128 5239 1523 -4066 601 -723 -7072 -676 5282 -1649 -2691 4395 -334 -6489 730
979G30L440o605K333M992n142k839M222n15j99O097l090p500N059N272q764K98
$$ 730 4170 -2435 -102 4890 -252 -3091 1131 616 417 6514 3424 -4076 983 6255 -2509 -2211
995b211J0985l385r890O219N185q410l46P564r56l851R21l052r06P515k41r072
$$ -2211 8774 5389 -4501 1718 6903 -1507 -1853 5711 4755 904 1825 -1227 -2133 5382 5141 -3931
1011c931M330P466q238n654Q843J468n795K435K157o179P99N499l463j423O051
$$ -3931 399 7865 -373 -6027 2816 4284 -1511 924 3081 -3098 -2299 3200 -263 -1686 4365
1026D365l426p305O390M301p869N06Q181m294n835N312J557n052L427L458n510
$$ 4365 939 -6366 24 4325 -3544 -3038 5143 849 -4986 326 1883 -3169 258 3716 -1794
1041a794k99M099m078j935P766j3p454K939M084n659P36N610m270l454P869o86
$$ -1794 -2093 2006 -2072 -4007 3759 3746 -3708 -769 3315 -2344 -1608 4002 -268 -3722 4147 3461
1057C461r894L383R024m986l538M331j249m199L593J378l835K665K102p094R28
$$ 3461 -6433 -3050 5974 988 -2550 1781 532 -3667 -74 1304 -2531 134 2236 -4858 -3930
1072c930P585m959n920Q461K875j0488o61P272k078k142L700j833l458M205M60
$$ -3930 3655 -1304 -7224 1237 4112 -6376 -7037 235 -1843 -3985 -285 -2118 -5576 -1371 -911
1087i11n677M594N839p706l337Q763k36p258M367N623n395j633M129j409j565
$$ -911 -6588 -1994 3845 -3861 -7198 1565 1329 -5929 -1562 4061 -1334 -2967 1162 -247 -1812
1102a812N363j902l606N022J063p689K835Q074m765m968O293J137o895K918M024
$$ -1812 3551 1649 -1957 3065 4128 -3561 -726 7348 2583 -2385 3908 5045 -1850 1068 5092
1117E092m405K0M946m803m602O776J531o346K191L878m830r86M199l769k060Q086
$$ 5092 687 707 5653 850 -3752 3024 4555 -1791 400 4278 -552 -1538 2661 -1108 -3168 4918
1133D918j104r107L297O094n251k257O912j353n895L354J870m300K753M033m759
$$ 4918 3814 -5293 -1996 4098 -1153 -3410 3502 2149 -3746 -392 1478 -2822 -69 3964 -795
1148g95m67M811m665m140Q594K554q853R21O609m363m199O112J620m146K369M25
$$ -795 -1262 3549 -1116 -5256 3338 5892 -2961 -2040 4569 206 -3993 2119 3739 -407 1962 2387
1164B387m294K647L481n291q1Q016l597q173N464N610o674j91O417l581m766L649
$$ 2387 -1907 740 4221 -1070 -1151 6865 3268 -4905 559 6169 -505 -696 5721 2140 -2626 1023
1180A023N50l499L999J586o083J417M631o188l023P567J187p285J127K997n197
$$ 1023 1573 -1926 2073 3659 -2424 -1007 3624 -2564 -5587 1980 3167 -4118 -2991 6 -5191
1195e191P44N540l377l916N719j09o748K240N059l892o9M403l828l874N962J449
$$ -5191 -4447 1093 -2284 -6200 -481 -590 -7338 -5098 -39 -3931 -4000 403 -3425 -7299 -1337 112
1211A12n162L450M174o102j059O319k169m406N808L307o646Q28M269k988q04M288
$$ 112 -5050 -1600 2574 -3528 -4587 1732 -437 -4843 965 4272 -2374 -1546 2723 -265 -1069 3219
1227C219j961k798N148n78p520M907P547o463n018P083R79o315J867L112k690
$$ 3219 1258 -1540 3608 3030 -4490 417 7964 1501 -3517 3566 4545 -1770 97 3209 519
1242E19Q24K186m914m19O332k521n111O132K047q518M89P280k526l916M323K46
$$ 519 1343 3529 -1385 -1804 4528 2007 -3104 3028 5075 -3443 -2954 4326 1800 -2116 2207 2453
1258B453m793K121K272l816J876M801m982l399N720l39n536L911M261n111p80
$$ 2453 -2340 -219 2053 -1763 113 4914 -68 -3467 2253 1914 -3622 289 4550 -561 -1341
1273a341M130l352k154N836O55n772K885L576n797p17O259j671l531M462K04n179
$$ -1341 2789 -563 -2717 3119 3774 -1998 887 4463 -1334 -2051 4208 2537 -994 3468 3672 -1507
1289a507J320M056m155L68N277m354n325N738K419o342J075N384l735l214K887
$$ -1507 -187 3869 -286 82 5359 1005 -4320 1418 3837 -2505 -1430 3954 219 -2995 -108
1304a08j266j636M967r27o419L616M908o996k903Q512P9o725K016L239m032r8
$$ -108 -1374 -3010 1957 1030 -5389 -1773 3135 -3861 -6764 1748 1827 -4898 -2882 357 -3675 -3773
1320c773M438k348j466L625k122l358N534J208o370K673N787n687m602P265K094
$$ -3773 665 -1683 -3149 476 -1646 -5004 530 1738 -4632 -1959 3828 -1859 -6461 804 2898
1335B898o131J958L777m531k52L366k979j319N976n36o366K438M001m153K70N354
$$ 2898 -3233 -1275 2502 -2029 -2281 1085 -1894 -3213 2763 2227 -4139 -1701 2300 -1853 -1583 3771
1351C771l396l253L713l15m422M307L562n039j074N593l484m633N860K961n354
$$ 3771 375 -2878 835 520 -3902 405 3967 -1072 -2146 3447 -37 -4670 1190 4151 -1203
1366a203J156K166m435K2N105j784l234M828Q07o529J010N069k965j960M912j126
$$ -1203 -47 2119 -2316 -2294 2811 1027 -2207 2621 3428 -3101 -2091 2978 13 -1947 2965 1839
1382A839l817K528K79l235L876M333o696k223O332j636m999N087L753o050m40
$$ 1839 -1978 550 829 -2406 1470 5803 -893 -3116 3216 1580 -3419 1668 5421 -629 -1069
1397a069N196k759l473M066J259k030J854q09n281L521N133m971k815O803r14
$$ -1069 4127 1368 -2105 1961 3220 1190 3044 2235 -3046 475 5608 637 -2178 4625 3711
1412C711p535L116M652m034n54L592k779k915M385m23m551L986L251n472j266
$$ 3711 -3824 -708 3944 -90 -644 2948 169 -2746 1639 1216 -3335 651 3902 -1570 -2836
1427b836M338k198k570M787L72n144K546K756m857p14N867k302l517M289N18n919
$$ -2836 1502 -696 -3266 1521 1893 -3251 -705 2051 -2806 -3520 2347 45 -3472 817 1335 -4584
1443d584K338M589l517j067L944k923l345M887J318n371K394M033m465k922N281
$$ -4584 -2246 2343 -1174 -2241 1703 -1220 -4565 322 1640 -3731 -1337 2696 -1769 -4691 590
1458E90J32m259L391J582m239Q57K406l529N41N048k678m594N015J794o688J424
$$ 590 722 -3537 -146 1436 -2803 -1946 460 -3069 -2528 2520 -158 -4752 263 2057 -4631 -3207
1474c207P258l107m629L303J418l286K227J225l360K520K935n276j961O932M7
$$ -3207 4051 944 -3685 -382 1036 -2250 -23 1202 -2158 362 3297 -1979 -3940 2992 3039
1489C039n946L161L777m897j409M759j578k079M451o78m644K604K886m505P6N185
$$ 3039 -2907 254 4031 -866 -2275 2484 906 -1173 3278 2600 -2044 560 3446 -1059 -983 4202
1505D202l050l179M372K53n197K885L686l797j118M087k571l443M649J113m627
$$ 4202 1152 -2027 2345 2598 -2599 286 3972 175 -943 3144 573 -2870 1779 2892 -1735
1520a735J445L649l857j685M131q38k785L595L3m824K620L907m778j399N880j202
$$ -1735 -290 3359 -498 -2183 1948 1110 -1675 1920 1953 -2871 -251 3656 -1122 -2521 3359 2157
1536B157n772L915K396m002J61M034l064j082L266j467k866M558J265o033J905
$$ 2157 -3615 300 2696 -1306 -1145 2889 -175 -1257 2009 542 -2324 2234 3499 -2534 -629
1551f29M983m035l245N378O54m371J709J748l116J284L119l945j183N006j809
$$ -629 4354 319 -2926 2452 3106 -1265 444 2192 -924 360 3479 -466 -1649 3357 1548
1566A548n324M028L464n026l20M234k402l836M045K69l512J649K392l927J06L233
$$ 1548 -3776 252 3716 -1310 -1630 2604 202 -3634 411 680 -2832 -1183 1209 -2718 -2612 621
1582F21l613j716N489j19n673K035L352l950m88M596j898k465L687K52n203K018
$$ 621 -2992 -4708 781 662 -5011 -2976 376 -3574 -4062 534 -1364 -3829 -142 110 -5093 -3075
1598c075N138l973j738M284o20l030K432J119k841K365K957n166o20N480j711
$$ -3075 2063 -1910 -3648 636 16 -3014 -582 537 -2304 61 3018 -2148 -2768 2712 1001
1613A001m544M536K420m984k02M261k587j597L698j038k672L098M30m479K321
$$ 1001 -3543 993 3413 -1571 -1773 2488 -99 -1696 2002 964 -1708 1390 1820 -2659 -338
1628c38M188m042k259N481l55m856K050L523l213m8K585k505j104M365j493l728
$$ -338 3850 -192 -2451 3030 2675 -2181 -131 3392 179 131 2716 211 -893 3472 1979 -1749
1644a749L909K307n756L58M818k436l699M841O56m968R44K936k563r6K788k360
$$ -1749 2160 4467 -1289 -931 3887 1451 -2248 2593 3249 -1719 -775 2161 -402 -498 2290 -70
1660g0k806M493k51m396K318L380l783j355M015k316k003M024Q43m383K258L153
$$ -70 -2876 1617 1366 -3030 -712 2668 -1115 -2470 1545 -771 -2774 1250 2093 -2290 -32 3121
1676C121m272j241M977q42l284K851J376l875J218L236l275m42L971k001l800
$$ 3121 -1151 -2392 2585 1743 -1541 1310 2686 -1189 29 3265 -10 -452 3519 1518 -2282
1691b282L393Q76l754J392M388l828l104L568K10l251J728J353k913J262K368
$$ -2282 1111 1987 -1767 -375 4013 185 -2919 649 859 -2392 -664 689 -2224 -962 1406
1706A406m473q52N980j144n008K591L311m024j211L573p60j439K542q15k416K880
$$ 1406 -3067 -3919 2061 917 -4091 -1500 1811 -2213 -3424 149 -611 -2050 492 -323 -2739 141
1722A41J647m312J114M139l422k982M685P62m607J376L152k782q09L272k310j982
$$ 141 1788 -2524 -1410 2729 -693 -3675 1010 1772 -2835 -1459 1693 -1089 -1898 1374 -936 -2918
1738b918L733l3m357K012L235l669o85M573j522l063L076P46l544K139K936l900
$$ -2918 815 782 -3575 -1563 1672 -1997 -2682 1891 369 -2694 382 1128 -2416 -277 2659 -1241
1754a241n65M361j116l574L408K185l654Q49K721l029o96L823j130k461L235K13
$$ -1241 -1806 2555 1439 -2135 1273 3458 -196 653 3374 345 -351 3472 2342 -119 3116 3329
1770C329m091J700M005l686k535M617j24m171J590J550k257M45J966l039o37M132
$$ 3329 -762 938 4943 1257 -1278 3339 3215 -956 634 2184 -73 372 2338 -701 -1338 2794
1786B794j903m036L880K554m981n25M284j515k692K941K02k952K158J532k914
$$ 2794 891 -3145 735 3289 -1692 -2217 2067 552 -2140 801 1003 -1949 209 1741 -1173
1801a173L20L248k801j889M261k76m641K340L444l233j017K751j777j681L445
$$ -1173 -853 2395 -406 -2295 1966 1690 -2951 -611 2833 -400 -1417 1334 -443 -2124 1321
1816A321l1l723J991K537l945p67M238j042l174K991L97l415J321L039k937p49
$$ 1321 1290 -2433 -442 2095 -1850 -2617 1621 579 -2595 396 793 -2622 -1301 1738 -1199 -1948
1832a948L812j631l309L483J553l953R69L296k531j989K965j30k090K743j12l195
$$ -1948 1864 233 -3076 407 1960 -1993 -1024 2272 -259 -2248 717 587 -1503 1240 1128 -2067
1848b067J875K964l952j741N209k31m658J648K863l124N7K537j554j144K904j896
$$ -2067 -192 2772 -1180 -2921 2288 2057 -2601 -953 1910 -1214 -1157 1380 -174 -1318 1586 -310
1864c10k857L509J790m070M39M006k606l145L927P01k859J236J527k602M0K445
$$ -310 -3167 342 2132 -1938 -1499 2507 -99 -3244 683 1384 -1475 -239 1288 -1314 -1274 1171
1880A171j656r62L643n92l903J874K715l314q16M198j502k080J915O78k933J855
$$ 1171 -485 -1447 2196 1604 -2299 -425 2290 -1024 -1840 2358 856 -1224 691 1369 -1564 291
1896B91J917l045l15L380j703k719L010R87l488J485K631k814j269L508j320k799
$$ 291 2208 -837 -1152 2228 525 -2194 816 1803 -1685 -200 2431 -383 -1652 1856 536 -2263
1912b263L688P05l981N72L610k103j726L050k33k749J597Q57k405J994J858l483
$$ -2263 1425 2130 -1851 -1279 2331 228 -1498 1552 1319 -1430 167 1024 -1381 613 2471 -1012
1928a012o78M219j407l560K830K715l274p24K367j361j030K671p04k511K097J321
$$ -1012 -1690 2529 1122 -2438 392 3107 -167 -891 1476 115 -915 1756 1052 -1459 638 1959
1944A959l614J078L071k570j834L686M25m262J384K661k627l21K437j728j326
$$ 1959 -1655 -577 2494 -76 -1910 1776 2201 -2061 -677 1984 -643 -964 1473 -255 -1581
1959a581K781n89l304K437K703l564j122L424j476k485K825R03k699R53J598k830
$$ -1581 1200 611 -2693 -256 2447 -1117 -2239 1185 -291 -2776 49 952 -1747 -794 804 -2026
1975b026n01L309j082k043K654P5l732K255K650k649j477L335o46k670K511P12
$$ -2026 -2527 782 -300 -2343 311 386 -3346 -1091 1559 -1090 -2567 768 122 -2548 -37 675
1991F75k963J495K843l102j650L809j6k567J617J279k779P90K161k579q6L386
$$ 675 -2288 -793 2050 -1052 -2702 1107 1091 -1476 141 1420 -1359 -569 1592 -987 -1073 2313
2007B313j725l067L678J091l513L92L238j854k036K277M58k088J624Q80k058N06
$$ 2313 588 -2479 1199 2290 -1223 -831 2407 553 -1483 794 1252 -836 788 1668 -390 116
2023A16J868k361j760M072ql104J493J957l019k98L069j142j601K501q83k670
$$ 116 1984 -377 -2137 1935 1927 -1177 316 2273 -746 -1044 2025 883 -718 1783 900 -1770
2039a770J877J929k991n8L864j902l265K425J265k572J019K156k983n30K607j242
$$ -1770 107 2036 -955 -1013 2851 949 -2316 109 1374 -1198 -179 1977 -1006 -1536 1071 -171
2055a71j344K607K56l021J451J849l132p01L957m70k803J960Q1k418J563K687
$$ -171 -1515 1092 1348 -1673 -222 1627 -1505 -2206 1751 1281 -1522 438 519 -1899 -336 2351
2071B351k746j109L524p83l475J746K509k296K65J822k125p33K796j024k037L130
$$ 2351 -395 -1504 2020 1237 -2238 -492 2017 -279 -14 1808 -317 -1050 1746 722 -1315 1815
2087A815Q80m353M49L404k176j758L553L52l711R10J683k195P21J883j823j500
$$ 1815 2695 -1658 -1209 2195 19 -1739 1814 2166 -1545 -635 1048 -1147 -426 1457 -366 -1866
2103a866K646j074l267K743K706l160r72K415j131k180K436M79k128J496J270
$$ -1866 780 -294 -3561 -818 1888 -1272 -2244 171 -960 -3140 -704 -225 -2353 -857 413
2118D13l354N4L423j223j685K519P63l657J158K389j995j79K704r59j847J974
$$ 413 -2941 -2887 536 -687 -2372 147 910 -2747 -1589 800 -1195 -1374 1330 371 -1476 498
2134D98J23k342J891K903l007q27K272o78k080K429J436l163J158J643k376j256
$$ 498 621 -1721 170 3073 66 -761 1511 833 -1247 1182 2618 -545 613 2256 -120 -1376
2150a376L489m11k956K427J266l413L17K726j074j163J923p16k052J914R71k910
$$ -1376 2113 1702 -1254 1173 2439 -974 -657 2069 995 -168 1755 1039 -1013 901 1872 -1038
2166a038J128K961k779j701L131L96l364J596K095j829r43J371q63r80K584j200
$$ -1038 90 3051 272 -1429 1702 2098 -1266 330 2425 596 -347 1024 161 -819 1765 565
2182E65k711K438J674l270l48L233j428k050J949K46k439J019J978j689p11K640
$$ 565 -2146 292 1966 -1304 -1652 1581 153 -1897 52 298 -2141 -1122 856 -833 -1544 1096
2198A096j506j929K546Q54k670J313J947k200r11K972p16j664J630O61k257P37
$$ 1096 -410 -2339 207 1061 -1609 -296 1651 -549 -1460 1512 796 -868 762 1423 -834 -97
2214i7K075k125r60L455j286k403K023J023k576K62K225k232j015K236o43k514
$$ -97 1978 -147 -1107 2348 1062 -1341 682 1705 -871 -609 1616 -616 -1631 605 -38 -2552
2230b552K681O52k920M35K471k181j250K495l34k045J439J178k142O25K164k500
$$ -2552 129 781 -2139 -1704 767 -1414 -2664 -169 -503 -2548 -1109 69 -2073 -1448 716 -1784
2246a784p56L508l27l345J552L069k607n41K048l40j004J480l78j619K006R07
$$ -1784 -2540 968 641 -2704 -1152 1917 -690 -1231 817 477 -527 953 575 -1044 962 1869
2262A869k744J85K813j643j927K480O25k910J034J912k255l28K334j070j521J979
$$ 1869 -875 -690 2123 480 -1447 1033 1658 -1252 -218 1694 -561 -889 1445 375 -1146 833
2278H33j4k540J676J968k497n73K611o81j834J533O16j958J406J651k556n18K821
$$ 833 819 -1721 -45 1923 -574 -1147 1464 783 -1051 482 1098 -860 546 2197 -359 -877 1944
2295A944q73k143K736M12k508J45K323j546j224K719o67j931J759N19k978J011
$$ 1944 1071 -1072 1664 2076 -432 -287 2036 490 -734 1985 1318 -613 1146 1665 -1313 -302
2311c02K502j748j830K540l92k324J443J162j667K45J483j838o82K296o08k408
$$ -302 2200 452 -1378 1162 770 -1554 -111 1051 -616 -371 1112 -726 -1408 888 280 -2128
2327b128K608J509l133m76K291m99j918J949L51j677J116Q55k480M41K680j966
$$ -2128 480 1989 -1144 -1620 671 172 -1746 203 554 -1123 -7 848 -1632 -1191 1489 -477
2343d77j291K297N16l066J186K132k188q82K340j012j269J521M96k273J401J565
$$ -477 -1768 529 1045 -2021 -835 1297 -891 -1773 567 -445 -1714 -193 303 -1970 -569 996
2359I96k215j231L487l94k402J784N14j731P80J545j710m72K521j114k070J916
$$ 996 -1219 -2450 1037 643 -1759 25 539 -1192 -412 1133 -577 -1049 1472 358 -1712 204
2375B04J230k415J89K420j572j072K212n17k037K202O63k363K27K176k176q77
$$ 204 1434 -981 -792 1628 56 -1016 1196 679 -1358 844 1507 -856 -629 1547 -629 -1506
2391a506K786n88k222J399J490k162l56K145j128o55J541n29k093K155J120k932
$$ -1506 1280 692 -1530 -131 1359 -803 -1159 986 -142 -797 744 215 -1878 277 1397 -1535
2407a535L05K949j589j775K074M59k121N85J751j984L39K160j714j106K593o0
$$ -1535 -1230 1719 130 -1645 429 888 -1233 -648 1103 -881 -542 1618 -96 -1202 1391 1331
2423A331k695J630K240k711p28K177j56j468J570K04k106J385J373k581nK589
$$ 1331 -1364 266 2506 -205 -933 1244 1088 -380 1190 1394 -712 673 2046 -535 -540 2049
2439B049q92k284K115N92k250O52J571j605o04K447j086j889J931N55k380P35
$$ 2049 1157 -1127 988 1580 -670 -18 1553 -52 -656 1791 705 -1184 747 1302 -1078 -343
2455c43J843j633r48J708k37j919J738J148k269L39J535j803o09K411j5k728K127
$$ -343 1500 -133 -1081 627 390 -1529 209 1357 -912 -573 962 -841 -1450 961 946 -1782 345
2472C45J298k281j215K737p27j114J837n43k058J875R54k619P24K163j430j989
$$ 345 1643 -638 -1853 884 157 -957 880 337 -1721 154 1108 -1511 -787 1376 -54 -2043
2488b043K288M13k377J161J449j620o51K158j197j475K364k46k369J750J467k463
$$ -2043 245 658 -1719 -558 891 -729 -1380 778 -419 -1894 470 224 -2145 -395 1072 -1391
2504a391l98K683r71j850J860P72j825O35J276j911L2J907r06j901K144P26k300
$$ -1391 -1789 894 -77 -1927 -67 705 -1120 -485 791 -1120 -1088 819 -87 -1988 156 882 -1418
2521a418O80J936j882m53K288p46j644K003O59k382O56J853k052n48K789m85k436
$$ -1418 -738 1198 -684 -1137 1151 405 -1239 764 1423 -959 -303 1550 -502 -1050 1739 1254 -1182
2538a182J512J211j576J29J464j335n88K064o55k270K327J012k299l67K505j062
$$ -1182 330 1541 -35 94 1558 223 -365 1699 1044 -1226 1101 2113 -186 -553 1952 890
2554H90j722J861r2j126J001J088k535L67J832j475j262K276J28k478J247J557
$$ 890 -832 1029 937 -189 812 1900 -635 -268 1564 89 -1173 1103 1231 -1247 0 1557
2570A557j965k99K104q32j755J945m88j728J763P26j890j29K241q37k125J966
$$ 1557 -408 -707 1397 565 -1190 755 267 -1461 302 1028 -862 -991 1250 413 -1712 254
2586B54J122k350P10J318j368o97J949r45j410K089L53k409Q32K151k154o79J884
$$ 254 1376 -974 -264 1054 -314 -1011 938 -7 -1417 672 1025 -1384 -552 1599 -555 -1234 650
2603F50l34j748J747Q80k544O94J868j865o77K174n72k542J912J416j658m02J441
$$ 650 316 -1432 315 1195 -1349 -655 1213 -652 -1329 845 273 -2269 -357 1059 -599 -1001 440
2620D40r29o12J742n00k010J835Q07k582M37K345j338j537J839K66j746R28J127
$$ 440 -489 -1101 641 141 -1869 -34 773 -1809 -1372 973 -365 -1902 -63 203 -1543 -615 512
2637E12j773K56J889j658r51K138K74k526J604J749k463q14K312m82j313J562
$$ 512 -1261 -1005 884 -774 -1725 413 687 -1839 -235 1514 -949 -1763 549 67 -1246 316
2653C16K07j354J248O96k097j15K437m52k158K253K36k236O29K032j556n33J858
$$ 316 523 -831 417 1113 -984 -1099 1338 886 -1272 981 1217 -1019 -390 1642 86 -447 1411
2670A411m39j760J473Q04j837L40K078k130m91J974o63j261J124J071k402M09
$$ 1411 972 -788 685 1489 -348 -8 2070 -60 -551 1423 760 -501 623 1694 -708 -299
2686b99J668j392n64K164q63j694J848Q54k112k26K017j082q76J589k97j547J677
$$ -299 1369 -23 -587 1577 714 -980 868 1722 -390 -616 1401 319 -557 1032 735 -812 865
2703H65M97k264N65K128j697j271K235r8k147J156J179j742o7J783j497p72K066
$$ 865 1362 -902 -337 1791 94 -1177 1058 960 -1187 -31 1148 -594 -661 1122 -375 -1147 919
2720I19m61k082J321J426k346l37K753o24k072J330O23j661J089J135k076k06
$$ 919 458 -1624 -303 1123 -1223 -1560 1193 569 -1503 -173 450 -1211 -122 1013 -1063 -1269
2736a269J979j036j447J769Q54k182P14J780j763r37K120m38j517J784j79j733
$$ -1269 710 -326 -1773 -4 850 -1332 -618 1162 -601 -1538 582 144 -1373 411 232 -1501
2752a501J138J444j734l59K199p55k459K018Q02k216P26J416j230m76J376p28
$$ -1501 -363 1081 -653 -1012 1187 432 -2027 -9 793 -1423 -697 719 -511 -987 389 -339
2768c39j424K035J168k563J94K049j535j055J590M72j266R58L69j825L93K355
$$ -339 -1763 272 1440 -1123 -929 1120 -415 -1470 120 592 -674 284 653 -1172 -779 1576
2784A576j573q79K076p9k447J058J813k207j7K097j172j207J745J02j889J389
$$ 1576 3 -876 1200 1121 -1326 -268 1545 -662 -679 1418 246 -961 784 886 -1003 386
2800C86J259k237j02K067j002j380K096j06j211J97J416j571o21K123q91j149
$$ 386 1645 -592 -694 1373 371 -1009 1087 981 -230 -33 1383 -188 -809 1314 423 -726
2816g26J300P98k454J343J700k096k65K106n67k199J473Q42j560P66P55r59q20
$$ -726 574 1372 -1082 261 1961 -135 -400 1706 1139 -1060 413 1255 -305 461 1216 257 -563
2833e63K069j289j451J904P93k394M22J356q80p54J647p16j299J399M86k112N04
$$ -563 1506 217 -1234 670 1463 -931 -509 847 -33 -787 860 144 -1155 244 730 -1382 -878
2850h78J821j141j204J614K9j886J723Q11k006L66J623j379q82K063l82j544J174
$$ -878 943 -198 -1402 212 241 -1645 78 889 -1117 -751 872 -507 -1389 674 292 -1252 -78
2867g8J236k037l53K177q76j407J562N55j893P07R73j621K86J873j240j589J773
$$ -78 1158 -879 -1232 945 69 -1338 224 779 -1114 -407 566 -1055 -769 1104 -136 -1725 48
2884D8N97k205O76J800j663l17J617p28j282J482K62j588J010J332j904q36K619
$$ 48 645 -1560 -884 916 -747 -1064 553 -175 -1457 25 287 -1301 -291 1041 -863 -1699 920
2901I20m28j702J462Q24j953j4J875j297o66K257r33j411J240J159k081J61J712
$$ 920 492 -1210 252 1076 -877 -891 984 -313 -979 1278 345 -1066 174 1333 -748 -587 1125
2918A125j522m91J829m24j190J331L36j829O54J767j688q54J738M2k013J483R88
$$ 1125 -397 -888 941 517 -673 658 994 -835 -181 1586 -102 -956 782 824 -1189 294 1282
2935A282k075L40J565p77r17J377l31j677J853R08k187j60K539j279j601J711
$$ 1282 -793 -453 1112 335 -582 795 464 -1213 640 1548 -639 -799 1740 461 -1140 571
2951E71N35j829P60R49j212l67J938j092j250K076j04j699K94J874j728n11J595
$$ 571 1106 -723 37 986 -226 -593 1345 253 -997 1079 975 -724 -430 1444 -284 -795 800
2968H00m50j351J629L39j899N84J237j357m22J936r65j531J881P10j936M44J271
$$ 800 350 -1001 628 967 -932 -348 889 -468 -890 1046 81 -1450 431 1141 -795 -351 920
2985I20j381n84J809n99j544K005K63j931K44J849j595o56J881p03j405R09J238
$$ 920 -461 -1045 764 165 -1379 626 889 -1042 -798 1051 -544 -1200 681 -22 -1427 -518 720
3002G20j527J11J642j229j184K044k99j763J347J139j797m13J722q01n84J275
$$ 720 -807 -696 946 -283 -1467 577 278 -1485 -138 1001 -796 -1209 513 -288 -872 403
3018D03m2j473J251N84j678p1K313j167j641J970L88j854L51J102r03j13J596
$$ 403 361 -1112 139 723 -955 -1026 1287 120 -1521 449 837 -1017 -666 436 -467 -580 1016
3035A016j069j218J457N77j989R22J816k154m54J878n86j411J656O86j911N49
$$ 1016 -53 -1271 186 763 -1226 -304 1512 -642 -1096 782 196 -1215 441 1127 -784 -235
3051b35J575j969J65J516p46j298J521N66j859N58J682j116q94J249k57j086Q40
$$ -235 1340 -629 -464 1052 306 -992 529 1095 -764 -206 1476 360 -534 715 458 -628 212
3068B12N95j382M92J543j768k58J836n01j562J239P90j538j00J639j057j137K401
$$ 212 807 -575 -83 1460 -308 -566 1270 769 -793 446 1236 -302 -402 1237 180 -957 1444
3085A444p58j395J189Q59j816m54K162p26j192J460M8j450R55J044j825k6J934
$$ 1444 686 -709 480 1339 -477 -931 1231 505 -687 773 821 -629 326 1370 -455 -481 1453
3102A453j467j163J723J35j625J008Q80j493n99J871o72r69J394O8j460R65P03
$$ 1453 -14 -1177 546 681 -944 64 944 -549 -1148 723 51 -918 476 544 -916 49 752
3119G52j561m3K001j175j429J472N87j123o2J322j241k61J228o88j068J618L35
$$ 752 -809 -852 1149 -26 -1455 17 604 -519 -581 741 -500 -761 467 -221 -1289 329 664
3136F64j942P41J572j481n95J313M7j363P30J106k123O09J683j978l05J805m61
$$ 664 -1278 -537 1035 -446 -1041 272 319 -1044 -314 792 -1331 -722 961 -1017 -1322 483 22
3153B2j252J355O81j858N24J182q20o84J399j25j617J378M63j622L58J712j367
$$ 22 -1230 125 806 -1052 -528 654 -166 -850 549 424 -1193 185 648 -974 -616 1096 -271
3170b71p47J479j73j172O44J038j463M31J410j192o64J566q4j686R68J246j782
$$ -271 -1018 461 288 -884 -240 798 -665 -234 1176 -16 -680 886 802 -884 84 1330 -452
3187d52m95K065p99j039R59O66j353Q07N64j540J89J666p73j506J698O72j995
$$ -452 -947 1118 319 -720 239 905 -448 359 923 -617 -428 1238 465 -1041 657 1329 -666
3204f66N07J389j216q31J730m01j393J797K8j821P60J126j312k45J731n88j332
$$ -666 -159 1230 14 -817 913 512 -881 916 944 -877 -117 1009 -303 -548 1183 595 -737
3221g37J225Q27j739J27J559j252o07J479m61j661J440P75j207n81J887j034r69
$$ -737 488 1315 -424 -297 1262 10 -597 882 421 -1240 200 975 -232 -813 1074 40 -929
3238i29J355Q2j740J342P44j943M53J518r22j415J821Mj574R54J110j438R3J323
$$ -929 426 508 -1232 110 854 -1089 -636 882 -40 -1455 366 370 -1204 -250 860 -578 -485 838
3256H38r81q48J260k52j556J289R18j577k65J732o84j149J101N03j288L36J383
$$ 838 -143 -991 269 17 -1539 -250 668 -909 -1174 558 -126 -1275 -174 329 -959 -623 760
3273G60j260k62R84o96q13J473M39k067P47J517j134q10J675l77j342J580J32
$$ 760 -500 -762 222 -474 -1287 186 625 -1442 -695 822 -312 -1122 553 176 -1166 414 546
3290E46j421N58J219j206n70J995p90j414J404M82j400K82J357p22p84J267m14
$$ 546 -875 -317 902 -304 -874 1121 331 -1083 321 803 -597 -315 1042 320 -464 803 389
3307C89j058J287N83j826J07J673j019r38J552j04j057O14M56j304N26J204r66
$$ 389 -669 618 1201 -625 -518 1155 136 -802 750 646 -411 203 659 -645 -119 1085 119
3324A19o67J664m16j406P48J492j488l42J191o76p69J175K49j534R47R14j650
$$ 119 -548 1116 700 -706 42 1534 46 -296 895 219 -550 625 874 -660 287 1201 -449
3341d49J26J670r89j191J374M93j504L00Q56r18j91J276o99q24J024J04j198L85
$$ -449 -323 1347 358 -833 541 1034 -470 -170 686 -232 -423 853 154 -670 354 458 -740 -355
3359c55J376j459l94J323k96j240J179O53j640O27J001j078m91J531o81j157J171
$$ -355 1021 -438 -832 491 195 -1045 134 787 -853 -226 775 -303 -794 737 56 -1101 70
3376G0Q79j903L75J025r13l20J315j60j601J123P12j385J34J691j460r25J574
$$ 70 949 -954 -579 446 -467 -787 528 368 -1233 -110 602 -783 -649 1042 -418 -1343 231
3393B31N8j298J114L85j486J66J218p74r22K064l10j666J261O30j449J98J235
$$ 231 289 -1009 105 490 -996 -830 388 -386 -1308 756 446 -1220 41 671 -778 -580 655
3410F55n54p48J165j03j165R27L51q57O3J335p96j187J442J00j342M20J085r19
$$ 655 101 -647 518 415 -750 177 528 -329 -266 1069 273 -914 528 628 -714 -294 791 -128
3428a28k85R32l42q02J175J19j244L64J158j325m06J686l84j483J527J33j647
$$ -128 -413 519 177 -625 550 669 -575 -211 947 -378 -784 902 518 -965 562 695 -952
3445i52N65J138q20m28J419o80j398J686L95j242J42J484j449n30J101K73j235
$$ -952 -387 751 -69 -497 922 242 -1156 530 925 -317 -175 1309 -140 -670 431 704 -531
3462e31R74L68j552N46J422j027q53J289J83j468P77P00j221P4J052p43o40R97
$$ -531 443 811 -741 -195 1227 200 -653 636 819 -649 128 828 -393 -319 733 -10 -650 347
3480C47K3r92P58R52j623kJ190n97j057J445Jj182M70R58j305KJ516r66j166J755
$$ 347 370 -622 136 1088 -535 -537 653 56 -1001 444 445 -737 -267 691 -614 -612 904 -62 -1228 527
3500E27J4j366L32J294j043n88J337j57j282J065L84j231J10J369j152k49J341
$$ 527 541 -825 -493 801 -242 -830 507 350 -932 133 517 -714 -604 765 -387 -636 705
3517G05p88q91J028O50j589N14R25q40l18J349m23j025R19L28j540N62J379r87
$$ 705 -83 -974 54 704 -885 -371 554 -286 -604 745 322 -703 216 544 -996 -434 945 -42
3535d2o01R36J13j447J052N14j014J84J068j085n05J480p07p75J074L56j015m56
$$ -42 -643 293 406 -1041 11 525 -489 -305 763 -322 -827 653 -54 -829 245 601 -414 -870
3553h70J570q62o72J168K60j529J024Q48j412j35J394p87q67J562k05j362O80
$$ -870 700 -162 -834 334 594 -935 89 937 -475 -610 784 -3 -870 692 487 -875 -195
3570a95J071r76m90J291o92m07R13J41j226L93J400j340m32J222l29q79J032L43
$$ -195 876 -100 -590 701 9 -398 515 656 -570 -177 1223 -117 -549 673 344 -535 497 840
3588H40j151M75Q27r58j54Q09j39r50P74O01j435K76J390j087p77J375m1j409
$$ 840 -311 164 991 33 -121 688 549 -401 373 974 -461 -185 1205 118 -659 716 675 -734
3606g34J301Kj213N77P56p87p16J367j42j027J028K57j283L96J239r16q53J362
$$ -734 567 569 -644 -67 689 -98 -814 553 411 -616 412 669 -614 -218 1021 105 -748 614
3624F14k94j030J018L85j351K10J409p59j261J046P14j025M18K44q29k90J347
$$ 614 320 -710 308 693 -658 -448 961 202 -1059 -13 701 -324 94 338 -491 -781 566
3641E66r02p78J254M18j297K09J329j317j62J257p49o05Q51K39j219O29Q72j215
$$ 566 -336 -1114 140 558 -739 -530 799 -518 -680 577 -172 -777 74 313 -906 -277 595 -620
3659f20k62J552n09r82N88K87p48K41R93q30k40R29m89p75R12L15j275O13J268
$$ -620 -882 670 161 -821 -233 54 -694 -453 540 -290 -530 399 -90 -865 47 362 -913 -300 968
3678I68j167k51J074m02n95L22M87j147M58J113q65l64R81q4j028N74O43q86L20
$$ 968 -199 -450 624 222 -373 -51 436 -711 -253 860 -5 -369 612 528 -500 74 717 -169 151
3697A51N75o26n21Q74K11j112Q17L53j237N35J178q56n78Q93J28j096K91P53j072
$$ 151 726 100 -421 453 664 -448 369 722 -515 20 1198 342 -236 657 785 -311 -20 733 -339
3716c39K98Q92n90p44J289j27j396P98Q26j088JP88m57o90J079r5j220J056N82
$$ -339 -41 851 261 -483 806 679 -717 81 907 -181 -180 608 151 -539 540 445 -775 281 863
3735H63j289l0J305n75r20J123K42j222kJ421r40n32P87l6q06Q35K33j059K89
$$ 863 -426 -456 849 274 -646 477 719 -503 -505 916 -24 -556 231 195 -611 224 457 -602 -313
3754c13J298r60j153J489j40j008P04M74o26n6J235j421k2P93j86q92R22K45j199
$$ -313 985 25 -1128 361 221 -787 -83 391 -235 -291 944 -477 -499 294 108 -784 138 383 -816
3773h16K61Q97n74o57J219J45j094O97L90j129R0Q79l99p43R82O7j063O71R44
$$ -816 -555 342 -232 -889 330 475 -619 78 468 -661 -571 308 -91 -834 148 215 -848 -177 767
3792G67j260P8J125q20o53J142k36p17M69N46j149K11J143o57r06R29K94p82O27
$$ 767 -493 -415 710 -110 -763 379 143 -574 -105 441 -708 -497 646 -11 -917 12 306 -476 151
3811A51K43p27j77J188n02j141J411M27j425M81J276j168l57O38No15N58J56r75
$$ 151 394 -333 -510 678 176 -965 446 873 -552 -71 1205 37 -320 318 323 -292 266 422 -553
3830e53O52P03r52M9J009m76o18L45Q63j276K32R28q58k90Q64j66r73Q75N24j076
$$ -553 99 802 -150 -101 908 432 -186 159 1022 -254 -22 906 48 -242 622 456 -517 358 882 -194
3850a94K29P54q65n40J183q2r78O16M61p70j3J149j047n84R03K80j017N11P79
$$ -194 35 789 -76 -616 567 485 -493 123 584 -186 -199 950 -97 -681 222 502 -515 -4 775
3869G75j041l27J229m83n19R72k21j111Q48M53j282J88J026k64q97Q40J45r96
$$ 775 -266 -593 636 153 -366 606 385 -726 122 575 -707 -519 507 243 -654 186 331 -665
3887f65L04Q65q99j19R11m02j036R75M29j035M24P30q82j63N76j45l68N08L22
$$ -665 -361 504 -395 -514 397 -5 -1041 -66 363 -672 -248 482 -400 -563 13 -132 -500 8 330
3906C30q48K95Q40r32n15J243j08q65N23M06j087N16R15j171k05O59K9o82P43
$$ 330 -518 -223 617 -315 -830 413 305 -560 -37 369 -718 -202 713 -458 -663 -4 25 -657 86
3925H6M32q60m82J344n37r86J401L8j114O44M61j041L28O54p06l81J065L9p68
$$ 86 518 -342 -824 520 -17 -1003 398 436 -678 -34 427 -614 -286 368 -338 -719 346 385 -383
3944c83L77J059j394J42J308q50n79M62L35q98L91Q89j258j18J446o88q03R16
$$ -383 -6 1053 -341 -199 1109 259 -320 142 477 -421 -30 859 -399 -517 929 241 -562 354
3962C54L64j397M88P14o11k73Q01Q2j032R94J4r31J43J472j399k18J338m46r52
$$ 354 718 -679 -191 523 -88 -361 440 522 -510 484 498 -433 -290 1182 -217 -435 903 457 -495
3981d95R12L62j458M62J120j117l21R87Op99R72r1j083M33R64p99n33J103j81
$$ -495 417 779 -679 -217 903 -214 -535 452 458 -341 631 540 -543 -110 854 55 -478 625 444
4000D44p88L25M45o35J68Q41q11p03J289m48n81L38O16j114K6J012m70n60R07
$$ 444 -344 -19 426 -209 -41 800 -11 -714 575 127 -454 -116 500 -614 -588 424 -46 -606 301
4019C01J63j319Q01O26j199J44P33k7r84R05J02p69L51Q82j205l71J236n92n15
$$ 301 464 -855 -54 572 -627 -483 250 223 -761 144 246 -523 -172 710 -495 -866 370 -222 -737
4038g37P68L24j102M72N92n65m26J098m02n61O03K27j012L20Q35j079K3J188n23
$$ -737 31 355 -747 -275 317 -248 -674 424 22 -539 64 291 -721 -401 434 -645 -622 566 43
4057D3p48J065n5r08N62P27j048q6Q53k50o09O19L20j064K41J008p73m55J034
$$ 43 -705 360 305 -603 -41 686 -362 -448 405 155 -454 165 485 -579 -338 670 -103 -558 476
4076D76l27p57P49M20q55P2P70p13l67J200k49r44N42N15r07J3J089q33O7M55
$$ 476 149 -608 141 561 -294 -222 548 -165 -532 668 419 -525 17 532 -375 -362 727 -106 -39 416
4096D16K1q82L91Q79j154L5J040m39o14P83L7j020O80N83q28j80O91j71o58J064
$$ 416 437 -445 -54 825 -329 -294 746 307 -307 476 513 -507 173 756 -72 -252 439 268 -390 674
4116F74m9j047L01P11q19l60J317l46r91R69O3p57K80J032j187j34R36l95r03
$$ 674 625 -422 -121 590 -229 -589 728 382 -609 360 423 -334 -54 978 -209 -343 593 198 -705
4135g05J081l8q13K62O23o64m48J141l69n37N87N05j378M78R67j071j26R24k48
$$ -705 376 338 -475 -213 410 -254 -702 439 70 -467 120 625 -753 -275 692 -379 -505 419 171
4154A71q63P12K86p15m1P58o08l0M70j13r76P81P43n83n30L78j56m37O16M10r89
$$ 171 -692 20 306 -409 -450 308 -300 -330 140 27 -949 -168 575 -8 -538 -160 -316 -753 -137 273 -716
4175g16M10R97j233J34P08l75n01P61N1j076O00N44q42Q7Q87o04m83Q12L07j242
$$ -716 -306 691 -542 -408 300 -75 -576 185 236 -840 -240 304 -538 -451 436 -168 -651 161 468 -774
4195g74N15N92o12k31J185l96j022J143R0j150N91N83p68l56Q96l03m29R62K20
$$ -774 -259 333 -279 -510 675 279 -743 400 490 -660 -69 514 -254 -610 286 -17 -446 516 736
4214G36j181L50O10l30l62N08J56o80M15N49p98j0O66n74m75J063k21o28N12P17
$$ 736 -445 -95 515 185 -177 331 487 -193 222 771 -27 -37 629 55 -420 643 422 -206 306 1023
4234A023r03l87J157o99n58J134o3j109P37K82o52n67J202m35n52O48q5l89J03
$$ 1023 120 -267 890 191 -367 767 704 -405 332 614 -38 -605 597 162 -390 258 173 -216 -113
4253a13N91o68J05Q10p83p60J348j02j218Q77P25j149j28R97k99n09M75P9q16
$$ -113 478 -190 -85 725 -58 -818 530 428 -790 87 812 -337 -465 532 233 -276 199 278 -538
4272e38O64L24q54m3P88o5j140Q16M07q29L83P64q43m54R05l24m14N06K0n98J65
$$ -538 126 450 -404 -447 341 276 -864 -48 359 -470 -87 677 -166 -620 285 -39 -453 53 73 -525 -360
4293c60P19p31n32J346j85q19Q70J30j005L33Q05q58m82J307l31j040J075K34
$$ -360 359 -372 -904 442 257 -562 308 438 -567 -234 571 -287 -769 538 207 -833 242 476
4311D76j281N53O19p05k47Q15l10l10J13Q33j036L74Q30q53o40J100q2q80L73
$$ 476 -805 -252 367 -338 -585 230 -80 -390 -277 556 -480 -106 724 -129 -769 331 249 -631 -258
4330b58N84m44l33R87k53p60J043j09j279R55O32j037J06P58j49o77M35L13o97
$$ -258 326 -118 -451 536 283 -477 566 457 -822 133 765 -272 -166 592 443 -234 201 514 -183
4349a83N37K89p28k04Q07m7p44P30Oq36M34Q06j082j18R40j13o66P28q5p38L23
$$ -183 354 643 -85 -289 518 471 -273 457 463 -373 61 867 -215 -333 607 494 -172 556 471 -267 56
4370E6N69o83l71J135m11j212J007N76r16J29O98p98k74R02l37l62L79L80p64
$$ 56 625 -58 -429 706 295 -917 90 666 -250 -121 577 -221 -495 407 70 -292 87 467 -297
4389b97k4R24n27m61O70l62m45N42R65j507L41O56m98o42R29n6p10K57Q14p23
$$ -297 -321 603 76 -385 285 -77 -522 20 985 -522 -181 475 -23 -665 264 208 -502 -245 569 -154
4409a54k54N91j52o75P30m0o82M81N27o10l41J328r11m12O13M69r29L71P76j046
$$ -154 -408 183 31 -644 86 46 -636 -155 372 -238 -579 749 -162 -574 39 508 -421 -50 726 -320
4429c20k13R54k15r92J124j32p20R2J066q53k12J190m79o04J56J27o00N07N85
$$ -320 -533 421 206 -786 338 206 -514 -422 644 -209 -421 769 290 -314 -158 -31 -631 -124 461
4448D61q11k92J116l31p73P64L80j230L14Q57l92m63O82j9q25L56O12q52qJ053
$$ 461 -350 -642 474 143 -630 134 514 -716 -402 455 63 -400 282 263 -562 -206 406 -446 -454 599
4468E99o21n46P42K13r05O33K49l88R9L85n42j42O46J16j194Q65N29r29P3O97
$$ 599 -22 -568 174 387 -518 115 364 -24 75 460 -82 -224 422 538 -656 209 738 -191 -118 579
4488E79m77m67Q35J55j133L66O75n27l67Q42l30p86Q59O63j076r3P28m68l57J064
$$ 579 102 -365 470 625 -508 -142 533 6 -361 481 151 -635 224 887 -189 -282 446 -22 -379 685
4508F85m06o51L48N47j311N39P53o51k24J288n77o61M85J39m44J27N45p30j59
$$ 685 279 -372 -24 523 -788 -249 504 -147 -371 917 340 -321 164 303 -141 -14 531 -199 -358
4527c58N38J67j103Q77L68r96J86R89q46k81N19K03q57L69N80r42K67M96k55p87
$$ -358 180 347 -756 121 489 -507 -321 668 -178 -459 60 263 -594 -225 355 -587 -320 176 -79 -866
4547h66Q36N00r18L19M73p69q2Q53m18p06J309m91p72M47P63o62j52P12m24o42
$$ -866 -30 470 -448 -129 344 -425 -507 346 -72 -778 531 40 -732 -285 478 -184 -336 376 -48 -690
4567f90O92K48q31O50P0l55j93Q44m41p32J024j51p21K76P68p96k40R94k97p12
$$ -690 2 250 -581 69 139 -216 -409 435 -6 -738 286 135 -586 -310 458 -338 -578 416 119 -593
4587e93R72J0o68K38M09m47m17R38j5p83N21L93r24K49O97m79n69J147k43p84
$$ -593 379 389 -279 -41 368 -79 -496 442 427 -356 165 558 -366 -117 580 101 -468 679 436 -348
4607c48M40K79p15L27Q72q39m69J105j83j015O60M43r30L15P56o48n00R36k01
$$ -348 92 371 -344 -17 855 16 -453 652 469 -546 114 557 -373 -58 698 50 -450 486 285
4626B85p46M98O24p87n3Q32o66n96R51k7q29O10M99q96p1J046n29o06P52Jq13
$$ 285 -461 37 661 -126 -179 653 -13 -609 342 315 -514 96 595 -301 -372 674 145 -461 291 292 -521
4647e21O18M52m78m03J071p86oN48j11q48M50O61r39J23M47j23q00N88L18r15
$$ -521 97 549 71 -332 739 -47 -53 495 384 -464 -14 647 -292 -169 278 155 -645 -57 261 -654
4667f54O75M63j162M11M98j99m86M67N35p91K07O01p89k42L59L08r35N57M1n20
$$ -654 21 484 -678 -267 231 32 -454 13 548 -243 -36 565 -224 -466 -107 201 -734 -177 -136 -656
4687f56L07N23l79m61J118j12p85N30M42q89K2O32m63o01J035k1j065O87N02r32
$$ -656 -349 174 -205 -666 452 340 -445 85 527 -362 -340 292 -171 -772 263 242 -823 -136 366 -566
4707e66O0J072p45l52N56L97j020L74P03r07n7R40k28n03M64Ro39L29O77p05j75
$$ -566 -506 566 -179 -531 25 422 -598 -224 479 -428 -485 455 227 -276 188 197 -442 -113 564 -141 -316
4728c16R28n02l93N86J96j176J009L77p58j04P75j33o93K40K64k82k4R83j051
$$ -316 612 110 -283 303 499 -677 332 709 -49 -153 622 489 -204 36 300 18 -6 977 -74
4747g4l88P85K1p78Q64J21p89L14L67o29n7O86j91p19P10L28r04P7J018o19n38
$$ -74 -462 323 344 -434 430 551 -238 76 443 -186 -243 443 252 -467 243 571 -333 -256 762 143 -395
4768c95Q82l76o07O50K84q18kJ214j105j60P83K74j028K67M17p99K7Q68n07l34
$$ -395 487 111 -496 154 438 -380 -382 832 -273 -433 350 624 -404 -137 280 -519 -492 376 -131 -465
4788d65O85j78m42K33N59q86J06Q23q10l53Q09K31j133P95L00m78l36R37l21p08
$$ -465 220 42 -400 -167 392 -494 -388 435 -375 -728 81 312 -821 -26 274 -204 -540 397 76 -632
4808f32Q66k31n84L84N07p36o6J137m19q92N02J69n10K18M18m76q1P31l80n20
$$ -632 234 3 -581 -197 310 -426 -492 645 226 -666 -164 5 -505 -287 131 -345 -426 305 -75 -595
4828e95O40L52o92M24K53p64NN85o9n17J87N49p98M80J35l72k71Q32J02r45N51
$$ -595 45 397 -295 129 382 -382 -377 208 139 -378 -191 358 -440 40 175 -197 -468 364 466 -479 72
4849G2L50o62qQ22n36m61Q26j34m71O1O99r37L09P55l65n62Q18j91o09J74M93
$$ 72 422 -240 -248 574 38 -423 403 269 -202 -141 558 -379 -70 685 320 -242 576 385 -224 -50 443
4870D43p64L14L88l71n88Q20J74m44J43N95m37l01M57j68n28K23O21q04L96M05
$$ 443 -321 -7 381 10 -578 242 416 -28 115 710 273 -28 429 261 -267 -44 577 -227 169 574
4890E74p06j46M03j38m10M20M51q91L48P50p18l48Q36j40n63M15J29q58K87N80
$$ 574 -132 -278 125 -13 -423 -3 448 -443 -95 655 -63 -411 425 285 -278 137 266 -592 -305 275
4910B75k41m31P57j45p01M58M05p51R9O52n13o4N41R2p86M43K89o26j99N89n8
$$ 275 34 -397 360 215 -486 -28 377 -374 -275 377 -136 -200 341 433 -353 90 379 -247 -446 143 85
4931H5o72N91M87q32L92m9k79k03P56n06j74M29J78n06J97J54m99K7P78m14l08
$$ 85 -587 4 491 -341 51 2 -277 -480 276 -230 -404 25 203 -303 -106 48 -451 -424 354 -60 -368
4952c68O79j94m46M81L33n70l95P10j02r28J037l07m27L15P39o14l59M96p9p45
$$ -368 311 117 -329 152 485 -85 -480 230 128 -800 237 -70 -497 -182 557 -57 -416 80 1 -744
4972g44J113L0q18L11N99n47j41P14l17m46K27K48m29J99N40p17k00P79l96m25
$$ -744 369 399 -419 -108 491 -56 -197 517 200 -246 -19 229 -200 -1 539 -178 -378 401 5 -420
4992d20O18L09l88j04M53n73J1L85J61j070O96L69m87L25K28j93o49P97k17o39
$$ -420 198 507 119 15 468 -105 -94 291 452 -618 78 447 -40 285 513 320 -329 468 251 -388
5012c88N26L03o00K56K08l48k84P21j80l21J94O45p00j54M42k70k78L75L05m59
$$ -388 138 441 -159 97 305 -43 -327 394 214 -107 87 732 32 -122 320 50 -228 147 452 -7
5032gN4J0j55j08M32l97l12O48R3n07j7P07l66k75M70l45m53Q89n1q18N08K74
$$ -7 47 57 -98 -206 226 -171 -483 165 258 -249 -266 441 75 -200 270 -75 -528 361 310 -508 0 274
5054B74m78l17O78q9m02M01K58n79O3O43q85j6N48k82j40M03J16o39K04M28l67
$$ 274 -204 -521 157 68 -334 67 325 -254 -191 452 -433 -449 99 -183 -323 80 196 -443 -239 189 -178
5075a78m87R40j37n26M72k58j52K20L79l95k34N79j58p27R55O7o55J60N90o08
$$ -178 -665 275 138 -388 84 -174 -326 -106 273 -122 -356 223 65 -662 293 360 -295 -135 455 -153
5095a53j93M96o6l06K24M25p23J5O80l61m51O22l08j54K24N73p74L8N45l46n77
$$ -153 -346 150 84 -222 2 427 -296 -281 399 38 -413 209 -99 -253 -29 544 -230 -192 353 7 -570
5116e70M93K65k92J27L20l98J2L86n39RL69J87n73J23L50k62m29R10lo04K76Q4
$$ -570 -77 188 -104 23 343 -55 -43 343 -196 -187 182 369 -204 -81 269 7 -422 488 485 -119 157 241
5138B41k46j37K98j20J94m1pm83L42J56k27J40M63l99l63P57l30o96N86%j05j8
$$ 241 -5 -142 156 36 230 189 182 -301 41 197 -30 110 573 174 -189 568 238 -458 128 128 23 5
5160EM05m62l61P31j78p60M62M79o18O8O32n34P0L73K16r03J11O53o29J29L00
$$ 5 410 -52 -413 318 140 -620 -158 321 -297 -229 403 -131 -61 312 528 -375 -264 389 -240 -111 189
5181A89l3m43M89Q8p95L55M13l75l99P85n45n4O09K33q33K02N95q67O4M54Jm58
$$ 189 156 -287 202 290 -505 -150 263 -112 -511 274 -271 -325 284 517 -316 -114 481 -386 -322 132 133 -325
5203c25M37k8n62L11L91o07q3M75J93o66K79K84j12k24O27n89k03M98J83o59N66
$$ -325 112 84 -478 -167 224 -383 -466 9 202 -464 -185 99 -13 -237 390 -199 -402 96 279 -380 186
5224A86k46k95J54O98m42m72P83m92l10L04P02j080L85L80k21k87K62K61p09K66
$$ 186 -60 -355 -201 497 55 -417 366 -126 -436 -132 570 -510 -125 255 34 -253 9 270 -439 -173
5244a73P19m95k28M29l62k29K71O60o88M10K9l92m4M04l16M5K0L48k95j64K46
$$ -173 546 51 -177 252 -110 -339 -68 592 -96 314 343 -49 -93 311 -5 40 60 408 113 -51 195
5265A95l51k06N07j11o53Q23j35m89L76K95j77r2N72n61n44O80L10n33L23K22
$$ 195 -156 -362 145 34 -619 204 69 -420 -44 251 74 -18 554 -7 -551 129 439 -94 229 451
5285D51k42n82Q98m82k35R5M24n98k3P57j77n12L08J08n32L03M31o91q4N53j45
$$ 451 209 -373 525 43 -192 -97 327 -271 -294 463 286 -226 82 190 -342 -39 392 -299 -383 170 25
5306B5n25O10K07r23K87J98j90M1M53l21j84L37r9m43M65M03o82r4M75N2m92L65
$$ 25 -500 110 317 -606 -319 -121 -311 -270 183 -138 -322 15 -84 -527 -62 341 -341 -435 40 92 -400 -35
5328c5J23n68L13O40n00l33N34k91K1K87n0p38O57J84n68M5p4N10n89O93j40m81
$$ -35 88 -480 -167 473 -27 -360 174 -117 -96 191 141 -597 60 244 -324 -279 -353 157 -432 261 121 -360
5350c60P6J65l00LP24p1o13M48J69n24K30J08j50j89N74o4o23K21N41r28O02L94
$$ -360 -284 -119 -419 -416 308 237 -376 72 241 -283 -53 55 -95 -284 290 226 -397 -176 365 -563 39 433
5372D33m82j62K26M08o88O13L64q32K25L41k82k83O86n00m85N00L92o54K64L26
$$ 433 -49 -211 15 423 -265 348 712 -120 105 446 164 -119 567 67 -418 82 474 -180 84 410
5392D10k97l15O27J37p41J18O74r16N77K9m18j21N40M8q58L46N45m41l18N30J3
$$ 410 113 -202 425 562 -179 -61 613 -303 274 303 -115 -236 304 352 -506 -160 385 -56 -374 156 169
5413A69m74L20K33n75J02P32k58k11M59o9j044O31M1m62M54J77k46k84O19k72
$$ 169 -305 15 248 -327 -225 507 249 38 497 428 -616 15 56 -406 48 225 -21 -305 314 42
5433D2j63R7L20o97O26J76p06J7M15l63k69N40P0m33K72K93m52j67O21k28n21
$$ 42 -121 -24 296 -401 225 401 -305 -288 127 -236 -505 35 105 -328 -56 237 -215 -382 239 11 -510
5454e10M81K39o16L07O10n63j97L19j00o36L74K18p82L04Q80l88l41M99k75k51
$$ -510 -29 210 -406 -99 511 -52 -249 70 -30 -666 -292 -74 -856 -552 328 -60 -401 98 -177 -428
5474d28L71J98l91P7L46m04j27O38kp09N23nk94l68Q96k30l56L47j2p48Q45Q1
$$ -428 -57 141 -250 -173 173 -231 -358 280 278 -431 92 87 -207 -575 321 91 -265 82 70 -678 167 248
5496B48n15P9P87m25l28N26j20k39q0L54l65j21O16l47n56O72j17j85o7N71m97
$$ 248 -267 -188 599 174 -154 372 252 13 -67 287 -78 -199 417 70 -486 186 69 -116 -183 388 -109
5517a09l8N87l91NK36N0o76K08L78k51k77P12j08k24j65K00j89j11P34m37k48
$$ -109 -147 440 49 54 290 340 -336 -128 250 -1 -278 434 326 102 -63 137 -52 -163 571 134 -114
5538a14N24o0l81J19J64m28j59R25r27j71R74k50m29K2M32j10j67L12l01m98R34
$$ -114 410 350 -31 88 252 -176 -335 590 -337 -508 466 216 -213 -191 241 131 -36 276 -25 -523 411
5559D11j11p59N86K28l24q6K26j75n57O25J60p96O45M18o67j35K22k0j63L05O0
$$ 411 300 -459 127 355 31 -55 171 -4 -561 64 224 -572 73 491 -176 -311 -89 -109 -272 33 93
5580I3k63mN35n74j28P01l52n16M13N33p86J39M45n55j04O55k62n71M92K98n39
$$ 93 -170 -174 361 -213 -341 360 8 -508 -95 438 -348 -209 236 -319 -423 232 -30 -601 -109 189 -350
5601c50L10K29j75n20N23m6l90K53O08o65l6P94n27k63N28j20n20L90K78n19k12
$$ -350 -40 189 14 -506 17 -29 -419 -166 442 -223 -259 535 8 -255 273 153 -367 23 301 -218 -430
5622d30O31l45k30N38n7j52j03N42o84K77J79k2l85L94p2j65J74N30q32K1M52
$$ -430 201 -144 -374 164 107 -45 -148 394 -290 -13 166 144 -241 153 81 -84 90 620 -212 -191 261
5643B61J4n60J78M92m37j9Q18p25l25N19j77k04O36J2o44Q5N17m99k79N00k65
$$ 261 275 -285 -107 385 -52 -71 747 22 -303 216 39 -165 471 483 -161 -76 441 -58 -337 163 -102
5664a02j58M66R3m91L3O92l75m24N20o6l57J40K64l85l7M22j75n95J106l46m30
$$ -102 -260 206 299 -192 -159 533 158 -266 254 188 -169 -29 235 -150 -187 235 60 -535 571 225 -205
5685b05L90J32p39L61O22n99k55K50K61l90L34J9m15k50M59l6k11K43N1m46L42
$$ -205 185 317 -422 -61 561 -38 -293 -43 218 -172 162 181 -234 -484 -25 -61 -272 -29 22 -424 -82
5706h2M87m04n00P24m95k12L21K56m40K3Q59q46j17O44k67k50Q42l26j57j63K91
$$ -82 405 1 -499 225 -270 -482 -161 95 -345 -322 537 -309 -426 218 -49 -299 543 217 60 -103 188
5727A88m23o5M55j2o70P66j36j42M1M9l41P0N40n9p92O97q9l68J53M93n87J18
$$ 188 -235 -300 155 143 -527 239 103 -39 2 51 -290 -220 320 261 -531 166 77 -291 -138 355 -232 -114
5749a14N46n48O6L93j6n36J23M07l96k46N50M6n37J95L47n35j43Q17l56nK11j75
$$ -114 432 -116 -50 343 327 -209 -86 321 -75 -321 229 275 -262 -67 280 -255 -398 419 63 58 269 94
5771I4m19K56K97j93m16Q85l56k54M64m6n71M52K12m14k84P78l85l77P68j36m22
$$ 94 -325 -69 228 35 -381 504 148 -106 358 312 -259 193 405 -9 -293 485 100 -277 491 355 -67
5792f7L60L56m71m89N30j60k37M21K25p81M36L37m75p3K83j19m28O89l68m5J54
$$ -67 293 649 178 -311 219 59 -178 243 468 -313 123 460 -15 -88 195 76 -352 337 -31 -76 78
5813G8R6l77o3N35j57l79L49K13n67R2M14m63j58N01o0m09M76J21m85j96Q09p32
$$ 78 174 -203 -266 269 112 -267 82 295 -272 -180 234 -229 -387 114 54 -355 121 242 -243 -439 370 -362
5835c62n2M31J64q01P27l35m5P6N61m84k94L82O1o27N39K02n55J80L91k13o62
$$ -362 -414 17 181 -620 107 -228 -273 -197 364 -120 -414 -32 29 -598 -59 143 -412 -232 159 -54 -716
5856g16R46j68n55K26M78k79k46P45k70n99N06J46o29N77J44m85k08P43l33k64
$$ -716 230 62 -493 -267 211 -68 -314 431 161 -438 68 214 -415 162 306 -179 -387 356 23 -241
5876b41M94O2k62l79M93k92K32j8P2l27K32L57n98M89Q7n24j43N41j37o15Q00
$$ -241 253 315 53 -326 167 -125 107 89 161 -166 66 423 -175 314 401 -123 -266 275 138 -477 323
5897C23J5l10Q7K61l56l21O91K3n04L67K66o33j26O45m62j04J82O8k69J63M45
$$ 323 338 28 115 376 20 -301 390 413 -91 276 542 -91 -217 428 -34 -138 44 112 -157 6 451
5918D51n78N4L43m31J12M96l89n16M00M02n84j30P23m56L6L07J60p75K21K39k56
$$ 451 -127 -73 270 -161 -49 447 58 -458 -58 344 -240 -370 353 -103 -67 240 400 -375 -154 85 -171
5939a71l7M99k26m87R73m99l22J72K05k62m9L42J21l64J24L48n69J00L84m50J02
$$ -171 -208 291 65 -422 551 52 -270 -98 107 -155 -204 138 259 -105 19 367 -202 -102 282 -168 -66
5960f6L85l41m11N00J9l82K30K26l70K8L67k16l83N56J35m02o3M46m30j73M30
$$ -66 319 -22 -433 67 86 -296 -66 160 -210 -182 185 -31 -414 142 277 -125 -188 258 -172 -345 85
5981H5J5k97O74j90p09J60M89l96j85K70P5l89L8M42m50m2P17l14k50L17j33j76
$$ 85 100 -197 477 287 -422 -262 227 -169 -354 -84 -9 -398 -360 82 -368 -410 307 -7 -257 60 -73 -249
6003b49M94l2m74P5N93r5l20L00j73m83L26J83m54J89O55l85n42O15J50m10j20
$$ -249 245 213 -261 -186 407 312 -8 292 119 -364 -38 145 -309 -120 535 150 -392 223 373 -37 -157
6024a57L42k20j74O36l05k76K93J82o72L41N13o23q9N91k52l72k41Q85n05l9N84
$$ -157 185 -35 -209 427 122 -154 139 321 -351 -10 503 -120 -209 382 130 -242 -483 402 -103 -142 442
6045D42n50N2M01L7o42M66K94n97P2K86n32J3L72m9l57M08L74q34K75L09l38k02
$$ 442 -108 -56 345 382 -260 206 500 -97 -25 261 -271 -258 114 65 -292 116 490 -344 -69 240 -98 -300
6067c00M65j19m59N55r7n27K82O11m78k48O85l97m16L03K48j36r5O40o52n4K44
$$ -300 165 46 -413 142 45 -482 -200 411 -67 -315 370 -27 -443 -140 108 -28 -123 517 -135 -189 55
6088E5o5l46M14r5k95q3N60j67m46L45N49n46J6P05q31j09L57m27O4P93k85m41
$$ 55 -10 -356 58 -37 -332 -415 145 -22 -468 -123 426 -120 -104 601 -230 -339 18 -409 -345 448 163 -278
6110b78K20K35m94j82P74m05M5P0L68p17M10K76l39l81N03J4j58K12K62q41K87
$$ -278 -58 177 -317 -499 275 -130 -85 -15 353 -364 46 322 -17 -398 105 119 -39 173 435 -406 -119
6131a19K32m15K86J52j01l32N37L9l76j50P41n74NM12j67m33M21J25m10j83P70
$$ -119 113 -302 -16 136 35 -297 240 279 -97 -247 494 -80 -75 337 170 -263 158 283 -127 -310 460
6152D60p42j22N96j08n25M48N48n93k78N14k2l19J01O12n46N3L45l79o4L45k42
$$ 460 -282 -404 192 84 -441 7 555 -38 -316 198 176 -143 -42 570 24 77 422 43 -21 324 82
6173H2l48O15l6j71j60L54k17l64M26k3k23K93K45m34l67Q82n74L0L3J30l15L59
$$ 82 -266 349 313 142 -18 336 119 -245 181 158 -65 228 473 39 -328 554 -20 10 43 173 -142 217
6195B17J57n08J23N8k33Q8J88L8m54L28M98o87J47M52n48k93O88q4k99Q1L67o27
$$ 217 374 -134 -11 47 -186 -98 90 128 -326 2 500 -187 -40 412 -136 -429 259 175 -124 -43 324 -303
6217c03QO53n57m1K43j68k09L56L68o60j13O43l74k10N51J44o61J71J92l52KO16
$$ -303 -295 358 -199 -240 3 -165 -374 -18 350 -310 -423 220 -154 -364 187 331 -330 -159 33 -319 -317 299
6239B99o07j82M67o2k61M96j62m0K64P1j55n58J98M57m76n8L49J6j85J72j35k70
$$ 299 -308 -490 -23 -85 -346 150 -12 -52 212 283 128 -430 -232 225 -251 -309 40 56 -129 43 -92 -362
6261c62K55J36m57J23N78k93j86M66k27j01k38J95J7K3M39j62l08L56Jn02N92
$$ -362 -107 29 -428 -305 273 -20 -206 260 33 -68 -306 -111 -94 -71 368 206 -102 254 255 -247 345
6282C45k4m57R8K72R0n83K58L72p01M26J35n41J69O07m17r3M32l60l12J32L40
$$ 345 321 -136 -38 234 324 -259 -1 371 -330 96 231 -310 -141 466 49 -44 388 28 -284 -152 188
6303A88l70RM17k28q6p2L88l51n5M33j59j0K44j52n53M91J06l86L86k03J24M4
$$ 188 -182 -173 244 16 -70 -142 246 -105 -160 273 114 104 348 196 -357 134 240 -146 240 37 161 205
6325B05P1l28k30M90l90L5P8K30l53J24J69l92J73K40J08m74K40K13k11l33L64
$$ 205 276 -52 -282 208 -182 -147 -69 161 -192 -68 101 -291 -118 122 230 -244 -4 209 -2 -335 29
6346B9q8n36M83K71m69K66L08l64l94Q32l69l39nM35m04K31M51n31K33j8j95p3
$$ 29 -59 -595 -112 159 -310 -44 264 -100 -494 338 -31 -370 -375 60 -344 -113 338 -193 40 22 -173 -246
6368b46L1N09l72j63L19n60Q4M78j2m81L73J13k09J2K93o72J91K91K67l42L15
$$ -246 -215 294 -78 -241 78 -482 -398 80 68 -413 -40 73 -136 -124 169 -503 -312 -21 246 -96 219
6389B19J35n69M2L86m33n6L54Ol50J50Jr7j80P32o42Q9O30k91n47N90J24l08L1
$$ 219 354 -215 -173 213 -220 -276 78 84 -266 -116 -115 -212 -392 340 -302 -213 417 126 -421 169 293 -15 16
6412A6L52j80j59j50N46l31o9K82k85m64P94l10l8n9N74o72o7Q42q53M12j11K72
$$ 16 368 188 29 -121 425 94 25 307 22 -442 352 42 4 -55 519 -153 -220 622 -231 181 70 342
6434C42n01J96K42m69L91O9j76m00R7L63k29J03L71o99L63N73o12k14J76q6O4
$$ 342 -159 37 279 -190 201 270 94 -306 -209 154 -75 28 399 -300 63 636 24 -190 -14 -100 -36
6455c6K01j44j91m0N38k77m90M95K20n51O3N15k39k69L95j98K0o1j08j14j56N83
$$ -36 165 21 -170 -210 328 51 -439 56 276 -275 -212 303 64 -205 190 -8 12 -49 -157 -271 -427 156
6477A56k91nL03l92lN07k10k55J81K68o1j88J19r5m45M42J9n40P20j6j29k66M21
$$ 156 -135 -140 163 -229 -232 275 65 -190 -9 259 198 10 129 34 -411 31 50 -490 230 214 85 -181 240
6500B40O3l13J68R2n14k33O47P9m62M43j88m08K71K10l40N1M65l18k30P35l27
$$ 240 303 -10 158 250 -264 -497 150 229 -233 210 22 -386 -115 95 -245 -194 271 -47 -277 458 131
6521A31m25M39P4l97J92K69k90j99M40O9k74J45P2l65l56Q92m59q2L58J15p84
$$ 131 -294 145 219 -178 14 283 -7 -206 234 303 29 174 246 -119 -475 417 -42 -124 234 349 -435
6542d35M41L31m27q8L97j23r6K55k04J61k35K02j38k97N54k96LM75l04k50J54
$$ -435 6 337 -90 -178 219 96 0 255 51 212 -23 179 41 -256 298 2 5 480 176 -74 80
6563H0J92l96j13J77J17l0K3L32l50j47Q6j27P7J74ql00O62P9o83J40J83o7k27
$$ 80 272 -124 -237 -60 57 27 50 382 32 -115 -29 -156 -79 95 87 -213 449 528 -155 -15 168 101 -126
6586a26L85r4l31M45j72l47K80L73n34l01O15L2m82K89k47O2r6N20q7o40O19j66
$$ -126 259 165 -166 279 107 -240 40 413 -121 -422 193 225 -257 32 -215 -153 -249 271 184 -456 163 -3
6608cj52L52M1n65K94M56n36m25O36m2k33N31j51j33j79M48l10k23L95q0m78K18
$$ -3 -155 197 238 -327 -33 423 -113 -538 98 56 -177 354 203 70 -109 339 29 -194 201 121 -357 -139
6630a39J21l44M9M01j30l52Q09k29n76J68L31k62J15J8k6j16K10O2l29K83K10
$$ -139 -18 -362 -313 88 -42 -394 415 186 -390 -222 109 -153 -38 -20 -46 -162 48 110 -219 64 274
6651B74j90k93L68j19k7Q2qk90K15K12n90K00N43m28l43N23j07j19N96l22k66
$$ 274 84 -209 159 40 13 95 87 -203 12 224 -366 -166 377 -51 -394 129 22 -97 499 177 -89
6672h9J46J32j33l92M80K8l07N5L63k58k63L93nk97L27l8j75J15K46l44j51M39
$$ -89 57 189 56 -336 144 172 -135 -80 283 25 -238 155 150 -147 180 142 -33 82 328 -16 -167 272
6694B72j68l37O8L31l03K5L59j92M7m0J45n33K30N15m98j09O58k22m45M30k52
$$ 272 104 -233 -165 166 -137 -112 247 55 102 62 207 -326 -96 419 -79 -188 470 248 -197 233 -19
6715a9J06m74N61k53M0K53k35k00J66K47j18l02J05K56l40N01m46l27N46J26l83
$$ -19 87 -387 174 -79 -39 214 -21 -221 -55 192 74 -228 -123 133 -207 294 -152 -479 67 193 -190
6736a90J72N9M7l54M79ql89N14l77k07K88K64n24O6L97k77n19J97M31k03K58k81
$$ -190 -18 41 88 -266 213 205 -184 330 -47 -254 34 298 -226 -160 237 -40 -559 -362 69 -134 124 -157
6758a57J0j52M15J77m86L39J73l67k52M35on00O40j09l46J21K49k26k4J79l47
$$ -157 -147 -299 116 293 -193 146 319 -48 -300 135 129 -371 269 160 -186 -65 184 -42 -66 113 -234
6779b34j04N49j60p8K00J39k73j90K68K07m54R0K05m55K31M49m55l0L50k79p8
$$ -234 -338 211 51 -27 173 312 39 -151 117 324 -130 -40 165 -290 -59 390 -65 -95 255 -24 -102
6800a02L56K16m98J29J02L1k64J52M8l57L09J97m20L07M1m76Q3N63J65p15R8M33
$$ -102 254 470 -28 101 203 234 -30 122 170 -187 122 319 -101 206 247 -229 -146 417 582 -133 -35 398
6822C98o76L52J31p5m36O48l05j61N6M0K99j90j27J45k70O6K96l59pL88r8m07
$$ 398 -278 74 205 130 -306 342 37 -124 -68 -28 271 81 -46 99 -171 -105 191 -168 -175 213 115 -292
6844b92K60r7J3K42j57j36J36j6k92K26J82j90Lj5O8K09Q7k33o6m57O45k89l50
$$ -292 -32 -129 -116 126 -31 -167 -31 -47 -339 -113 69 -121 -118 -133 -65 144 231 -2 -68 -525 120 -169 -519
6867e19O67k65R8j44J94l2k79K38k03M5J50R0m32L69J90q3k04J91k8n09P41j96
$$ -519 148 -117 -19 -163 31 -1 -280 -42 -245 -200 -50 40 -392 -23 167 84 -120 71 43 -466 275 79
6889G9k94J4R7o9J8J2P1k36N43l56l22M7L50J12l82N19Qk32o1L38k91K10L2k56
$$ 79 -215 -201 -104 -173 -155 -143 -72 -308 235 -121 -443 -396 -46 66 -316 203 211 -21 -82 256 -35 175 207 -49
6913d9j18L29m1j93O5m0J6p8O07n63q3O7J55j98M20m11k5K24j38L14k38j10J37
$$ -49 -167 162 121 -72 -7 -47 -31 -109 498 -65 -148 -81 74 -124 296 -115 -140 84 -54 260 22 -88 49
6936D9P5J20K83k65k08j0K38l43O2Kj33J86J28O7k17K62l17J03o1j23J06k18L86
$$ 49 124 244 527 262 54 44 282 -61 1 3 -130 56 184 251 34 296 -21 82 21 -102 4 -214 172
6959A72k09K9J07j30p9J84K45l95p0J57k79J99K78J34m78J58K09l40k21M53k20
$$ 172 -37 -8 99 -31 -110 74 319 -76 -146 11 -268 -69 209 343 -135 23 232 -108 -329 124 -96
6980i6Q9M2m7k45O59n94L31j33mk02n4L25l39K74RK02n33M9N54l34k98M66N2l99
$$ -96 -7 35 -12 -257 402 -192 139 6 2 -200 -254 71 -268 6 15 217 -316 -267 287 -47 -345 121 173 -226
7004b26M74k52L5o7O8K3p9L25n0n40J64J96k58P4J13L7l64J92K18l20K67j16j05
$$ -226 248 -4 31 -36 32 55 -24 301 251 -289 -125 71 -187 -113 0 37 -327 -135 83 -237 30 -86 -191
7027a91N3J80l8n26M89OQ3o5K51l10k5O8J25k46L11m6j24j01P8K33l05o6O2j81
$$ -191 -138 42 4 -522 -33 -27 56 -9 242 -68 -93 -25 100 -146 165 119 -5 -106 -28 205 -100 -166 -104 -285
7051b85N24J21k59j40R5k84Q4N36n74q3K64J74l49M58l7m23P7K56k40j9K59L98
$$ -285 239 360 101 -39 56 -228 -144 392 -182 -265 -1 173 -176 282 245 -178 -101 155 -85 -104 155 553
7073E53o38Q0K21l30L3K90J25l99J13M34m35J05m8n8J64l29L33l89K45K06m90
$$ 553 -85 -5 216 -114 -81 209 334 -65 48 482 47 152 104 46 210 -119 214 -175 70 276 -214
7094b14J50K87l53j16M87l31P9o9K45l86j60O14r1k35J92n14L15L58k42J8J2o3
$$ -214 -64 223 -130 -246 241 -90 -11 -80 165 -221 -381 233 142 -93 99 -415 -100 258 16 34 46 -17
7116a7j62m4J19L33l13N0L36o38J99L64J02l32N3L1l59K61n7L13k15K03nk3p4
$$ -17 -179 -223 -104 229 -84 -34 302 -336 -137 227 329 -3 50 81 -278 -17 -74 239 24 227 222 199 125
7139A25j83j37J45J70O3m04K70K02n82M09Q8k58n5O30n78j97K52J29k94J98K82
$$ 125 -58 -195 -50 120 183 -221 49 251 -331 78 166 -92 -147 483 -95 -292 -40 89 -205 -7 275
7160B75o75K99K82j51j61L14Q5p08L56O05k42l96M10k82j07K50q8l34J26L49n33
$$ 275 -400 -101 181 30 -131 183 268 -440 -84 521 279 -117 293 11 -96 154 66 -268 -142 207 -326
7181c26PP10j43m77K79L49l16M6L53n61K49r4J64p2Q9r8k23J8K92k45j9Q2M0l24
$$ -326 -319 391 248 -229 50 399 83 129 482 -79 170 76 240 168 257 159 -64 -46 246 1 -18 64 104 -220
7205b20M93k13j28J01M17l38j40L32k98m67M76J81n82M43K40k77J00P7k27j46
$$ -220 273 60 -68 33 450 112 -28 304 6 -461 15 196 -386 57 297 20 120 197 -30 -176
7225a76L66M4k87R4K59l43j45M16k18m72O39J02n26L63J07J04n97K72J95n25j01
$$ -176 190 234 -53 41 300 -43 -188 228 10 -462 177 279 -247 116 223 327 -270 2 197 -328 -429
7246d29O08l67p0K04N7l99N74j65j00k23K39P5j18K48j4l21M79k63j68J55j9j16
$$ -429 179 -188 -258 -54 3 -396 178 13 -87 -310 -71 4 -114 134 120 -201 278 15 -153 2 -17 -133
7268a33j83O68k57n6j72M06l64K33K3r4k84L13j51k37K61j90L51l91L20l87J48
$$ -133 -316 352 95 39 -133 273 -91 142 165 71 -213 100 -51 -288 -27 -217 134 -257 63 -324 -176
7289a76L95j78k09J40L15m12p0O05k74oJ98l81J49j04K31l44q1L56l03N5j5J30
$$ -176 219 41 -168 -28 287 -125 -195 410 136 130 328 -53 96 -8 223 -121 -202 154 -149 -94 -109 21
7311B1k88L21P6r4k37N92l14n08N68j4k33J33L95j39n28M03q6k48L29j83k28L92
$$ 21 -267 54 130 36 -201 391 77 -431 137 123 -110 23 418 279 -249 154 68 -180 149 -34 -262 130
7333A30l3l84J03J74J72l20L46l1j43L99m0n66K90J13k32l66P31j50m53J0N47
$$ 130 97 -287 -184 -10 162 -158 188 157 14 413 373 -193 97 210 -22 -388 343 193 -260 -250 297
7354B97k73j98K23o3k08K72J2k90P7R6j9m7Q4J94l90M12l4k97J52n1L31n52N13
$$ 297 24 -174 49 -14 -222 50 62 -228 -151 -55 -74 -121 -37 157 -233 179 145 -152 0 -51 280 -272 241
7377B41k43j6J05R3l38R1J51M5l98J02K18k26O6J33l21L03n4M2J8N7l1k55J63
$$ 241 -2 -18 87 180 -158 -67 84 129 -269 -167 51 -175 -109 24 -297 6 -48 -6 12 69 38 -217 -54
7400e4L12n24k7J52n3P2J32K48n89L84K23l95J83k96j12K41j11K57j78L26j60
$$ -54 258 -266 -293 -141 -194 -122 10 258 -331 53 276 -119 64 -232 -344 -103 -214 43 -135 191 31
7421C1l7m8l9L02K9q2R0l73K72n0m12J65J08L9j67K86Q4M3r4J83j21k13j54K36
$$ 31 -6 -54 -93 209 238 156 246 -127 145 95 -317 -152 -44 -5 -172 114 198 241 147 330 209 -4 -158 78
7445G8o5K67j14k38Q8K76n32O7N84m06N1k93M96m22J98j20K30m04K42J06m19L07
$$ 78 13 280 166 -72 16 292 -240 -173 411 5 56 -237 259 -163 35 -85 145 -259 -17 89 -330 -23
7467b3L16l05K58K02n71o4N18P9n66L99K78k82l74L29j93R7O2k38k7r3J10j3p7
$$ -23 293 -12 246 448 -123 -187 331 410 -156 243 521 239 -135 194 1 98 160 -78 -105 -198 -88 -101 -178
7490a78M36l33j4L29l77l8N1M63k19m71L35J89k63j0J65p0l5L31k75m32M39J35
$$ -178 258 -75 -89 240 -137 -175 -124 339 120 -351 -16 173 -90 -100 65 -5 -40 291 16 -416 23 158
7512A58m17M58l26j67K4L65j02k96J41K48k98N21j68l32J68J34j86k30M57k2k29
$$ 158 -259 199 -127 -294 -270 95 -7 -303 -162 86 -212 309 141 -191 -23 111 -75 -305 152 130 -99
7533i9L04K35o45L77k66J58j17J73j2k05K52K5k68O8O2k16J38K60j38Nj29K82
$$ -99 205 440 -205 172 -94 64 -53 120 108 -97 155 180 -88 -20 42 -174 -36 224 86 91 -38 244
7555B44l95j48O08k45k2j5j0k07K49L79j92m32K78Q7l30K8M08m05K93K04l03p
$$ 244 -151 -299 309 64 42 27 17 -190 59 438 246 -186 92 179 -151 -123 285 -120 173 377 74 67
7577F7K14k45p0K53J6Q8o69O12l37J48J10M9m18K38K04l03l8L56j30j17n2J96
$$ 67 281 36 -34 219 235 323 -346 266 -71 77 187 236 -182 56 260 -43 -81 275 145 28 -24 172
7599A72m93K94J42j99L71j26k31K78j86L42o08L24K60o80K27N00l00k5L45l45
$$ 172 -321 -27 115 -84 287 161 -70 208 22 364 -244 80 340 -340 -113 387 87 62 407 62
7619F2n6L07l96j51J36M77m65q1K12j05r2QL44l37OK69l56K84j79K93k68R4Pj84
$$ 62 6 313 -83 -234 -98 379 -86 -167 45 -60 -152 -144 200 -137 -131 138 -218 66 -113 180 -88 6 13 -171
7643a71kQ2j94J45K34j36K6j01L83m39k42N19j43n12J74O08m11K47K43n54J53
$$ -171 -173 -91 -285 -140 94 -42 -16 -117 266 -173 -415 104 -39 -551 -377 231 -180 67 310 -244 -91
7664i1L95m17M2J06J59o95O10J62l78J20J24J2l28L78j52o1j68j46M91o07N37
$$ -91 304 -113 -71 35 194 -501 109 271 -107 13 137 149 -179 199 47 -14 -182 -328 163 -444 93
7685I3J09m16L58R7j45j70K69k95k74N64j7m32J38L49k92j07N52o88M07K07o6
$$ 93 202 -214 144 241 96 -74 195 -100 -374 190 173 -259 -121 228 -64 -171 381 -307 100 307 241
7706B41k56J78n8P3j35J27l60J07J00L37o10J49L55l11j40L93j22k59M98k17j84
$$ 241 -15 163 105 178 43 170 -190 -83 17 354 -256 -107 248 -63 -203 190 68 -191 307 90 -94
7727i4l5M10l88J96R4k26J22j71m0P9j45L51M8k63L69k60k37M06j93k79L51O6
$$ -94 -129 281 -107 89 183 -43 79 -92 -132 -53 -198 153 201 -62 307 47 -190 216 23 -256 95 161
7749A61l58Q3J48J55n38L58L88p13M05o1j07j04L73p8l30K33M42o39L27l39n6
$$ 161 -197 -114 34 189 -349 9 397 -316 89 28 -79 -183 190 112 -218 15 457 -182 145 -194 -250
7770b50K53J6j6K0k9o1J30k49M03j46n67N28Q3m86K54L82m42q5N36m17k35N47
$$ -250 3 19 3 23 -6 -67 63 -186 217 71 -496 32 115 -371 -117 265 -177 -262 274 -143 -378 169
7792A69l59J90k1L03j93l40K49K2K6k2j04k12L48j6j08k54L14K15k50K71j00m71
$$ 169 -190 0 -21 282 89 -251 -2 20 46 24 -80 -292 56 40 -68 -322 -8 207 -43 228 128 -343
7814c43L16L83o15M72r9j06k6J17R0j58l7L53l25l93O83n17J70K08j43P1q8K85
$$ -343 -27 356 -259 213 114 8 -18 99 189 31 -6 347 22 -371 312 -205 -35 173 30 101 13 298
7836B98k58p0L59m55k6O3K8n8Q2K43j59k59K94pl22L70M0L1k37l6K34m29M71m1
$$ 298 40 -30 329 -126 -152 -89 -61 -119 -37 206 47 -212 82 75 -247 123 163 194 -43 -79 155 -274 197 156
7860A56n77O33n6k74k5L94r8l32N27k99k12J17M35k93k72O63l23j61nJ93k67J03
$$ 156 -421 212 156 -118 -143 251 153 -179 348 49 -163 -46 389 96 -176 487 164 3 -2 191 -76 27
7882B7J25j26m41P42m69J32J56j88L7k9M0L79m38O9J57m29N54l5k16o5L31m33
$$ 27 152 26 -415 327 -142 -10 146 -42 -5 -34 6 385 -53 16 173 -256 298 263 47 -18 313 -120
7904a20kK80l77o6O07J18q29K17K16l4l26L92p5l48L03J13rj31L1M9q2L20n7k85
$$ -120 -122 158 -219 -285 322 440 -389 -172 44 10 -316 76 1 -347 -44 69 60 -71 -40 9 -73 247 190 -95
7928i5K5Lo5j4M12k56j86J48M3j85L65l8j15j77L99k42j58L33j33l90M18P1m05
$$ -95 -70 -67 -132 -146 266 10 -176 -28 15 -170 195 157 42 -135 264 22 -136 197 64 -326 92 163 -242
7951b42L0K42k73J22M07j50j12J7nj53K2K28j69k10M29q5p0qM53o86L27r8J32
$$ -242 -212 30 -243 -121 286 136 24 41 36 -117 -95 133 -36 -246 183 98 28 20 473 -213 114 16 148
7974A48l58OL18k75M0M33m52K38K54k07l32L84K14n22K40o5k48p2L1P3K39O0j2
$$ 148 -210 -204 114 -161 -121 312 -140 98 352 145 -187 197 411 -111 129 64 -184 -256 -225 -152 87 147 135
7997A35M7p5L90m92O6J52k02N4K9l1j86jJ15k5N9J61p2l18M74p7j41k45L63l79
$$ 135 182 107 497 5 71 223 21 75 104 73 -113 -114 1 -24 35 196 124 -194 280 203 62 -183 180 -199
8021a99L80O0k79l51L33J33j60o4K81k18j15M30k52k48L14j6K2j36K32o5l24K59
$$ -199 181 241 -38 -389 -56 77 -83 -147 134 -84 -199 231 -21 -269 45 29 51 -85 147 82 -242 17
8043A7J20n05L33J49K86j90j81J88k30LK92m30K0P5J48k73N49m92l8M85l62K9
$$ 17 137 -368 -35 114 400 210 29 217 -13 -10 282 -148 -128 -53 95 -178 371 -121 -159 326 -36 -7
8065gK3J6J13j97Q7N5m22k3L04N3j23P8j97j2O37l75j36m7O29l23m7j68L91l96
$$ -7 16 32 145 -52 35 90 -332 -355 -51 2 -121 -43 -240 -252 385 10 -126 -173 456 133 86 -82 309 -87
8089h7M2J71QR4Nk28j66N21o2k27Q7M4j19J70J64l98k59M37k75l25M96j69l2j26
$$ -87 -45 126 134 228 233 5 -161 360 298 71 158 202 83 253 417 19 -240 197 -78 -403 93 -76 -108 -234
8113b34N03l00L7J25k58%K16K3k84K52k1j71K6N8L46l86QM06l32R3O9k68j86K82
$$ -234 269 -31 6 131 -127 -127 89 112 -172 80 59 -112 -86 -28 318 -68 -60 346 14 107 176 -92 -278 4
8137DL1L7k34L49l33O9K23k24q5K42j39k49K49L09jn00K34J03q9M05m77l27K87
$$ 4 35 72 -162 187 -146 -77 146 -78 -163 79 -60 -309 -60 249 248 -252 -18 85 -4 401 -76 -403 -116
8160a16L37j96r4K32rk92j98N37l72J77P2k05J45JK50m84L2Q10p42K01o00L03
$$ -116 221 25 -69 163 154 -138 -336 201 -171 6 78 -127 18 19 269 -215 -183 627 -115 86 -514 -211
8182b11K77J55l39n7p1N15m02L0M10
$$ -211 66 221 -118 -175 -246 269 -133 -103 307
8191C07
$$ Imaginary data points
##PAGE= N=2
##DATA TABLE= (X++(I..I)), XYDATA
0@%%%%%%Qj6J6j6K4l2M0m8N6p2Q8j04J21j42J66j94K26k58K98l45L93m43N00n70
$$ 0 0 0 0 0 0 0 8 -8 8 -8 16 -16 24 -24 32 -40 48 -56 65 -77 89 -105 121 -137 161 -184 209 -234 266 -304
30c04O43p23Q11r08J017j131J259j403J555j723J911k114K339k588K868l182L533
$$ -304 339 -384 427 -481 536 -595 664 -739 816 -907 1004 -1110 1229 -1359 1509 -1673 1860
47A860l933M391m920N542o288P194q327R795j1777J4619j9063K7045m5766J67132
$$ 1860 -2073 2318 -2602 2940 -3348 3846 -4481 5314 -6463 8156 -10907 16138 -29628 137504
61A37504J10030l37158j7467J96842P0659j47755m0590Q0417O0908n7216o0164
$$ 137504 247534 -89624 -107091 89751 160410 12655 -27935 52482 113390 56174 -3990
72c990n72L9236j1407p512L1798O884o6690k8400L0132J8191N794J9883m1355
$$ -3990 -4562 34674 23267 15755 47553 54437 -12253 -40653 -10521 7670 13464 33347 -8008
85h008n9062M4142P7149n0997q3606L6890Q5248J180o4754n5225J8541R1002L7603
$$ -8008 -67070 -22928 54221 3224 -80382 -43492 41756 42936 -21818 -77043 -58502 32500 70103
98G0103q6546o1584O4389N6101m3084l7587K7621K7777q763j9600l770J5267m37
$$ 70103 -16443 -78027 -13638 42463 -621 -38208 -10587 17190 8427 -11173 -14943 324 -113
111a13k6546J5289N6994k3348q6682J1807Q5377Q95n4110J95J1464j3117K4352
$$ -113 -26659 -11370 45624 22276 -64406 -52599 32778 33673 -20437 -20242 -8778 -21895 2457
124B457K6687m4855l2646N5264M3665m7251n7077J7394O7120K8975n2831n2053
$$ 2457 29144 -15711 -48357 6907 50572 3321 -53756 -36362 30758 59733 6902 -45151
136d5151L7029M5303l6422k5834N0999J4945n4278n220M3091j1486l8686J2407
$$ -45151 -8122 37181 759 -25075 25924 40869 -13409 -18629 24462 12976 -25710 -13303
148a3303L3346J0910j2627m1502k7001M2639M4903l0905l6699J9409J4890j4592
$$ -13303 20043 30953 18326 -23176 -50177 -7538 37365 6460 -30239 -10830 4060 -10532
160a0532j993O91j1719J5708K5949j6139k7459L664R597J0225J8308r702k7589
$$ -10532 -12525 -11834 -23553 -7845 18104 1965 -25494 -21830 -12233 -2008 16300 6598 -20991
173b0991J2306K3744j5662n461K5026j1030k5983L1166K6567m3212k6664M5676
$$ -20991 -8685 15059 -603 -6064 18962 7932 -18051 13115 39682 -3530 -30194 15482
185A5482L0790k7425k9146J6K0474K0172j1919k8589R082K2467j3097j0610J7006
$$ 15482 46272 18847 -10299 -10283 10191 30363 18444 -10145 -1063 21404 8307 -2303 14703
198A4703q915k0023K5339K0213l5639j9312L1212R624j9574L621O249j3996J85
$$ 14703 5788 -14235 11104 31317 -4322 -23634 7578 17202 -2372 1249 7498 -6498 -6313
211f313J5010j198l009P4j4927K743K7716j0084l6887K0012M3383j8719m0739
$$ -6313 8697 7499 4490 4564 -10363 -7620 20096 10012 -26875 -6863 36520 17801 -22938
224b2938O714K3913L847l129r811n691J4282P98k5006O148L1019j3397k6082K4042
$$ -22938 -16224 7689 11536 8407 -1404 -7095 7187 7985 -17021 -10873 20146 6749 -19333 4709
238D709J7200l5901j5244L1045J3187j3227m652o401n967J5488R080j7231m142
$$ 4709 21909 -13992 -29236 1809 14996 1769 -2883 -9284 -15251 237 9317 -7914 -12056
251a2056J3065k170k358L574j5137n921L1656R939l6076p518K8364k489j7144
$$ -12056 1009 -1161 -3519 55 -15082 -21003 10653 20592 -15484 -23002 5362 2873 -14271
264a4271J3954Q959j7672j838J1796m651k803P041l905J325J3505j2325k2746
$$ -14271 -317 8642 -9030 -10868 928 -3723 -6526 515 -3390 -2065 11440 -885 -23631
277b3631J6283K3275j4200r801J3241o500j2646J6354R433j7846j973J5287k067
$$ -23631 -7348 15927 1727 -8074 5167 -1333 -13979 2375 11808 -6038 -8011 7276 5209
290E209o495p84q099O215K3725r999l0666J3385K7663j8318j7243K2606P210k2619
$$ 5209 -1286 -2070 -10169 -3954 19771 9772 -20894 -7509 20154 1836 -15407 7199 14409 -8210
304h210j240J6125j044n882j606j653J0472P470k2800j1548L0644J2146k8963
$$ -8210 -9450 6675 5631 -251 -1857 -3510 6962 14432 -8368 -19916 10728 22874 -6089
317f089n900K1197n452j0846J3038K999j4111P442J0622j2728n813J0237j609
$$ -6089 -11989 9208 3756 -7090 5948 8947 -5164 2278 12900 172 -5641 4596 2987
330B987j527J0423p643j3679J2765R244j5105J829J4982j1941j2962J7240N985
$$ 2987 1460 11883 4240 -9439 3326 12570 -2535 -706 14276 2335 -10627 6613 12598
343A2598j8047K971J3810q566p193Q411k629m277R313k094j0341Q851L553j7742
$$ 12598 -5449 -2478 11332 2766 -4427 3984 1355 -2922 6391 4297 -6044 2807 6360 -11382
357a1382M259K3124j0270k1181J4595J3575j7357o372J4051J50n726K473l542
$$ -11382 -7123 16001 5731 -15450 -855 12720 -4637 -11009 3042 3192 -2534 -61 -3603
370c603j034J0284l913j2380J2906R751k0517n058K5346k695k3585Q947J7893
$$ -3603 -4637 5647 1734 -10646 2260 12011 -8506 -13564 11782 9087 -14498 -5551 12342
383A2342j1068r506Q129K813m20K239r626n461J6641J043j8557P018J6900j4478
$$ 12342 1274 -8232 -103 2710 2290 4529 -5097 -10558 6083 7126 -11431 -4413 12487 -1991
397a991j3133J7515M684j6652M017J1909r480n851P015l592j452J1165l271j2472
$$ -1991 -15124 2391 7075 -9577 -5560 6349 -3131 -8982 -1967 -5559 -7011 4154 883 -11589
411a1589Q307N971j2862K154J4336r337r375J4216J142j6597P988J5216j0779
$$ -11589 -3282 2689 -10173 -8019 6317 -3020 -12395 1821 2963 -13634 -5646 9570 -1209
424a209p745J1648j326j0336O063N191l413M901K59j2984M932J5956j1186j2058
$$ -1209 -8954 2694 1368 -8968 -2905 2286 -1127 3774 4033 -8951 -4019 11937 751 -11307
438a1307J8662P824k0216k666J5512k946p132R739N58q174K908J779n285P526
$$ -11307 7355 15179 -5037 -7703 7809 4863 -2269 7470 8028 -146 2762 4541 -744 6782
452F782M407j3050J635J6864j1113j7219J7933J5378j8666r334J4298J552r174
$$ 6782 11189 -1861 -226 16638 5525 -11694 6239 21617 2951 -6383 7915 9467 293
465B93K421J223j036O053m619j2868R153J2659j4587p036J7341r44k0607N623
$$ 293 2714 3937 2901 8954 4335 -8533 620 13279 -1308 -8344 8997 8053 -12554 -6931
479f931J4216q943n264Q913l464o598O796o46q058Q258O138j2072o28J0026o842
$$ -6931 7285 -1658 -6922 1991 -1473 -8071 -1275 -1921 -9979 -1721 4417 -7655 -8283 1743 -5099
494e099n963J3662J207j2371O464Q107j3326j709J6891k072j3386O640P030p625
$$ -5099 -11062 2600 3807 -8564 -2100 6007 -7319 -9028 7863 5791 -7595 -955 6075 -1550
508a550M75M664m070L440P789j1894q812J5989L365j5821M465J3990j1720j0502
$$ -1550 -1075 3589 -481 2959 10748 -1146 -9958 6031 9396 -6425 -1960 12030 310 -10192
522a0192J2199L817j0018J800N264n114j54K26p592N114J3059j0429j2440J4940
$$ -10192 2007 5824 -4194 -2394 2870 -2244 -2398 -2172 -9764 -4650 8409 -2020 -14460 480
536D80P085j9180q68J8467l225j2854N757M777n976K612K713m430M989M477j1812
$$ 480 7565 -11615 -12483 5984 2759 -10095 -4338 439 -5537 -2925 -212 -4642 347 4824 -6988
551f988k387J5360l121j3250R528J0400j3857n237J3716j342q196O198K477q025
$$ -6988 -9375 5985 2864 -10386 -858 9542 -4315 -9552 4164 2822 -5374 824 3301 -4724
565d724L060L479q091L153J1306o891q043R711O99r797O617Q427j0923j632J2866
$$ -4724 -1664 1815 -6276 -3123 8183 1292 -6751 2960 3659 -6138 479 8906 -2017 -3649 9217
580I217m952j1088R723Q388q762m74O572n863j700P511l632l188R125j921j2160
$$ 9217 4265 -6823 2900 11288 2526 2052 8624 2761 1061 8572 4940 1752 10877 8956 -3204
595c204O877J0157j2036m263J4792j965j5755M349R598o659m121M948j143r85
$$ -3204 3673 13830 1794 -2469 12323 10358 -5397 -1048 8550 1891 -2230 2718 1575 590
609E90K557q239l713J4118J264j7214K471J4648q088j1638J1101O417r523Q89
$$ 590 3147 -5092 -8805 5313 6577 -10637 -8166 6482 -1606 -13244 -2143 4274 -5249 -4360
623d360L890m677M90N539n559j04J0091n299j1649J0180Q570j2612r41J3233m405
$$ -4360 -470 -5147 -4657 882 -4677 -4781 5310 11 -11638 -1458 7112 -5500 -6441 6792 2387
638B387j1102O413M997o577K776M951p334j045O792n159l775R685k53r550N006
$$ 2387 -8715 -2302 2695 -3882 -1106 3845 -3489 -4534 2258 -2901 -6676 3009 2756 -6794 -1788
653a788N297j1249J18J3564l706r971Q671L899j1388J047J1531l715n481N766
$$ -1788 3509 -7740 -7622 5942 2236 -7735 936 4835 -6553 -5506 6025 2310 -3171 2595
667B595o97m891M484R21m698P147L951j2849p46J2859n592j1613J2531R482j4745
$$ 2595 1898 -2993 1491 2412 -2286 4861 8812 -4037 -4783 8076 2484 -9129 3402 12884 -1861
682a861p097J0091K093m417K543j847k626O192k640j1905O904J3479q263q980
$$ -1861 -8958 1133 3226 -1191 1352 -495 -3121 3071 431 -11474 -4570 8909 646 -8334
696h334J0040R65j1581M329R840l846k894K716l968o87P579l116n558J1345M663
$$ -8334 1706 2671 -8910 -4581 5259 1413 -1481 1235 -2733 -3420 4159 1043 -4515 6830 11493
711A1493j5708j701J3871k871q334Q688M384j0164m19O437m104q91P305k657n321
$$ 11493 -4215 -5916 7955 5084 -3250 5438 9822 -342 -761 5676 1572 681 7986 5329 8
726HL504k164n945P672N735r335p00Q607p776q336J1877N398j1099L58Q288p760
$$ 8 3512 1348 -4597 3075 8810 -525 -1225 7382 -394 -8730 3147 8545 -2554 -2196 6092 -1668
742a668o242R665K339n656M172J521q609J36N567k473K802N801r332p231J1687
$$ -1668 -7910 1755 4094 -1562 2610 4131 -4478 -4342 1225 -1248 1554 7355 -1977 -9208 2479
757B479L473j2767K327J4251n177j0983L764K008l375O368K734p386L07M247q058
$$ 2479 5952 -6815 -4488 9763 4586 -6397 -2633 -625 -4000 2368 5102 -2284 -1977 2270 -5788
772e788j357J3461j203j2158M568Q096r382n569Q324L488r53J063n188o050P944
$$ -5788 -7145 6316 5113 -7045 -2477 5619 -3763 -9332 -1008 2480 1527 2590 -2598 -8648 -704
787g04L414q008M284R558r797j0091J0861M311r255L170R237o888n568N017k257
$$ -704 2710 -5298 -1014 8544 -1253 -11344 -483 3828 -5427 -2257 6980 92 -5476 -459 -2716
802b716l134Q530L775q365j163L218l991K240P500n442m495Q638j041j1684N124
$$ -2716 -5850 2680 6455 -1910 -3073 145 -3846 -1606 5894 452 -4043 4595 3554 -8130 -3006
817c006J0528o666l832R180k696j0412N642P675n117j147L607m461j016O011l444
$$ -3006 7522 856 -2976 6204 3508 -6904 -1262 6413 1296 149 3756 -705 -1721 4290 846
832H46m996R757L341j2119l73Q615m064l900Q977J00r452J324N275l212J511L603
$$ 846 -4150 5607 8948 -3171 -3544 5071 1007 -2893 6084 6184 -3268 -1944 3331 119 1630 5233
848E233n567k33P561o292j0105J1280R772j2147m937R854j654p854M809N417k557
$$ 5233 -334 -567 6994 702 -9403 1877 11649 -498 -5435 4419 2765 -5089 -280 5137 2580
863B580o65j737n330M558P159p142m317J0979N36j1879J686O632l819O39O714
$$ 2580 1915 178 -5152 -594 6565 -577 -4894 6085 6621 -5258 -3572 3060 -759 -120 6594
878F594n979q081P885L749p550K257O587n211l105N179l505n053P594L425p007
$$ 6594 615 -7466 419 4168 -3382 -1125 5462 251 -2854 2325 -1180 -6233 1361 4786 -2221
893b221J417L573p811q16J0661j681q546M717L767p564j25N828k768r8N598m836
$$ -2221 -804 2769 -5042 -5858 4803 3122 -5424 -707 3060 -4504 -4629 1199 -1569 -1667 3931 -905
909i05o798O734L186o873L361P443r154o666J0776K738q847K074O793l814l426
$$ -905 -7703 -969 2217 -4656 -1295 6148 -3006 -9672 1104 3842 -5005 -2931 3862 48 -3378
924c378K830j978P22N382l456m757O400Q14j0678M037J2932o046j0883P096M996
$$ -3378 -548 -2526 -1804 3578 122 -4635 1765 2579 -8099 -4062 8870 2824 -8059 -963 4033
939D033o547l82M572k809J372M518o802n332Q319L303o435K786L842p716j652
$$ 4033 -2514 -2896 1676 -1133 239 4757 -2045 -7377 942 4245 -2190 596 4438 -3278 -4930
954d930P713p50n047O082J512p527J489L942n187Q37R167l331p879M419K120n802
$$ -4930 2783 2033 -3014 3068 4580 -2947 -1458 2484 -2703 -1866 7301 3970 -3909 510 2630 -3172
970c172M618P031o855m081O972j634p060O430N246o809o22N395m057m127N281
$$ -3172 1446 8477 1622 -2459 4513 2879 -4181 2249 7495 686 64 5459 1402 -2725 2556
985B556J462k404L382j703p384M001O401p045k346J0110k369j0604M372P349p020
$$ 2556 4018 1614 4996 3293 -4091 -90 6311 -734 -3080 7030 4661 -5943 -1571 5778 -1242
1000a242k516P960j107n924R28j48p01O196j32q296J753P760o303o493R083L724
$$ -1242 -3758 4202 3095 -2829 -1901 -2049 -2750 3446 3314 -4982 -3229 4531 -1772 -8265 818 4542
1016D542p511L97L971m938k91O137j929l550M875r16p247N116N808o895j908Q377
$$ 4542 -2969 -2572 1399 -3539 -3830 2307 378 -3172 1703 787 -6460 -1344 4464 -2431 -4339 4038
1032D038k523p597N386L928n474J272M204m724k327N220j648k884N972J074p721
$$ 4038 1515 -6082 -696 3232 -2242 -970 3234 -1490 -3817 1403 -245 -3129 2843 3917 -3804
1047c804J254N642m236j906O172k809m858O294J325r470K525R848m190p038M569
$$ -3804 -2550 3092 -1144 -3050 3122 313 -4545 1749 3074 -6396 -3871 5977 1787 -5251 -682
1062f82R92m640K858L131m031L33L401n508k47P725k743p243O802M458r378j665
$$ -682 310 -4330 -1472 1659 -2372 -2039 1362 -4146 -4393 3332 589 -6654 148 4606 -4772 -6437
1078f437R239j39m666K874O59m307L329K665m633K413O119o618m644Q790J840
$$ -6437 2802 2663 -2003 871 1530 -2777 552 3217 -1416 997 7116 498 -4146 4644 6484
1093F484q253L147O687n140m057N554o76k965M111o21m905L383K718o787L42Q133
$$ 6484 -1769 1378 8065 2925 -1132 4422 3746 781 4892 4271 -634 2749 5467 -1320 -978 7155
1109G155l865p320O149K080o907R01N928m322k168M760k462n170N957K750o424
$$ 7155 3290 -4030 2119 4199 -2708 -1807 4121 -201 -2369 2391 -71 -5241 716 3466 -2958
1124b958K49N117l982k570M986j243k832N748K07q760K426P820m177m067O308
$$ -2958 -2709 2408 -1574 -4144 842 -401 -3233 2515 2722 -6038 -3612 4208 31 -4036 2272
1139B272K21o562K208M376l578L89M315l582k738M859k221m118O943L124r157
$$ 2272 2493 -4069 -1861 2515 -1063 -674 3641 59 -2679 2180 -41 -4159 2784 5908 -3249
1154c249l53P904l483n166N730K661n503M20K757m122J013M530m148k351P248
$$ -3249 -3602 4302 819 -4347 1383 4044 -1459 -1039 1718 -2404 -1391 3139 -1009 -3360 3888
1169C888k017q713M738P062o367k696O122j855o083L583K552l527K092K338n363
$$ 3888 1871 -6842 -2104 4958 -1409 -4105 2017 162 -5921 -2338 214 -3313 -1221 1117 -4246
1184d246o71N641l778m153P243K547q466J64N265k968o00O075j635n400M560K234
$$ -4246 -4917 724 -3054 -7207 36 2583 -5883 -5719 -454 -3422 -4022 2053 418 -4982 -422 1812
1200A812o251J732O024k548k190M357j724m550N690K792n224J176M657m995k837
$$ 1812 -4439 -2707 3317 769 -1421 2936 1212 -3338 2352 5144 -80 1096 5753 758 -2079
1215b079P057p06n330M000M042o591j446N439j577k932L959q83m379L617J084
$$ -2079 4978 4272 -1058 2942 6984 393 -1053 4386 2809 -123 3836 2953 -1426 2191 3275
1230C275o574L366P398o426o357P074K387o621O52M988k564j600K502l058j334
$$ 3275 -3299 67 7465 1039 -5318 1756 4143 -2478 -1826 3162 598 -1002 1500 -1558 -2892
1245b892N855j194n863M592L305p941m70Q534j555o186L853K245m710P78L703
$$ -2892 2963 1769 -4094 498 3803 -4138 -4608 3926 2371 -3815 38 2283 -2427 -1649 2054
1260B054k941k54M521l539m441N543J975n566K248N127m721l052N114j349l547
$$ 2054 -887 -1141 3380 -159 -4600 943 2918 -2648 -400 4727 6 -3046 2068 719 -2828
1275b828N206J831o515M88N099m462k207O541m47n566L029J892n620M76N499l338
$$ -2828 2378 4209 -2306 -1818 3281 -1181 -3388 3153 2706 -2860 169 2061 -3559 -3083 2416 -922
1291i22k027M943k679n672M944L941n976n42N445k931m150L742Q48k337L292N94
$$ -922 -2949 1994 -685 -6357 -1413 2528 -3448 -3990 1455 -1476 -5626 -1884 -1036 -3373 -81 513
1307E13n743K521N377n067l441P994J690q073P64N486k882j651M958j280l067
$$ 513 -5230 -2709 2668 -2399 -5840 2154 3844 -4229 -3465 2021 -861 -2512 2446 1166 -1901
1322a901L128l03l546M323K460o017L71O437m355n058O747L179o663J92M644l555
$$ -1901 1227 924 -2622 1701 4161 -1856 -1485 4952 597 -4461 2286 5465 -1198 -1006 3638 83
1338H3k133M431j227k503M775j68o615K254N388l455k309N365k308m315L223K198
$$ 83 -2050 2381 1154 -1349 3426 3258 -3357 -1103 4285 830 -1479 3886 1578 -2737 486 2684
1354B684m197K009M580n148k208N089j224n186N016L733o106p95L854k791j225
$$ 2684 -1513 496 5076 -72 -2280 2809 1585 -3601 1415 5148 -958 -1753 2101 -690 -1915
1369a915N180n08m843L624K025o314j28O336j455m090M338J91m542J669K327k600
$$ -1915 3265 2757 -2086 1538 3563 -2751 -2879 3457 2002 -2088 2250 2441 -2101 -432 1895 -705
1385g05J801M011n410l641O659L3n592L584M574n772k827N756j259m392L825J906
$$ -705 1096 5107 -303 -3944 2715 2748 -2844 740 5314 -458 -3285 2471 1212 -3180 645 2551
1401B551l010J72K32l946K669N419m486m159N802P77p703K104O304l419k628L680
$$ 2551 -459 -287 -55 -4001 -1332 4087 -399 -4558 1244 2021 -5682 -3578 2726 -693 -3321 359
1417C59j277l790M230J696m783K192L934m652k917N397j73l479L737J406n379
$$ 359 -918 -4708 -478 1218 -3565 -1373 2561 -2091 -5008 389 216 -3263 474 1880 -3499
1432c499R81M438l934j614N860r17m995L265K288n197J032N503k790k987L727
$$ -3499 -2518 1920 -2014 -3628 2232 1315 -3680 -415 1873 -3324 -2292 3211 421 -2566 1161
1447A161r32l908M121K475n194N76M891l510l897N747J228m662J870L008m229
$$ 1161 229 -3679 442 2917 -2277 -1701 3190 -320 -4217 1530 2758 -1904 -34 2974 -1255
1462a255k52L325j909r78M551j262n448M225L258o006K15O786k039o358L273L345
$$ -1255 -1507 1818 -91 -1069 3482 2220 -3228 997 4255 -1751 -1536 5250 3211 -3147 126 3471
1478C471l493P08K252k967R57L019m009k785O491R17o208J624M460m190k562M493
$$ 3471 -22 686 2938 -29 928 3947 -62 -2847 3644 4561 -1647 -23 4437 247 -2315 2178
1494B178L29l015K547J063n349J423M200l771j263M867j787m583L936J704n170
$$ 2178 2507 -508 2039 3102 -2247 -824 3376 -395 -1658 3209 1422 -3161 775 2479 -2691
1509b691J728M664l576k915M380r07m028M134K322m748l5M379l266k619M398K96
$$ -2691 -963 3701 125 -2790 1590 683 -3345 789 3111 -1637 -1672 2707 -559 -3178 1220 1516
1525A516l716K617J205m233J355M398l444k904N474O2n596K115M281l790j244
$$ 1516 -2200 417 1622 -2611 -1256 3142 -302 -3206 2268 2330 -3266 -1151 3130 -660 -1904
1540a904M148j507k746L151j48l120L157J826n616M64N513k811m260M621K027
$$ -1904 2244 737 -2009 1142 994 -2126 1031 2857 -2759 -2295 3218 407 -3853 768 2795
1555B795n153K70L655k930m24L329k745k435M272j1n721L309M581m734k289M835
$$ 2795 -2358 -2088 1567 -1363 -1787 1542 -1203 -3638 634 623 -5098 -1789 2792 -1942 -4231 604
1571F04j468l842L088K449l585L10L635l687p45L703j410k819M902J036n569J150
$$ 604 -864 -4706 -1618 831 -2754 -2444 1191 -2496 -3241 462 -948 -3767 1135 2171 -3398 -2248
1587b248M813k752k011M376j30l669K840J837n002J437N421l336l299M121J083
$$ -2248 2565 -187 -2198 2178 2048 -1621 1219 3056 -1946 -509 4912 1576 -1723 2398 3481
1602C481m328K014K142k729R81K717m092j787N337n07m915K830L286m947j144
$$ 3481 -847 1167 3309 580 1561 4278 186 -1601 3736 3229 -1686 1144 4430 -517 -1661
1617a661M924j415l263L214P59l534J937J833l967O83M398k792l838M858J376
$$ -1661 3263 1848 -1415 1799 2558 -976 961 2794 -1173 -490 3908 1116 -2722 2136 3512
1632C512n499J075M447k767j940K535r96j976L560l89m235K763K827m693j359
$$ 3512 -1987 -912 3535 768 -1172 1363 367 -1609 1951 1562 -2673 90 2917 -1776 -3135
1647c135N336j400m893L788K267n133J3M309k010j285K768j578k835L697J420
$$ -3135 2201 801 -4092 -304 1963 -3170 -3157 1152 -858 -2143 625 -953 -3788 -91 1329
1662A329m469J435L946l011k397M202n77k638L284J416m129O00L898l428k609
$$ 1329 -3140 -1705 2241 -770 -3167 1035 458 -2180 1104 2520 -1609 -1009 2889 -539 -3148
1677c148N445K06m632J886K707l945j47L851k505k042L818j281m014K612K589
$$ -3148 2297 2503 -2129 -243 2464 -1481 -1628 2223 -282 -2324 1494 213 -3801 -1189 1400
1692A400m077K57M411l158l605L600J650l125J057K090k666J23K924k858j524
$$ 1400 -2677 -2420 1991 -1167 -4772 -1172 478 -2647 -1590 500 -2166 -2043 881 -1977 -3501
1707c501N377L9n477J935M545l418k148M214J56k748J633Q05l042K278K336m052
$$ -3501 1876 1915 -3562 -1627 2918 -500 -2648 1566 1722 -1026 607 1412 -1630 648 2984 -1068
1723a068m86M601j975m139L999K013m703j4M440k676j879L445p47k704K918J507
$$ -1068 -1554 3047 1072 -3067 932 2945 -1758 -1772 2668 -8 -1887 1558 811 -1893 1025 2532
1739B532m171Q25L994k597j902L958l62l441K179K133l432J391L222l585k093
$$ 2532 -1639 -814 3180 583 -1319 2639 2277 -1164 1015 3148 -284 1107 4329 744 -1349
1754a349M905l15l905K385K295l391q24L329k391k031L758J1l588J837J554m008
$$ -1349 3556 3241 -664 1721 4016 625 -199 3130 739 -1292 2466 2477 -1111 726 2280 -1728
1770a728N91L980k832l607L896J267m203M21L417k640j54K146k006j151L429p87
$$ -1728 -1137 2843 11 -3596 300 1567 -2636 -2215 1202 -1438 -1592 554 -1452 -2603 826 39
1786C9l683K536L567m463j315N058o20l833K423J436k993J257K007k850l15L455
$$ 39 -3644 -1108 2459 -2004 -3319 1739 1119 -2714 -291 1145 -1848 -591 1416 -1434 -1749 1706
1802A706j528k776L417R79m784J480M077k959k223L304p68k315K746J254l944
$$ 1706 178 -2598 819 1798 -2986 -1506 2571 -388 -2611 693 -75 -2390 356 1610 -2334
1817b334J044L270k776j811M211m47l906K691J545l516R04L452k413j849L452
$$ -2334 -1290 1980 -796 -2607 1604 1157 -2749 -58 1487 -2029 -1125 2327 -86 -1935 1517
1832A517o40l214K829K203l849j44M034k424k652L308N99k481J453J191l638Q46
$$ 1517 877 -2337 492 2695 -1154 -1298 2736 312 -2340 968 1567 -914 539 1730 -1908 -1062
1848a062L691l070k474N028N29m993J181L207k306j106K969r55j978K707n18l375
$$ -1062 2629 -441 -2915 2113 2642 -2351 -1170 2037 -269 -1375 1594 639 -1339 1368 850 -2525
1864b525K864K635l649o02M103k016l375L220K201l627L88L111k720j044K939
$$ -2525 339 2974 -675 -1277 2826 810 -2565 655 2856 -771 -383 2728 8 -1036 1903
1879A903j003j907L186J6m026J046L571l135j565M088l34l367J634J600k622O03
$$ 1903 900 -1007 2179 2195 -1831 -785 2786 -349 -1914 2174 1840 -1527 107 1707 -915 -312
1895c12K583k636j393L466j190l060L187J549l303M9L240k179j792L181k22l268
$$ -312 2271 -365 -1758 1708 518 -2542 645 2194 -1109 -1060 2180 1 -1791 1390 1168 -2100
1911b100K701J107l098J22L377j643k420K912M75k703N03J974k057Q08J870k745
$$ -2100 601 1708 -1390 -1268 2109 466 -1954 958 1433 -1270 -767 1207 -850 -42 1828 -917
1927i17j677M053m9m342K121L431l125j965L151m18j863K069R7k516J327J873
$$ -917 -2594 1459 1410 -2932 -811 2620 -505 -2470 681 263 -1600 469 566 -1950 -623 1250
1943A250l022kL409j533k786L208N62m231J272L676k376j420K338p94k114K619
$$ 1250 -1772 -1774 1635 102 -2684 524 1086 -3145 -1873 1803 -573 -1993 345 -449 -2563 56
1959E6L87l521K097K882k825j982L673l04l097K522J772l299L29K617k312r49
$$ 56 443 -3078 -981 1901 -924 -2906 767 463 -2634 -112 1660 -1639 -1310 1307 -1005 -1954
1975a954L182k82k716K039J049k809Q87L240k271j811K718O3k763J651K048k787
$$ -1954 1228 946 -1770 269 1318 -1491 -604 2636 365 -1446 1272 1335 -1428 223 2271 -516
1991e16L74K594k126k306M050M15l613J033K303k149o97K884j747j405K942o99
$$ -516 -142 2452 326 -1980 2070 2485 -1128 -95 2208 59 -638 2246 499 -906 2036 1337
$$ [...]
8191b08
##END NTUPLES=NMR FID
##END=
