##TITLE=1H_TG-2291-3
 CDCl3, 8 sc, 
 29.6.2020
##JCAMPDX= 6.0         $$ Bruker NMR JCAMP-DX V2.0
##DATA TYPE= NMR FID
##DATA CLASS= NTUPLES
##ORIGIN= UXNMR, Bruker Analytische Messtechnik GmbH
##OWNER= root
$$ XWIN-NMR		Version 3.5
$$ Mon Jun 29 11:19:02 2020 Russian Standard Time (UT+4h)  she@DPX200
##.OBSERVE FREQUENCY= 200.1315
##.OBSERVE NUCLEUS= ^1H
##.DELAY= (6, 6)
##.ACQUISITION MODE= SIMULTANEOUS
##.ACQUISITION SCHEME= undefined
##.AVERAGES= 8
##.DIGITISER RES= 18
##SPECTROMETER/DATA SYSTEM= spect
##.PULSE SEQUENCE= zg30
##.SOLVENT NAME= CDCl3
##.SHIFT REFERENCE= (INTERNAL, CDCl3, 0, 15.7039)
##AUDIT TRAIL= $$ (NUMBER, WHEN, WHO, WHERE, WHAT)
$$ ##TITLE= Audit trail, XWIN-NMR		Version 3.5
$$ ##JCAMPDX= 5.01
$$ ##ORIGIN= Bruker BioSpin GmbH
$$ ##OWNER= she
$$ F:/spectra/data/she/nmr/H-F/1/audita.txt
$$ ##AUDIT TRAIL=  $$ (NUMBER, WHEN, WHO, WHERE, WHAT)
(   1,<2020-06-29 11:17:13.53 +0400>,<she>,<DPX200>,
      <created by zg, POWCHK disabled, PULCHK disabled
       configuration hash MD5:
       00 E9 B6 7A A2 85 ED C7 34 08 36 98 17 FE 4E 26
       data hash MD5: 16K
       EB 53 2C 08 81 8C 4F E4 3B 37 6B 43 CB C0 2E 68>)
$$ ##END=
$$ 
$$ hash MD5
$$ 1B 34 5D 9A AE 9F FE A7 EB B3 97 73 8E 97 1D 0A
##$RELAX= 
##$RELAX= 
##$RELAX= 
##$RELAX= 
##$RELAX= 
##$RELAX= 
$$ Bruker specific parameters
$$ --------------------------
##$DU= <F:/spectra>
##$EXPNO= 1
##$NAME= <H-F>
##$PROCNO= 1
##$TYPE= <nmr>
##$USER= <she>
##$AMP= (0..31)
100 100 100 100 100 100 100 100 100 100 100 100 100 100 100 100 100 100 
100 100 100 100 100 100 100 100 100 100 100 100 100 100 
##$AQSEQ= 0
##$AQ_mod= 1
##$AUNM= <au_zg>
##$AUTOPOS= <>
##$BF1= 200.13
##$BF2= 200.13
##$BF3= 200.13
##$BF4= 200.13
##$BF5= 200.13
##$BF6= 200.13
##$BF7= 200.13
##$BF8= 200.13
##$BYTORDA= 1
##$CFDGTYP= 0
##$CFRGTYP= 5
##$CHEMSTR= <none>
##$CNST= (0..31)
1 1 145 1 1 1 1 1 1 1 1 1 1 1 1 1 1 1 1 1 1 1 1 1 1 1 1 1 1 1 1 1 
##$CPDPRG= <>
##$CPDPRG1= <>
##$CPDPRG2= <>
##$CPDPRG3= <>
##$CPDPRG4= <mlev>
##$CPDPRG5= <mlev>
##$CPDPRG6= <mlev>
##$CPDPRG7= <mlev>
##$CPDPRG8= <mlev>
##$CPDPRGB= <>
##$CPDPRGT= <>
##$D= (0..31)
0 1.2 0 0 0 0 0 0 0 0.06 0 0.03 0 0 0 0 0.0002 0 0 0 0 0 0 0 0 0 0 0 0 
0 0 0 
##$DATE= 1593415032
##$DBL= (0..7)
120 120 120 120 120 120 120 120 
##$DBP= (0..7)
150 150 150 150 150 150 150 150 
##$DBP07= 0
##$DBPNAM0= <>
##$DBPNAM1= <>
##$DBPNAM2= <>
##$DBPNAM3= <>
##$DBPNAM4= <>
##$DBPNAM5= <>
##$DBPNAM6= <>
##$DBPNAM7= <>
##$DBPOAL= (0..7)
0.5 0.5 0.5 0.5 0.5 0.5 0.5 0.5 
##$DBPOFFS= (0..7)
0 0 0 0 0 0 0 0 
##$DE= 6
##$DECBNUC= <off>
##$DECIM= 24
##$DECNUC= <off>
##$DECSTAT= 4
##$DIGMOD= 1
##$DIGTYP= 9
##$DL= (0..7)
0 120 120 120 120 120 120 120 
##$DP= (0..7)
150 150 150 150 150 150 150 150 
##$DP07= 0
##$DPNAME0= <>
##$DPNAME1= <>
##$DPNAME2= <>
##$DPNAME3= <>
##$DPNAME4= <>
##$DPNAME5= <>
##$DPNAME6= <>
##$DPNAME7= <>
##$DPOAL= (0..7)
0.5 0.5 0.5 0.5 0.5 0.5 0.5 0.5 
##$DPOFFS= (0..7)
0 0 0 0 0 0 0 0 
##$DQDMODE= 0
##$DR= 18
##$DS= 0
##$DSLIST= <SSSSSSSSSSSSSSS>
$$ [...]
##$SUBNAM2= <"">
##$SUBNAM3= <"">
##$SUBNAM4= <"">
##$SUBNAM5= <"">
##$SUBNAM6= <"">
##$SUBNAM7= <"">
##$SUBNAM8= <"">
##$SUBNAM9= <"">
##$SW= 24.9337058887773
##$SWIBOX= (0..15)
0 0 2 0 0 0 0 0 0 0 0 0 0 0 0 0 
##$SW_h= 4990.01996007984
##$TD= 16384
##$TD0= 1
##$TE= 0
##$TE2= 300
##$TE3= 300
##$TEG= 300
##$TL= (0..7)
0 120 120 120 120 120 120 120 
##$TP= (0..7)
150 150 150 150 150 150 150 150 
##$TP07= 0
##$TPNAME0= <>
##$TPNAME1= <>
##$TPNAME2= <>
##$TPNAME3= <>
##$TPNAME4= <>
##$TPNAME5= <>
##$TPNAME6= <>
##$TPNAME7= <>
##$TPOAL= (0..7)
0.5 0.5 0.5 0.5 0.5 0.5 0.5 0.5 
##$TPOFFS= (0..7)
0 0 0 0 0 0 0 0 
##$TUNHIN= 0
##$TUNHOUT= 0
##$TUNXOUT= 0
##$USERA1= <user>
##$USERA2= <user>
##$USERA3= <user>
##$USERA4= <user>
##$USERA5= <user>
##$V9= 5
##$VALIST= <valist>
##$VCLIST= <CCCCCCCCCCCCCCC>
##$VD= 0
##$VDLIST= <DDDDDDDDDDDDDDD>
##$VPLIST= <PPPPPPPPPPPPPPP>
##$VTLIST= <TTTTTTTTTTTTTTT>
##$WBST= 1024
##$WBSW= 4
##$XGAIN= (0..3)
0 0 0 0 
##$XL= 0
##$YL= 0
##$YMAX_a= 619409
##$YMIN_a= -287291
##$ZGOPTNS= <>
##$ZL1= 120
##$ZL2= 120
##$ZL3= 120
##$ZL4= 120
##$ABSF1= 10
##$ABSF2= 0
##$ABSG= 5
##$ABSL= 3
##$ALPHA= 0
##$AQORDER= 0
##$ASSFAC= 0
##$ASSFACI= 0
##$ASSFACX= 0
##$ASSWID= 0
##$AUNMP= <proc_1d>
##$AZFE= 0.1
##$AZFW= 0.1
##$BCFW= 1
##$BC_mod= 2
##$BYTORDP= 1
##$COROFFS= 0
##$CY= 11.3945322036743
##$DATMOD= 1
##$DC= 2
##$DFILT= <>
##$DTYPP= 0
##$F1P= 16.9975609425685
##$F2P= -3.02152046262296
##$FCOR= 0.5
##$FTSIZE= 0
##$FT_mod= 4
##$GAMMA= 1
##$GB= 0.15
##$INTBC= 1
##$INTSCL= 1
##$ISEN= 128
##$LB= 0.24
##$LEV0= 0
##$LPBIN= 0
##$MAXI= 10000
##$MC2= 0
##$MEAN= 0
##$ME_mod= 0
##$MI= 1.114404
##$NCOEF= 0
##$NC_proc= 0
##$NLEV= 6
##$NOISF1= 3.799351
##$NOISF2= 2.8
##$NSP= 1
##$NTH_PI= 0
##$NZP= 0
##$OFFSET= 15.70392
##$PC= 1
##$PHC0= -9786.69
##$PHC1= 8.400868
##$PH_mod= 1
##$PKNL= yes
##$PPARMOD= 0
##$PSCAL= 0
##$PSIGN= 0
##$REVERSE= no
##$SF= 200.130013532006
##$SI= 16384
##$SIGF1= 3
##$SIGF2= 2
##$SINO= 400
##$SIOLD= 16384
##$SREGLST= <1H.CDCl3>
##$SSB= 0
##$STSI= 0
##$STSR= 0
##$SW_p= 3612.71676300578
##$SYMM= 0
##$S_DEV= 0
##$TDeff= 0
##$TDoff= 0
##$TI= <>
##$TILT= no
##$TM1= 0
##$TM2= 0
##$TOPLEV= 0
##$USERP1= <user>
##$USERP2= <user>
##$USERP3= <user>
##$USERP4= <user>
##$USERP5= <user>
##$WDW= 1
##$XDIM= 8192
##$YMAX_p= 0
##$YMIN_p= 0
$$ End of Bruker specific parameters
$$ ---------------------------------
##NTUPLES= NMR FID
##VAR_NAME=  TIME,          FID/REAL,        FID/IMAG
##SYMBOL=    X,             R,               I
##VAR_TYPE=  INDEPENDENT,   DEPENDENT,       DEPENDENT
##VAR_FORM=  AFFN,          ASDF,            ASDF
##VAR_DIM=   8192,          8192,            8192
##UNITS=     SECONDS,       ARBITRARY UNITS, ARBITRARY UNITS
##FACTOR=    0.0002004,     1,               1
##FIRST=     0,             0,               0
##LAST=      1.6414764,     0,               0
##MIN=       0,             -287291,         0
##MAX=       1.6414764,     619409,          0
$$ Real data points
##PAGE= N=1
##DATA TABLE= (X++(R..R)), XYDATA
$$ [...]
2586B06q3o65L70L021j191m810J241M357j218l484Q63R09N49J282j325l427K060
2603a345L689l031l367J612K046m24o9j038j615K137K869k867l693L307J996k486
2619b279j143mN9K058J899l734k485M126K060l587j746K001P01P80N37k850j239
2636d846M778J136m692q65L201O83j217J52q85J55L731K79m740J20M464k74k408
2653a228l5L79P13K192l10l633J621M572j321l476J108J373k74R14q91k337J920
2670A287M065k261l400K228K261j210j68r76j049J980K453k954k680L101K876
2685E553k266j713N54j89J144J398k872k067M050J551l035j527K086K96q3K93
2701C173k361r85L612R49m390r63L815M58j528q79q06k42K645j55m168K56M136
$$ plain form
2586 206 123 -542 -172 2849 1658 -3152 -1911 2446 1228 -2256 -1393 -484 65 1347 22 -3405 -1345
2603 -1345 2344 -687 -4054 -2442 -396 -820 -889 -1927 -3542 -1405 1464 -1403 -5096 -1789 207 -2279
2619 -2279 -3422 -3426 -3367 -1309 590 -3144 -5629 -1503 557 -3030 -4776 -2775 -2074 -1294 -757 -3607 -4846
2636 -4846 -68 1068 -3624 -4489 -1288 -605 -1822 -1670 -2555 -2400 1331 1610 -3130 -3010 1454 1180 -1228
2653 -1228 -1263 -884 -171 2021 1711 -1922 -301 4271 2950 -526 582 1955 1681 2595 1704 -633 1287
2670 1287 5352 3091 -309 1919 4180 2970 2802 1826 777 2757 5210 2256 -424 2677 5553
2685 5553 3287 1574 2128 1939 3083 4481 1609 -458 3592 5143 2108 581 2667 2963 2880 3173
2701 3173 812 -173 3439 4388 -2 -965 2850 3308 1780 901 95 -147 2498 2343 -1825 -1569 2567
2718B567p10k704M92K76O4J714j072l657J140L880p50l905J214K192p58L74n18
2735a61k738J522L782k729l625K190K733j143j178K69p48J216K005l154k867K979
2751a647K253k420j468J142M96L64J028k787j470L233J657l933p07K435P65l77
2767a436L60j053j090L323J197m387m35L885J31j798R3r3J03K808J62l778LM026
2785B021l23l423R91J407JJ063P5k984J088M330j722l846J512K487j048j75J82
2802A636j563J403L528k061l610K418K506j606j460O81m48J319J881k530k295
2817b01L278K070k891j886J900R6L3P34j825j894L344J901l716j651K722L24j011
2834A327j11j473n59K691J084l835q98M114k37k582K25k1k38J615L29l618J12
$$ plain form
2718 2567 1857 -847 -355 -79 -15 1699 627 -3030 -1890 1990 1240 -2665 -1451 741 -17 357 -161
2735 -161 -2899 -1377 2405 -324 -3949 -1759 974 -169 -1347 -1078 -1826 -610 1395 -1759 -4626 -1647
2751 -1647 606 -1814 -3282 -2140 -1644 -1280 -252 -3039 -4509 -1276 381 -3552 -4259 -1824 -1059 -1436
2767 -1436 -1076 -2129 -3219 104 1301 -3086 -3521 364 495 -1303 -1210 -1303 -1200 1608 1770 -2008 -2005 2021
2785 2021 1698 -1725 -734 673 674 1737 1812 -1172 -84 4246 2524 -1322 190 2677 1629 1454 1636
2802 1636 73 1476 5004 2943 -667 1751 4257 2651 1191 1872 1424 2743 4624 2094 -201
2817 -201 3077 5147 2256 370 2270 2366 2399 3133 1308 -586 2758 4659 943 -708 2014 2338 1327
2834 1327 1216 -257 -816 1875 2959 -876 -1774 2340 2103 -479 -254 -275 -513 1102 1431 -2187 -2075
2851b075M301o93l157K46J734o15K25k98k483O66L915j356l880J706K472j488
2867g80p06K30j497P17K361k105l230K423K864j670j262P97l82M8J711j519k651
2884d651K660K397k388j759K110O18l23P64j827j039K341J806l178j503L111J312
2900D51j715J13k50p72K057J252l505m25L449J84k568N72J087m00J698K07k759
2917a324J3L875p72l074P95K262p94L27L37j599P02K915q87l901J834K312j238
2934A783q10O25o31N81K361j382l191K223K791k744j540J384M12j60J738j570
2950A870k282K674J913k754j877K529J01j138R14r98j224J897K155l666j362L414
2966B166n3k158L10r1q61J602J009k978o65L642Q7l495M01P91o11O03M15k609
$$ plain form
2851 -2075 2226 1533 -1624 -1378 356 -259 -34 -332 -2815 -2149 1766 410 -3470 -1764 708 -780
2867 -780 -1486 -1256 -2753 -2036 325 -1780 -5010 -2587 277 -1393 -2655 -1858 -2240 -2192 -481 -2000 -4651
2884 -4651 -1991 406 -1982 -3741 -1631 -1013 -1336 -572 -2399 -3438 -1097 709 -2469 -3972 -861 451
2900 451 -1264 -1151 -1401 -2173 -116 1136 -2369 -2794 655 839 -1729 -1157 -70 -470 1228 1435 -1324
2917 -1324 -1311 2564 1792 -1282 -487 1775 981 1308 1645 46 748 3663 2776 -1125 709 3021 1783
2934 1783 973 1598 967 1548 3909 2527 -664 1559 4350 1606 66 1450 1862 1702 3440 1870
2950 1870 -412 2262 4175 1421 -456 2073 2174 1036 1950 952 -272 1625 3780 114 -1248 2166
2966 2166 2113 -45 265 174 -687 915 1924 -1054 -1719 1923 2010 -1485 -1084 -293 -904 -301 114 -2495
2984b495j1L527n86l263K10K377q89p76M43j368O7L086j539l065J535K384j306
3001a669j617R79m53K89J319r64k608J951K914k218j622J405L83n97J036j141
3017b613j631K296J838k201j659K249P75j311M79j91j049J806J174k698r23L345
3033c14Q60k172J90O45q05J389R60k648k52L448J71l128M88K065m72N30J3j742
3051g74Q4K773J1l472R27K740o70o20N01q99K51K160p43k775J433K606j578j145
3069H10Q08NKJ837j043k411J600K584k484j720K080M63j099J160p78j767J894
3086A941J672k502j605K202J009j827L5L68j096J170J444k943q64K602N13k697
3102e78R7J045n18L63Q45k284p75L025M77l811L20J811n34m96M68j128l02K365
$$ plain form
2984 -2495 -2506 1021 435 -2828 -2618 -241 -1130 -1906 -1463 -2831 -2764 322 -1217 -4282 -2747 -363 -1669
3001 -1669 -3286 -2307 -2760 -2471 -1152 -2116 -4724 -2773 141 -2077 -3699 -2294 -1911 -2508 -1472 -2613
3017 -2613 -4244 -1948 -110 -2311 -3970 -1721 -946 -2257 -1778 -1969 -3018 -1212 -38 -2736 -3659 -314
3033 -314 546 -1626 -1436 -791 -1596 -207 753 -1895 -2147 1301 1472 -1656 -1168 897 425 955 968 -774
3051 -774 -690 2083 2094 -1378 -451 2289 1619 999 1500 601 852 3012 2269 -506 927 3533 1955 810
3069 810 1618 1623 1625 3462 2419 8 1608 4192 1708 -12 2068 2531 1432 2592 1814 47 1941
3086 1941 3613 1111 -494 1708 2717 890 925 1293 197 1367 2811 -132 -996 1606 2119 -578
3102 -578 -481 564 46 409 1254 -1030 -1805 1220 1697 -2114 -1794 17 -517 -1013 -545 -1673 -1975 390
3120C90l70l041O80K158o77j482P85o80o6J952o79k520J402K300j786j708J048
3137b294K20O8R56m88j893J304K572k117j821K032P71o81j00r7j513K010J733
3154F62k421j233K553R39k242O05L29j35Q99P76k021j084L367O35k571K70J559
3171H87j043N20R27k213P7K787N20k858k4K161j97p70N55p53J9K114k52k726Q73
3190F04L001j118j176O03j89m30J611n11k328J273K853k114j727J745P48r62P51
3207B634j8k237J611J456j897j852K085J148j101r0K20j610R48J804j860j834
3223e93K367R04k125l63J247j132P88P14j561j684K589M19k274j98J332n17l07
3240c94P89j082r91K197k9k839K65J792l36j170P36o74j60K024l11l254R59K467
$$ plain form
3120 390 20 -3021 -2341 -183 -860 -2342 -1557 -2237 -2303 -351 -1030 -3550 -2148 152 -1634 -3342 -2294
3137 -2294 -2074 -2006 -1050 -1538 -3431 -2127 445 -1672 -3493 -1461 -690 -1371 -1471 -1568 -3081 -1071 662
3154 662 -1759 -2992 -439 500 -1742 -1137 -808 -943 -44 732 -1289 -2373 994 1629 -942 -672 887
3171 887 -156 364 1291 -922 -845 1942 2462 -396 -420 1741 1544 774 1329 576 595 2709 2457 -269 604
3190 604 3605 2487 1311 1914 1725 1295 2906 2395 67 1340 4193 2079 352 2097 2845 1883 2634
3207 2634 2616 379 1990 3446 1549 -303 1782 2930 1829 1739 1959 349 1297 3101 1241 -593
3223 -593 1774 2678 553 190 1437 305 1093 1807 246 -1438 1151 1570 -704 -902 430 -87 -394
3240 -394 395 -687 -1678 519 490 -2349 -2084 -292 -628 -1798 -1062 -1736 -1896 128 -183 -3437 -2478 -11
3258a1j280j589J075K68m98Q33K14k279J252K005j480j906J518R36j127N75J69
3275a325j588R78K086j916j593K178J138j843j46P69p23Q99J540j482j362K446
3291E6M52j571k77J090j24R7J141j610q11K737M53k353M8J659l69m97P88p50o47
3310d88K339L88k910M68K224m24j534O73Kj80J533m93j630K34K522p37k079J144
3328A052N56n20M78j10j559Q66K201j220k056J571R89r18M5J46j295P52J886j821
3346A043j769J965J111j829k20N05l23M51Q83j575j380K081R61k361m22J454k42
3363C33p16Q42j246r23J875O43k370l99K231m02q71m0k03o21J509M93k775K01
3381b439K293m45j519L50L10j29P62R1j996J51K487r82k021J495P67r60L34J95
$$ plain form
3258 -11 -1291 -2880 -1805 -1537 -2035 -1202 -988 -3267 -2015 -10 -1490 -3396 -1878 -942 -2069 -1494 -1325
3275 -1325 -2913 -1935 151 -1765 -3358 -1180 -42 -1885 -2031 -1262 -1985 -1086 454 -1028 -2390 56
3291 56 508 -1063 -1340 -250 -374 -277 864 -746 -1557 1180 1633 -720 -672 987 618 121 909 159 -488
3310 -488 1851 2239 -671 -203 2021 1597 63 736 738 558 2091 1598 -32 202 2724 1987 -92 1052
3328 1052 1608 1088 1566 1456 -103 763 2964 1744 -312 1259 2248 1330 1375 1521 226 978 2864 1043
3346 1043 -726 1239 2350 521 301 806 483 934 1817 242 -1138 943 1904 -457 -879 575 333
3363 333 -383 459 -787 -1710 165 808 -1562 -1961 270 -132 -1003 -1043 -1246 -1867 -358 135 -2640 -2439
3381 -2439 -146 -591 -2110 -1760 -1450 -1579 -817 -726 -2722 -2571 -84 -1066 -3087 -1592 -825 -1785 -1451 -1256
3399a256j729R50K114j678j619J282J670j643K71O37n49N70J183j425j505K068
3415f59J647k107r2J354q30L76Q84j020j036K241N82k259r4J534m14j55Q33o73
3433A12p78J894P41k329l53K373k87j279R63j69n62J489L10j819M4K096n26j680
3451B40R43L79m86J056K08j919L53K133o01j790P20J344j053J36J55q13n7J878
3469B826q80j965J531J114j064p66N88p10K88J313j346j191J399R73j809p04J472
3486A069m87j93J034j111j272J583P56j531j106K115r0j178P73o47r22J295O87
3503G75k082l65J923j63j172K49K00p26P83O52k252L90J987n10k049Q23J311j238
3521a464L68K61j301L76J758o26j788R50J401j001q6L80n38K3J236m47j791J325
$$ plain form
3399 -1256 -2985 -2035 79 -1599 -3218 -1936 -266 -1909 -1638 -1001 -1550 -980 203 -1222 -2727 -659
3415 -659 988 -1119 -1211 143 -687 -311 573 -447 -1483 758 1340 -919 -1013 521 107 -48 785 112
3433 112 -666 1228 1969 -360 -713 1660 1373 94 1057 888 326 1815 2125 306 350 2446 1920 240
3451 240 1183 1562 1076 2132 2340 421 774 2907 2306 516 1236 2580 1527 1663 1818 1005 948 2826
3469 2826 1946 -19 1512 2626 1562 796 1384 674 962 2275 929 -262 1137 2110 301 -403 1069
3486 1069 582 389 1423 312 -960 623 1379 -152 -1258 857 767 -411 362 -285 -1207 88 775
3503 775 -1307 -1672 251 88 -1084 -835 -635 -1361 -578 74 -2178 -1788 199 -311 -2360 -1537 -226 -1464
3521 -1464 -1096 -835 -2136 -1760 -2 -628 -2416 -1466 -65 -1066 -1152 -772 -1310 -1287 -51 -498 -2289 -964
3539i64J333j405l85J131n03m24J812o36j852J915R05j527o82J259J02m59J051
3556F71p07r69J781Q20j690p38J817J32q79N76K09n31J044N92j805o07K513k88
3574A941j289M66L68k34J92N95j285j85K068n02j646N32J249r17L86N21j275J77
3592A162J902o07k145J201J299j338m57R23q48R4J017l46k019J205J607j641p33
3609B76O09L67m07K17o62j118J261J062j768p32J463j43r49O38m74r92J415O00
3627F63j846n42J840p9j144K82L34m79N70P38j953m65J924O1j786P53K41m61L85
3646i64M69j296J22J455k85j895P57J040p95o6L43q13r9J834m92j428N78J638
3664A03j097k81P37l50l32J317p40j594J316J129q59r86J524O3l19L61J61j470
$$ plain form
3539 -964 369 -1036 -1421 -290 -793 -1217 595 -41 -1893 22 927 -600 -1282 -23 79 -380 671
3556 671 -36 -1005 776 1596 -94 -832 985 1117 238 814 1023 492 1536 2128 323 -284 2229 1941
3574 1941 652 1118 1486 1252 1444 2039 754 569 2637 2135 489 1021 2270 1353 1739 2260 985 1162
3592 1162 3064 2457 312 1513 2812 1474 1017 1940 1092 1186 2203 1857 -162 1043 2650 1009 276
3609 276 885 1252 845 1062 400 -718 543 1605 -163 -895 568 425 -524 114 -360 -1352 63 663
3627 663 -1183 -1725 115 36 -1108 -826 -492 -971 -401 337 -1616 -2081 -157 -96 -1882 -1129 -888 -1349 -964
3646 -964 -495 -1791 -1669 -214 -499 -2394 -1637 -597 -1392 -1458 -1115 -1928 -2027 -193 -685 -2113 -1535 103
3664 103 -994 -1275 -538 -888 -1220 97 -643 -2237 -921 208 -651 -1637 -113 -50 -369 -8 153 -1317
3682a317J151J350j617o53J292L29q15O91k0j016J195R49j290p82J737K11j019
3699C76K90K26m28P49N74j320l06J614L47j569K91J111o40K55O48j104l37J791
3717B568j77k022O34J475p82n48N46l21o91J563m83j531M00J481j276m13Q60k82
3735A001m09J070k96j680J030R87j174j129J282J65q21L24k38j395J305J018j678
3752f38o22Q23O56j183J42L27j090P42J089j448p98J418J10j131K42N71q76L93
3770a273Q24r82n43J359L27j713J85J378r48j38P93q00k22P83N41j826P32J265
3788b58j194j43P53o43J79P79j96j163P18J292p97p03J004k46l16N52L7q50R04
3807b91J026r05j046J479K10j058O85K56j130Q57R82j046q52J318M96j148N75
$$ plain form
3682 -1317 -166 1184 -433 -1086 206 535 -280 411 391 -625 570 1519 229 -553 1184 1395 376
3699 376 666 892 464 1213 1787 467 161 1775 2122 553 844 1955 1315 1570 2218 1114 777 2568
3717 2568 2391 369 1003 2478 1696 1148 1694 1373 682 2245 1762 231 631 2112 836 423 1283 1001
3735 1001 592 1662 1366 -314 716 1703 529 -600 682 847 26 350 112 -1283 22 1040 -638
3752 -638 -1260 -437 219 -964 -822 -495 -1585 -843 246 -1202 -2000 -582 -472 -1603 -1361 -790 -1666 -1273
3770 -1273 -449 -1431 -1974 -615 -288 -2001 -1816 -438 -1386 -1524 -731 -1531 -1753 -970 -429 -2255 -1523 -258
3788 -258 -1452 -1595 -842 -1485 -1306 -527 -723 -1886 -1168 124 -673 -1376 -372 -618 -934 -382 -345 -1195 -291
3807 -291 735 -170 -1216 263 473 -585 100 356 -774 83 1065 19 -833 485 981 -167 408
3824D08K99o46M35Q61q62n19J152N13j284J93P85m13L78O77j084n56J501j9j517
3843C02K94J533m65l30K91l06o24J162J24j715K46J568p92n19L35m91%P08j92
3862A129j194N24J195r77r91P64l29j32O57l25q07L88R12p73j293J349N2n13L05
3881e9K05j297R61Q51p86j051P85L88j166J92N93o84J11Q92r20q03J213J84j387
3900a778q7Q33j46j85K38o17l55J586J53j753L60J329o86k71L70m61LJ400j7j984
3920b068Q49J451o05r83N53O89q07J168m79p40J35J710p20j442J299L81m79L55
3938B67Q2r21P20J078j239p82R82L73n19K17M80p59L19J091r17j129J870N91j453
3957C51J99R04n05K96Q63j117o30J230O29j318l21J309m42n31O09n74l43J125
$$ plain form
3824 408 707 61 496 1357 495 -24 1128 1641 357 550 1335 922 1300 1977 893 337 1838 1819 302
3843 302 596 2129 1664 1334 1625 1319 695 1857 1981 266 512 2080 1288 769 1104 613 613 1321 1129
3862 1129 -65 459 1654 677 -314 450 121 -11 646 321 -486 -98 814 41 -1252 97 149 -364 -59
3881 -59 146 -1151 -190 661 -125 -1176 -391 -3 -1169 -977 -384 -1068 -957 -65 -985 -1788 -575 -391 -1778
3900 -1778 -1865 -1032 -1178 -1363 -1125 -1742 -2097 -511 -358 -2111 -1751 -422 -1108 -1379 -1009 -1470 -1467 -67 -84 -2068
3920 -2068 -1219 232 -373 -1356 -803 -114 -921 247 -232 -972 -837 873 153 -1289 10 391 -88 267
3938 267 349 -572 148 1226 -13 -795 187 560 41 258 738 -21 298 1389 472 -657 1213 1804 351
3957 351 550 1454 949 1245 2108 991 361 1591 2220 902 581 1890 1448 917 1526 952 609 1734
3975A734K30j227j54J190n17p73M32K40q56Q64K41j603L07J421o02r21M86M46
3993I38r96O44J28r22K69J308q31q69M70N89q24Q4M96j134M74J016r21j353J039
4012c95J025j449J76K86p68M83O83p65j117J545J40j259n4M69l4P0L01m30n29
4031a622P62O12j583K97J135k72n32N72p20l60J280Jq30k28J271n13m14M70l5
4050g09m69P86R7j196N09J280n14j432J042N54q03M18M13r39L87J213q25j002
4068a190P94Q73n43k58P09o85l9J097k23r48J102P42j194R8L09j9k13P85l28j052
4088a83J040Q83j281p5J134n34j9N48n27o25J122M44j323j22J398p88n60M58N0
4107A040r57J173J25j069J58J166n64r90N10L58q41O22J92r95j57J220l43j239
$$ plain form
3975 1734 1964 737 583 1773 1256 483 915 1155 299 1163 1404 -199 108 1529 927 6 492 938
3993 938 -58 586 714 -208 61 1369 538 -331 139 728 -96 -12 484 -650 -176 840 -81 -1434 -395
4012 -395 630 -819 -643 -357 -1125 -642 41 -724 -1841 -296 -156 -1415 -1469 -1000 -1034 -964 -663 -1093 -1622
4031 -1622 -860 -248 -1831 -1534 -399 -671 -1203 -631 -1351 -1711 -431 -430 -1260 -1488 -217 -730 -1144 -674 -709
4050 -709 -1178 -392 -295 -1491 -982 298 -216 -1648 -606 -52 -855 -437 -24 -963 -576 637 -188 -1190
4068 -1190 -396 477 -66 -324 385 -300 -339 758 535 -413 689 1431 237 335 644 625 412 1197 869 -183
4088 -183 857 1740 459 384 1518 984 965 1513 986 361 1483 1927 604 482 1880 1092 532 990 1040
4107 1040 83 1256 1381 312 470 1636 1072 82 592 950 109 731 923 -72 -229 991 648 -591
4125e91O84P84r09L56M50j741O66R21r83n93J055Q66j407O7K34j68n00J292p00
4144b17j234R52P55j040j92M77o02K79L90k33j394J071O95j166k43J222m86l60
4162a326M39m42m59J081L25j459R0J293n67l20L58M8o27N94M25j039j03J390l86
4181f85r40N96K20j80M22J54n81k86J278n03j193J066L81n96M20M46p26k68J203
4200B28q4j127R55O38o26l89P76l43q4R23l80p15M97R08q92m14J134k76qJ24n2
4221G93p93R07O04p67o41R53M14r57O70j8q33R69M04j127m95J942r04p92L44K97
4241I70m65N47L49j036m05J583l61j231M83M64n07M34K90p14m90J195p29q68P84
4260B93M48p41m71R84q13k44Q94m9j579J139N45o36q81P94p3m42N23k50q83N11
$$ plain form
4125 -591 93 877 -32 324 774 -967 -301 620 -363 -956 99 965 -442 -375 -141 -309 -809 483 -217
4144 -217 -1451 -499 256 -784 -976 -499 -1101 -822 -432 -665 -2059 -988 -293 -1459 -1702 -480 -966 -1326
4162 -1326 -887 -1329 -1788 -707 -382 -1841 -1751 -458 -1025 -1345 -987 -939 -1566 -972 -547 -1586 -1689 -299 -685
4181 -685 -1625 -1029 -809 -989 -567 -413 -994 -1280 -2 -505 -1698 -632 -251 -847 -427 19 -707 -975 228
4200 228 144 -983 -28 610 -16 -405 371 28 -56 867 487 -228 269 1177 285 -129 1005 729 721 845 793
4221 793 0 907 1511 744 103 1056 1470 513 1183 1165 332 1301 1705 578 83 2025 1121 329 673 970
4241 970 505 1052 1401 365 -40 1543 1182 -49 434 898 391 825 1115 401 -89 1106 377 -491 293
4260 293 741 0 -471 513 -300 -544 350 301 -1278 -139 406 -230 -1111 -317 -390 -832 -309 -559 -1442 -931
4280i31M13j69p73J161l97k66N93n56m80P35L79j052k62J156j5q86L52J50p69
4299a617Q24M86j013r3R17N3p08M97K97p41P88K68j157M7J141k87j156J003K85
4318a66m55J19M87p05l9J237l67j389Q57Q84o40j91P24k74m87J126k83j177Q59
4337A20J040j132j22N66L19o66O98J72r88O26O04m22q62J009J71r58Q44L29p30
4356F18M4R34r17m28J303n60l56L01L08r19N41P37j392k4P59K78j166M12L24m62
4376C35K63N62q26m65J446l16j132K37N89n72j84N58m71l87J009j98j199M48Q07
4395E04o92m14M70o5p06P48K39r82K95P98r17k02M91l18k18M98j65q01M48P95
4415a94o92m98Q61J32r14M63K5k63K39O00q21n12J300j31p33M29M27r24M12O04
$$ plain form
4280 -931 -518 -687 -1460 -299 -696 -962 -369 -925 -1405 -670 -291 -1343 -1605 -449 -464 -1350 -998 -848 -1617
4299 -1617 -793 -307 -1320 -1413 -496 -443 -1151 -654 -357 -1098 -310 -42 -1199 -1152 -11 -298 -1454 -451 -166
4318 -166 -621 -502 -15 -720 -759 478 111 -1278 -421 463 -177 -368 356 82 -405 721 438 -739 120
4337 120 1160 28 -94 472 791 125 823 995 7 633 1237 815 -47 962 1133 175 1019 1348 618
4356 618 662 1596 679 251 1554 994 638 939 1247 328 869 1606 214 190 949 1227 61 473 797 335
4376 335 598 1160 334 -131 1315 999 -133 104 693 121 -63 495 24 -363 646 448 -751 -303 504
4395 504 -188 -602 -132 -197 -903 -155 84 -898 -603 195 -722 -924 -433 -751 -969 -471 -636 -1437 -989 -194
4415 -194 -886 -1384 -523 -391 -1305 -842 -817 -1080 -841 -241 -1062 -1574 -274 -405 -1138 -709 -282 -1206 -794 -190
4435a90n72l43J165j28j041N06M37m88J7M70n66k10O33M03j001M80O54o56q1O86
4455A75m88l94J166l07j064Q10Q83o20k49P87j54m86P67R5r88M46J002q30m72
4474G9Q34K11n76N80k67p11M45J019j130p38J455l70p38N80N41q42OR90j075m03
4494a10J090L01r05J54J08l84K09O17q33k41P27O2j103N61M21n29k16M93l22m46
4514c46N99L62j174L80P04j031J3N88m05l16O67K81j196K06Q35m08l51N50m50
4533d92n45P41k89m82K7J254p54o61Q67J2p77L62M58o91J69Q49q90o62R54N67
4553A7r81K36M73n72J13P34p79l37R14K7r71J50N20k82J24L29l66n58J289P8j012
4574h54L39O11j18m21O21l53l84N34N64j040M96P58l97n25N50J09m98N25P9l90
$$ plain form
4435 -190 -762 -1105 60 -68 -1109 -603 -166 -654 -637 -167 -733 -943 -310 93 -908 -428 226 -430 -511 175
4455 175 -313 -707 459 152 -912 -102 781 161 -88 699 545 59 826 921 -67 379 1381 551 79
4474 79 913 1124 548 1128 861 150 595 1614 484 -254 1201 831 93 673 1214 372 378 1368 293 -110
4494 -110 980 1281 376 530 638 254 463 1080 247 6 733 795 -308 253 674 145 -71 422 100 -346
4514 -346 253 615 -559 -179 525 -506 -493 95 -310 -626 41 322 -874 -668 167 -241 -592 -42 -492
4533 -492 -1037 -296 -585 -1067 -1040 214 -540 -1201 -334 -322 -1099 -737 -279 -970 -801 48 -842 -1504 -550 17
4553 17 -964 -728 -255 -827 -714 20 -759 -1096 -182 -155 -1126 -976 -456 -738 -614 -285 -651 -1209 80 158 -854
4574 -854 -515 96 -22 -443 178 -175 -559 -25 539 -501 -5 753 356 -169 381 490 -8 517 596 206
4594B06j60J147o82n06R53J39r33Q35J55p65J80Q06p62l57O80J95n71R4M42n17
4614E79kJ023p76p20P90K78q72M86N9l86j20P13m51o46Q90K14j114M55J90j58
4634D32l40O63l63n73M81L18o81o8P19n41m03P06j89p21R79k85p75K16M30k56
4654b51n18L49O7k81M25K0p06J48L70K90q35M37N35q62K77J72o82N08P01r13l04
4675a053O00J2k89l07P50n23j7P20m64p48R41L47q61R2N95l14k82N39l44k62Q54
4696a4k62m01j69Q86m25j58M81m37l37M42P99q78k0Q90k69o94P30k56J50P5M33
4717E66q54M50N03j55p04N76J59l01K71L99p74K08O55j30o47L84O18n29J55q7
4737G63J9l59O11k36n92P92K76j029M39L23m86j65N83K13r33O16P6o28K36M66
$$ plain form
4594 206 46 1193 511 5 958 1097 164 999 1154 389 569 1375 613 256 936 1131 560 654 1096 579
4614 579 577 1600 824 104 894 1172 300 786 845 459 339 1052 601 -45 845 1059 -55 400 590 432
4634 432 92 755 392 -181 300 618 -63 -131 588 47 -356 350 161 -560 419 134 -641 -425 5 -251
4654 -251 -769 -420 -353 -634 -209 -189 -895 -747 -377 -87 -922 -485 50 -812 -535 -363 -1045 -537 164 -749 -1053
4675 -1053 -453 -441 -730 -1037 -287 -810 -827 -107 -571 -1319 -378 -31 -892 -800 -205 -519 -801 -262 -606 -868 -14
4696 -14 -276 -677 -846 40 -385 -543 -62 -499 -836 -394 405 -473 -493 397 128 -566 164 -92 58 133 566
4717 566 -288 162 665 510 -194 382 541 240 511 910 136 344 999 869 222 606 1224 695 850 763
4737 763 782 423 1034 798 206 998 1274 245 684 1007 521 356 939 1152 219 835 911 283 519 985
4757I85k90l96P25n83l23O45J20p52R2P30m44l44M31j80o59M99M70p88k79O49
4777C08k85n3L17k00l54M16k75m87l16J156K9r64N35L6n90M68J6n00K35M07l77
4798d78m69N62L35p82J08Q03j261L36O78m02n37O93J80l74j98L00k77r0O84O3
4818a26p26L32R62j229j80Q90q9l66L36p6o42O52O32j017j06P92K29o11N39J44
4838C40p31L92K38p25J90P97m21j41O16p6m77J80Q63j194L97O73m8q08J82N54
4858H01l17J04L85p79L53O45n33m20L51L98k27k86J35Oj07P71n51m11M80J36j24
4879H10m81Q11n72k69N47j64o51O14M62q11j97N47j09l30L44L00q58L76P91j102
4899E8j23N77p3o98M33L15n36L54L40p56k02N20R7n17J12J86n82K85M81o55k58
$$ plain form
4757 985 695 299 1024 441 118 763 883 131 223 953 509 165 596 416 -243 256 726 -62 -341 308
4777 308 23 -30 287 87 -267 149 -126 -613 -929 227 256 -708 -173 -137 -727 -259 -243 -743 -508 -101 -478
4798 -478 -947 -385 -50 -832 -724 79 -1182 -846 -168 -570 -1107 -414 -234 -608 -806 -506 -783 -873 -189 -126
4818 -126 -852 -520 442 -787 -967 -77 -166 -532 -196 -272 -914 -262 370 -647 -753 39 268 -343 196 340
4838 340 -391 1 239 -486 -296 501 80 -61 555 479 2 182 1045 -149 248 921 873 65 247 801
4858 801 484 588 973 194 547 1192 659 239 590 988 761 475 610 616 509 1280 729 318 798 934 810
4879 810 329 1140 568 299 846 682 31 645 1107 296 99 646 537 207 551 851 -7 369 1160 58
4899 58 -65 512 439 -259 174 489 -47 307 647 -109 -311 209 306 -211 -99 87 -495 -210 271 -384 -642
4920f42P70m05q76O13M10m33K12J21o26K73L86m26m89M39M55n62R2N12n66m01
4940a143R12j62q08O93K96m52l92N90O3o04Q39k25p70N89P66m85n12N16k86r5
4960f70M82O1n50M96P40j027j96O98r7l27M46J98l46J13P23p22q0K78L13l10J72
4981C95K43j34k72N12n43R4Q32l32n32L6N59m46j45M02r9k40M68K19n49J37N63
5002A168n48j59L08J4l33K72J14n13L24L70o06k03L77P7k39K51M8r20R02Lo83
5023B4MM08J20o2k2j69k35K10M67q02l15P79o4p63M17K65l04j30K75n00j93O57
5045F7k14o35N96J77l91j42K74l75l33O02m0m86J21Q16p75m3K75j41L4K82J41
5066a90o24o3Q09n29j93O11m37L91k30L50r29M81O11m15n35P20m52L4K62K54m46
$$ plain form
4920 -642 128 -277 -1153 -540 -130 -563 -351 -230 -856 -583 -197 -623 -1112 -673 -218 -780 -688 -176 -742 -1143
4940 -1143 -231 -393 -1201 -508 -212 -664 -1056 -466 -403 -1007 -168 -393 -1163 -574 192 -293 -805 -289 -575 -670
4960 -670 -188 -127 -677 -181 559 -468 -664 34 -63 -390 56 254 -92 21 744 22 -58 220 533 223 395
4981 395 638 504 232 744 201 295 1127 795 263 299 858 412 267 669 570 330 798 1017 468 605 1168
5002 1168 620 461 769 783 450 722 836 323 647 1017 411 208 585 662 423 674 722 -198 704 707 24
5023 24 28 436 556 494 472 303 68 278 745 -57 -372 407 343 -420 -3 262 -42 -172 103 -397 -590 67
5045 67 -147 -782 -186 -9 -400 -542 -268 -643 -976 -374 -414 -900 -779 37 -738 -781 -506 -647 -613 -331 -190
5066 -190 -814 -877 -68 -597 -790 -179 -616 -225 -455 -105 -1034 -553 58 -357 -892 -172 -624 -590 -328 -74 -520
5087e20pO92q48k5Q39Q5o64j7M58k72k9N33k00l29N60j33n17N68M1p8m9M24l04
5110B08l22M63j72j1K4L93M7m05J85n73L41Q61l52q10L29O90m99J29j1J45l38
5131C22L40L94n63K61J1J3p35O04m71J94K48L3l60J14M84k82o58M83K30p40M01
5152C23L08r62N5J017n14m63P85l86j55K7J99m32P5P08p40l17M19N15j021L35
5172b24K97o73K32O44o70k55P43J2q36L80M41m90P6J19l31k50N99q2k82Q6k0l99
5194h83J04P76o20j71P66j13p89J58P61l51m16O61k13n22O48L18p64P6L92r0m31
5215g03K11M35m48K46K26n15J82N38m20k69M02J56k47J49K89m72L48N1q7l71P06
5236D07r2k52J3K83q5n8K78k3n67M39K51n39PO74l14j63L46j22k51K08M23r32
$$ plain form
5087 -520 -527 165 -683 -708 131 216 -448 -465 -7 -279 -308 225 25 -304 256 123 -394 174 215 137 88 512 208
5110 208 -114 349 177 166 190 583 630 225 410 -163 178 1039 687 -123 206 896 397 526 515 660 322
5131 322 662 1056 493 754 765 778 43 647 176 370 618 651 291 405 889 607 -51 432 662 -78 323
5152 323 631 -331 -276 741 227 -236 549 163 8 35 234 -198 -123 585 -155 -472 -53 462 -559 -224
5172 -224 73 -600 -368 276 -394 -649 94 106 -730 -350 91 -399 -323 -204 -535 -785 -186 -268 -550 -464 -484 -883
5194 -883 -779 -3 -623 -794 -28 -141 -930 -772 -11 -362 -778 -117 -330 -852 -204 114 -650 -574 -182 -272 -703
5215 -703 -492 -57 -505 -259 -33 -548 -366 172 -248 -517 -115 41 -206 -57 232 -240 108 159 72 -299 407
5236 407 315 63 76 359 274 216 494 471 -96 343 594 55 62 736 422 259 605 483 232 440 863 -69
5258f9O29J76k19%k19K80n09P43j81n59J9R69q92K45j03L55l94J57L95l81m32
5279A0P53j02o77M88j51l19J88M2M13n80N02l99j75K4K7j30j75L18k22j02M88
5300B21l35n66Q46k14l43L20J16j71o07L72K6q9J63K47o12J48N5j50j84M44n1
5321c64m38M99J23l50k18M49k93m90O58k8j66N30k90q8q0M12j81m75L75M63m06
5342c58K48l33m70O09M44m04r9k0N64n45J03k7J58nL79j88m80R79j13l70k98N95
5364C69l68k3J25j39j18M69K60m61k07O70m84LN92Q4n06J14J07j14k00L07N1n38
5386gP26K25l93j64P3l66NN01j88r7J17N1m0k32L02k12j18M32j7o99K99M95o07
5409H6J41J27k10j11K85R6n98J76M07m65J46n7j71K30l09K58o26N30Rl60K0M85
$$ plain form
5258 -69 560 736 517 517 298 578 69 812 631 72 91 1060 168 413 310 665 271 428 823 442 10
5279 10 763 661 -16 472 321 2 190 232 645 65 567 168 -7 17 44 -86 -261 57 -165 -267 221
5300 221 -114 -680 166 -48 -391 -71 45 -126 -733 -361 -335 -424 -261 -14 -626 -478 -423 -573 -757 -313 -364
5321 -364 -802 -303 -180 -530 -748 -299 -592 -1082 -424 -452 -618 -88 -378 -466 -546 -134 -315 -790 -415 48 -358
5342 -358 -110 -443 -913 -304 140 -264 -363 -383 181 -364 -261 -288 -130 -135 244 56 -424 555 442 72 -226 369
5364 369 1 -22 103 -36 -154 315 575 114 -93 577 93 96 688 772 266 380 487 373 173 480 531 -7
5386 -7 719 944 551 387 460 94 99 600 412 315 432 483 443 211 513 301 183 615 598 -101 198 693 86
5409 86 227 354 144 33 318 414 -184 -8 399 -66 80 23 -148 82 -227 31 -595 -65 -56 -416 -396 89
5431H9o26q1M22kl28L96K07n25ll2K4j71N24l38l96K48O06o06j14L94k05r1J51
5454d57K56m12L17j11k75J57M18l59n42P62R8l04J00K33j23k73M24K07o74K80
5474b78jj16r2N12K7k47K86l12Q3K87R2m16Q5L64n04L04k56K21k28J89K17m73
5496b56M57oj91J29K30L74q27M73L42o13J92R1k19Q2P4J42m11J92K54l51J48K75
5518E81j51k84J39J73K3k2J87m43J00R4m3l9Q7Q0l92p4L90o6k79K67j03l06N19
5541D38J31o23K17K9j95j26M62k65n61L29K99l77j32lJ49N2m1M3l02P3q5K1L73
5564i4j68O2m72K06L2k47K62K80m23j70N87M6m76L49J70k96J35k30j31q2O42j50
5586a68n56M19j64P9l2J23j23n69Q33Q0m57J07M29n89L96L33m45K42j28L0l10
$$ plain form
5431 89 -537 -618 -196 -198 -526 -130 77 -448 -451 -483 -459 -630 -106 -444 -840 -592 14 -592 -706 -312 -517 -608 -457
5454 -457 -201 -613 -296 -407 -682 -525 -107 -466 -1008 -246 -148 -452 -352 -119 -242 -515 -91 116 -558 -278
5474 -278 -279 -395 -487 25 52 -195 91 -221 -138 149 241 -175 -90 274 -230 74 -182 39 -189 0 217 -256
5496 -256 201 195 4 133 363 737 -90 383 725 112 304 395 176 258 332 474 63 255 509 158 306 581
5518 581 430 146 285 458 481 459 646 203 303 397 354 315 402 482 90 16 406 340 61 328 225 -81 438
5541 438 569 -54 163 192 -3 -129 333 68 -493 -164 135 -242 -374 -377 -228 -176 -217 -174 -476 -403 -488 -467 -94
5564 -94 -262 -200 -672 -466 -434 -681 -419 -139 -562 -732 -145 -99 -575 -226 -56 -352 -217 -447 -578 -660 -18 -168
5586 -168 -724 -305 -469 -390 -422 -299 -422 -991 -158 -78 -535 -428 1 -588 -192 141 -304 -62 -190 -160 -470
5607d70K72L16m00J38L56j5n11M85m6l01P6O3J0j50L96N6j81J00kl2m2M32l99
5630A51p9L84j76k37M75n0l93k4M77m59K66J50L62o56K90P0l59K83m6k00q6M15
5652E58J3p73K28N31k22j56M31j82l25N93J8p64K31n9R8L1J08l94k73N36K0j32
5674A16N1L73o04K21n1J2n23M68J82m20K05j7j87m30N91j22l64J66J97k54m1K64
5696a67k44k97P51m46m27O79l15l50P6N92l08k72R06l68l98L68K53n44ML09m64
5717f62M3J63K91k02l9M00k74p0K79m9j97J62R5l26Q7J59n8o1M53l49j55J77M2
5740i1q8R0K29l32k6Q63n08l24N74m50L1Q1K13j23k64L62L44k49o4M38k35O6O
5763E43k55r9L66J8n66J21N47j91J9J27k46M9J80j75j59q6J69n5o3O34j96o63
$$ plain form
5607 -470 -198 118 -282 -144 212 197 -314 171 125 -176 -100 -37 -27 -177 219 275 94 194 192 160 118 550 151
5630 151 72 456 280 43 518 468 75 51 528 69 335 485 847 191 481 551 192 475 429 229 143 558
5652 558 571 -202 26 557 335 179 610 428 103 696 714 -50 181 122 220 251 359 -35 -308 228 248 116
5674 116 167 540 -64 157 106 118 -405 63 245 -175 30 13 -174 -604 -13 -135 -499 -333 -136 -390 -431 -167
5696 -167 -411 -708 43 -403 -830 -151 -466 -816 -740 -148 -456 -728 178 -190 -588 -220 33 -511 -507 -198 -662
5717 -662 -619 -456 -165 -367 -406 -6 -280 -350 -71 -120 -317 -155 -60 -386 -299 -140 -198 -259 194 -155 -310 -133 -91
5740 -91 -179 -89 140 -192 -218 645 137 -187 387 -63 -32 49 262 139 -125 237 581 332 268 706 471 537 543
5763 543 288 189 555 573 7 128 675 484 503 630 384 433 613 438 279 193 362 307 244 878 682 19
5785A9P61l87j99j16M17l65Q8N51k52k78Q3M2j50P1J98j47k77L5J61n69L94L83
5807D63l67m09M02om78M72om39K76p9N3m63O32m13k56J21J03r0J51K88m92J41
5829c96M65j03o07L79J25o7k52L43j58k09L98l13l09M25J94m37K84J10l52j3L22
5850a71p2j31M33m20O2n8M83j48k29l19N01r4k04L53j60J07K28k66l27L53Q3m17
5872d13M46J64k47n1M70n64N6J29K56j99J70J0m2k10O40l10rj13L30l12J86K46
5894F33l90m55Q30l56L2o8Q3j79L0K79Q8m08N30k66p8J62j46k6k53N04j30m2o8
5917C06J54n36N45k40k11J22M74k40k02J34o5o1Qp3l62K84K46l30j37K3K7R7J
5940c6K28n12J89J73j97k94k8O57l53q2J88M9m93K91L03l17J80j77k27k8K42l8
$$ plain form
5785 19 780 393 194 78 495 130 218 769 517 239 322 364 214 285 483 336 59 94 255 -314 80 463
5807 463 96 -313 89 83 -395 77 71 -368 -92 -171 -118 -581 51 -362 -618 -497 -394 -484 -333 -45 -537 -396
5829 -396 69 -34 -641 -262 -137 -204 -456 -113 -271 -480 -82 -395 -704 -279 -85 -522 -238 -128 -480 -493 -171
5850 -171 -243 -374 59 -361 -299 -357 126 -22 -251 -570 -69 -163 -367 -14 -174 -67 161 -105 -432 -79 4 -413
5872 -413 33 197 -50 -101 369 -195 -139 -10 246 47 217 227 185 -25 615 305 296 183 513 201 387 633
5894 633 243 -212 618 262 294 226 309 130 160 439 527 119 649 383 305 467 321 295 42 546 416 374 306
5917 306 460 -76 469 229 18 140 614 374 172 306 241 180 188 115 -247 37 283 -47 -184 -161 -134 -37 -36
5940 -36 192 -320 -131 42 -155 -449 -477 180 -173 -255 -67 -18 -511 -220 83 -234 -54 -231 -458 -486 -244 -282
5962b82q8M63l34m96N36k40k87L42K41n02m2K48j16j82J65K78k49p0L91m9k45
5983e18M38k60j07J78K74l88J7J24J33j50J52K07k48j0M31k97l08N63m62n8K75
6004a4K85o67M06K74k76j10M11j20j59J09K25J4m05K84m40L48J22J03m34M6K68
6025B70Rj54L18k24o9M37j23k97M35j6k18j09L71l48j65J78J59k29N2R3l4m71
6047a35N22J8k37L12r0j94O5L88m77J27k44K11m68K69N4o8l36M01j47l0K60k4
6069A77l03K40J16l97K72J9k68j32N07k60k63J38j07R2j93J02j02j19K16l90J89
6090d66J37j0K76j53k27Q7l9K02J21l06l6L75m38l7M17k84J5K61k1o9N1l86L1
6113d99OL25N1j78J47L58o32Q3P00m77q6J12L5j51M63J11l74K9J4m2N1K83l27
$$ plain form
5962 -282 -370 93 -241 -737 -201 -441 -728 -386 -145 -647 -689 -441 -557 -739 -574 -296 -545 -615 -224 -273 -518
5983 -518 -80 -340 -447 -269 5 -383 -366 -242 -109 -259 -107 100 -148 -158 273 -24 -332 231 -231 -289 -14
6004 -14 271 -396 10 284 8 -102 309 189 30 139 364 378 -27 257 -183 165 287 390 -44 2 270
6025 270 279 125 443 219 150 587 464 167 602 586 368 259 630 282 117 295 454 225 277 370 336 -135
6047 -135 387 405 168 480 390 196 261 649 172 299 55 266 -202 67 121 53 -283 118 -29 -59 201 177
6069 177 -126 114 230 -167 105 124 -144 -276 231 -29 -292 -154 -261 -169 -362 -260 -362 -481 -265 -655 -466
6090 -466 -329 -339 -63 -216 -443 -356 -395 -193 -72 -378 -414 -39 -477 -514 -97 -381 -366 -105 -126 -195 -144 -530 -499
6113 -499 -493 -168 -117 -295 -148 210 -422 -339 361 -116 -202 -90 -55 -206 257 368 -6 23 37 -5 46 329 2
6136BJ0M11j22j82k2K9j47Q7K94j01j20j74L79q6m1M23m52n3J10k23l48N23P5
6159B72l51L07kLr1K29r1l8J50jj18K8P9M6l68J04n5Nk53J17K79p5J45j84k40
6184a03R6J59k49j1P36n57l20N39p8l72J67J53k19O5K40l74K47N5j25k22K50k57
6206a80N7l83L31j00l1K60j97J34P2l34k2o0J64J67k88O31l78j46J71o3NJ99r
6229@k72k62L97K98p09N64j92q8j65M94n9J28k40O0r1M26j08j93k34K68J00l57
6251b35n6J63n1J76J30l02J79J14q9j80K68J0j14j11K25K40k48J44j02O8OL8p7
6274A96r3L24j75r4r9L39p3l31J23R8J48m4j16J06j72J17J08k49Q63m85j82K25
6296E34k97n35O86l04J04K90m1p9l31J73Q9j06J41k5n68M22L1l37j24M98J33j27
$$ plain form
6136 2 12 423 301 119 97 126 -21 66 360 259 139 -35 344 258 217 640 188 135 245 22 -326 197 272
6159 272 -79 228 226 229 138 367 276 238 388 387 269 297 376 422 54 158 103 108 -145 -28 251 176 321 137 -103
6184 -103 -7 152 -97 -108 628 71 -249 290 212 -160 7 160 -59 6 246 -128 119 174 49 -173 77 -180
6206 -180 -123 -506 -175 -275 -306 -46 -243 -109 -37 -371 -393 -453 -289 -122 -410 221 -157 -303 -132 -195 -190 9 0
6229 0 -272 -534 -137 161 -548 16 -176 -264 -429 65 6 134 -106 -46 -137 289 181 -12 -246 22 122 -235
6251 -235 -291 -128 -179 -3 127 -175 4 118 29 -151 117 127 13 -98 127 367 119 263 161 229 235 273 196
6274 196 103 427 252 158 59 398 325 -6 117 215 363 319 203 309 137 254 362 113 976 491 309 534
6296 534 237 -298 388 84 188 478 437 358 27 200 289 183 324 299 -269 153 184 -153 -277 221 354 227
6318B27k66N7j62J47Nk92J65R9p6j31k9M17n67M0J27L62n05K96J4l36R1l3K15
6341a35j38J33J52r1r9l5k00J1O05k37k92k30L84l8n4l5KJ99K25j18l08J61m40
6364e78J33J1O31p80K05R5J92l54K8J47Q2l9K85l64O3L00n3j92Q1K6j09J06L1
6387e3K76j90Mj45L2N6L40m48K79K67k87k37K28K60M2k11k49L3r7M60j86j38J72
6410B08J85k13L06q5M6k28J10J1j96J72k42j82M15J72l79J81O4j63p8q1L90k15
6432A98l9j0P9l34L58m50k42M43K63l78k12L90J9p5K70k82j67M97m31q1L11J11
6454B38n51K60j02Q9k54J70J79q6j5N1k34N9K30k87j0K35k0l74L97j95m6Rm6J20
6478a83k8Pp5M4nn6J29K5M0l76K66N7J95k22J30J0j11n4J86l9j90L8K55Q4k96
$$ plain form
6318 227 -39 18 -144 3 8 -284 -119 -20 -96 -227 -256 161 -406 -366 -239 123 -382 -86 -72 -408 -317 -350 -135
6341 -135 -273 -140 12 -79 -178 -213 -413 -402 203 -34 -326 -556 -172 -210 -264 -299 -297 -98 127 9 -299 -138 -578
6364 -578 -445 -434 197 -583 -378 -283 -91 -445 -417 -270 -188 -227 58 -306 -243 57 4 -188 -107 -81 -190 -84 -53
6387 -53 223 33 37 -108 -76 -20 320 -128 151 418 131 -106 122 382 424 213 -36 -3 -100 360 174 36 208
6410 208 393 180 486 401 447 219 329 340 144 316 74 -108 307 479 100 281 345 182 104 23 413 198
6432 198 159 149 228 -106 252 -198 -440 3 266 -112 -324 66 85 10 280 -2 -169 328 -103 -184 127 238
6454 238 -313 -53 -155 -66 -320 -150 29 -57 -72 -21 -255 -196 34 -253 -263 -28 -48 -422 -25 -220 -266 -257 -303 -183
6478 -183 -211 -204 -279 -235 -240 -296 -167 -142 -102 -478 -212 -155 40 -182 -52 -42 -153 -207 -21 -60 -250 -212 43 127 -169
6503a69p8j41Q7L58j60k56K00K26l18n6L66k41K29J43J16k67j36K25j18l75N28
6524A63k51j20N26Q2j52J20j60j63K82m62K64k43L25J43m5j48J18k04K82l82K98
6545B73J44q9N2j51L04j96Pj18k91N9K95j78j37K84J25J02l08l1J29k01J79q8
6567A65k28M21j34k23J95J02o4n4k23J82J01m03M00M2l24R0m59P15l58O1j0n1
6589e7j79O6o6j03K53J78j56l51N58j51n29O44J04l64n6K67m01N3J95r9K5o5J92
6612d2k33J18k3j5J9j90K14n3j15N09l13l75L74j3r3K35k65k74P63j19pl12K52
6635D2l02J08J84j66Q2j53J48J70l4j88K18p5j46L02l2l70P63p06M27p2k55j8
6657g3K15j75J07J45l8J03k52L37k1q2p1J40m5j07J77k04J40L37k17j90L12m9
$$ plain form
6503 -169 -247 -388 -301 57 -103 -359 -159 67 -251 -307 59 -182 47 190 306 39 -97 128 10 -365 163
6524 163 -88 -208 318 400 248 368 208 45 327 -135 129 -114 211 354 309 161 279 75 357 -25 273
6545 273 417 328 380 229 533 337 344 226 -65 -6 289 111 -26 258 383 485 177 146 275 74 253 165
6567 165 -63 358 224 1 196 298 234 180 -43 139 240 -163 237 279 -45 45 -414 301 -57 4 -6 -57
6589 -57 -236 -170 -236 -339 -86 92 -64 -415 143 -8 -537 107 211 -153 -209 58 -343 -290 -95 -194 -169 -234 -42
6612 -42 -275 -157 -180 -195 -176 -366 -152 -205 -320 189 -124 -499 -125 -138 -231 4 -261 -535 228 109 102 -210 42
6635 42 -260 -152 32 -134 -52 -205 -57 113 79 -109 109 34 -112 190 158 -212 551 -155 272 200 -55 -73
6657 -73 142 -33 74 219 181 284 32 369 348 266 195 335 290 183 360 156 296 633 416 226 538 489
6679D89j36l22J81j22K85r6k31J29j6K33k50j21l5K19j0K8k03J4J23k2k16K31
6701A52o3l5k33J4L44m08J21J9k36J74K34o5p8q3J35k23K08K80l71N4J97j70l8
6724g1K50k26l7l81M71k63j27K25J32k61J9J02j90L43L23m37p8K81j23J8k9J65
6746A06n40J46J47k01j6L09Q8l41l29O65l18J37K06J6p31K42M47m50N07l29K0
6767b19N3O0K29k34M03l69k87K54j58L75j74K47j4Q2J13Ml67Nq1L2N3rJ29Qj7
6792A18M4k16N16J32k70j95K43j12l99N95m83N11l22O0Jj54r9J81K33l46J74j95
6814A7K70j77pR2j4M0J25k54j40N16l98P1Rj48K09k17k75L63n9n1J71j09K51m45
6838a60j28L27n8r2o9p2L10k19l0K63k21J00lj24M33n35L42j2j22l39J62K99l85
$$ plain form
6679 489 353 31 212 90 375 279 48 177 161 394 144 23 -12 207 197 225 22 36 159 137 -79 152
6701 152 89 54 -179 -165 179 -229 -108 -89 -325 -151 83 18 -60 -143 -8 -231 -23 257 -114 -60 137 -33 -71
6724 -71 179 -47 -84 -465 6 -257 -384 -159 -27 -288 -269 -167 -357 -14 309 -128 -206 75 -48 -30 -59 106
6746 106 -434 -288 -141 -342 -358 -49 39 -302 -631 34 -284 -147 59 75 -656 -414 33 -417 90 -239 -219
6767 -219 -166 -106 123 -111 292 -77 -364 -110 -268 107 -67 180 166 248 361 365 -2 3 -78 -46 7 -2 127 135 118
6792 118 162 -54 462 594 324 129 372 260 -139 456 -27 484 162 222 223 69 -30 151 384 38 212 17
6814 17 287 110 103 195 181 221 346 92 -48 468 70 141 150 2 211 -6 -281 82 23 -28 143 34 285 -160
6838 -160 -288 39 -19 -111 -180 -252 58 -161 -191 72 -149 -49 -52 -176 257 -278 64 52 -70 -409 -247 52 -333
6861c33O9J21J44k2m4k28k7j29M47m0M4K3r2J63j86q9QO9m7L7m0n1j75o1N98j59
6887@k75J34K77l25P3K62j92j59K07j30L7J40J5M6jJ25Ok64J48J06k37N8K2J37
6911B10l91J26k5K24j50n9J03p8J82j99N58l73K19l28j64M13l3k37m4K88Ro9K96
6934D78p11L94k79M61n09N80k93j5o1r8l2J86K19k98j49N1J54R4m70L49R7k36
6956h8J30J49q3M8j29q5j15J68r1J57J52l32K19n0O0l34M44m51j10M37j1k57J20
6979e2J10J79m88K57q4J32m85M66k86j38P3P6JJ00N7k51K15lkm06M95j03J16J47
7003A26j67j13Q1l3m4l31O51m62J68j07J11J08j24qJ0K7J74M3nr2n1j31j53L13
7027iL27l77K62o7n9j24J41R7j93K12k32O5j13M02k6m41K69m23m9Q45k33m52j29
$$ plain form
6861 -333 -264 -143 1 -21 -65 -293 -320 -449 -2 -42 2 25 -67 96 -90 -179 -171 -102 -149 -112 -152 -203 -378 -439 159 0
6887 0 -275 -141 136 -189 -116 146 -46 -205 2 -128 -91 49 64 110 109 234 240 -24 124 230 -7 51 73 210
6911 210 -181 -55 -80 144 -6 -65 38 -40 142 -57 501 128 347 19 -145 268 235 -2 -46 242 251 182 478
6934 478 -233 161 -118 343 -166 414 121 106 45 -53 -85 101 320 22 -127 -76 78 172 -298 51 148 -88
6956 -88 42 191 108 156 27 -58 -173 -5 -96 61 213 -119 100 50 110 -224 220 -231 -341 96 85 -172 -52
6979 -52 58 237 -251 6 -78 54 -431 35 -251 -389 -316 -240 -239 -139 -82 -333 -118 -121 -123 -529 -34 -137 -21 126
7003 126 -41 -154 -73 -106 -150 -481 170 -292 -124 -231 -120 -12 -136 -144 -134 -107 67 110 105 13 -38 -169 -322 -9
7027 -9 318 -59 203 136 77 -47 94 191 -2 210 -22 43 -70 332 306 -135 134 -289 -338 507 274 -178 -307
7050c07M84K8j2r3m2J7L11j22J68k77J32m33J04J10q1L3J26J56k57j91K21Nj47
7073f7M77j67k96J78K37J00m41J58j04k88M76k99K4k12M10K6l49o2L21l98L16
7094D0p1j86J94j87L07J3M4k06J61j28j32l4j68J25L3K96j13k35K41j40j69J77
7116a38L5q3j22J45O2j21j33J69J98m95P16k02Q1l27Q2J51k57k20J12M26l65N45
7138B59l66j14J01o7J25k32L4J84M2j67J2j27K78J32j53j99L28R6k20j05K56j37
7160d0k1Q7j3J17l56K54J4K40m84K82J58p3j5N2j43L26k86N3J11k43j20J47k53
7183b06J57K75l46K01K02K83o79J50J33j76l5J65J00l50K23l2K8Q9k9j52j69L30
7205A62k40jO48m13N6j76R1j72K22l8O3m9k35K43r4j12L45k02j38K0K4j84l1Q6
$$ plain form
7050 -307 177 205 193 100 58 75 386 264 432 155 287 -146 -42 68 -13 20 146 302 45 -146 75 80 -67
7073 -67 410 243 -53 125 362 462 21 179 75 -213 263 -36 -12 -224 186 212 -137 -199 122 -276 40
7094 40 -31 -217 -23 -210 97 110 154 -52 109 -19 -151 -185 -353 -228 -195 101 -12 -247 -6 -146 -315 -138
7116 -138 -103 -186 -308 -163 -101 -222 -355 -186 12 -483 233 31 112 -215 -133 18 -239 -459 -347 79 -286 259
7138 259 -107 -221 -120 -187 -62 -294 -260 -76 -34 -201 -189 -316 -38 94 -59 -258 70 166 -54 -159 97 -40
7160 -40 -61 26 13 130 -226 28 42 282 -202 80 238 165 150 202 59 385 99 152 263 20 -100 47 -206
7183 -206 -49 226 -120 81 283 566 -113 37 170 -6 -41 124 224 -126 97 65 93 182 153 1 -168 162
7205 162 -78 -79 569 156 212 36 127 -45 177 139 202 153 -82 161 67 -45 300 98 -40 -20 4 -180 -211 -125
7229a25L06l92M9J2r5J10p8j46L00K3r5Q2K23k45m89O22q9l76J07L07p6R3k30
7252b02J41n36M59M83m55j3L04k57J68k82J06J80j76k3j34L4Q3j78L58K07m04
7273a37j13N7K78m76k9M28J54j61m08N98k63Jj37j45J29M7J22l5Q1L54n51K03
7295cK46R7k60j82k2J18P8J88K0k38j20J9M93l03L9j18K2Q8l53L13J22j73J26
7318A97mJ20m14M44j38KJ89j10r2k00K46l29J96k39M19j70j9K59P0m87k6r3K27
7341D8J2O0o5j20J93k29J37r8L9K69l35J30j88K40k82k7K27L21r1k02k1r0j94
7364b66q5L61K07l50OK86l40K5K80l98O8M15l39K7J56O5k12J12j36k69L57p7O7
7387d0k65M65m21J9j12R6K04k8j58m9K51j02k8L10k33n6Op6K88k07k3j29J02P
$$ plain form
7229 -125 181 -211 -162 -150 -245 -135 -213 -359 -59 -36 -131 -49 174 -71 -560 62 -27 -403 -296 11 -65 28 -202
7252 -202 -61 -597 -138 345 -110 -123 181 -76 92 -190 -84 96 -80 -103 -237 -203 -120 -298 60 267 -137
7273 -137 -250 -193 85 -391 -420 8 162 1 -407 191 -72 -71 -208 -353 -224 -177 -55 -90 -9 345 -206 -3
7295 -3 243 340 80 -102 -124 -6 72 260 280 42 -78 -59 434 131 170 52 74 162 -191 122 244 71 197
7318 197 193 313 -101 343 205 207 396 286 194 -6 240 -89 107 -132 287 117 98 357 427 -60 -86 -179 48
7341 48 60 120 55 -65 128 -101 36 -62 -23 246 -89 41 -147 93 -189 -216 11 332 241 39 18 -72 -266
7364 -266 -351 10 217 -133 -127 159 -181 -156 124 -274 -206 209 -130 -103 53 118 -94 18 -118 -387 -30 -107 -40
7387 -40 -305 160 -261 -242 -354 -258 -54 -82 -240 -289 -38 -140 -168 142 -91 -147 -141 -217 71 -136 -159 -288 -186 -179
7411a79K07j75N0J33J15l01J69j61P1K70j29N1M6p7j66M52k67n37O40k76J80J91
7433C07j4j61l97N17l22L01j67j77K20mL04m95J88k78J85p1M42k19M7k47n8j28
7455b27M58j94j45J41M04l75q4j91K46K62j66N7m46j6Q6L21j42Q0K00n93O72l64
7477a6Q2j55o7M96n41L07k83K35L6q7j85L42n7j88M03n97L71j22m1J94p8k20K07
7500C6J05l6q5k23n4K52l9j60J2J87m0k05K85j2r3k81J17L81l69M68k74p2K78
7523A78J17o50J59R1L73n46K64k04Q9J05J16j50R3O9j90m4J70l9o1J45q6j07K76
7546A68k74J19m35O70k29J05L56n04J2m10P41m30L7N1M0J2j0m1J31j44L47j65
7568A47j1o0P8j71k20K18r9M30l65J19o9n1M1L99m11J76l22M16l61R2l6P8K27
$$ plain form
7411 -179 28 -147 -97 36 151 -150 19 -142 -71 199 70 121 167 90 -76 376 109 -428 212 -64 116 307
7433 307 293 132 -265 252 -70 231 64 -113 107 103 407 -88 100 -178 7 -64 378 159 206 -41 -99 -227
7455 -227 231 37 -108 33 437 62 -22 -213 33 295 129 186 -260 -276 -190 131 -11 69 269 -324 348 -16
7477 -16 66 -89 -156 340 -201 106 -177 58 94 7 -178 164 107 -81 322 -275 96 -26 -67 127 49 -171 36
7500 36 141 105 20 -203 -257 -5 -44 -204 -192 -5 -45 -250 35 23 -70 -351 -234 147 -222 246 -28 -100 178
7523 178 295 -355 -196 -105 268 -278 -14 -218 -129 -24 92 -58 35 104 -86 -130 40 1 -60 85 -1 -108 168
7546 168 -106 13 -422 248 19 124 480 -24 -12 -422 319 -111 -74 -23 17 29 19 -22 109 -35 312 147
7568 147 136 76 154 -17 -237 -19 -118 312 -53 66 -3 -54 -13 386 -25 151 -171 245 -116 -24 -60 18 245
7591B45o6N3m60L84j23j1L73k62r3K74k10k96M03k39n4J86k44L4K0j33N9j02J32
7614a30L10l51J77P7k40J07j39j03PM5K48j6N2L1P8r5m63K51K01k04j85L09j98
7637b31M9R0L3j66L00j51q2l2J82k96L36k59J30J54j26l38K54j18j12L66k45K78
7659A6RP3k20l8k06M86qq5lR3l96J30K76q8J76k47R9k89M18l16L99k38j76LR2
7684d0l11J76J63M46n36J11k88L70R7k4j98m5J44k22q7L28q3j9Q9K36l50P6M04
7707D37m82N3J04k58L17k41j05L40mJ5p2J60n89J56N96l90r4R7Q7j64q2L85l18
7730e2NP4n0K9Q7j16j08j96K16j88K49J30k46j90K73J07j06n6J91k44q2L44j89
7753a18k53J91n2m0K14o5Q2Q9n89M53l34M46k44J78j08m3pK14k20J72j08n5N1
$$ plain form
7591 245 179 232 -228 156 33 22 395 133 40 314 104 -192 211 -28 -82 104 -140 -106 -86 -219 -160 -262 -130
7614 -130 180 -171 6 83 -157 -50 -189 -292 -285 -240 8 -8 44 75 153 58 -405 -154 47 -157 -342 -33 -231
7637 -231 -182 -92 -59 -225 75 -76 -158 -190 -8 -304 32 -227 -97 57 -69 -407 -153 -271 -383 -17 -262 16
7659 16 25 98 -122 -160 -366 120 112 27 24 117 -279 -149 127 39 215 -32 67 -222 196 -120 279 41 -135 -132 -40
7684 -40 -351 -175 -12 434 -102 9 -279 91 188 164 -34 -79 65 -157 -244 84 1 -18 71 307 -43 33 437
7707 437 -45 8 112 -146 171 -70 -175 165 161 176 104 264 -325 -169 427 37 -57 40 127 -37 -119 266 -52
7730 -52 -47 27 -23 6 93 -23 -131 -327 -111 -299 -50 80 -166 -356 -83 24 -82 -138 53 -191 -273 71 -118
7753 -118 -371 -180 -232 -272 -58 -123 -41 48 -541 -88 -422 24 -220 -42 -150 -193 -200 14 -206 -34 -142 -197 -146
7776a46J50n5K26J7n99L30L71k41j03J00M2j12N6l36L20J47k01m1q1L15l44N5
7798a30L0L24j93l6j28K41j87J47o8J75r1J70n5k21K05j70J36J59r0q1J03L9J11
7821C90%m69J23K35j03j35J08O6k20q2Q5J47rk25L01o1O9k3k08K5J20j00L09k05
7845A38k20K61M8k16M1J0J73pJ33m13k4K75m21K40r5L5o8J27J37q5o9J43k13K13
7869A43k85jK40j14l64K80k3J17K46n18M79n50K01K42j11j93J02K11k02P4J02
7890G6j86j56K84k08K02K16l53k36J65J52q4o47O64J46k93K70J08J65o14L59k31
7911b01o9L06k13r8L09r3p7K11m0Q3k41O6J90r0j90L3J99j13J99k19J58l13J92
7934a1l31O8J08J46l18L29j01J53K44j61jj38J37j27L5J31k09J01PR0J25k71K18
$$ plain form
7776 -146 4 -51 175 192 -407 -77 294 53 -50 50 92 -20 36 -300 20 167 -34 -75 -156 159 -185 -130
7798 -130 -100 224 31 -5 -133 108 -79 68 0 175 84 254 199 -22 183 13 149 308 218 137 240 279 390
7821 390 390 -79 44 279 176 41 149 215 -5 -87 -2 145 136 -89 212 151 220 197 -11 14 134 34 343 138
7845 138 -82 179 227 11 52 62 235 228 361 -52 -76 199 -222 18 -77 -42 -110 17 154 69 0 143 -70 143
7869 143 -142 -143 97 -17 -381 -101 -124 -7 239 -279 200 -350 -149 93 -18 -211 -109 102 -100 -26 76
7890 76 -110 -266 18 -190 12 228 -125 -361 -196 -44 -128 -775 -111 35 -258 12 120 285 -329 30 -201
7911 -201 -270 36 -177 -275 34 -59 -136 75 35 118 -123 -57 133 43 -147 -114 85 -28 171 -48 110 -203 -11
7934 -11 -342 -274 -166 -20 -338 -9 -110 43 287 126 125 -13 124 -3 32 163 -46 55 62 152 277 6 224
7957B24j15m95K86L19K7q1n3l7j00K43l61J75J46R3k80N8P5M1l20L5N36n07M1
7980e0J23N7MK40k97j32K01p5j17Q8J94m58L50j24pK29j9k1j62r0J53K77k70J3
8004A07j51k2L95n20l8L02M8l88J25K96l49P4J49k08K82k53R0k1j95K81r3pk3
8027a19L98k07J42k9m42P0o1K8K63p5j7J34l47K84j85J61n8po6J17J83o4L11n87
8051a73K49N3O8l4j6M4j4k31n2J85j28JL12j79n5j31K9K73o2k06P1K30l36K87
8075A85r6M1j29r1J12j76K88k53L93l38K27J11k43m6J62j18J11K18k84K89m05
8096d2j93K01l6L06j83J06j33J03k33L77m58L20j80K67o11N07JJ22K25m16J22
8117A72k88o0M47l47j10L01J29k72J18J52j45p0L5j60j3K27J47j87q5k16J14K64
$$ plain form
7957 224 109 -386 -100 219 246 165 112 75 -25 218 -143 32 178 271 -9 49 124 165 -155 -120 416 -91 -50
7980 -50 73 130 134 374 77 -55 146 71 -46 42 236 -222 128 4 -3 226 207 186 24 -66 87 364 94 107
8004 107 -44 -66 329 -191 -229 73 121 -267 -142 154 -195 -121 28 -180 102 -151 -61 -82 -277 4 -89 -96 -119
8027 -119 279 72 214 185 -257 -187 -248 -220 43 -32 -49 85 -262 22 -163 -2 -60 -67 -133 -16 167 103 414 -173
8051 -173 76 129 197 163 147 191 177 -54 -106 79 -49 -48 264 85 30 -101 -72 201 139 -67 4 234 -102 185
8075 185 89 130 1 -90 22 -154 134 -119 274 -64 163 274 31 -15 147 29 140 358 74 363 -42
8096 -42 -235 -34 -70 236 53 159 26 129 -104 273 -185 135 -45 222 -389 118 119 241 466 50 172
8117 172 -116 -176 271 -76 -186 115 244 -28 90 242 97 27 62 -98 -111 116 263 76 -9 -225 -111 153
8139A53r8l7J65k9k79J28j40J43j49j02N33l46j11J11k89K28J60q4J1n5k52J49
8161a90N0k16L93j98n0M93k85%m02K19K32j76J48J82m60M66J00p23L96j15K3K5
8183h8m2K50K9r6p7k8n4o2
$$ plain form
8139 153 55 18 183 154 -125 3 -137 6 -143 -245 288 -58 -169 -58 -347 -119 41 -43 -32 -87 -339 -190
8161 -190 -140 -356 37 -161 -211 282 -3 -3 -405 -186 46 -130 18 200 -260 206 306 -417 -21 -136 -113 -88
8183 -88 -130 120 149 53 -24 -52 -106 -168
8191a68
$$ Imaginary data points
##PAGE= N=2
##DATA TABLE= (X++(I..I)), XYDATA
0@%%%qJ6j6J6k4L2l9N2o1P3r2J15j41J70k05K43k84L34l90M52n21N98o87P85q91
28d73J012j148J296j455J631j829K043k276K533k814L122l464L838m247M703n209
44b737N770o398P104p907Q829r895J1146j2641J4463j6743J9693k3681K9405l8367
58b1959N4521r2735L42101L37481n73018j77358K15636K55397j11590j50423J1002
69H9055J74699J9952j62921j53678P9194J46675O0234n1463q7586j17162m6815
80d9816L6857P8113O8497K8101r2527j10079K8292Q3650n2174p4343P0600J04560
92A19731m6800j36456p0457O9265J43992N8586q5613p5637J7362q691n9946K6516
104d8148R1947O108o7849j4564M0767N587n9260l2530R6504J16048r5086k25919
$$ plain form
0 0 0 0 0 -8 8 -8 8 -16 16 -23 29 -32 41 -51 64 -77 93 -112 131 -153 181 -209 243 -278 320 -367 418 -473
28 -473 539 -609 687 -768 863 -966 1077 -1199 1334 -1480 1642 -1822 2016 -2231 2472 -2737
44 -2737 3033 -3365 3739 -4168 4661 -5234 5912 -6729 7734 -9009 10684 -12997 16408 -21959
58 -21959 32562 -60173 281928 619409 46391 -130967 84669 340066 228476 78053 89055
69 89055 263754 283706 120785 -32893 46301 192976 253210 201747 114161 -3001 -49816
80 -49816 -12959 65154 133651 161752 69225 -40854 -12562 71088 18914 -55429 15171 119731
92 119731 72931 -63525 -133982 -64717 79275 137861 52248 -23389 -6027 -14718 -74664 -48148
104 -48148 43799 49907 -17942 -32506 8261 13848 -45412 -77942 18562 134610 39524 -186395
116a86395o418K24685R1152j47386j04555Q8119J27211j3449j51209r7292J20499
127e5038J87627l7790k11488n9949J62045J37769m6907j30143k5111J09532N9880
138I0427j02920r3281O6157Q6555k7273m0736J7483J065j9593J8786K5426j3951
150H145l6321m1022r717N9141M9482m7852n2839L9150M7238j8853k5366n22m551
163c3887M735J6765o407j3822J0807J7561L1455M6897j7833q9937j7551R3574
175D2357N6482m8738o4400n506O4659Q1153j9286j07695o094J31504M7168j26417
187D5187j07194N7233J25942K9581r7793q1366O4651J08805k9463j07335m500
198C748P2705J3538m7689m1932m208M8653N5107k3004o1001N092L7516j3458k8564
$$ plain form
116 -186395 -192813 31872 123024 -24362 -128917 -40798 86413 72964 -78245 -175537 -55038
127 -55038 132589 94799 -116689 -176638 -14593 123176 76269 -53874 -78985 30547 90427
138 90427 -12493 -105774 -39617 46938 19665 -21071 -3588 -2523 -22116 -3330 22096 8145
150 8145 -28176 -69198 -78915 -19774 29708 -18144 -70983 -31833 15405 -3448 -28814 -29336 -33887
163 -33887 -29152 -12387 -18794 -32616 -21809 -4248 27207 74104 56271 -33666 -51217 42357
175 42357 98839 50101 -14299 -19805 44854 126007 106721 -974 -7068 124436 171604 45187
187 45187 -62007 -4774 121168 150749 52956 -28410 36241 145046 115583 8248 3748
198 3748 76453 89991 42302 370 -3838 44815 99922 76918 15917 21009 58525 45067 16503
211A6503L610M441l602J759j2720p655L3345K0805l2024j8412J6934j2992l4159
224b4167L163J9906P156Q687r150l6137j171M4456J4347k7377k6908k2033k747
237e1975L8894J1174n4396j1051Q2260M0660p1503p5402J2758P2093M4863m5462
249g087q7907O17Q7938K8632n9184k8049M3704M5257q087o8117o4760L6623R9735
262A9315Q014q2663k2989N3280K2089k8462j8466J5181L2597M139n7415m9716
274a05096L7693O1069j274j8104J2126R69k2493q941k478O861L3305J4732m2087
287c3718l2980K4194L2950J3179P376q400j6138Q925l259m4040o813O6138M1913
300D9327k9526l9507r396J9132M0953J1622m4508k3791L9814J8938m3914l4170
$$ plain form
211 16503 20113 24554 20952 22711 9991 2336 35681 56486 24462 6050 22984 9992 -24167
224 -24167 -21004 -1098 6058 14745 5595 -30542 -31713 12743 27090 -287 -27195 -49228 -51975
237 -51975 -13081 -1907 -56303 -67354 14906 55566 -15937 -91339 -78581 -6488 38375 -7087
249 -7087 -94994 -94377 -6439 22193 -36991 -65040 -21336 23921 15834 -52283 -117043 -80420 19315
262 19315 27329 -55334 -78323 -25043 -2954 -31416 -49882 -34701 -2104 2035 -55380 -105096
274 -105096 -67403 -6334 -7608 -25712 -13586 -12617 -35110 -44051 -46529 -39668 -6363 8369 -33718
287 -33718 -66698 -42504 -9554 3625 11001 2601 -13537 -4612 -7871 -51911 -58724 7414 49327
300 49327 19801 -19706 -29102 -9970 30983 42605 -1903 -25694 14120 33058 -10856 -45026
312d5026K6526O2697M2436l6748q5379q429Q0979K5309o4922k8058M6393L2596
324D8374k2234l7972q491M7151N3789k3779o9487j0033L6624M577j6534N115J5740
337B2840J4504M756l0849k9761L1765M2083k3452m2993L683J9137N97m200m551
350C559Q199L4576R057m9819l6878K5913K8809n228j1157j2698o613K8060K3446
363C9226l1587k9551L1989L3694k3280m4582j8187K3427M6546M884n1342j4692
375c3455N5169K2813n0436l4661K1963K8871K193k6814l4781J4940N7480P128
387C0410n1861j5523L7599J7045k2957l0736j2261K7834L7764j8362m5317J8246
399b8119N2562n873m1719r070J6155J2455P74k0688j7904K6611L2604j6399k4235
$$ plain form
312 -45026 -18500 44197 86633 49885 -35494 -43923 37056 62365 -2557 -30615 15778 48374
324 48374 26140 -11832 -20323 26828 80617 56838 -12649 -22682 13942 18519 1985 7100 22840
337 22840 37344 42100 11251 -18510 13255 55338 31886 -11107 -7424 11713 12310 8110 3559
350 3559 11758 46334 55391 5572 -31306 -5393 23416 18188 7031 -5667 -12280 15780 39226
363 39226 7639 -21912 10077 43771 20491 -24091 -42278 -18851 27695 32579 -18763 -33455
375 -33455 21714 44527 -5909 -40570 -18607 10264 12457 -14357 -49138 -34198 23282 30410
387 30410 -21451 -36974 625 17670 -5287 -36023 -48284 -20450 17314 -1048 -46365 -28119
399 -28119 24443 18570 -23149 -32219 -16064 -3609 -2835 -23523 -41427 -14816 17788 1389 -22846
412b2846J4558J9359k631j1661k3539j5497L1029L5212k4668l3431K3682L5136
424B4703p123k6749j4496J0165L1157L300m7797k4255M4463L9875j4429k2706
436c892P48J1623J3021q289l8533o487N0888K4282m1012k9294K4477L3529P435
449C8496j9640k6086Q529L2156j5052n0357M892N3880J7194k5193j9717l252J3111
462H961J8755j4817l5247Q013L4188q117l4556l743K4508K7130R015l0199l6102
475c2211J7152L3094k0649l3969J7791L4193O66j8199j5983J181L1384K1801l1430
488D821l4573J5015K2598q570j2718K671J5526K6173K185m4376k5166L8328L1139
501C3053k8133l0832P759J9705J0493q372k0559Q891M0166K467m8663k2287K4254
$$ plain form
412 -22846 -8288 11071 8440 -3221 -26760 -42257 -11228 23984 -684 -34115 -10433 24703
424 24703 17580 -9169 -23665 -13500 17657 20957 -26840 -51095 -6632 33243 18814 -3892
436 -3892 -3144 8479 21500 13211 -25322 -31809 19079 43361 2349 -26945 -2468 31061 38496
449 38496 18856 -7230 1299 33455 18403 -31954 -27062 26818 44012 18819 -898 -4150 8961
462 8961 27716 12899 -22348 -14335 19853 11736 -22820 -26563 -2055 25075 34090 3891 -32211
475 -32211 -15059 18035 -2614 -36583 -18792 15401 16067 -2132 -18115 -16934 14450 36251 4821
488 4821 -29752 -14737 7861 -709 -13427 -10756 4770 30943 33128 -11248 -36414 1914 33053
501 33053 4920 -25912 -18153 1552 12045 3673 -16886 -7995 32171 34638 -14025 -36312 -12058
514a2058J9765n05q183j1200Q697L0663k510l8218k766M0128R806l1387k4411
527b2179K339K5323K4186j3004k7806J7419L4369j7430m1421p32K4310J1082m649
540A1807j9828j7502K2575L3966j3507l1738Q715K3247m942k2119j7685M129L3996
553A1114K2469k8827k5549K8504K9445j7263k3213K402J2914J2828k615k6388
565d179p089L9305K6547k1030k0858O769J0148J887r733k2603J266L7844J0354
578D8628l9569j6387L1409K1069j2915k1742j1935O444J7326j0892l0861R551
590i874L9992M294k8134j3244O559J1030R314j5496k9218J0559L4590p466l2691
603a9785M480L1942J2974j4292k7572j5299K1851K2733k2618k8108J8943K9000
$$ plain form
514 -12058 7707 7202 -981 -12181 -3484 27179 24669 -13549 -16315 23813 33619 2232 -22179
527 -22179 -19840 5483 29669 16665 -11141 6278 40647 23217 -18204 -18936 5374 16456 11807
540 11807 -8021 -25523 -2948 31018 17511 -14227 -5512 17735 12793 -9326 -27011 -22882 11114
553 11114 33583 4756 -20793 7711 37156 19893 -3320 -918 11996 24824 22209 -4179
565 -4179 -11268 28037 54584 33554 12696 19465 29613 31500 21767 -836 430 38274 48628
578 48628 9059 -7328 24081 45150 32235 10493 -1442 5002 22328 11436 -19425 -9874
590 -9874 30118 34412 6278 -6966 -407 10623 19937 4441 -24777 -14218 20372 12906 -19785
603 -19785 -15305 16637 29611 15319 -12253 -27552 -5701 17032 -5586 -33694 -14751 14249
615A4249o611j8916p324M173J8067Q301l0085k9978J8954K8305p939j7160M451
628b1513J3880J3382m724l0090j1970L2324J9168k8457k0706J8387J9289K343
640A313m849q170L749K0848j976l4622j0805K7298J4906r804q637j638J0431J8323
654A6367q644l1588L375L3503l047l6236r821K0575J9219M807j3305j6738J4474
667g059K3635j7215l2608N409K5829P499r268j4559n481K5711K8367j7378l3336
680b0454J0063K7687o662k3449o636J3496K5208J0547k5046j9536K4364K3313
692C2895j8127k3177L202J0050N776j702j4861l326K8637J6052k4718k0354J2634
705B981J1322o630j0563q664O766K3304J274k6935j549L0588O095k4664j2641
$$ plain form
615 14249 7638 -11278 -18602 -14429 3638 11939 -18146 -48124 -29170 -865 -8804 -25964 -21513
628 -21513 -7633 5749 1025 -29065 -41035 -8711 10457 -18000 -38706 -20319 -1030 1313
640 1313 -3536 -11706 -7957 12891 10915 -23707 -34512 -7214 7692 -2112 -10749 -12387 -1956 16367
654 16367 7723 -23865 -20490 13013 9966 -26270 -36091 -15516 3703 8510 -4795 -21533 -7059
667 -7059 16576 -639 -33247 -27838 -2009 5490 -3778 -18337 -23818 1893 30260 12882 -20454
680 -20454 -10391 17296 10634 -12815 -19451 -5955 19253 29800 4754 -14782 9582 32895
692 32895 14768 -8409 -5207 4843 10619 8917 -5944 -9270 19367 35419 10701 -9653 2981
705 2981 14303 7673 -2890 -11554 -4788 18516 19790 -7145 -8694 21894 27989 3325 -9316
718i316M666P287O862p552j7356R830K9931p00k7983p943J2569Q775k245j8008
732a1183j9743J6018L1453r853l3064N245K9747K897j9547j9114n530J7198J6990
745A514j8027k4922J6197K8401m454j9823p093N748J2841L396k4186j8622K3775
758b5255K4694j5096j8281J1823J5583l52j0654j5228j830K0803N683k4750q124
771d0984K4391J2755j0792o577l90L527J0116m679k3799k477K7087R202j6300
784a8920p560R879J2446P626j2021k3276O984K8675l360k8886j261K3933J3213
797G472j201j0906j2871J0881K2997j0250l1336K013K8937R456j2290j3112O09
810i601K1470J7652k0542k7463J3989K4344j1111k0377M773J5548J1865J356j5124
$$ plain form
718 -9316 -4650 2637 9499 1947 -15409 -5579 24352 23652 -4331 -12274 295 9070 6825 -11183
732 -11183 -30926 -14908 16545 6692 -26372 -21127 8620 11517 -8030 -27144 -32674 -15476 1514
745 1514 -16513 -41435 -25238 3163 -1291 -21114 -28207 -22459 -9618 -6222 -30408 -49030 -25255
758 -25255 -561 -15657 -33938 -22115 -6532 -6884 -17538 -32766 -34596 -13793 -8110 -32860 -40984
771 -40984 -16593 -3838 -14630 -21207 -21597 -18070 -7954 -12633 -36432 -38909 -11822 -2620 -18920
784 -18920 -26480 -16601 -4155 3471 -8550 -31826 -24842 3833 473 -28413 -29674 -5741 7472
797 7472 6271 -4635 -17506 -6625 16372 6122 -25214 -23201 5736 15192 2902 -10210 -9601
810 -9601 11869 29521 8979 -18484 -4495 19849 8738 -11639 -6866 8682 20547 21903 6779
823F779j0580J8215J2245j9384j5024J3709J1166m759m966k635N648J9045L298
836C2757k5472j0769J9017P882j5386p697O116J1253J0649o307k1045L306K6452
849C0756J565k5510j0689Q140Q011O144m667j4642O626K7273j469l2354r877J9095
863H402J2682o957j7182j0888J6359K3143j0427k5751Q110K4252m150k1794j1557
876a5758K397J4384J2478j3890j8406J4763K1627j1890k0022L669J1453K095p253
889d353j5710n192K1564J4221j6191j0948J4953Q335j3442j0789j561O286J2399
902d28j105k0580l163K3883R790j3846p759K789L267M266o982j9833L261L0546
916D106Q132k4136j1718J4297J3355J45j2256j5862O134K2774m417k4129J117
$$ plain form
823 6779 -3801 14414 26659 7275 -7749 5960 17126 12367 7401 4766 10414 29459 32757
836 32757 7285 -3484 15533 23415 8029 332 6448 17701 28350 22043 998 4304 30756
849 30756 32321 6811 -3878 4262 12273 18417 13750 -892 5734 33007 31538 -816 -10693 8402
863 8402 21084 14127 -3055 -13943 2416 25559 15132 -10619 -2509 21743 17593 -4201 -15758
876 -15758 -13361 1023 13501 -389 -18795 -4032 17595 5705 -14317 -10648 805 2900 -4353
889 -4353 -20063 -25255 -3691 10530 -5661 -16609 -1656 6679 -6763 -17552 -19113 -12827 -428
902 -428 -1533 -22113 -25276 -1393 8397 -5449 -13208 -10419 -7152 -2886 -9868 -29701 -26440 4106
916 4106 12238 -11898 -23616 -9319 4036 4181 -8075 -23937 -17803 4971 554 -23575 -22458
929b2458K5173J1031p621j3372j0481R498J8646q221k3888P334K5311r69j7022
942g039j151J1261J2073J911j7102j5420J3696J6473j1002j2427J2669J4351j307
955A6986p255q323r26J5710P118k0260j3207J6038J2543p363n642J839P232J0709
969B5199l941k4842o888K4185J0237j8578j0180R131J0212M771n548j5028J485
982B15K1252J62k5445j0470J3943J3433L171p641j3198N950K1768n385k7202j335
996a0782K1586L970j3673q239N42J1885J3832p335j8093N655J5775q201j6974
1009a0052Q48Q819P085K124j0000q775J3755J4277j5274j6629R294J1684o283
1022H73j0503m894M698J7509O391j9840j1446J7299R472j6130j1595K782P339
$$ plain form
929 -22458 2715 13746 6125 -7247 -17728 -8230 10416 2195 -21693 -14359 10952 9983 -7039
942 -7039 -8190 3071 15144 17055 -47 -15467 -1771 14702 3700 -8727 3942 18293 16986
955 16986 9731 1408 482 16192 23310 3050 -10157 5881 18424 11061 5419 7258 14490 25199
969 25199 21258 -3584 -10472 13713 23950 5372 -4808 4323 14535 19306 13758 -1270 215
982 215 21467 21629 -3816 -14286 -343 13090 16261 8620 -4578 1372 23140 17755 -9447 -10782
996 -10782 10804 14774 1101 -7138 -6596 5289 19121 11786 -6307 -652 15123 6922 -10052
1009 -10052 -9204 -385 6700 8824 -1176 -9951 3804 18081 2807 -13822 -4528 7156 873
1022 873 -9630 -14524 -9826 7683 14074 -5766 -17212 87 9559 -6571 -18166 -15384 -8045
1035h045R128j191j7637l330K2392R861j7807j2744N143P175K578o599j3843N649
1049a9270K4618L250k2618o201J5379O245n617o997o889M709J5990j987j7548
1062a6936K942K1599M037j2089p488j488O362R014p334j3632J1391J9824o530
1075I672j6709M765J1770K017m123r706p136J2161J0975j2475j0639J5706J4725
1088B1003o970j1966n119J719J1984M119j8530r891J9102J3343j2045j1114M875
1101E10R301N896o007j9451m213K0196Q260j5703o090J1321P157p46m613j1285
1115e467L99J6790J539j9994n483J6002Q374m399m744k189N872J0584p875k0026
1129a0617L245J9555o62j2371j140O707N410L910q076j2712Q183J4489r950j8677
$$ plain form
1035 -8045 1083 -108 -17745 -21075 1317 11178 -6629 -19373 -14230 -7055 -4477 -11076 -24919 -19270
1049 -19270 5348 8598 -14020 -20221 -4842 1403 -4214 -11211 -18100 -13391 2599 612 -16936
1062 -16936 -13994 7605 11642 -447 -7935 -9423 -3061 5953 -1381 -15013 -3622 16202 9672
1075 9672 -7037 -2272 9498 11515 7392 -2314 -9450 2711 13686 1211 -9428 6278 21003
1088 21003 14033 2067 -3052 -1333 10651 14770 -3760 -13651 5451 18794 6749 -4365 510
1101 510 9811 15707 9700 -9751 -13964 6232 14492 -1211 -7301 4020 11177 10431 5818 -5467
1115 -5467 -5068 11722 13261 -6733 -12216 3786 12160 7761 3017 828 6700 17284 9409 -10617
1129 -10617 -7372 12183 11521 -850 -1990 4717 10127 14037 5961 -6751 1432 15921 5971 -12706
1143a2706L620J2738L085k878o813l876J1520P745j8194j5933J3407J3893p514
1156a906j0739o32M775J0291K189j4895p614J5803P672j5967j1487N967R064P471
1170hj09j2920l326J7380N382j8277q281J2484P838l077o751o469N518J7757K066
1185I207j7309k705J3261M54j0242l244K233P170J1143m564j5672M082J8083p47
1199A1150j4796j465P052K751j841p472n564J4014J6894r738j7972M636J0488
1212H137k051o441l901j325R726P676j2756j1818J3753J4151o941j2025l540J147
1226f208O582L256j1632m246J7790R199j4736j0511P728P714J470m202j1053j932
1240a0781J5182N809j3504l263J4436O612o532p909o514L435J3629k40j6786q95
$$ plain form
1143 -12706 -9086 3652 6737 3859 -2954 -6830 4690 12435 -5759 -21692 -8285 5608 -1906
1156 -1906 -12645 -13277 -8502 1789 3978 -10917 -18531 -2728 4944 -11023 -22510 -16543 -7479 -8
1170 -8 -117 -13037 -16363 1017 6399 -11878 -20159 -7675 163 -2914 -9665 -16134 -10616 7141 9207
1185 9207 -8102 -10807 2454 2908 -7334 -10578 -8345 -1175 9968 5404 -10268 -6186 11897 11150
1199 11150 -3646 -5111 1941 4692 2851 -4621 -10185 3829 20723 10985 -6987 -2351 8137
1212 8137 6086 -355 -4256 -5581 4145 11821 -935 -12753 1000 15151 8210 -3815 -7355 -6208
1226 -6208 374 3630 -8002 -12248 5542 14741 5 -10506 -2778 4936 6406 2204 -8849 -10781
1240 -10781 4401 10210 -3294 -6557 7879 14491 7959 50 -6464 -3029 10600 10360 -6426 -7321
1254g321J7043L696j1015l294M046M410K876r081j4330N561J6874k923j2925J976
1268d407Q572Q57k467o545p580P573J1537j0953j5632O956J4869l9p113l303n86
1283h261P553L834j3743j1248J3059J2611q039r141K986N813N934J688j1092p345
1297a5391J1939P196j3352q084R732R900J384l289q004j46J4053K241j6952m912
1311a3685J4792N455p527m129J899O396J0087k291j5533l45J4347L51j1797k202
1325d182O094O217M422m500j1115N717J5438n407j6849J437J0183J019l322l829
1339A323j375Q854J0716r586j4229O018J1053m463q002q20K344P970N900j0916
1353D787r117J2349J2281j0265j1840J901N763L022j18p758j546J4568O992j4786
$$ plain form
1254 -7321 9722 13418 2403 -891 3155 7565 10441 1360 -12970 -7409 9465 6542 -6383 -4407
1268 -4407 4165 5022 2555 -3990 -11570 -3997 7540 -3413 -19045 -12089 2780 2741 -4372 -7675 -8261
1283 -8261 -708 3126 -10617 -21865 -8806 3805 -4234 -13375 -10389 -4576 1358 3046 -8046 -15391
1297 -15391 -3452 3744 -9608 -17692 -7960 1940 3324 35 -7969 -8115 5938 8179 -8773 -13685
1311 -13685 1107 6562 -965 -5094 -3195 3201 13288 10997 -4536 -4881 9466 9817 -1980 -4182
1325 -4182 1912 8129 12551 8051 -3064 2653 18091 12684 -4165 -2728 7455 8474 5152 1323
1339 1323 -52 8802 19518 9932 -4297 1721 12774 8311 309 -511 1833 9803 15703 4787
1353 4787 -4330 8019 20300 10035 -1805 96 5859 8881 8763 1005 -541 14027 21019 6233
1367F233q842Q663O125l187m116m793L59J0793K604j3071j988J3946L948j1062
1381E612p521o29L578P704k482j1839K620J5078j584j4386j018P498K654j746
1395C539o647r552N206J3714k370j2210L008J0388j572p120o270k324Q372R418
1409E580q833j3252P763J2905l910p575J256K915K512K33j0925p246J2875J2729
1423G027p783q650M218M851M3j338o189j766J0561M926j4574p244J2376R472k388
1438C542m060l552L87O429j146j2581J49J5198L206j0924l331M538L749M925j912
1453D617j1042K37J1700k053j2569J332J1673N239j889n674p193N433J1341n529
1467E623j2663M221J1408k110n863r12K264P340P277q938j2944N656J1200m410
$$ plain form
1367 6233 -2609 6054 12179 8992 4876 83 442 11235 13839 768 -1220 12726 16674 5612
1381 5612 -1909 -2538 1040 8744 6262 -5577 -2957 12121 10537 -3849 -4867 2631 5285 3539
1395 3539 -3108 -12660 -7454 6260 3890 -8320 -5312 5076 3504 -3616 -9886 -12210 -3838 5580
1409 5580 -3253 -16505 -8742 4163 253 -7322 -6066 -3151 -639 -406 -11331 -18577 -5702 7027
1423 7027 -756 -9406 -5188 -337 -294 -1632 -7821 -9587 974 5900 -8674 -15918 -3542 5930 3542
1438 3542 -518 -4070 -3683 2746 1600 -10981 -10832 4366 7572 -3352 -6683 -2145 1604 6529 4617
1453 4617 -6425 -6188 5512 3459 -9110 -7778 3895 9134 7245 1571 -5622 -189 11152 5623
1467 5623 -7040 -2819 8589 6479 616 -296 1968 9308 16585 7647 -5297 359 11559 7149
1481G149p232K407N173M155J101q200n865J0602R311j1098j0504N364N452l37
1495G478r78k522lR203K744j3909o714J0343N178o354m390l46J579P094O61j0815
1511a751j428J2801J426j3711n017N106L843K450k899p139K799J1524k781j3616
1525h393J09Q926M12m470l716m244N173J0564l661j2151L749J0746l127r308k121
1540a1512J423N481M898o398q440Q360J0745n632r047K324M328Q05m90o130m663
1555a3948J0468R019q651p601P447N814l018m585l650o1Q606L671j1684l832J2539
1570E34N861q219m113J672J893K855k102r267N16J3354K441j0506j582O625K204
1585B166l39k957p144K788J1064j875j1441J956J1624J782m596k706k163L168
$$ plain form
1481 7149 -83 2324 7497 11652 12753 4553 -1312 9290 18601 7503 -3001 2363 7815 7478
1495 7478 6500 3978 3975 13178 15922 2013 -4701 5642 10820 4466 76 -270 1309 8403 9064 -1751
1511 -1751 -3179 9622 11048 -2663 -7680 -2574 1269 3719 820 -6319 -3520 8004 5223 -8393
1525 -8393 -8284 642 1054 -3416 -7132 -11376 -6203 4361 700 -11451 -7702 3044 -83 -9391 -11512
1540 -11512 -10089 -4608 290 -6108 -14548 -6188 4557 -1075 -10122 -7798 -3470 -2665 -3155 -9285 -13948
1555 -13948 -3480 5539 -3112 -10713 -3266 2548 -470 -5055 -8705 -8766 -160 3511 -8173 -12005 534
1570 534 6395 -1824 -5937 -4265 -2372 483 -1619 -10886 -10370 2984 5425 -5081 -6663 -38 2166
1585 2166 1827 -1130 -8274 -5486 5578 3703 -7738 -5782 5842 7624 3028 322 -1841 1327
1599A327O763m950j0034N010J1374k101o505N52K046L027L725o791r139O121R954
1614A0379o057p855M202O588J616j610n564l609P879O025j0105p374Q653O597
1628I765l524k676m92J713O124J191j1256m484J1135L515q233l748M475L227K745
1643I477j854r134j43J0458p44j3075j723Q008K077k526j972l358J707Q018l044
1658B172j2160L50Q360l63n116j463k85M226O615l823r840L703R779m146q064
1673a0055P78L790K443K768m127n374O896Q709o996r315L733N243j472j491l195
1688g665j717P977O295r364o711Q099O039o698n157K99K583N380J296p898j249
1703h491J1822K439r773l480N813K377L43j600n580J920J0950J294j0189q33P841
$$ plain form
1599 1327 8090 3140 -6894 -1884 9490 7389 884 1436 3482 6509 10234 3443 -5696 425 10379
1614 10379 4322 -3533 669 7257 8873 7263 1699 -1910 5969 11994 1889 -5485 3168 9765
1628 9765 6241 3565 3073 4786 10910 12101 845 -3639 7496 11011 2778 -970 3505 6732 9477
1643 9477 7623 -1511 -1654 8804 8060 -5015 -6738 1270 3347 821 -1151 -4509 -2802 5216 2172
1658 2172 -9988 -9638 -1278 -1641 -6757 -8220 -8505 -4279 2336 -1487 -11327 -7624 2155 -1991 -10055
1673 -10055 -9277 -5487 -3044 -276 -4403 -9777 -2881 5828 -1168 -10483 -6750 -1507 -2979 -4470 -7665
1688 -7665 -9382 -1405 4890 -4474 -11185 -3086 2953 -3745 -8902 -8603 -6020 -640 656 -7242 -8491
1703 -8491 3331 5770 -4003 -7483 -1670 707 1050 -550 -6130 -4210 6740 8034 -2155 -2988 4853
1718D853J151m724k751k789L277Q244k449r997J894R357l19o756j233N33Q96L945
1734C132l926p580M650J0663k493p481Q31L636J030M52m076m000O010P898o686
1749B060p124O696P806j687l330k764j529N500L255q001m657R500N657o700m630
1764E2K033K122L254j058q567k975R249K982r222k486P044L094j887l401n360
1779e126O81Q607m75j0223o73Q921R86l963n47k96J835N429l028j0507J089R380
1795B090k93n933L94K200J458K398m015o584M277Q000n165q708K538N567K85J79
1811a312j891l312M554N685p710p286N866P069k857l322n42J183N889L201p220
1826b005m712Q515M552q087m622M784L748K767l93n772m04Q301J788r314k931
$$ plain form
1718 4853 6004 1280 -1471 -4260 -983 7261 4812 -5185 -3291 6066 5747 -1009 -2242 -1709 -813 3132
1734 3132 -794 -8374 -3724 6939 4446 -3035 -2204 1432 2462 2914 -1162 -5162 848 8746 2060
1749 2060 -5064 1632 9438 7751 4421 1657 128 5628 8883 882 -3775 5725 11382 4682 52
1764 52 2085 4207 7461 6403 -2164 -5139 4110 7092 -2130 -4616 2428 5522 3635 234 -5126
1779 -5126 -4445 4162 3687 -6536 -7209 1712 2698 -1265 -1812 -2108 -273 5156 2128 -8379 -7290 2090
1795 2090 1797 -4136 -3742 -1542 -84 2314 -1701 -8285 -4008 3992 -1173 -9881 -7343 -1776 -1491 -1312
1811 -1312 -3203 -6515 -1961 3724 -3986 -11272 -5406 1663 -1194 -4516 -5058 -3875 2014 5215 -2005
1826 -2005 -6717 1798 6350 -1737 -6359 -1575 2173 4940 4547 -1225 -1629 6672 8460 -854 -3785
1841c785O135K452k265j801k650J863Q147j6r755n90Q039K28o069j085Q81K401
1857B130M837j579p139K918Q405k167p194l2K963N16J684j970m867M839P979l889
1873G434p820L369M750j701k829k440j516M949N490o619n808O492N432m634m896
1888c47N33N90K454R47o371l257R318M786p397m270L240K331q09j398m996n58
1904e204Q223J431q733k214P823K415l731k052k360j72N390p85p537L42Q913M05
1920B154n607j273J043J028L367k161p262J492Q036j880o599K168N265L47r45
1935h27k953m439L218O586m220o115L525O074j897k758j08l13L672L277o538o952
1951a0768O056O563l598l587K612J959J451jn586k581P895L941p499m479M933
$$ plain form
1841 -3785 2350 4802 2537 736 -1914 -51 8096 8080 -1675 -2265 5774 6002 -67 -1152 -271 2130
1857 2130 6967 5388 -1751 1167 9572 7405 211 179 3142 3658 5342 3372 -1495 3344 11323 7434
1873 7434 -386 2983 7733 6032 3203 763 -753 4196 9686 3067 -2741 3751 9183 4549 -347
1888 -347 186 776 3230 4177 -2194 -5451 3867 8653 1256 -3014 226 2557 1748 350 -4646 -5204
1904 -5204 3019 4450 -4283 -6497 1326 3741 10 -2042 -4402 -4574 816 31 -7506 -7164 1749 2154
1920 2154 -3453 -4726 -3683 -2655 712 -1449 -8711 -7219 817 -1063 -7662 -5494 -229 118 -827
1935 -827 -3780 -8219 -5001 1585 -2635 -8750 -5225 849 -1048 -3806 -3914 -4227 -555 2722 -3816 -10768
1951 -10768 -4712 1851 -1747 -5334 -2722 -763 688 687 -4899 -7480 415 4356 -3143 -7622 -2689
1966b689L189M00R4k706p65N695L63q135j970P787K716l259j291p72J279N319
1982E255k04p328N38P484j516o645J95L837K007K374j494n429J144O789j807o322
1998a122J076N163p15j713j358j975M329O439m476p937L166N021k452l387O65
2013G24J004K691K096n455m791O112N535n363n477J945J031O53Q11l423k019O646
2029B720K961p802m789M996L212k665j432k773l24N667J020o701j286P309P37
2044H50n565k240M79Q37L904p7o072M32P542j47o161n25L710P74n17j977m466
2061i219L211P233j602o852J950N685j317k312r85j495K675M564l898n806M204
2076c964O626k258l847M50M67J536J534m424l489O191N089n295l773M037K385
$$ plain form
1966 -2689 500 900 994 -1712 -2477 3218 3581 -4554 -6524 1263 3979 720 -571 -1343 -64 5255
1982 5255 5051 -2277 -1739 5745 4229 -2416 -2221 1616 3623 5997 4503 -926 218 7007 5200 -1122
1998 -1122 -46 5117 4402 2689 1331 -644 3685 10124 5648 -2289 877 5898 3446 59 724
2013 724 1728 4419 6515 1060 -3731 2381 7916 2553 -2924 -979 52 705 1516 -1907 -3926 2720
2029 2720 5681 -2121 -6910 -1914 1298 -1367 -2799 -5572 -5896 -229 791 -5910 -7196 113 850
2044 850 -4715 -6955 -6476 -5639 -1735 -1812 -7884 -7452 90 -57 -6218 -6743 -3033 -2259 -2776 -4753 -9219
2061 -9219 -6008 1225 -377 -7229 -5279 406 -911 -3223 -4208 -5703 -3028 1536 -2362 -8168 -3964
2076 -3964 2662 404 -3443 -2993 -2526 -990 544 -3880 -7369 -1178 3911 -1384 -5157 -1120 1265
2091A265j85o48l232k109N539K509n998k211O061K672k635j399r11M03M345K38
2107C704o988j157P053J719m889l86K459J066J791k029n263R17O995o01o014P95
2123h28L862N46J37p40k616K047N058l156p063K499O510l85k252k50j81K307L402
2140H897l859m874L867N217l969m428J886J742J545J682l879m178M320L414n986
2155A397m028L405K873j152j470k607j128N305J540o553l388N052J621m481j516
2170e130J132J260K684O21o283r10O372R07n409j147K720J33J189j83l987J820
2186d211O587j151p350l44M813O3j428p68j793J812M983k337n760K787N540j612
2202a69m083m80L05J877L537k543m289M543N577l856m798K536K550N84j77k862
$$ plain form
2091 1265 1080 432 -2800 -4909 630 3139 -2859 -5070 991 3663 1028 -371 -1282 -879 3466 3704
2107 3704 -3284 -4441 2612 4331 -558 -944 1515 2581 4372 2343 -2920 -2003 4992 4391 -1623 -828
2123 -828 3034 3580 3717 2977 361 2408 7466 4310 -2753 -254 6256 5871 3619 3369 3188 5495 8897
2140 8897 5038 164 4031 9248 5279 851 2737 4479 6024 7706 3827 -351 3969 7383 1397
2155 1397 -2631 774 3647 2495 1025 -1582 -2710 2595 4135 -2418 -5806 -754 867 -3614 -5130
2170 -5130 -3998 -2738 -54 567 -5716 -6626 -254 653 -4756 -5903 -3183 -3050 -1861 -2044 -6031 -4211
2186 -4211 2376 1225 -6125 -6469 -1656 -1593 -3021 -3789 -5582 -3770 1213 -1124 -6884 -4097 1443 -169
2202 -169 -4252 -4732 -4427 -2550 987 -1556 -5845 -1302 4275 419 -4379 -1843 707 1291 1114 -1748
2218a748j959M900M488m645l744M516K226k558j606j075r04M427J863n675k545
2233d039N737K488m312j503R70K14J712k64n220l81P319J169n453m51L689P75
2249B450k82q38k972J027N510k30n905J421N818P35k426p95j089J298M088k547
2265E263n744K756O551k349l594R50J004Q78J439l765m052L220M621l885m288
2280i95K915K762p11k56k389k446L317L276n189l729M436K878k352j145j59j46
2296F7K781R90n487k363N160J664m474j116K291P64R86n8m260j006N076N21o163
2313d627n96L789J024o81q92k259J048M721j224o173R76N202o71k913K86N55J705
2330g30L329j965m860K227N748k495l764O69K071M41J238j962k904M122M513m355
$$ plain form
2218 -1748 -3707 1193 5681 1036 -2708 1808 4034 1476 -130 -1205 -2109 2318 4181 -1494 -4039
2233 -4039 1698 4186 -126 -1629 -659 -445 1267 1003 -4217 -4598 2721 3890 -1563 -2014 1675 2450
2249 2450 2168 1330 -1642 -615 4895 4665 -1240 181 5999 6734 4308 3513 2424 3722 7810 5263
2265 5263 -481 2275 8826 6477 2883 3833 4837 5715 7154 3389 -663 2557 7178 3293 -995
2280 -995 1920 4682 3971 3715 1326 -1120 2197 5473 284 -3445 991 3869 1517 372 213 67
2296 67 2848 3838 -1649 -4012 1148 2812 -1662 -2778 -487 277 1263 1205 -3055 -4061 1015 1536 -4627
2313 -4627 -5223 -1434 -410 -1091 -1983 -4242 -3194 1527 303 -5870 -4894 308 -363 -3276 -2990 -2435 -730
2330 -730 2599 634 -4226 -1999 3749 1254 -2510 -1841 230 671 1909 -53 -2957 1165 5678 1323
2346A323m643K259K710r99n92r13j113L283K572m980k757M586K289l001j620k12
2362a808K00K544J885m195j088N276K288n283j719L197Q69N53m07k693J80N292
2378E091P71n507N21L987k26j960p63j493J151M241n65n491Q37N125n06l514n23
2395A176R17P03J377j989m743L120N378k047m563J620J937p83n2j496l032L290
2411H13L617l816l751L365K986j284j638p42j365K008J943m269k895N060K757
2426B789l336k175Q73M72J360P60l926k003M518J592n111m34L212Q91k85n03k978
2443d284o42N024L7n203j70N026J6k541J30n09R46L374j561n777J504M807j029
2460h52l195L25J791R31J031j496m020K114M935k847m290J930K796q16M78p40
$$ plain form
2346 1323 -3320 -1061 1649 650 58 -855 -1968 1315 3887 -1093 -3850 736 3025 24 -1596 -1808
2362 -1808 -1608 936 2821 -1374 -2462 2814 5102 -181 -1900 1297 2166 2719 2312 -381 -201 5091
2378 5091 5862 355 876 4863 4637 2677 1914 421 1572 5813 5248 -243 594 5719 5213 1699 1176
2395 1176 2093 2796 4173 2184 -2559 561 5939 3892 -671 949 2886 2103 2051 555 -2477 813
2411 813 4430 614 -3137 228 3214 1930 292 -450 -1815 193 2136 -2133 -5028 32 2789
2426 2789 -547 -2722 -1849 -1377 -17 743 -3183 -5186 -668 924 -4187 -4621 -1409 -518 -803 -1306 -4284
2443 -4284 -4926 98 135 -5068 -5238 -212 -196 -2737 -2607 -3116 -2170 1204 -357 -6134 -4630 177 -852
2460 -852 -4047 -3722 -1931 -1000 31 -1465 -5485 -3371 1564 -1283 -5573 -3643 -847 -1663 -1185 -1925
2476a925j475K595K707l732l633L124L315k053j026M40k18J926K196l352k663
2491c774M413K325l685j673J964R11J047P27k791j116N261R51m951j061L670Q18
2507C036j070m55j324K72M459M20n329j44M469j09k912l47J86O20K565o72m510
2524h45J121N189j077m645P88J479m09R02j199k794K244M160k990m023K150K559
2540B610j521q50n80j733K014K944k916l238L344K755k484k305P32o7R43J899
2556A547l635k340M519K632l864k137K592Q19k40j3l111m70M018J743m977j044
2572c961L846P93j608l23j541L57L183j86m554J0M954Ml205K79P46l80J865o72
2590c93l760Q85N209j049m013R90K316j21P1p45k351J679L645k790l784K934L006
$$ plain form
2476 -1925 -3400 -805 1902 -1830 -5463 -2339 976 -1077 -2103 -1663 -1881 45 2241 -1111 -3774
2491 -3774 639 2964 -721 -2394 -430 481 1528 2255 -536 -1652 3609 4560 -391 -1452 2218 3036
2507 3036 1966 1511 187 459 4918 5338 9 -135 4334 4225 1313 966 1152 1772 4337 3665 -845
2524 -845 276 5465 4388 -257 531 2010 1601 2503 1304 -1490 754 4914 1924 -2099 51 2610
2540 2610 1089 239 -341 -2074 -60 2884 -32 -3270 74 2829 345 -1960 -1228 -1295 -352 1547
2556 1547 -2088 -4428 91 2723 -1141 -3278 -686 133 -107 -120 -3231 -3701 317 2060 -2917 -3961
2572 -3961 -115 678 -930 -1253 -2794 -2437 746 560 -3994 -3984 970 974 -2231 -1952 -1206 -1586 279 -393
2590 -393 -4153 -3268 1941 892 -3121 -2131 185 64 135 -610 -2961 -1282 2363 -427 -4211 -1277 1729
2607A729j281o65j9j412J888K306k703l118L200L062k403k201J380J292P35J014
2623B804k716k352M158K205m073j704L195J334o33K52j806n65L928Q56m947r05
2639i69M269N00k198L72j29K62K622n4m258l98M513J3l851M45J421L56J020m20
2657C516l351J030M143j721m302R71K733q09l15k85j913J135L363k123m307K072
2673a63K682j742j563L98o12J283K083k528l073L101L100l506k206J477O46K5
2689e98O55k299j406L553K148m095k074L493N19j400r6j564m00L141J159m102
2705c366j037M134O14k949n55O62j09K069J7l372K33M471q1l970R27K088j038
2722a262Q40j55k672O64M388r90m051J554K976o62j183l83j289J468K854k232
$$ plain form
2607 1729 448 -217 -236 -1648 240 2546 -157 -3275 -75 2987 584 -1617 -237 1055 1790 2804
2623 2804 88 -2264 1894 4099 26 -1678 1517 2851 2218 2470 664 99 4027 4883 -64 -969
2639 -969 3300 3800 1602 1974 1845 2107 4729 4675 417 19 4532 4545 694 1139 2560 2916 3936 3516
2657 3516 165 1195 5338 3617 -685 286 3019 2210 1895 1610 -303 832 4195 2072 -2235 -163
2673 -163 2519 777 -786 -388 -1000 283 2366 -162 -3235 -134 2966 -540 -2746 -1269 -623 -598
2689 -598 57 -2242 -3648 -95 2053 -2042 -4116 -623 -104 -1504 -1600 -3164 -3564 -423 736 -3366
2705 -3366 -4403 -269 345 -2604 -3159 -2497 -2606 -537 -520 -3892 -3659 812 731 -3239 -2312 -224 -1262
2722 -1262 -422 -577 -3249 -2585 1803 813 -3238 -1684 1292 630 -553 -936 -2225 -757 2097 -135
2738a35l511K557L372k095j792J366l26O1J922j999k704L425K570k976j754J998
2754b1Q24j40N83j698j485L068K096l804j531L959J093j813O8l60o43K247J014
2771C457l437j073L814P99l310N62Q66k32J508K86l889k25M126r6l689J73K333
2788A973m15K06j08j993L61L367j398l843J303L052j326j485Q03o85M14K650k146
2805G30l658K444L039k289k328J427L70k00J315j462k694L128K097l662j982K450
2821a275N95m49J21j051j388K347K032l875j597L347J009k283j66J72l74J901
2837i34J216k996j157L752N11l239l33J509R2P26O22k842j39M074j4l897M76K625
2855E2n78p59J51j349K54L681o50m112J467L056j317j297M80j78K36J863r50k967
$$ plain form
2738 -135 -3646 -1089 2283 188 -1604 -238 -564 -503 1419 -580 -3284 141 2711 -265 -2019 -21
2754 -21 803 663 1246 -452 -1937 1131 3227 -577 -2108 1851 2944 1131 1199 839 196 2443 3457
2771 3457 20 -1053 2761 3560 250 812 1678 1446 2954 3240 -649 -874 3252 3156 -533 -360 1973
2788 1973 1558 1764 1656 -337 24 3391 1993 -1850 -547 2505 1179 -306 497 -188 226 2876 730
2805 730 -2928 -484 2555 266 -2062 -635 -265 -465 850 -612 -3306 -178 1919 -1743 -3725 -1275
2821 -1275 -680 -1129 -1008 -2059 -3447 -1100 932 -2943 -4540 -1193 -184 -2467 -2633 -2461 -2835 -934
2837 -934 282 -2714 -3871 -119 392 -2847 -3180 -1671 -1579 -853 -231 -3073 -3212 862 848 -3049 -2573 52
2855 52 -526 -1285 -1134 -2483 -2229 1452 802 -3310 -1843 1213 -104 -1401 -921 -1099 -863 1000 50 -2917
2873b917K486L049j819k492J828K87j2J284j517k130K617K661k845k085K940J056
2889B391j202j46m40j052J953J684l154j277L554R51k666r3R09o17O91J087k704
2906a31r15L974M35l405K2J764m62J79N52k336p9L090l29l370N84K994j111r22
2924E34M42j112K0K421j084l618J205L435j539j875N86L23J28R31j261k806J995
2941a275L139k144k873K145R47p97M19p80j836J785K339k997k098K651R26j351
2957a800l71M21r30J588J421k951j471L117O59k311j0J143q00J030J386l029o97
2974c605L266L24l193PK537o95k50Q04j361l75K965l66l458J115K745o37j520
2991a697M04K10m16K692q97k855J399L056j371k449J512R05n32J353k17k658K082
$$ plain form
2873 -2917 -431 2618 799 -1693 135 422 410 1694 177 -1953 664 3325 480 -1605 1335 2391
2889 2391 1189 1043 603 -449 1504 3188 34 -1243 2311 3262 596 503 1412 795 1486 2573 -131
2906 -131 -1046 2928 3363 -42 -20 1744 1282 1461 2013 -323 -402 2688 2359 -1011 -427 2567 1456 534
2924 534 976 -136 -116 2305 1221 -2397 -1192 2243 704 -1171 -585 -262 -134 797 -464 -3270 -1275
2941 -1275 1864 -280 -3153 -1008 -61 -858 -439 -1219 -3055 -1270 1069 -1928 -4026 -1375 -449 -1800
2957 -1800 -2171 -1750 -2680 -1092 329 -2622 -4093 -976 -317 -2628 -2638 -1495 -2295 -1265 121 -2908 -3605
2974 -3605 -339 -15 -3208 -3201 -664 -1359 -1609 -805 -2166 -2541 424 58 -3400 -2285 460 -177 -1697
2991 -1697 -1293 -1083 -1499 1193 296 -2559 -1160 1896 525 -1924 -412 493 -39 1314 1097 -1561 521
3008E21K716k150k154J861R70o45K03j78j427J750K011k165j926K852J192j975
3024A456l61O65j015J453J321k788j060L472N94k523o64J592k95L0P41j918n80
3041A20L471L31l722J48K735o81j222N45r80m27K499l77k917L75K914o17k225
3058c0P05k30n30J669l22k820J303K641j556k159J412M02l09M38o16k199J523
3075f78K207k144k185K472Q94j467M9p2j366J276K020k621k015K456J219j776
3091a731k05Q87n84N22Q99k002j631L321Q74k893J6J639o8l67Q43j657o15K630
3109a22M64l184q8L153j83j209N18o24o9K015j15k980N05L247j091j870J168O81
3127B16n68J600n00k231J309K385j314k127J447J070n52M68o4j604J223K570j821
$$ plain form
3008 521 3237 1087 -1067 794 1764 1119 1322 1144 -283 1467 3478 1313 -613 2239 3431 1456
3024 1456 1095 1760 745 2198 3519 731 -329 3143 3737 1214 550 2142 1847 1877 2618 700 120
3041 120 3591 3922 200 348 3083 2402 1180 1725 745 318 2817 2440 -477 -102 2812 2195 -30
3058 -30 675 445 -85 1584 1262 -1558 -255 2386 830 -1329 83 485 176 614 -2 -2201 -678
3075 -678 1529 -615 -2800 -328 566 -901 -852 -924 -2290 -1014 1006 -1615 -3630 -1174 45 -1731
3091 -1731 -1936 -1049 -1633 -1111 -212 -2214 -3845 -524 350 -2543 -2527 -888 -956 -1323 -480 -2137 -2752 -122
3109 -122 342 -2842 -2930 223 40 -1169 -651 -1275 -1344 671 556 -2424 -1919 1328 237 -1633 -465 216
3127 216 -352 1248 748 -1483 -174 2211 897 -1230 217 1287 735 1203 1139 -465 758 3328 1507
3144A507l004L006J189j653k92Q63p41J121J432k067j503K644J147k251n53J356
3160B201m58M49R48k082j073K746J285k954l22J744m80q49Q62r72l85K535J01
3177C296l189k7K578n72j598O82l7o92J701j32k864P83K699p75k222O77L14p17
3195i5J199n43j920R15K306j685k420J739J535j571j40R8j351P48J853j834j856
3212c022K240J102j995l68J145j175P04J428k157j105K091J110k492j48J352n31
3228a821m9Q77j319r47K019P86k012n97K125k36j183Q54l98r24K269N53k763r7
3246b863K648k10j610P69L67m56Q60M85j987N1K856p86k485J514J007o20M98L42
3264C80j708Q71K274j252k440J792J424q35l00N21j106L70K505j686j989K155
$$ plain form
3144 1507 -1497 1509 2698 1045 753 1616 875 1996 3428 1361 -142 2502 3649 1398 845 2201
3160 2201 1743 2192 3140 1058 -15 2731 4016 1062 740 2484 2004 1155 2017 1045 660 3195 3296
3177 3296 107 80 2658 2086 488 1170 1133 441 2142 2010 -854 -71 2628 1853 -369 308 622 -95
3195 -95 1104 561 -1359 -444 1862 177 -2243 -504 1031 -540 -680 -582 -1933 -1185 668 -1166 -3022
3212 -3022 -782 320 -1675 -2043 -898 -2073 -1369 59 -2098 -3203 -1112 -2 -2494 -2642 -1290 -1821
3228 -1821 -1870 -993 -2312 -3259 -1240 -454 -2466 -3063 -938 -1174 -2357 -1503 -1901 -2825 -556 -3 -2766 -2863
3246 -2863 -215 -425 -2035 -1266 -899 -1355 -495 -10 -1997 -1946 910 124 -2361 -847 160 -460 38 380
3264 380 -1328 -457 1817 565 -1875 -83 1341 506 206 727 -379 -9 2496 810 -1179 976
3280I76J600k387k50J372m93L32J407j459j752K318J469k127r47J649J52r14J059
3297B005q31j150J773J224k641n27K346k73j546N91K8m59J183L80k374k96K879
3314B312p62k056J149J44m06P99J61k142M75K630q52k721J259J329p43j74M37
3331H39j363N15J601j051k488J740J548j471q01P33n48j99J910j487j832J827
3347e27J369j856q70J317j68n92Q16j046j094K171J014k209o80K079l58o25P8
3364a181k12j071J690J470k582m63K243O1j721P53K38n28R60O33k122k30K355
3381B93J19j974N90J241j133M09O57j589L81J998j78k333J335J239j153J82N27
3398F11j155L53K122j095j873J371K186j678n85J171q43j03J719j104j427J585
$$ plain form
3280 976 2576 189 -61 1311 818 1150 2557 1098 -654 1664 3133 1006 59 1708 1860 946 2005
3297 2005 1174 24 1797 3021 380 -147 2199 1926 380 971 999 540 1723 2103 -271 -567 2312
3314 2312 1550 -506 643 787 381 1180 1341 -801 -326 2304 1452 -1269 -10 1319 576 402 839
3331 839 -524 -9 1592 541 -1947 -207 1341 -130 -931 -198 -746 -945 965 -522 -2354 -527
3347 -527 842 -1014 -1884 -567 -735 -1327 -511 -1557 -2651 -480 534 -1675 -2355 -276 -634 -1259 -1181
3364 -1181 -1393 -2464 -774 696 -1886 -2349 -106 -45 -1766 -1013 -775 -1303 -343 290 -1832 -2062 293
3381 293 412 -1562 -972 269 -864 -455 202 -1387 -1006 992 814 -1519 -184 1055 -98 84 611
3398 611 -544 -191 1931 836 -1037 334 2520 842 257 1428 585 482 2201 1097 -330 1255
3414A255J588j600j246J494j3n30J012q63r06J278J316k213j055J959L05p17P9
3431A143Lo85Q27O53j797m82K156n1j628L53M16j66Q88J67k016J16K291n16j824
3450a52M60J451j202P2L01j262p8K398j088j700Q44J643j174q52R85q32R9J383
3468A296p98k349J330J941j977q73J456l65j74R85r67j472J812J427k158q02J509
3485a79M64j057J014p22j152J532J152k258q12J829L70j266l3L01n28J108R85
3502G48k061k73K037j30j478j05J035o82N71N83j582J08J728K55k443J128J432
3519H71r61l06Q75r81m54K712j146j675M75J902j038o95O86j54q4J273p19j654
3537a073J037J720j273j069J156L87n76P91n77j261J514J343j708r48J778m9n14
$$ plain form
3414 1255 2843 1243 -3 1491 1478 948 1960 1097 191 1469 2785 572 -483 1476 1781 1064 1143
3431 1143 1146 461 1288 1941 144 -338 1818 1767 139 492 908 742 1630 1797 -219 -103 2188 1672 -152
3450 -152 308 1759 557 629 930 -332 -410 1988 900 -800 44 1687 513 -339 646 -186 -87 1296
3468 1296 498 -1851 -521 1420 -557 -1430 26 -339 -513 472 -495 -1967 -155 1272 -886 -1688 -179
3485 -179 285 -772 242 -480 -1632 -100 1052 -1206 -2018 -189 181 -1085 -1118 -817 -1345 -237 748
3502 748 -1313 -1586 451 321 -1157 -1262 -227 -909 -338 245 -1337 -1229 499 754 -1689 -561 871
3519 871 -90 -396 479 -502 -956 1756 610 -1065 -590 1312 274 -421 265 111 27 1300 581 -1073
3537 -1073 -36 1684 411 -658 498 885 309 1100 523 -738 776 2119 411 -537 1241 1192 678
3554F78J98j73n71Q10Q61j469j097J972M71j427K9M39m95P25M75j806j08J796
3572A308J99j734J89J120p43l39J091j512k16J710l09j941P01J806j451j7L04
3589A66m09l46J249n94j782Q43J808j428j015R19j95J38O52k80j659R53J118j295
3607a157j021J408J75o35P31J30j919J542J099j513q08J221M66q60K15M97j019
3624a448O89J244j839n21J942K72j390N7R23o60L92P15j471m31K036L44k062M93
3642g15J196n37j5O94j035j44J552j56j798M93J630o78q88L73K60m45J409k43
3660I53j497O08J352o48j348J433K2m09N19J5j511Q51J582j136j299J275P66j134
3678C94M32j88q28O38J129j165p78J263K00o07J23L24n94L10Q84j398p29J675
$$ plain form
3554 678 876 703 132 942 1803 334 -763 1209 1680 253 282 721 226 951 1426 -380 -488 1308
3572 1308 1507 -227 -38 1082 339 0 1091 -421 -637 1073 764 -1177 -476 1330 -121 -138 166
3589 166 -243 -589 660 66 -1716 -873 935 -493 -1508 -589 -784 -646 6 -274 -1933 -980 138 -1157
3607 -1157 -2178 -770 -595 -1230 -499 -369 -2288 -746 353 -1160 -1968 -747 -281 -1141 -926 -429 -1448
3624 -1448 -759 485 -1354 -1875 67 339 -1051 -994 -71 -731 -339 376 -1095 -1526 510 854 -1208 -715
3642 -715 481 -56 -71 623 -412 -556 996 840 -958 -465 1165 487 -401 -28 232 -213 1196 953
3660 953 -544 64 1416 768 -580 853 875 466 985 1000 -511 340 1922 786 -513 762 1528 394
3678 394 826 638 -190 448 1577 412 -366 897 1097 490 613 937 343 653 1537 139 -590 1085
3696A085N42j804M9Q56l15K60N31j351m24J748K20k046n3K003j235l40O78o87
3714b83q83J553K7j734N81J320o68j191O51J13o91J043J50j965O47J307p82j287
3732b092O99M87o62L33K01j529Q25J624r73j069P72O34j143O68J22o52N08J250
3750Cj542p95J452N82j296J94M35l60N80Q44j440k44J454K12j222J04Q05j91j88
3769f13Q52r94n05J713L19j649P8J278l22p40J135k70m76J371k62j301L47J384
3787A345k57r55O75Jk96Q71l13r10L68J509q15j214P89O77p29M06K88q72L29J319
3807B216j227p82J073K88p22NL13l22j45J196j111j025J193Q23j300m17J133n34
3825F55o4J167j804j99J653J79j482L4J084m26o98Q17n29o95J103N41j709j78
$$ plain form
3696 1085 1627 -177 -128 728 413 673 1204 -147 -571 1177 1397 -649 -702 1301 66 -274 404 -283
3714 -283 -1166 387 414 -1320 -739 581 -87 -1278 -627 -514 -1205 -162 -12 -1977 -1330 -23 -805 -2092
3732 -2092 -1393 -906 -1568 -1235 -1034 -2563 -1738 -114 -1087 -2156 -1384 -750 -1893 -1225 -1103 -1755 -1247 3
3750 3 -1539 -2334 -882 -300 -1596 -1402 -967 -1327 -747 97 -1343 -1587 -133 79 -1143 -1039 -234 -425 -613
3769 -613 239 -755 -1260 453 772 -877 -799 479 157 -583 552 282 -194 1177 915 -386 -39 1345
3787 1345 1088 133 808 809 513 1384 1071 161 529 2038 1223 9 798 1475 746 1152 1440 568 897 2216
3807 2216 989 207 1280 1568 846 851 1164 842 697 1893 782 -243 950 1773 473 56 1189 655
3825 655 591 1758 -46 -245 1408 1587 105 139 1223 797 99 916 387 -308 795 1336 -373 -551
3843e51J691r82m51L60k69n84Q55N1j777L49J636o89j188Q16R1n83O44o9j310
3862a960K13J864j008j478J170K95k94J45K98j207N55J170j036n32O39Q99p88
3879a055O4L09n92J42Q35q71p04J169Q17j475K1J005q96K87Q57o31j048J117Q55
3898B06j426p3J391j20q06O62j0o06R01P29j427j42J723l52r46M84K72m33J019
3917A046jj108M80J267p22n42N96L07q25M11N34j361N59J034m33j381R49R22r55
3936G77J75L94p81J80J415p98j296R28J143j358J44K54n52N09P68o23j302J264
3954A241N06j020j94Q84l78m87P99p67o33J235L67j439m37J403l34j018M07j04
3972C1m56O83O53j117p18J549k93j206L11N69p02P29J02j075j56J365m63j029
$$ plain form
3843 -551 1140 158 -293 67 -202 -786 69 120 -1657 -1308 328 -361 -1549 -733 -642 -1225 -581 -650 -1960
3862 -1960 -1747 117 -891 -2369 -1199 -904 -1198 -1053 -755 -1962 -1407 -237 -1273 -1805 -1166 -267 -1055
3879 -1055 -991 -682 -1274 -1132 -297 -1168 -1872 -703 114 -1361 -1340 -335 -1231 -944 -87 -718 -1766 -649 206
3898 206 -1220 -1293 98 -22 -828 -166 -176 -782 119 848 -579 -721 1002 650 -296 188 460 27 1046
3917 1046 1045 -63 417 1684 962 420 1016 1323 498 909 1443 82 641 1675 1242 -139 810 1732 777
3936 777 952 1346 565 745 2160 1362 66 994 2137 779 923 1177 625 1134 1902 1279 -23 1241
3954 1241 1747 727 533 1417 1039 552 1351 584 -49 1186 1553 114 -323 1080 746 -272 135 31
3972 31 -425 258 911 -206 -924 625 332 -874 -563 6 -696 33 135 -940 -1096 269 -194 -1223
3990a223P92N19q22n5N44q95K07Q34m95j397J005P07q09J97J84p46R5J248j028
4009a138j107J409N85j405L5O38k71O8L40J5j123J048R60j462l50J325k62n56
4027a251Q21l12n51R45P35j676j10J332p0p39N91j1n77P44L08p06m65J431j60
4046B79j167P26M43m48K43R22j685J26J702p08j064O98Q73q66N3P82p70L41Q51
4065A331o38p83Q35N03n88l75Q46o15j4J180p37j144J538M22j122n11P46j15j44
4084F15P82o77n36P20P17j111o81J357l36p86O37M2r56Q62L20o77n79R29K13j359
4104e04N37K75o33N75L02j104m7J205k28j242M11K30l43j1Q09j091j13J410n22
4123h4j344N81R13p53j65O13o42k49J316p33j092J117L83r55k40Q62j69m50Q00
$$ plain form
3990 -1223 -431 88 -734 -789 -245 -1140 -933 -99 -594 -1991 -986 -279 -1088 -891 -707 -1453 -1358 -110 -1138
4009 -1138 -2245 -836 -251 -1656 -1621 -983 -1254 -1186 -846 -831 -1954 -906 54 -1408 -1758 -433 -695 -1251
4027 -1251 -430 -742 -1293 -348 387 -1289 -1399 -67 -137 -876 -285 -296 -873 -129 179 -527 -992 439 279
4046 279 -888 -162 281 -167 76 998 -687 -561 1141 433 -631 67 940 74 127 909 139 480 1331
4065 1331 693 -90 745 1248 660 285 1131 516 502 1682 945 -199 1339 1761 639 128 874 759 615
4084 615 1397 720 184 904 1621 510 -171 1186 850 64 701 743 -213 649 969 292 -287 642 855 -504
4104 -504 33 308 -325 250 552 -552 -599 606 378 -864 -453 -223 -566 -577 232 -859 -972 438 -84
4123 -84 -1428 -847 66 -687 -852 -239 -881 -1130 186 -547 -1639 -522 -139 -1094 -1334 -472 -641 -1091 -291
4142b91m33j179J113J071j232p27J201j65m54N91j78o18O15Q94j098j76R11l0
4160a85q48O54L32r00O65M81j226q6J366k54q97M81O04l93J65P10j117m04J938
4179A086p11j017M95P68o39J29O36r33M5P14M77j483O31Q42p09n2N49l17k84J135
4199A362r0j296O62P68r37j85M45M93o57Q17j71j349R69O87q58p16J167O8n99
4218E80K99J75j160P24R65j379p34J217J57p82L53o3l95M16L73r91n03J498l61
4237C89p20jN93n63Q3O22j057k99J289J91j347L74N26n86m0M82o74k48J119J52
4257B85j619O50O81o66o19P33K66n66M72O0j176O89J146j243n30J099J49p30N50
4276c69n9o60M71J035r46p33J034K39l30J4K26n47J67J026r79k95R71P6q55L84
$$ plain form
4142 -291 -724 -1903 -790 281 -951 -1678 -477 -642 -1096 -505 -683 -1301 -686 208 -890 -1066 -155 -185
4160 -185 -1033 -379 -47 -947 -282 199 -1027 -1113 253 -1 -898 -417 187 -206 -41 669 -448 -852 1086
4179 1086 375 -642 -147 621 -18 111 747 -186 -141 573 1050 -433 198 1040 331 279 828 511 227 1362
4199 1362 1272 -24 638 1406 469 284 729 1222 565 1382 1211 -138 831 1518 660 -56 1111 1179 580
4218 580 879 1054 -106 618 1583 204 -530 687 844 62 415 352 -43 373 746 -245 -748 750 389
4237 389 -331 -332 261 -302 -219 403 -654 -953 336 527 -820 -446 80 -506 -546 -64 -738 -986 133 285
4257 285 -1334 -684 -3 -669 -1288 -555 -289 -855 -383 -323 -1499 -810 336 -907 -1437 -338 -189 -919 -369
4276 -369 -428 -1088 -617 418 -528 -1261 -227 12 -318 -304 -78 -625 -458 568 -411 -706 265 341 -514 -130
4296a30M73p31N92K72o43k71J177L92j230j04J084r02K62O61q21m55J284J35j463
4315d18R61M79k31o75Q22k84m07O88P7j260N35J219q46l97P17j86n89Q25l07q72
4335a49O19J046p11j142J286j72m32L17M42j055KJ015o32p21P64J41n06L88o1
4354D39n75j02J065p75r97J139N15j273N02J20l24j42N08l21o80Q82L78j451J60
4373i32J080o91k51P06m81n73J139J89j556L49P73m76o41R60l55n25Q72J64q33
4392a082O7J211j003m71R49l59o57J050K11j118M56O40n34p35J252m8m32M57K36
4411I0j025N99P35n37o85P53L85p50K65L39k54K35O77q73l63R96J68p94J15N47
4431F23l05j7P70r35o43J376Pm89k88R59o46lN84n60l79R61R3p14L00N63p57l95
$$ plain form
4296 -130 343 -388 204 476 -167 -438 739 1131 -99 -203 881 -21 241 902 81 -374 910 1045 -418
4315 -418 543 1022 791 116 938 654 247 935 1012 -248 287 1506 660 263 980 794 205 1030 723 -149
4335 -149 470 1516 805 -337 949 777 345 662 1104 49 51 1066 434 -287 477 618 112 500 439
4354 439 -136 -238 827 52 -945 194 709 -564 -62 58 -266 -408 100 -221 -901 -19 359 -1092 -932
4373 -932 148 -543 -794 -88 -569 -1142 -3 186 -1370 -1021 -248 -724 -1365 -405 -760 -1285 -413 -249 -1082
4392 -1082 -1015 196 -807 -1278 -329 -688 -1345 -295 -84 -1202 -746 -106 -640 -1375 -123 -171 -603 -146 90
4411 90 -935 -336 399 -138 -823 -70 315 -435 -170 169 -85 150 827 -46 -409 587 755 -39 76 623
4431 623 318 301 1071 136 -507 869 876 387 99 1058 412 409 993 433 54 1015 1108 394 694 1257 500 105
4453A05P12j03j27K19M69q98N5J382q90n43O73Q8p37N38J20p27N06L84n11j168
4473d53J006M91q85K28pl61J43R23j040n23N17M79p61j84R10p45L32J68m58p70
4493i90J283P1r69J26K43k43k86O02l64n1k3N96j081M38N47r73k00J008l36m58
4513a060O06J36r31J45P09m00n10K68O41p45P12K19j077K88R62n38q24P12J76
4532e11m64L98M6q17N98J020k83j273R78O69r52R1O43m86l0Q56o32n78Q85J89
4552C47p98J05O24j67j04O99j77p93Q44M09r32M37N19l25m39O17L5p99O40M28
4572A170q86r3R45m76l84O76K27p03L84O26j069J4J030p27l01N22J96n32K98M59
4592A376j075K54P64n57p48Q19O9o96L11M16p71O2J074n10q21O98L58j023L10
$$ plain form
4453 105 817 714 587 806 1275 377 432 1814 924 381 1054 1142 405 943 1063 336 842 1226 715 -453
4473 -453 553 1044 159 387 380 19 162 1085 45 -478 39 518 -243 -427 483 -262 70 238 -220 -990
4493 -990 293 364 -605 -479 -236 -479 -765 -163 -527 -578 -601 -5 -1086 -648 -101 -1074 -1274 -266 -602 -1060
4513 -1060 -454 -318 -1249 -1104 -395 -795 -1305 -1037 -396 -1141 -429 -210 -1287 -999 -37 -575 -1399 -687 -511
4532 -511 -975 -577 -531 -1348 -750 270 -13 -1286 -308 361 -591 -500 143 -343 -373 483 -149 -727 158 347
4552 347 -451 -346 278 111 7 706 529 -264 580 989 57 494 1013 688 249 866 901 102 742 1170
4572 1170 284 191 1136 660 276 952 1179 476 860 1486 417 431 1461 734 433 955 1151 619 917 1376
4592 1376 301 555 1319 762 14 833 902 206 517 933 162 224 1298 788 -33 665 1023 0 310
$$ [...]
8191A11
##END NTUPLES=NMR FID
##END=
