##TITLE=1H_TG-2291-2
 CDCl3, 8 sc, 
 29.6.2020
##JCAMPDX= 6.0         $$ Bruker NMR JCAMP-DX V2.0
##DATA TYPE= NMR FID
##DATA CLASS= NTUPLES
##ORIGIN= UXNMR, Bruker Analytische Messtechnik GmbH
##OWNER= root
$$ XWIN-NMR		Version 3.5
$$ Mon Jun 29 11:28:57 2020 Russian Standard Time (UT+4h)  she@DPX200
##.OBSERVE FREQUENCY= 200.1315
##.OBSERVE NUCLEUS= ^1H
##.DELAY= (6, 6)
##.ACQUISITION MODE= SIMULTANEOUS
##.ACQUISITION SCHEME= undefined
##.AVERAGES= 8
##.DIGITISER RES= 18
##SPECTROMETER/DATA SYSTEM= spect
##.PULSE SEQUENCE= zg30
##.SOLVENT NAME= CDCl3
##.SHIFT REFERENCE= (INTERNAL, CDCl3, 0, 15.7039)
##AUDIT TRAIL= $$ (NUMBER, WHEN, WHO, WHERE, WHAT)
$$ ##TITLE= Audit trail, XWIN-NMR		Version 3.5
$$ ##JCAMPDX= 5.01
$$ ##ORIGIN= Bruker BioSpin GmbH
$$ ##OWNER= she
$$ F:/spectra/data/she/nmr/H-F/1/audita.txt
$$ ##AUDIT TRAIL=  $$ (NUMBER, WHEN, WHO, WHERE, WHAT)
(   1,<2020-06-29 11:27:58.45 +0400>,<she>,<DPX200>,
      <created by zg, POWCHK disabled, PULCHK disabled
       configuration hash MD5:
       00 E9 B6 7A A2 85 ED C7 34 08 36 98 17 FE 4E 26
       data hash MD5: 16K
       A2 A0 A5 77 42 F7 6A F5 2E 7D 39 77 83 88 27 F7>)
$$ ##END=
$$ 
$$ hash MD5
$$ AC 32 6D 25 BB E3 B2 19 9E EB B5 79 1C 1C 4F 76
##$RELAX= 
##$RELAX= 
##$RELAX= 
##$RELAX= 
##$RELAX= 
##$RELAX= 
$$ Bruker specific parameters
$$ --------------------------
##$DU= <F:/spectra>
##$EXPNO= 1
##$NAME= <H-F>
##$PROCNO= 1
##$TYPE= <nmr>
##$USER= <she>
##$AMP= (0..31)
100 100 100 100 100 100 100 100 100 100 100 100 100 100 100 100 100 100 
100 100 100 100 100 100 100 100 100 100 100 100 100 100 
##$AQSEQ= 0
##$AQ_mod= 1
##$AUNM= <au_zg>
##$AUTOPOS= <>
##$BF1= 200.13
##$BF2= 200.13
##$BF3= 200.13
##$BF4= 200.13
##$BF5= 200.13
##$BF6= 200.13
##$BF7= 200.13
##$BF8= 200.13
##$BYTORDA= 1
##$CFDGTYP= 0
##$CFRGTYP= 5
##$CHEMSTR= <none>
##$CNST= (0..31)
1 1 145 1 1 1 1 1 1 1 1 1 1 1 1 1 1 1 1 1 1 1 1 1 1 1 1 1 1 1 1 1 
##$CPDPRG= <>
##$CPDPRG1= <>
##$CPDPRG2= <>
##$CPDPRG3= <>
##$CPDPRG4= <mlev>
##$CPDPRG5= <mlev>
##$CPDPRG6= <mlev>
##$CPDPRG7= <mlev>
##$CPDPRG8= <mlev>
##$CPDPRGB= <>
##$CPDPRGT= <>
##$D= (0..31)
0 1.2 0 0 0 0 0 0 0 0.06 0 0.03 0 0 0 0 0.0002 0 0 0 0 0 0 0 0 0 0 0 0 
0 0 0 
##$DATE= 1593415677
##$DBL= (0..7)
120 120 120 120 120 120 120 120 
##$DBP= (0..7)
150 150 150 150 150 150 150 150 
##$DBP07= 0
##$DBPNAM0= <>
##$DBPNAM1= <>
##$DBPNAM2= <>
##$DBPNAM3= <>
##$DBPNAM4= <>
##$DBPNAM5= <>
##$DBPNAM6= <>
##$DBPNAM7= <>
##$DBPOAL= (0..7)
0.5 0.5 0.5 0.5 0.5 0.5 0.5 0.5 
##$DBPOFFS= (0..7)
0 0 0 0 0 0 0 0 
##$DE= 6
##$DECBNUC= <off>
##$DECIM= 24
##$DECNUC= <off>
##$DECSTAT= 4
##$DIGMOD= 1
##$DIGTYP= 9
##$DL= (0..7)
0 120 120 120 120 120 120 120 
##$DP= (0..7)
150 150 150 150 150 150 150 150 
##$DP07= 0
##$DPNAME0= <>
##$DPNAME1= <>
##$DPNAME2= <>
##$DPNAME3= <>
##$DPNAME4= <>
##$DPNAME5= <>
##$DPNAME6= <>
##$DPNAME7= <>
##$DPOAL= (0..7)
0.5 0.5 0.5 0.5 0.5 0.5 0.5 0.5 
##$DPOFFS= (0..7)
0 0 0 0 0 0 0 0 
##$DQDMODE= 0
##$DR= 18
##$DS= 0
##$DSLIST= <SSSSSSSSSSSSSSS>
$$ [...]
##$SUBNAM2= <"">
##$SUBNAM3= <"">
##$SUBNAM4= <"">
##$SUBNAM5= <"">
##$SUBNAM6= <"">
##$SUBNAM7= <"">
##$SUBNAM8= <"">
##$SUBNAM9= <"">
##$SW= 24.9337058887773
##$SWIBOX= (0..15)
0 0 2 0 0 0 0 0 0 0 0 0 0 0 0 0 
##$SW_h= 4990.01996007984
##$TD= 16384
##$TD0= 1
##$TE= 0
##$TE2= 300
##$TE3= 300
##$TEG= 300
##$TL= (0..7)
0 120 120 120 120 120 120 120 
##$TP= (0..7)
150 150 150 150 150 150 150 150 
##$TP07= 0
##$TPNAME0= <>
##$TPNAME1= <>
##$TPNAME2= <>
##$TPNAME3= <>
##$TPNAME4= <>
##$TPNAME5= <>
##$TPNAME6= <>
##$TPNAME7= <>
##$TPOAL= (0..7)
0.5 0.5 0.5 0.5 0.5 0.5 0.5 0.5 
##$TPOFFS= (0..7)
0 0 0 0 0 0 0 0 
##$TUNHIN= 0
##$TUNHOUT= 0
##$TUNXOUT= 0
##$USERA1= <user>
##$USERA2= <user>
##$USERA3= <user>
##$USERA4= <user>
##$USERA5= <user>
##$V9= 5
##$VALIST= <valist>
##$VCLIST= <CCCCCCCCCCCCCCC>
##$VD= 0
##$VDLIST= <DDDDDDDDDDDDDDD>
##$VPLIST= <PPPPPPPPPPPPPPP>
##$VTLIST= <TTTTTTTTTTTTTTT>
##$WBST= 1024
##$WBSW= 4
##$XGAIN= (0..3)
0 0 0 0 
##$XL= 0
##$YL= 0
##$YMAX_a= 485932
##$YMIN_a= -240607
##$ZGOPTNS= <>
##$ZL1= 120
##$ZL2= 120
##$ZL3= 120
##$ZL4= 120
##$ABSF1= 10
##$ABSF2= 0
##$ABSG= 5
##$ABSL= 3
##$ALPHA= 0
##$AQORDER= 0
##$ASSFAC= 0
##$ASSFACI= 0
##$ASSFACX= 0
##$ASSWID= 0
##$AUNMP= <proc_1d>
##$AZFE= 0.1
##$AZFW= 0.1
##$BCFW= 1
##$BC_mod= 2
##$BYTORDP= 1
##$COROFFS= 0
##$CY= 11.3945322036743
##$DATMOD= 1
##$DC= 2
##$DFILT= <>
##$DTYPP= 0
##$F1P= 16.9975609425685
##$F2P= -3.02152046262296
##$FCOR= 0.5
##$FTSIZE= 0
##$FT_mod= 4
##$GAMMA= 1
##$GB= 0.15
##$INTBC= 1
##$INTSCL= 1
##$ISEN= 128
##$LB= 0.24
##$LEV0= 0
##$LPBIN= 0
##$MAXI= 10000
##$MC2= 0
##$MEAN= 0
##$ME_mod= 0
##$MI= 1.114404
##$NCOEF= 0
##$NC_proc= 0
##$NLEV= 6
##$NOISF1= 3.799351
##$NOISF2= 2.8
##$NSP= 1
##$NTH_PI= 0
##$NZP= 0
##$OFFSET= 15.70392
##$PC= 1
##$PHC0= -9788.016
##$PHC1= 10.40087
##$PH_mod= 1
##$PKNL= yes
##$PPARMOD= 0
##$PSCAL= 0
##$PSIGN= 0
##$REVERSE= no
##$SF= 200.130013532006
##$SI= 16384
##$SIGF1= 3
##$SIGF2= 2
##$SINO= 400
##$SIOLD= 16384
##$SREGLST= <1H.CDCl3>
##$SSB= 0
##$STSI= 0
##$STSR= 0
##$SW_p= 3612.71676300578
##$SYMM= 0
##$S_DEV= 0
##$TDeff= 0
##$TDoff= 0
##$TI= <>
##$TILT= no
##$TM1= 0
##$TM2= 0
##$TOPLEV= 0
##$USERP1= <user>
##$USERP2= <user>
##$USERP3= <user>
##$USERP4= <user>
##$USERP5= <user>
##$WDW= 1
##$XDIM= 8192
##$YMAX_p= 0
##$YMIN_p= 0
$$ End of Bruker specific parameters
$$ ---------------------------------
##NTUPLES= NMR FID
##VAR_NAME=  TIME,          FID/REAL,        FID/IMAG
##SYMBOL=    X,             R,               I
##VAR_TYPE=  INDEPENDENT,   DEPENDENT,       DEPENDENT
##VAR_FORM=  AFFN,          ASDF,            ASDF
##VAR_DIM=   8192,          8192,            8192
##UNITS=     SECONDS,       ARBITRARY UNITS, ARBITRARY UNITS
##FACTOR=    0.0002004,     1,               1
##FIRST=     0,             0,               0
##LAST=      1.6414764,     0,               0
##MIN=       0,             -240607,         0
##MAX=       1.6414764,     485932,          0
$$ Real data points
##PAGE= N=1
##DATA TABLE= (X++(R..R)), XYDATA
$$ [...]
$$ plain form
2504 -884 37 -2333 -1814 683 -668 -3050 -1139 -39 -1899 -1418 -61 -1744 -1652 1189 92 -2436
2520 -2436 -93 975 -1514 -1141 781 -856 -946 1628 741 -1572 837 2392 -70 -30 1790 656
2536 656 137 2116 1183 -217 1840 3357 676 613 3037 1772 442 2377 1890 20 2141 3644
2552 3644 813 872 3657 2722 957 2311 2278 390 2080 2975 198 90 2901 2254 -129 2087 2413
2569 2413 711 1537 2469 40 212 2605 1564 -887 1098 2338 110 451 1626 -413 -610 1823
2585 1823 747 -1924 -20 1328 -1013 -716 797 -702 -1170 1013 -553 -2602 -344 523 -2208 -1728
2601 -1728 255 -1252 -2266 -70 -922 -3074 -903 215 -2761 -2670 -617 -1714 -2638 -948 -1099 -2716
2617 -2716 -1008 151 -2918 -3154 -356 -1279 -3148 -1267 -1083 -2760 -1092 0 -2280 -2848 328 -870
$$ packed form
2504h84R21k370N19K497j351k382J911J100j860M81J357j683R2K841j097k528
2520b436K343J068k489L73J922j637r0K574q87k313K409J555k462M0J820j134
2536F56n19J979r33j400K057J517k681o3K424j265j330J935m87j870K121J503
2552C644k831N9K785r35j765J354l3j888J690Q95k777j08K811o47k383K216L26
2569B413j702Q26R32k429J72K393j041k451J985J240k228L41J175k039j97K433
2585A823j076k671J904J348k341K97J513j499m68K183j566k049K258Q67k731M80
2601a728J983j507j014K196q52k152K171J118k976R1K053j097r24J690j51j617
2617b716J708J159l069k36K798r23j869J881J84j677J668J092k280n68L176j198
$$ plain form
2633 -870 -3379 -1395 -859 -2409 -1081 273 -2198 -2415 601 -534 -2888 -495 201 -1741 -1091 223
2649 223 -1319 -1652 978 176 -1985 -77 1571 -971 -643 744 -350 -418 1492 630 -1812 271 2376
2666 2376 -479 -36 1996 370 -198 1637 978 -245 1667 3078 450 53 2617 1682 427 2035
2682 2035 1711 -121 1691 2890 308 161 2950 1937 268 1747 1807 -116 1548 2961 132 141 2452
2699 2452 1658 -300 1030 2087 135 1186 2223 -228 -654 2198 1139 -1371 310 1430 -237
2714 -237 -156 1164 -825 -772 1536 149 -2409 -527 918 -1053 -985 568 -971 -1409 650 -637 -3287
2731 -3287 -1152 404 -1494 -2184 -388 -1265 -1920 148 -1124 -2975 -1159 431 -2474 -3265 -1170 -1277
2747 -1277 -2352 -923 -1438 -3389 -1601 3 -2526 -3095 -757 -1391 -2588 -1285 -1032 -2843 -779 339
$$ packed form
2633h70k509J984N36j550J328J354k471k17L016j135k354K393O96j942O50J314
2649B23j542l33K630q02k161J908J648k542L28J387j094o8J910q62k442K083K105
2666B376k855M43K032j626n68J835o59j223J912J411k628l97K564r35j255J608
2682B035l24j832J812J199k582j47K789j013j669J479O0j923J664J413k829RK311
2699B452p94j958J330J057j952J051J037k451m26K852j059k510J681J120j667
2714b37Q1J320j989N3K308j387k558J882J445j971O8J553j539m38K059j287k650
2731c287K135J556j898o90J796q77o55K068j272j851J816J590k905p91K095j07
2747a277j075J429n15j951J788J604k529n69K338o34j197J303K53j811K064J118
$$ plain form
2763 339 -2018 -2482 194 -368 -2390 -853 -459 -1851 -574 748 -1720 -1755 1482 593 -1890 -633 889
2780 889 -1250 -349 879 -770 -789 1658 885 -1868 423 1687 -113 -45 1100 -62 -559 1859 1069
2797 1069 -886 1076 2530 619 248 1997 1096 341 2710 1788 -279 1800 3128 919 154 2350
2813 2350 1858 404 2113 1871 -156 1539 3133 538 -138 2587 1888 269 1642 1492 -335 1227
2829 1227 2593 10 -617 2199 1479 -219 873 1278 -419 661 2130 -317 -594 1804 1048 -1126
2845 -1126 -30 1055 -569 -167 1332 -1001 -1130 1391 237 -2063 -661 702 -1298 -1395 62 -1327
2861 -1327 -1733 355 -512 -2971 -1547 -107 -2002 -2122 -272 -1260 -1828 -317 -1260 -3168 -1679 385
2877 385 -2301 -2687 -807 -1334 -2454 -619 -968 -2487 -1126 264 -2019 -2956 -724 -547 -2082 -718
$$ packed form
2763C39k357m64K676n62k022J537L94j392J277J322k468l5L237q89k483J257J522
2780H89k139R01J228j649j9K447p73k753K291J264j800O8J145j162m97K418p90
2797A069j955J962J454j911l71J749r01p55K369r22k067K079J328k209p65K196
2813B350m92j454J709k42k027J695J594k595o76K725o99j619J373j50j827J562
2829A227J366k583o27K816p20j698J092M05j697J080J469k447k77K398p56k174
2845a126J096J085j624M02J499k333j29K521j154k300J402J363k000r7J457j389
2861a327m06K088q67k459J424J440j895j20J850r88n68J511r43j908J489K064
2877C85k686l86J880n27j120J835l49j519J361J390k283r37K232J77j535J364
$$ plain form
2893 -718 -424 -2374 -901 720 -1938 -2318 303 96 -2034 -698 170 -1410 -198 1216 -743 -1577
2909 -1577 1066 982 -1137 -349 940 -386 38 1713 -270 -879 1829 1658 -449 581 1845 388
2925 388 502 1907 610 68 2473 2164 -300 1155 3115 940 614 2187 1064 627 2633 1678 -587
2942 -587 1106 3174 1139 426 2198 1585 743 2301 1662 -104 1209 3134 736 -467 2105 1768
2958 1768 366 1614 1386 -635 877 2519 313 -1147 1716 1550 -377 533 856 -529 139 1435
2974 1435 -892 -1719 951 642 -1392 -575 513 -795 -208 392 -1383 -2169 483 73 -2460 -1614 -306
2991 -306 -1453 -1311 25 -1782 -1960 -66 -359 -2771 -1804 -288 -1600 -2212 -441 -2010 -2207 34 -319
3008 -319 -3013 -1545 260 -1716 -2411 -816 -1474 -1963 -258 -722 -2797 -920 819 -1405 -2251 -32
$$ packed form
2893g18K94j950J473J621k658l80K621k07k130J336Q68j580J212J414j959q34
2909a577K643q4k119P88J289j326M24J675j983o09K708j71k107J030J264j457
2925C88J14J405j297n42K405l09k464J455J960k175l26J573j123m37K006r55k265
2942e87J693K068k035p13J772o13q42J558o39j766J313J925k398j203K572l37
2958A768j402J248k28k021J512J642k206j460K863j66j927R10L23j385O68J296
2974A435k327q27K670l09k034Q17J088j308N87O00j775p86K652m10k533Q46J308
2991c06j147J42J336j807j78J894k93k412R67J516j312o12J771j569j97K241l53
3008c19k694J468J805j976o95J595o58m89J705m64k075J877J739k224q46K219
$$ plain form
3024 -32 -365 -1486 -5 -221 -1807 -663 1261 -984 -1789 711 894 -713 69 339 -1055 409 1988
3041 1988 -203 -1018 1554 1547 -689 557 1393 108 297 2185 107 -358 2011 2044 84 1114 2015
3058 2015 723 1283 2258 692 2 2503 2451 79 1067 2871 1211 1053 2157 1311 644 2508 2155
3075 2155 130 1345 2726 1177 780 2164 1307 551 2223 1707 -609 932 2333 530 -346 1298
3091 1298 1292 169 1093 1316 -490 595 1866 -313 -1240 1060 1031 -902 54 521 -1051 -449 1096 -1118
3109 -1118 -2009 54 180 -1739 -486 -79 -1190 -619 431 -1583 -2230 352 -87 -2530 -1908 -575 -1167
3126 -1167 -1308 -339 -1944 -2439 -256 -299 -2616 -1874 -188 -1374 -1524 -680 -1659 -2389 -217 -217 -2447 -1606
3144 -1606 149 -1299 -2130 -801 -986 -1825 3 -211 -2286 -970 1037 -843 -1586 -45 -132 -1230 111
$$ packed form
3024c2l33j121J481k16j586J144J924k245q05K500J83j607P82K70j394J464J579
3041A988k191q15K572pk236J246Q36j285J89J888k078m65K369L3j960J030R01
3058B015j292N60R75j566o90K501n2k372R88J804j660j58J104q46o67J864l53
3075B155k025J215J381j549l97J384q57p56J672n16k316J541J401j803q76J644
3091A298oj123R24K23j806J085J271k179r27K300k9j933R56M67j572O02J545k214
3109a118q91K063J26j919J253M07j111N71J050k014o47K582m39k443O22J333n92
3126a167j41R69j605m95K183m3k317P42J686j186j50Q44r79p30K172%k230Q41
3144a606J755j448q31J329j85q39J828k14k075J316K007j880p43J541q7j098J341
$$ plain form
3161 111 176 -1260 26 1720 -161 -1376 376 939 -292 860 709 -504 457 2272 394 -896
3177 -896 1642 2020 521 851 1454 -185 713 2335 483 -438 2085 2333 150 483 1855 722 1188
3194 1188 2375 810 -316 2080 1898 30 839 2256 1110 864 1701 850 147 1758 2157 -44 184
3211 184 1666 392 195 1569 835 -184 1951 1589 -836 59 1677 2 -570 850 525 -629 527
3228 527 877 -991 -368 1370 -469 -1604 -108 -195 -1048 -51 -73 -1560 -714 1040 -879 -2451 -295
3245 -295 29 -1679 -898 -777 -1782 -1038 385 -1472 -2456 -437 -437 -1941 -1575 -457 -2013 -1366 -2 -1482
3263 -1482 -2544 -454 138 -1988 -1783 -281 -1684 -1587 -505 -1611 -2158 50 275 -2024 -1658 29 -1004
3280 -1004 -1533 -263 -1015 -1545 147 62 -1983 -468 923 -292 -994 98 -79 -1004 372 448 -1504
$$ packed form
3161A11O5j436J286J694j881j215J752N63j231J152j51j213R61J815j878j290
3177h96K538L78j499L30O03j639Q98J622j852r21K523K48k183L33J372j133M66
3194A188J187j565j126K396j82j868Q09J417j146k46Q37q51p03J611L99k201K28
3211A84J482j274j97J374p34j019K135l62k425Q95J618j675n72J420l25j154J156
3228E27L50j868O23J738j839j135J496q7q53R97k2j487Q46J754j919j572K156
3245b95L24j708P81J21j005P44J423j857r84K019%j504L66J118j556O47J364j480
3263a482j062K090N92k126K05J502j403R7J082j106n47K208K25k299L66J687j033
3280a004n29J270p52n30J692q5k045J515J391j215p02J092j77r25J376P6j952
$$ plain form
3297 -1504 -361 1622 82 -770 853 763 -218 815 1141 -168 112 1588 1007 -610 1371 1392 -162
3314 -162 1141 1339 12 742 2096 564 -644 1620 1850 339 840 1736 847 894 2352 1197 -256
3331 -256 1708 2151 363 469 1633 428 578 1739 922 -306 1667 1549 -84 152 1389 414 194
3348 194 1424 81 -315 1038 1350 -1067 -366 1285 272 -857 212 246 -601 395 745 -1463 -701
3365 -701 1213 -110 -1021 5 25 -1112 264 641 -1185 -567 1058 -534 -1716 -436 -53 -1214 -590
3382 -590 -382 -1679 -912 389 -722 -1960 -477 410 -1152 -1066 -693 -1261 -1208 285 -1019 -2032 -143
3399 -143 303 -1792 -1442 -221 -876 -859 378 -766 -1941 -197 783 -1315 -874 410 -480 -858 57 -434
3417 -434 -1127 345 697 -1012 -585 1544 81 -679 544 270 -379 1122 1253 -683 -403 1773 896
$$ packed form
3297a504J143J983j540q52J623r0r81J033L26j309K80J476n81j617J981K1j554
3314a62J303J98j327P30J354j532j208K264K30j511N01Q96q89M7J458j155j453
3331b56J964M43j788J06J164j205J50J161q17j228J973j18j633K36J237r75k20
3348A94J230j343l96J353L12k417P01J651j013j129J069L4q47R96L50k208P62
3365g01J914j323r11J026K0j137J376L77j826O18J625j592j182J280L83j161O24
3382e90K08j297P67J301j111j238J483Q87j562Q6L73n68N3J493j304j013J889
3399a43M46k095L50J221o55J7J237j144j175J744R80k098M41J284q90l78R15m91
3417d34o93J472L52j709M27K129j463p60J223k74o49J501J31j936K80K176q77
$$ plain form
3434 896 -450 1074 948 190 1199 1088 -332 244 2174 1101 -501 942 1281 696 1698 1623 298
3451 298 700 2013 940 -326 1168 1912 434 1036 1256 320 683 2227 646 -64 1358 1674 218
3468 218 342 1382 600 301 1759 568 -171 1137 1233 -247 -112 1353 418 -277 729 154 -587 937
3486 937 1277 -409 -842 878 144 -555 541 144 -778 445 604 -925 -719 736 134 -1035 154
3503 154 -35 -1335 -212 411 -1511 -752 944 -430 -1303 -377 -36 -1098 -311 31 -1368 -1378 464 -551
3521 -551 -1784 -153 -191 -1120 -866 7 -1487 -945 470 -745 -1907 -294 249 -902 -593 444 -713
3538 -713 -688 241 -597 -1596 183 583 -1038 -1028 260 -175 -624 508 126 -1053 414 1064 -856 -492
3556 -492 764 -77 -306 641 357 -716 608 1038 -593 18 1190 610 -296 878 362 169 1047 1326
$$ packed form
3434H96j346J524j26p58J009j11j420N76J930j073j602J443L39n85J002p5j325
3451B98M02J313j073j266J494P44j478O02K20r36L63J544j581p10J422L16j456
3468B18J24J040p82k99J458j191p39J308R6j480J35J465r35o95J006n75p41J524
3486I37L40j686m33J720p34o99J096l97r22J223J59j529K06J455o02j169J189
3503A54j89j300J123O23j922P59J696j374q73R26L41j062P87L42j399j0J842j015
3521e51j233J631l8r29K54Q73j494N42J415j215j162J613N43j151L09J037j157
3538g13K5R29q38r99J779M00j621J0J288m35m49J132l82j179J467O50j920L64
3556d92J256q41k29R47k84j073J324M30j631O11J172n80r06J174n16j93Q78K79
$$ plain form
3574 1326 -58 -87 1989 774 -172 1123 1265 263 866 1721 -70 282 1838 904 -266 769 1446
3591 1446 197 666 963 -55 608 1726 838 -419 1060 1531 67 261 1235 -101 228 1193 344
3608 344 -353 942 1378 -489 -246 722 -126 -231 832 76 -886 419 832 -484 -445 811 93 -901
3626 -901 238 -285 -725 -73 617 -1302 -1170 528 -428 -1214 -87 -260 -924 -251 118 -1383 -1198 107
3644 107 -244 -1509 -934 -559 -1129 -706 -390 -1882 -1404 -66 -532 -1663 -826 177 -951 -740 -275 -1326
3662 -1326 -1006 84 -514 -2071 -604 13 -1048 -777 262 -947 -873 290 -252 -1275 2 993 -489
3679 -489 -604 603 -140 -374 481 -58 -691 424 943 -364 -298 778 -83 338 897 315 -256 763 1497
3698 1497 -321 -134 1124 566 -51 522 905 121 1075 1498 215 165 1443 984 -15 980 1172 231 919
$$ packed form
3574A326j384k9K076j215r46J295J42j002O03Q55j791L52J556r34j170J035O77
3591A446j249M69K97j018O63J118q88j257J479M71j464J94R74j336L29R65q49
3608C44o97J295M36j867K43R68q48j05J063p56r62J305M13j316L9J256p18r94
3626i01J139n23m40O52O90j919J32J698r56p86J127j73o64O73L69j501J85J305
3644A07l51j265N75L75n70M23L16j492M78J338m66j131Q37J003j128K11M65j051
3662a326L20J090n98j557J467O17j061K71J039j209P4J163n42j023J277R91j482
3679d89j15J207p43k34Q55n39o33J115N19j307O6J076q61M21N59n82n71J019P34
3698A497j818J87J258n58o17N73L83p84R54M23j283n0J278m59r99R95J92r41O88
$$ plain form
3717 919 1702 530 184 1775 1213 32 1092 1361 563 748 1204 -127 196 1518 493 -90 735 1180
3735 1180 -33 371 723 90 -108 1031 707 -623 581 909 -231 -300 538 -364 -201 556 -287 -1052
3753 -1052 -56 669 -884 -941 456 -582 -875 -1 -597 -1698 -377 -15 -1208 -1091 -103 -385 -1179 -342
3771 -342 -409 -1504 -505 33 -1246 -1419 -180 -721 -1282 -614 -840 -1280 -839 -423 -1567 -1311 -86 -606 -1525
3790 -1525 -641 -375 -1412 -766 -446 -1349 -1043 117 -487 -1469 -356 -4 -538 -667 27 -524 -558 518 5
3809 5 -1053 303 315 -237 42 787 -252 -42 945 506 -426 678 1128 86 30 1109 359 50 1199
3828 1199 572 86 966 1494 125 160 1584 849 87 1131 1026 277 1296 1132 423 113 1687 994
3846 994 257 954 983 495 1205 1458 433 413 1708 1175 -44 1120 858 217 549 864 -47 -81 1171
$$ packed form
3717I19P83j172l46J591n62j181J060K69p98J85M56j331L23J322j025n83Q25M45
3735A180j213M04L52o33j98J139l24j330J204L28j140o9Q38r02J63P57q43p65
3753a052R96P25j553n7J397j038k93Q74n96j101J321L62j193J17R88k82p94Q37
3771c42o7j095R99N38j279j73J239n41n61O68k26m40M41M16j144K56J225n20r19
3790a525Q84K66j037O46L20r03L06J160o04r82J113L52n34j29O94n51l4J076n13
3809Ej058J356J2n52K79P45j039K10R87m39r32J104M50j042n6J079p50l09J149
3828A199o27m86Q80N28j369L5J424p35p62J044j05p49J019j64p09l10J574o93
3846I94p37O97K9m88P10K53j025k0J295n33j219J164k62o41L32L15r11l4J252
$$ plain form
3865 1171 382 -365 243 778 149 206 529 -34 -603 622 -92 -777 -135 316 -458 -812 349 -448 -415 388
3885 388 -40 -944 -467 677 -942 -1006 -43 -424 -843 -52 -592 -1628 -505 11 -912 -1238 -289 -653 -981
3904 -981 -573 -727 -1594 -583 -381 -1632 -1264 -571 -563 -1307 -636 -602 -1482 -476 -44 -974 -1261 61 -254 -1058
3924 -1058 -402 68 -977 -542 339 -745 -890 503 202 -751 -192 43 -382 -459 562 -149 -148 838 180
3943 180 -522 206 707 -110 -116 883 -338 -91 1010 452 -126 502 890 49 51 794 709 207 1369 840 -180
3964 -180 788 1544 275 242 1113 844 369 1036 970 106 1052 1506 349 82 1005 819 -154 615 1009 29
3984 29 469 805 -85 286 1171 465 -202 560 778 30 377 1001 -153 -372 890 410 -581 430 671
4003 671 -123 -257 340 -410 -642 564 174 -590 -158 322 -359 -443 158 -405 -540 234 -338 -1182 -635 335
$$ packed form
3865A171p89p47O08N35o29N7L23n63n69J225p14o85O42M51p74l54J161p97L3Q03
3885C88m28r04M77J144j619o4R63l81m19P91n40j036J123N16r23l26R49l64l28
3904i81M08j54q67J011K02j251L68O93Qp44O71L4q80J006M32r30k87J322l15q04
3924a058O56M70j045M35Q81j084j45J393l01r53N59K35m25p7J021p11JR86o58
3943A80p02P28N01q17oR99j221K47J101n58n78O28L88q41KP43q5n02J162n29j020
3964a80R68P56j269l3Q71k69m75O67o6q64R46M54j157k67R23j86r73P69L94r80
3984B9M40L36q90L71Q85p06o67P62K18p48L47O24j154k19J262m80r91J011K41
4003F71p94j34N97p50k32J206l90p64M32M80o81q4O01n63j35P74n72q44N47R70
$$ plain form
4023 335 -753 -732 -96 -803 -1072 -113 -149 -1271 -447 -124 -1111 -1349 -174 -673 -1178 -188 -363 -1214 -219 165
4043 165 -949 -994 -252 -692 -1147 -290 -92 -650 -312 308 -960 -1148 177 -39 -918 -235 446 -353 -307 386
4063 386 -523 -805 418 195 -1008 -90 324 -198 -158 750 163 -400 985 592 -380 443 773 -22 158
4082 158 724 76 17 1083 941 -63 233 1253 188 391 1142 330 236 1002 821 -21 967 1178 340
4101 340 476 1042 832 311 1084 904 42 767 1209 76 -47 1061 741 367 481 783 -290 383 1075
4120 1075 24 -204 915 576 -398 438 705 -192 437 485 -594 -301 306 396 -898 50 489 -789 -94
4139 -94 399 -411 -609 77 -127 -917 -272 47 -719 -548 -103 -380 -814 -308 -428 -1508 -356 121 -744 -866
4159 -866 -300 -852 -1102 -16 -240 -1070 -459 19 -1022 -1326 -469 -734 -1022 -515 -181 -1273 -301 -33 -844
$$ packed form
4023C35j088K1O36p07k69R59l6j122Q24L23r87k38J175m99n05R90j75q51R95L84
4043A65j114m5P42m40m55Q57J98n58L38O20j268j88J325k16q79O83O81p99M6O93
4063C86r09k82J223k23j203R18M14n22M0R08n87n63J385l93r72Q23L30p95J80
4082A58N66o48n9J066j42j004K96J020j065K03P51q12r4P66j81q42R88K11q38
4101C40J36N66k10n21P73j80q62P25M42j133j23J108l20l74J14L02j073O73O92
4120A075j051k28J119l39r74Q36K67q97O29M8j079K93O07R0j294R48M39j278O95
4139i4M93q10j98O86k04p90O45L19p66J71M45k77m34N06j20j080J152M77q65j22
4159h66N66n52k50J086k24q30O11M78j041l04Q57k65k88N07L34j092R72K68q11
$$ plain form
4178 -844 -930 75 -136 -1105 -239 -176 -704 -188 239 -385 -595 444 239 -810 349 241 -427 52 651
4197 651 -465 -194 916 502 -361 220 773 212 78 638 -21 182 901 927 -472 297 939 271 307 878
4217 878 364 141 982 952 -295 592 1118 299 327 1120 634 401 1451 849 45 526 1253 483 -16 981
4237 981 790 90 485 508 -214 447 1084 163 19 855 429 -161 791 464 -393 313 530 -440 -632 396
4257 396 239 -606 -53 318 -553 -404 495 -486 -705 316 50 -823 -437 232 -745 -390 5 -564 -994 -54
4277 -54 -192 -779 -316 -131 -1048 -754 -123 -702 -1153 144 -496 -1163 -619 253 -1083 -974 -39 -533 -582 -105
4297 -105 -408 -1328 -432 50 -747 -1128 -239 -525 -1081 -502 -271 -914 -293 347 -242 -992 233 119 -638 -241
4317 -241 533 -795 -154 679 -191 -653 301 296 -259 120 274 -78 -161 888 -9 -362 635 641 -192 271 552
$$ packed form
4178h44q6J005k11r69Q66O3n28N16M27o24k10J039k05j049J159j08o68M79N99
4197F51j116K71J110m14q63N81N53n61j34N60o59K03P19K6j399P69O42o68L6N71
4217H78n14k23Q41l0j247Q87N26q19K8P93m86k33J050o02q04M81P27p70m99R97
4237I81j91p00L95K3p22O61O37r21j44Q36m26n90R52l27q57P06K17r70j92J028
4257C96j57q45N53L71q71J49Q99r81k19J021k66q73L86O69r77L55L95n69m30R40
4277e4j38n87M63J85r17K94O31n79m51J297o40o67N44Q72j336J09R35m94m9M77
4297a05l03r20Q96M82p97l81Q89k86n56N79K31o43O21O40n89p50J225j14p57L97
4317b41P74j328O41Q33q70m62R54nn55L79J54l52q3J049q97l53R97Oq33M63K81
$$ plain form
4338 552 -178 318 938 346 -108 949 1175 143 396 1077 280 107 1006 530 147 880 1098 -50 460
4357 460 1259 495 323 916 624 146 1159 813 -94 342 1200 379 -147 842 535 90 744 816 -63 432
4377 432 762 121 -95 486 459 -356 264 383 -302 -92 553 31 -508 69 209 -466 51 70 -724 -357 302
4398 302 -205 -714 90 -219 -744 91 197 -557 -705 50 -500 -686 -69 -6 -1158 -665 83 -729 -668 -220
4418 -220 -507 -926 -316 -370 -1135 -588 180 -683 -795 -308 -818 -1079 -349 -298 -998 -373 43 -659 -960 -125 -195
4439 -195 -642 134 -9 -660 -321 118 -655 -658 117 -19 -633 236 327 -758 -18 551 -154 -478 614 125
4459 125 -476 -164 474 -5 -87 576 -21 -364 221 571 -214 593 763 82 586 991 321 79 898 946 182
4480 182 711 1146 427 304 1108 643 338 1325 1051 43 654 960 483 188 1127 644 139 877 968 168
$$ packed form
4338E52p30M96O20n92m54J057K26j032K53O81p97j73Q99m76l83P33K18j148N10
4357D60P99p64j72N93k92m78J013l46r07M36Q58q21n26R89l07m45O54P2q79M95
4377D32L30o41k16N81k7q15O20J19o85K10O45n22n39N77J40o75N17J9p94L67O59
4398C02n07n09Q04l09n25Q35J06p54j48P55n50j86O17O3j152M93P48q12O1M48
4418b20k87m19O10n4p65N47P68q63j12M87n10k61P30N1p00O25M16p02l01Q35p0
4439a95m47P76j43o51L39M39p73lP75j36o14Q69R1j085P40N69p05l24J092m89
4459A25o01L12O38m79q2O63n97l43N85L50p85Q07J70o81N04M05o70k42Q19M8p64
4480A82N29M35p19j23Q04m65l05R87k74j008O11L06m77k95R39m83n05P38R1q00
$$ plain form
4500 168 339 1023 507 -25 733 275 168 596 335 -396 48 981 385 -96 637 88 -304 682 479 -350
4520 -350 -209 943 -207 -305 170 250 -597 38 121 -561 86 211 -528 -818 -110 106 -628 -842 -163 -720
4540 -720 -545 -124 -911 -891 -82 -367 -991 -724 -327 -411 -711 -148 -937 -1191 -98 -285 -1093 -624 15 -406
4560 -406 -696 -427 -798 -1015 -176 -69 -921 -384 -139 -470 -431 198 -204 -814 -165 -261 -713 -250 99 -478 -361
4581 -361 113 235 -366 -180 191 -696 151 523 -28 -262 743 245 -297 153 594 -290 198 687 415 -33
4601 -33 784 866 -8 449 691 369 374 919 475 -192 984 688 110 371 984 260 411 1129 698 217 977
4622 977 1002 163 313 911 471 261 906 385 113 828 744 17 169 537 206 124 649 289 119 379 225
4643 225 -379 186 767 68 -241 507 -50 -191 97 208 -194 -155 416 -449 -449 -107 435 -715 -38 -180 -832
$$ packed form
4500A68J71O84n16n32P58m58j07M28k61p31M44R33n96m81P33n49l92R86k03q29
4520c50J41J152j150r8M75Q0q47O35Q3o82O47J25p39k90P08K16p34k14O79n57
4540g20J75M21p87K0Q09k85o24K67L97q4l00N63p89k54J093j87q08M69O39m21
4560d06k90K69l71k17Q39J07q52N37K45l31L9O29m02o10O49r6m52M63L49n77J17
4581c61M74J22o01J86L71q87Q47L72n51k34J005m98n42M50M41q84M88M89k72m48
4601c3Q17Q2q74M57K42l22NN45m44o67J176k96n78K61O13p24J51P18m31m81P60
4622I77K5q39J50N98m40k10O45n21k72P15q4p27J52L68l31q2N25l60j70K60j54
4643B25o04N65N81o99l09P48n57j41K88J11m02L9N71q65%L42N42j150O77j42o52
$$ plain form
4664 -832 -279 102 -907 -991 97 -294 -1016 -358 -282 -831 -671 -151 -556 -1286 -166 -194 -1039 -829 -199 -1040
4684 -1040 -958 -195 -896 -974 -245 -47 -901 -581 -548 -642 -687 32 -394 -776 36 220 -905 -404 88 -473 -645
4705 -645 -141 89 -362 -10 224 -293 -52 649 -34 -161 142 142 -446 439 351 -481 8 723 204 -305 436
4726 436 515 338 803 621 -216 432 972 348 -66 835 637 387 571 559 133 464 814 382 61 540 506
4747 506 185 254 706 283 372 1047 263 226 669 940 93 228 728 217 256 830 -61 72 625 596 -210 -114
4769 -114 843 152 -185 417 346 -221 446 357 -412 -230 281 -147 -289 93 135 -574 252 143 -211 -394 430
4790 430 -126 -635 -126 -462 -698 -422 49 -1001 -579 283 -711 -1183 -213 -406 -1003 -651 63 -757 -745 -185
4810 -185 -635 -1110 -602 96 -972 -508 -285 -456 -722 -185 -187 -1022 -69 15 -428 -698 -10 -427 -165 213 -376
$$ packed form
4664h32N53L81j009q4J088l91p22O58P6n49J60N20m05p30J120k8q45K10O30q41
4684a040Q2P63p01p8P29J98q54L20L3r4m5P19m26l82Q12J84j125N01M92n61j72
4705f45N04K30m51L52K34n17K41P01o83j27L03%n88Q85q8q32M89P15n19n09P41
4726D36P9j77M65j82q37O48N40o24m14R01j98k50J84j2m26L31L50m32l21M79l4
4747E06l21O9M52m23Q9O75p84l7M43K71q47J35N00n11L9N74q91J33N53k9q06R6
4769a14R57o91l37O02p1n67O67q9p69J82N11m28j42L82M2p09Q26j09l54j83Q24
4790D30n56n09N09l36k36K76M71j050M22Q62r94m72R70j93n97L52P14q20J2N60
4810a85m50m75N08O98j068M64K23j71k66N37kq35R53Q4m43k70O88m17K62L78n89
$$ plain form
4831 -376 -888 7 325 -292 -468 122 -465 -256 201 45 -248 -19 491 -281 -151 100 -239 -203 446 368 -536
4852 -536 410 542 -527 246 707 199 88 676 440 151 461 662 0 -78 674 494 -136 442 797 258
4872 258 518 949 165 16 521 189 228 522 731 43 340 707 -28 356 781 296 -412 374 578 168
4892 168 121 533 89 229 399 32 -61 322 274 -270 33 324 -154 -406 431 185 -558 96 269 -833 -352
4913 -352 533 -142 -509 177 -263 -500 -273 -160 -650 -434 -135 -289 -519 -66 -69 -828 -243 -78 -705 -738 -310
4934 -310 -599 -841 -211 -31 -802 -713 -388 -371 -641 -118 -342 -776 -417 -249 -599 -754 -255 -859 -566 -96 -218
4955 -218 -879 -352 -15 -542 -565 -110 -543 -428 14 -143 -529 -451 290 -346 -177 238 -161 -181 536 93 -541
4976 -541 441 753 -258 -54 591 -50 -44 542 552 -209 287 567 -293 289 820 144 -26 536 585 182 567
$$ packed form
4831c76n12Q95L18o17j76N90n87K09M57j56k93K29N10p72J30K51l39L6O49p8r04
4852e36R46J32j069P73M61n08j11N88k36k89L10K01o62p8P52j80o30N78L55n39
4872B58K60M31p84j49N05l32L9K94K09o88K97L67p35L84M25m85p08P86K04m10
4892A68m7M12m44J40J70l67r3L83m8n44L03K91m78k52Q37k46p43O54J73j102M81
4913c52Q85o75l67O86m40k37K27J13m90K16K99j54k30M53lp59N85J65o27l3M28
4934c10k89k42O30J80p71Q9L25J7k70N23k24m34L59J68l50j55M99o04K93M70j22
4955b18o61N27L37n27k3M55m33J15M42j57l86P8P41o36J69M15l99k0P17m43o34
4976e41R82L12j011K04O45o41ON86J0p61M96K80q60N82N31o76j70N62M9m03L85
$$ plain form
4997 567 724 54 56 878 287 2 270 1073 179 627 791 353 466 938 398 -79 944 330 265 463 694
5018 694 207 208 773 417 138 470 622 10 390 710 -147 154 477 173 -287 353 782 -78 -150 16 -70
5039 -70 -167 322 -257 -525 -79 160 -212 -94 -82 -337 -583 -368 -253 -525 -211 -95 -515 -648 -65 -569 -599
5060 -599 -315 -467 -939 -74 -8 -765 -1002 -215 -413 -549 -78 -390 -776 -676 -172 -707 -671 272 -590 -612 -328
5081 -328 -155 -508 -217 214 -255 -358 262 -259 -610 -132 -30 -233 -72 251 124 -408 -66 41 -612 211
5101 211 675 -224 -97 501 74 -400 218 395 -298 158 404 -41 168 767 392 -244 675 511 239 691
5121 691 396 99 376 495 364 -2 593 720 50 677 497 157 217 769 318 240 636 392 58 255 919
5142 919 414 78 807 333 52 550 456 272 247 464 260 28 530 555 -387 98 562 -245 -28 271 -124
$$ packed form
4997E67J57o70KQ22n91k85K68Q03q94M48J64m38J13M72n40m77J023o14o5J98K31
5018F94m87JN65l56k79L32J52o12L80L20q57L01L23l04m60O40M29q60p2J66q6
5039g0r7M89n79k68M46K39l72J18J2k55k46K15J15k72L14J16m20j33N83n04l0
5060e99K84j52m72Q65O6p57k37P87j98j36M71l12l86J00N04n35L6R43q62k2K84
5081c28J73l53K91M31m69j03O20n21l51M78J02k03J61L23j27n32L42J07o53Q23
5101B11M64q99J27N98m27m74O18J77o93M56K46m45K09N99l75o36R19j64k72M52
5121F91k95k97K77J19j31l66N95J27o70O27j80l40O0N52m51p8L96k44l34J97O64
5142I19n05l36P29m74k81M98r4j84k5K17k04k32N02K5r42M85M64q07K17K99l95
$$ plain form
5163 -124 54 253 -227 -341 -25 279 -482 -366 170 -312 -588 262 -115 -610 -274 -191 -597 -285 131 -533
5183 -533 -654 -93 -498 -649 10 86 -722 -615 -10 -443 -753 -49 -22 -587 -283 -19 -750 -626 -262 -227 -715
5204 -715 -154 -283 -418 -419 -357 -600 -518 -30 -80 -767 -220 -111 -377 -273 53 -417 -357 231 -191 -451 62 157
5226 157 -382 -334 367 -157 -311 286 -59 -44 143 378 19 -15 518 144 109 434 303 -48 488 244 -153
5247 -153 207 440 425 118 531 486 67 377 364 306 18 666 94 125 520 827 8 664 323 184 -64 599
5269 599 349 256 382 678 89 392 351 214 91 587 685 134 375 454 -7 55 412 119 71 622 177 -170
5291 -170 218 198 -225 51 343 1 -462 308 -380 -687 -155 -72 -519 -324 -270 -451 -580 -328 -161 -787 -245
5312 -245 -307 -259 -387 -158 -437 -191 -266 -488 -826 -671 -158 -608 -269 -102 -249 -709 -301 -206 -625 -499 -214
$$ packed form
5163a24J78J99m80j14L16L04p61J16N36m82k76Q50l77m95L36Q3m06L12M16o64
5183e33j21N61m05j51O59P6q08J07O05m33l10P04K7n65L04K64p31J24L64L5m88
5204g15N61j29j35jO2k43Q2M88n0o87N47J09k66J04L26m70O0N88m22k60N13R5
5226A57n39M8P01n24j54N97l45J5J87K35l59l4N33l74l5L25j31l51N36k44l97
5247a53L60K33j5l07M13m5m19L10j3n8k88O48n72L1L95L07q19O56l41j39k48O63
5269E99k50r3J26K96n89L03m1j37j23M96R8n51K41P9m61O2L57k93m8N51m45l47
5291a70L88k0m23K76K92l42m63P70o88l07N32Q3m47J95N4j81j29K52J67o26N42
5312b45o2M8j28K29k79K46p5k22l38J55N13m50L39J67j47m60M08R5m19J26K85
$$ plain form
5333 -214 -518 -747 -85 -244 -482 -135 -244 -301 -498 -99 -385 -627 280 198 -285 152 108 -720 -190 219 -268
5354 -268 -151 211 103 -587 68 353 -343 3 292 -140 -60 -11 69 35 134 560 67 385 476 138 10 578
5376 578 477 -104 339 383 208 45 396 327 214 675 550 179 526 633 417 351 357 563 -68 470 480 192
5398 192 726 446 176 65 376 208 -49 491 380 -83 225 383 122 82 457 353 -161 199 226 -115 212
5419 212 468 98 -325 189 270 -258 183 -186 -134 -94 -114 -229 -294 212 196 -341 -215 132 -62 -391 -43 -478
5441 -478 -512 -119 -181 -528 -259 -214 -503 -268 -282 -400 -851 -164 -253 -670 -612 -433 -405 -626 -244 -282 -905 -356 -346
5464 -346 -794 -253 -311 -552 -454 -81 -230 -399 -204 109 -381 -422 175 -367 -226 -77 -565 -428 277 255 53
5485 53 -17 333 92 -216 252 -132 -64 292 292 -50 134 276 -48 -32 510 253 -116 451 232 400 218 577
$$ packed form
5333b14l04k29O62j59k38L47j09n7j97L99k86k42R07q2m83M37m4q28N30M09m87
5354b68J17L62j08o90O55K85o96L46K89m32Q0M9Q0l4R9M26m93L18R1l38j28N68
5376E78j01n81M43M4j75j63L51o9j13M61j25l71L47J07k16o6OK06o31N38J0k88
5398A92N34k80k70j11L11j68k57N40j11m63L08J58k61m0L75j04n14L60K7l41L27
5419B12K56l70m23N14Q1n28M41l69N2M0k0j15o5N06j6n37J26L47j94l29L48m35
5441d78l4L93o2l47K69M5k89K35j4j18m51O87q9m17N8J79K8k21L82l8o23N49J0
5464c46m48N41n8k41R8L73j49j69J95L13m90m1N97n42J41J49m88J37P05k2k02
5485E3p0L50k41l08M68l84O8L56%l42J84J42l24J6N42k57l69N67k19J68j82L59
$$ plain form
5507 577 122 -150 151 684 -48 -43 467 311 285 696 240 361 434 453 116 103 371 303 265 435 522 398 248
5530 248 591 -104 77 708 -120 386 721 337 -303 234 262 -231 71 433 113 -42 254 17 -323 205
5550 205 47 -3 -160 168 -308 -173 370 -114 -531 196 16 -302 -306 74 -191 -563 -178 -169 -454 -100 -303 -563
5572 -563 -141 -87 -568 -350 -203 -365 -579 -392 -47 -530 -503 -175 -519 -720 -107 -165 -476 -358 -340 -634 -342
5593 -342 -241 -266 -510 -483 -131 -523 -267 -116 -222 -372 67 -305 -218 -33 -52 -317 -329 300 -60 -349 179 -27
5615 -27 -177 -69 116 -91 -14 410 178 77 319 459 54 -300 11 194 433 492 246 -42 281 586 -74
5636 -74 372 516 114 173 608 315 123 452 232 -32 523 390 304 141 454 -22 532 456 593 1 216
5657 216 404 270 497 198 177 -106 212 460 -115 315 533 266 0 437 113 -102 473 487 -67 174 513
$$ packed form
5507E77m55k72L01N33p32NN10j56k6M11m56J21P3J9l37j3K68o8l8J70Q7j24j50
5530B48L43o95J81O31q28N06L35l84o40N37K8m93L02L62l20j55K96k37l40N28
5550B05j58n0j57L28m76J35N43m84m17P27j80l18mL80k65l72L85Rk85L54k03k60
5572e63M22N4m81K18J47j62k14J87L45m83K7L28l44k01O13n8l11J18J8k94K92
5593c42J01k5k44K7L52l92K56J51j06j50M39l72Q7J85j9k65j2O29l60k89N28k06
5615b7j50J08J85k07P7M24k32j01K42J40m05l54L11J83K39N9k46k88L23L05o60
5636g4M46J44m02N9M35k93j92L29k20k64N55j33q6j63L13m76N54p6J37n92K15
5657B16J88j34K27k99k1k83L18K48n75M30K18k67k66M37l24k15N75J4n54K41L39
$$ plain form
5678 513 -32 -232 -44 135 -482 90 280 -484 -363 316 54 -465 18 -49 -122 -103 3 -688 -182 -99 -267
5699 -267 -429 -29 -46 -588 -173 -34 -297 -300 251 -366 -465 -219 -171 -408 -163 -50 -441 -744 50 62 -769 -274
5721 -274 -504 -372 -237 107 -406 -399 25 -164 -550 -159 -32 -596 -160 -181 -251 -208 -4 -443 -186 -295 198 -329
5743 -329 -5 168 -132 -97 345 408 -138 -92 246 142 -69 353 -41 43 877 327 -425 611 345 231 -2
5764 -2 520 309 238 745 207 147 453 578 -17 193 429 388 332 495 451 350 527 626 291 134 655 439 348
5787 348 443 261 128 245 264 323 -64 290 425 58 367 254 126 185 403 102 -230 217 -49 -176 -7
5808 -7 359 26 -16 12 -217 -319 -26 -140 -327 -57 228 -326 -282 -29 -163 -570 -156 20 -327 -142 42 -503
5830 -503 -427 38 -465 -492 -122 -110 -574 -463 -105 -254 -382 125 -506 -493 -519 -358 -757 -166 -330 -429 -149 -53
$$ packed form
5678E13n45k00J88J79o17N72J90p64J21O79k62n19M83o7p3J9J06o91N06Q3j68
5699b67j62M00j7n42M15J39k63lN51o17r9K46M8k37K45J13l91l03P94J2q31M95
5721b74k30J32J35L44n13PM24j89l86L91J27n64M36k1p0M3K04m39K57j09M93n27
5743c29L24J73l00L5M42O3n46M6L38j04k11M22l94Q4Q34n50p52J036k66j14k33
5764bN22k11p1N07n38o0L06J25n95K10K36m1n6J63m4j01J77R9l35j57N21k16r1
5787C48R5j82j33J17J9N9l87L54J35l67L09j13j28N9K18l01l32M47k66j27J69
5808gL66l33m2K8k29j02K93j14j87K70K85n54M4K53j34m07M14J76l47J85J84n45
5830e03P6M65n03k7L70J2m64J11L58j49j28N07o31J3k6J61l99N91j64r9K80R6
$$ plain form
5852 -53 -181 -272 -247 86 -372 -188 -186 -302 -196 200 -277 -178 -133 -137 -212 -117 212 -208 -190 158 3 -127 3 90
5876 90 95 95 124 11 -122 71 -19 -121 -104 104 -116 139 436 93 181 201 569 122 511 521 -104 22 673 180
5900 180 90 653 258 74 -22 590 348 -209 725 406 195 462 629 271 151 525 69 110 655 468 96
5921 96 479 279 -191 -36 337 373 23 274 236 -148 499 473 -158 -84 446 -28 -64 173 133 -66 6 81 -279
5944 -279 -268 63 -57 -350 197 -3 -289 -88 -52 -118 -313 195 -113 -384 -87 -91 -514 -439 -10 -583 -522 -140
5966 -140 -365 -442 -190 -410 -495 -307 -27 -384 -236 -380 -188 -542 -228 -112 -405 -157 -169 -233 -217 -156 -33 -541
5988 -541 -54 -164 -170 -79 -97 -63 -169 168 -37 -301 138 304 -148 -17 103 -176 -281 -70 112 -288 19 142
6010 142 -106 -78 423 236 117 319 -137 -29 200 651 137 -45 687 87 98 170 390 367 248 394 -149
$$ packed form
5852e3j28r1K5L33m58J84Kj16J06L96m77R9M5mp5R5L29m20J8L48j55j30J30Q7
5876I0N%K9j13j33J93r0j02J7K08k20K55K97l43Q8K0L68m47L89J0o25J26O51m93
5900A80r0N63l95j84r6O12k42n57R34l19k11K67J67l58j20L74m56M1N45j87l72
5921I6L83k00m70J55L73L6l50K51l8l84O47k6o31P4N30m74l6K37m0j99P2P5l60
5944b79J1L31j20k93N47k00k86K01L6o6j95N08l08k71K97mm23P5M29n73O1L82
5966a40k25p7K52k20q5J88K80l57J48j44J92l54L14J16k93K48j2o4J6O1J23n08
5988e41M87j10oR1j8L4j06L37k05k64M39J66m52J31J20k79j05K11J82m00L07J23
6010A42k48K8N01j87j19K02m56J08K29M51n14j82P32o00J1P2K20k3j19J46n43
$$ plain form
6031 -149 82 483 133 -20 241 369 453 242 217 373 252 212 -110 31 356 297 118 200 315 134 -107 381
6053 381 428 -28 329 492 -354 164 42 -366 119 278 31 -121 -147 40 148 -196 10 -128 36 90 -66
6074 -66 -157 -2 364 -21 -91 -69 83 -570 -157 -77 -326 60 -74 -571 -542 -54 -269 -331 -245 -151 -557 -384 -205
6097 -205 -571 -537 -121 -629 -635 -257 168 -382 -542 -388 -172 -676 -180 -481 -312 -180 -99 -582 66 -100 -435
6118 -435 -287 -165 -101 -409 -50 33 -50 41 159 60 -440 354 -147 -94 18 89 -45 72 313 255 -87 164 131
6141 131 -161 -212 446 -64 182 427 13 8 365 138 22 287 153 590 247 135 173 168 167 221 113 270 399
6164 399 356 146 527 104 8 416 678 -85 100 437 100 0 238 462 68 163 189 48 161 433 75
6185 75 -199 200 390 -16 2 231 -98 -100 219 -51 62 151 39 -155 -79 79 -150 -63 249 -79 -194 133
$$ packed form
6031a49K31M01l50j53K61J28Q4k11k5J56j21m0l22J41L25n9j79Q2J15j81k41M88
6053C81M7m56L57J63q46N18j22m08M85J59k47j52k6J87J08l44K06j38J64N4j56
6074f6r1J55L66l85p0K2J52o53M13Q0k49L86j34m97K9M88k15o2Q6R4m06J73J79
6097b05l66L4M16n08oL78M25n50j60J54K16n04M96l01J69J32Q1m83O48j66l35
6118d35J48J22O4l08L59Q3q3R1J18r9n00P94n01N3J12P1j34J17K41n8l42K51l3
6141A31k92n1O58n10K46K45m14nL57k27j16K65j34M37l43j12L8njN4j08J57J29
6164C99m3k10L81m23r6M08K62p63J85L37l37j00K38K24l94R5K6j41J13K72l58
6185G5k74L99J90m06J8K29l29kL19k70J13Q9j12j94P6J58k29Q7L12l28j15L27
$$ plain form
6207 133 88 -184 -253 -62 -414 -520 -11 -246 -305 -218 -6 -319 -99 -242 -452 -348 -49 -363 -508 -164 -102 -283
6229 -283 -372 -92 -398 -623 -243 -434 -92 -270 -279 0 -226 -421 -259 -238 -161 -293 -360 38 -18 -455 -251 -134
6251 -134 -290 -248 -166 -415 -246 56 -42 -235 -33 -124 333 -62 261 -33 -66 88 199 -235 91 274 -163 -26
6273 -26 -108 247 -381 67 328 -109 205 190 620 11 400 421 163 178 363 335 -76 330 279 505 354 340 75
6296 75 620 379 525 259 270 178 -14 466 397 -28 219 458 233 58 260 395 -123 283 258 -227 41 -51
6318 -51 120 -18 109 -129 57 306 227 -173 -103 174 37 -225 -42 239 -253 -66 -26 32 -222 55 -8 -398
6340 -398 -12 -346 -485 -496 -205 -441 -488 -286 60 -367 -69 -57 -324 -124 -74 -517 -356 -285 -367 -322 -255 -172 -530
6363 -530 -609 -262 -213 -420 -306 -88 -377 18 -320 -182 -35 -138 -239 -315 -282 -84 -297 159 -8 -506 -5
$$ packed form
6207A33m5k72o9J91l52j06N09k35n9Q7K12l13K20j43k10J04K99l14j45L44O2j81
6229b83q9K80l06k25L80j91L42j78rK79k26j95J62K1P7j32o7L98n6m37K04J17
6251a34j56M2Q2k49J69L02r8j93K02r1M57l95L23k94l3J54J11m34L26J83m37J37
6273b6q2L55o28M48K61m37L14j5M30o09L89K1k58J5J85k8m11M06n1K26j51j4k65
6296G5N45k41J46k66J1r2j92M80o9m25K47K39k25j75K02J35n18M06k5m85K68r2
6318e1J71j38J27k38J86K49p9m00P0K77j37k62J83K81m92J87M0N8k54K77o3l90
6340c98L86l34j39j1K91k36m7K02L46m27K98J2k67K00N0m43J61P1q2M5O7Q3l58
6363e30p9L47M9k07J14K18k89L95l38J38J47j03j01p6L3J98k13M56j67m98N01
$$ plain form
6384 -5 107 -84 -429 35 -196 2 -105 103 -156 93 10 286 -67 153 -64 50 -42 254 79 48 236 332
6406 332 -83 116 177 184 377 412 69 11 404 256 152 611 248 139 416 451 578 419 487 1 70 544 205
6429 205 -120 -74 283 121 316 563 109 -187 230 226 233 53 211 -9 86 443 183 80 27 228 -236 199
6451 199 213 -234 196 18 154 -100 52 247 -217 18 140 -111 -190 -65 -82 -284 -406 3 -36 -307 -146
6472 -146 -418 -487 -425 -274 -304 28 -179 -331 -362 103 -37 -333 -381 -235 -70 -226 -109 -236 -479 -206 -288 -335
6494 -335 101 1 -267 -388 79 -201 -313 -10 -91 -261 -149 -15 166 -14 5 -131 -65 142 -207 -211 -187 69
6516 69 -130 -48 366 11 -45 -32 -176 -32 68 413 45 163 111 -3 270 449 51 172 87 281 155 -211
6538 -211 -6 72 37 546 404 44 -27 232 -12 -166 354 67 39 342 675 346 432 609 -79 61 344 362
$$ packed form
6384eJ12j91l45M64k31J98j07K08k59K49q3K76l53K20k17J14r2K96j75l1J88R6
6406C32m15J99O1PJ93L5l43n8L93j48j04M59l63j09K77L5J27j59O8m86O9M74l39
6429B05l25M6L57j62J95K47m54k96M17mPj80J58k20R5L57k60j03n3K01m64M35
6451A99J4m47M30j78J36k54J52J95m64K35J22k51p9J25j7k02j22M09l9k71J61
6472a46k72o9O2J51l0L32k07j52l1M65j40k96m8J46J65j56J17j27k43K73q2m7
6494c35M36j00k68j21M67k80j12L03q1j70J12J34J81j80J9j36O6K07l49mK4K56
6516F9j99Q2M14l55n6J3j44J44J00L45l68J18n2j14K73J79l98J21q5J94j26l66
6538b11K05P8l5N09j42l60p1K59k44j54N20k87k8L03L33l29Q6J77o88J40K83J8
$$ plain form
6560 362 207 113 220 17 -21 103 24 -74 427 146 -46 155 28 454 231 92 51 31 190 249 104 15 205
6583 205 -146 83 230 -168 21 171 12 -178 28 -169 -85 52 150 -130 -185 -53 -75 -386 -4 -35 -245 -89
6605 -89 -70 -135 -30 -94 -150 -268 -9 -30 -390 -63 -165 -68 -319 -241 -130 -485 -53 -94 -450 -381 -179 -139 -464 -253
6629 -253 -71 -399 -150 -92 -207 -372 233 169 -144 -269 -72 -61 -51 -80 110 -216 -254 -276 -231 18 -101 221 -79
6652 -79 119 266 74 305 155 -275 236 405 91 -212 243 215 -23 200 210 185 215 183 48 -29 436 341 177
6675 177 263 418 -120 -23 263 322 234 220 226 146 256 295 192 261 302 373 -48 38 487 168 80 53 131 257 41
6700 41 238 94 245 12 -381 282 110 93 -102 181 -40 -245 161 -29 68 -132 148 -156 -322 -35 -118
6721 -118 29 7 -84 -84 -230 -224 -276 -286 -97 0 -343 -247 -22 -231 -70 45 67 -351 -110 13 -386 -147 -106 -237
$$ packed form
6560C62j55r4J07k03l8J24p9r8N01k81j92K01j27M26k23j39m1k0J59N9j45q9J90
6583B05l51K29J47l98J89J50j59j90K06j97Q4J37R8k80n5J32k2l11L82l1k10J56
6605h9J9o5J05o4n6j18K59k1l60L27j02R7k51P8J11l55M32m1l56O9K02M0l25K11
6629b53J82l28K49N8j15j65O05o4l13j25J97J1J0k9J90l26l8k2M5K49j19L22l00
6652g9J98J47j92K31j50m30N11J69l14l03M55k8k38K23J0k5L0l2j35p7M65r5j64
6675A77Q6J55n38R7K86N9q8j4Oq0J10L9j03O9M1P1m21Q6M49l19q8k7P8J26k16
6700D1J97j44J51k33l93O63j72j7j95K83k21k05M06j90R7k00K80l04j66K87q3
6721a18J47k2r1%j46On2j0J89R7l43R6K25k09J61J15K2m18K41J23l99K39M1j31
$$ plain form
6745 -237 -51 -13 -340 -237 -440 -243 -175 -196 201 -576 -355 -221 -206 -693 -272 -213 -421 -348 -53 -119 -292 -6
6767 -6 2 -22 80 -164 -283 55 67 123 74 -198 -60 -202 67 98 150 -67 203 -238 -161 354 -54 -168 184 73
6791 73 190 10 -73 112 57 309 259 83 354 -23 170 -129 395 127 408 376 234 98 541 519 -102 193
6813 193 224 -51 68 533 154 71 -110 356 -21 -94 302 283 43 206 -26 2 330 301 -4 402 519 63
6835 63 -129 112 -73 176 383 185 -246 -58 13 -140 -127 90 13 -255 79 -40 -69 260 136 19 -353 149
6857 149 -167 -94 -243 -118 -445 -286 -9 -400 -272 176 -106 -73 -77 -145 -358 -149 93 -90 -227 155 -39 -277
6879 -277 -563 -243 -30 -449 -236 -345 -361 196 -182 -116 -229 -190 -98 -192 -82 -334 2 -209 278 -407 148 -64
6901 -64 -372 -203 -346 -6 -279 -47 35 -21 157 143 -252 -110 194 151 -110 362 -122 7 -120 -4 104 238
$$ packed form
6745b37J86L8l27J03k03J97O8k1L97p77K21J34J5m87M21N9k08P3K95o6j73K86
6767fQk4J02k44j19L38J2N6m9k72J38j42K69L1N2k17K70m41P7N15m08j14L52j11
6791G3J17j80q3J85n5K52n0j76K71l77J93k99N24k68K81l2j42j36M43k2o21K95
6813A93L1k75J19M65l79q3j81M66l77p3L96j9k40J63k32K8L28k9l05M06J17m56
6835F3j92K41j85K49K07j98m31J88P1j53J3K17p7k68L34j19k9L29j24j17l72N02
6857A49l16P3j49J25l27J59K77l91J28M48k82L3mo8k13K09K42j83j37L82j94k38
6879b77k86L20K13m19K13j09j6N57l78O6j13L9R2r4J10k52L36k11M87o85N55k12
6901f4l08J69j43L40k73K32Q2n6J78j4l95J42L04m3k61M72m84J29j27J16J08J34
$$ plain form
6923 238 219 150 188 10 300 32 -88 111 353 207 129 154 27 -46 364 321 84 298 240 75 534 625 373
6946 373 558 43 146 -60 115 -42 -23 129 472 -118 11 235 123 -177 184 -219 128 292 347 86 80
6967 80 148 -165 -32 215 136 -79 322 -217 -403 -106 89 -23 -305 163 -52 -57 -261 -253 -183 -594 180 122 -23
6990 -23 -353 -72 -605 34 -211 -582 -2 -37 221 -228 -115 29 -190 -276 -114 -287 -149 -88 -200 -480 -45
7011 -45 7 -125 -384 -352 -70 92 9 7 -281 -381 152 -320 -194 368 -126 -292 -210 36 -211 28 24 -4 -317
7034 -317 -178 306 -200 -274 69 -246 -117 -125 176 -72 -91 -265 -92 -96 -123 -104 183 -19 -306 -46 283 148 67
7057 67 3 267 -60 18 317 140 1 -148 210 -75 423 140 -29 73 296 400 493 191 287 291 178 255 115
7080 115 95 339 40 198 90 268 -32 231 226 380 265 225 292 -122 -165 308 -22 33 364 199 -163 12
$$ packed form
6923B38j9o9L8j78K90k68j20J99K42j46p8K5j27p3M10m3k37K14n8j65M59R1k52
6946C73J85n15J03k06J75j57J9J52L43n90J29K24j12l00L61m03L47J64N5k61o
6967H0O8l13J33K47p9k15M01n39j86K97J95j12k82M68k15nk04QP0m11P74n8j45
6990b3l30K81n33O39k45l71N80l5K58m49J13J44k19q6J62j73J38O1j12k80M35
7011d5N2j32k59L2K82J62q3kk88j00N33m72J26N62m94j66Q2K46k47K39mk8l13
7034c17J39M84n06p4L43l15J29qL01k48j9j74J73mk7J9K87k02k87K60L29j35q1
7057F7o4K64l27P8K99j77j39j49L58k85M98k83j69J02K23J04R3l02R6Mj13P7j40
7080A15k0K44k99J58j08J78l00K63nJ54j15m0O7m14m3M73l30N5L31j65l62J75
$$ plain form
7102 12 10 10 111 74 -137 -102 192 44 -372 -39 -405 -167 24 -104 64 -32 0 -53 -107 215 -132 -155 67 42
7126 42 -248 -280 -241 -21 -188 -230 -326 -212 48 -248 -508 -196 -102 -140 -82 -275 -44 -283 -258 231 -200 -203 -184 -159
7150 -159 -233 -41 -181 -31 -52 -233 -291 -259 252 -63 -123 -171 161 90 -159 -125 -207 208 121 -40 -241 44 -78
7173 -78 -18 161 147 186 -40 -45 438 212 339 128 -366 268 450 222 30 358 -109 -133 150 -77 141 -88
7195 -88 128 241 11 287 331 183 248 355 -26 48 298 242 43 508 -58 -91 29 436 -217 -11 87 11 -69
7218 -69 334 68 97 301 220 -115 75 117 59 -244 115 270 -89 84 61 6 -137 -144 67 -221 -292 47 84 -3
7242 -3 125 -81 55 -50 -173 -101 -277 -37 -271 -74 -221 -34 -176 69 -85 -8 230 -41 -347 -132 11
7263 11 -192 299 111 -122 -418 -179 -214 -479 -129 40 -188 -160 -63 -27 -163 -33 -210 -372 -338 22 -40 -6 146
$$ packed form
7102A2k%J01l7k11L5K94j48m16L33l66K38J91j28J68r6L2n3n4L22l47k3K22k5
7126D2k90l2L9K20j67m2r6J14K60k96k60L12R4l8N8j93K31k39K5M89m31lJ9K5
7150a59p4J92j40J50k1j81n8L2N11l15o0m8L32p1k49L4q2M15q7j61k01K85j22
7173g8O0J79j4L9k26nM83k26J27k11m94O34J82k28j92L28m67k4K83k27K18k29
7195h8K16J13k30K76M4j48O5J07l81P4K50n6j99M65n66l3J20M07o53K06R8p6q0
7218f9M03k66K9K04q1l35J90M2n8l03L59J55l59J73k3n5j43pK11k88p1L39L7q7
7242cJ28k06J36j05j23P2j76K40k34J97j47J87j42K45j54P7K38k71l06K15J43
7263A1k03M91j88k33k96K39l5k65L50J69k28K8R7L6j36J30j77j62L4L60o2L4J52
$$ plain form
7286 146 -220 -283 96 -200 -224 -82 -9 37 27 20 85 -247 27 -9 -151 42 -142 -40 -20 174 -177 -79 -174 350
7310 350 54 -159 307 406 214 380 456 131 212 -137 -95 85 148 58 75 279 -119 15 71 469 459 -12 403
7333 403 -131 72 193 -69 -10 347 158 -94 -232 271 360 219 103 148 -33 75 223 115 -244 -142 -168
7354 -168 -9 120 -2 67 -98 -103 308 213 21 24 -91 -59 -40 22 -104 227 8 -240 225 -289 -408 167 -51
7377 -51 -285 -95 -237 -41 -242 160 -33 -300 -85 -94 -116 -250 -162 -154 -256 -96 -214 -279 -364 -94 -155 -360 -32
7400 -32 -46 40 -76 73 -315 -247 89 -56 36 -176 -121 2 -122 -83 12 -194 11 129 -274 -18 248 -247 66
7423 66 159 -96 17 207 212 60 174 208 236 78 -24 89 91 91 16 119 384 101 23 111 302 -124 -29 149 472
7448 472 -101 -2 281 -238 95 382 185 443 455 154 -237 340 317 -315 -13 93 249 3 -120 177 62
$$ packed form
7286A46l66o3L79k96k4J42P3M6j0pO5l32K74l6j42J93j84J02K0J94l51R8r5N24
7310C50k96k13M66R9j92J66P6l25Q1l49M2J80O3r0J7K04l98J34N6L98j0m71M15
7333D03n34K03J21k62N9L57j89k52j38N03Q9j41j16M5j81J08J48j08l59J02k6
7354a68J59J29j22O9j65nM11r5j92Lj15L2J9O2j26L31k19k48M65n14j19N75k18
7377e1k34J90j42J96k01M02j93k67K15rk2j34Q8Qj02J60j18o5q5K70o1k05L28
7400c2j4Q6j16J49l88O8L36j45R2k12N5J23j24L9R5k06K05J18m03K56K66m95L13
7423F6R3k55J13J90Nj52J14L4K8j58j02J13K%p5J03K65k83p8Q8J91m26R5J78L23
7448D72n73R9K83n19L33K87j97K58J2l01l91N77k3o32L02J06J56k46j23K97j15
$$ plain form
7469 62 51 26 -172 392 -280 72 169 -60 204 -115 189 569 -37 -55 374 182 59 -246 -76 -67 320 133
7491 133 113 160 139 73 -12 102 -217 -93 52 -65 73 -189 -69 -212 -366 -63 83 -232 95 -11 -571 86
7513 86 -24 85 -312 -66 -278 -164 -237 26 -330 -277 11 -183 -26 -678 198 -17 -249 -2 -242 -228 -50
7534 -50 204 -209 -127 88 -276 -273 -149 -109 -202 -151 130 112 -3 273 -83 -6 247 -119 193 -67 243 -166 -30
7557 -30 305 -41 101 262 237 -87 202 371 -101 265 -80 -272 277 94 -33 342 107 122 -14 178 257
7578 257 -90 176 347 62 75 429 -85 290 71 68 -90 283 169 119 43 -94 569 200 -29 172 85 222
7600 222 182 171 -106 -243 283 136 58 35 66 19 296 134 46 5 96 52 -69 181 216 68 88 -22 -241 -183
7624 -183 203 -43 140 -265 -317 159 65 -94 -301 -200 -83 -368 -193 -12 110 -168 -48 -1 -285 -160 85
$$ packed form
7469F2j1k5j98N64o72L52R7k29K64l19L04L80o06j8M29j92j23l05J70RL87j87
7491A33k0M7k1o6q5J14l19J24J45j17J38k62J20j43j54L03J46l15L27j06n60O57
7513H6j10J09l97K46k12J14p3K63l56N3K88j94J57o52Q76k15k32K47k40J4J78
7534e0K54m13Q2K15l64LJ24M0r3N1K81j8j15K76l56P7K53l66L12k60L10m09J36
7557c0L35l46J42J61k5l24K89J69m72L66l45j92N49j83j27L75k35J5j36J92P9
7578B57l47K66J71k85J3L54n14L75k19lj58L73j14n0p6j37O63l69k29K01q7J37
7600B22m0j1k77j37N26j47p8k3L1m7K77j62q8m1R1m4j21K50L5j48K0j10k19N8
7624a83L86k46J83m05n2M76r4j59k07J01J17k85J75J81J22k78J20M7k84J25K45
$$ plain form
7645 85 127 -205 -35 -95 -314 -179 -136 -385 56 197 -164 2 237 -57 -217 134 -317 -311 -195 101 -523 -129
7667 -129 -33 -8 -194 -21 125 66 41 69 97 -332 88 33 106 309 -353 -238 -80 -104 134 149 238 56 -47 -15
7691 -15 214 5 59 -265 -36 257 85 287 -88 97 214 80 41 -86 64 -71 117 156 381 168 259 -3
7713 -3 -112 93 311 24 96 237 38 224 215 79 273 443 161 -130 253 254 -15 232 426 277 136 137 16
7736 16 -96 -78 134 -302 313 165 22 -254 -27 -141 0 -57 -378 87 59 306 -52 -146 -68 132 196 35
7758 35 261 293 -113 -205 62 202 -97 289 -428 -65 -70 -98 26 -260 118 -156 -480 -166 -94 -6 -85 -438 -169
7781 -169 -144 -218 -105 -152 85 -98 93 -80 -290 -385 -192 -213 -195 -247 346 -197 -17 -179 -180 -159 -147 42 -154 -227
7805 -227 -272 -125 -326 -338 213 -62 -79 5 -171 405 170 -159 58 41 -25 75 455 111 11 31 125 49 140
$$ packed form
7645H5M2l32J70o0k19J35M3k49M41J41l61J66K35k94j60L51m51OJ16K96o24L94
7667a29R6K5j86J73J46n9k5K8K8m29M20n5P3K03o62J15J58k4K38J5Q9j82j03L2
7691a5K29k09N4l24K29K93j72K02l75J85J17j34l9j27J50j35J88L9K25k13R1k62
7713cj09K05K18k87P2J41j99J86rj36J94J70k82k91L83Jk69K47J94j49j41Jj21
7736A6j12J8K12m36O15j48j43k76K27j14J41n7l21M65k8K47l58r4P8K00O4j61
7758C5K26L2m06r2K67J40k99L86p17L63nk8J24k86L78k74l24L14P2Q8p9l53K69
7781a69K5p4J13m7K37j83J91j73k10r5J93k1J8n2N93n43J80j62jK1J2J89j96p3
7805b27m5J47k01j2N51k75j7Q4j76N76k35l29K17j7o6J00L80l44j00K0R4p6R1
$$ plain form
7828 140 240 4 10 169 391 277 -133 163 -86 195 177 154 54 288 262 178 265 222 207 72 24 239 -20
7851 -20 274 293 -82 -31 158 -145 -220 215 -111 66 -14 336 158 260 26 53 -75 241 115 -178 80 62
7873 62 66 -315 -185 -142 340 71 -126 -213 73 -146 -148 381 45 -290 -313 190 101 -379 51 -238 -252 -252 198 -65
7897 -65 -169 -358 17 -186 -283 -37 -84 -312 139 -78 -192 -162 -259 -329 67 18 -95 10 -218 -400 -223 -55
7919 -55 -181 -383 -272 -177 -57 8 102 139 -138 -145 238 -155 -178 -213 -204 -227 -190 -235 -121 -23 -178 70 -70 244 -164
7944 -164 -107 -99 298 -349 -50 68 62 -129 218 -325 146 305 -306 -109 125 199 -110 139 286 269 93 321
7966 321 287 603 29 354 67 -18 109 384 70 -16 235 106 22 357 -116 36 -138 108 150 112 2 -249
7988 -249 158 199 228 261 -26 -126 -32 -46 114 6 78 43 -145 -387 -67 -122 -128 -196 67 24 -97 391 121 -221
$$ packed form
7828A40J00k36OJ59K22j14m10K96k49K81j8k3j00K34k6q4Q7m3j5j35m8K15k59
7851b0K94J9l75N1J89l03p5M35l26J77q0L50j78J02k34K7j28L16j26k93K58j8
7873F2Ml81J30M3M82k69j97q7K86k19kN29l36l35k3N03q9m80M30k89j4%M50k63
7897f5j04j89L75k03r7K46m7k28M51k17j14L0r7p0L96m9j13J05k28j82J77J68
7919e5j26k02J11R5J20O5R4L7k77pL83l93k3l5Rk3L7m5J14R8j55K48j40L14m08
7944a64N7QL97o47K99J18oj91L47n43M71J59o11J97K34P4l09K49J47j7j76K28
7966C21l4L16n74L25k87q5J27K75l14q6K51j29q4L35m73J52j74K46M2l8j10k51
7988b49M07M1K9L3k87j00R4j4J60j08P2l5j88k42L20n5oo8K63m3j21M88k70l42
$$ plain form
8012 -221 2 -211 -10 72 60 35 -163 -120 -97 160 -178 300 -186 47 -136 -194 79 -169 -380 -248 -71 -171
8034 -171 -463 -363 -330 49 -233 -270 -23 -207 -300 192 -297 -385 -108 -468 -33 -22 -77 -387 -271 -135 -76 243
8056 243 -288 -96 -175 -386 -443 -369 -421 -13 -12 -62 122 -241 -391 198 22 7 116 -24 -188 -280 -43 -174 166
8079 166 17 247 54 89 -102 0 130 351 159 426 69 350 215 204 143 95 210 90 368 69 131 -11
8101 -11 221 -72 -17 371 177 275 167 173 139 13 129 -113 -102 165 -20 117 143 84 197 -27 28 -11 160 1
8125 1 -8 28 396 31 -34 171 -22 -30 115 153 -178 -85 -75 -334 -162 -201 171 208 146 63 -227 59 32 -198 -283 -224
8151 -224 -151 151 -193 -175 -237 -246 -365 -57 -40 -130 -70 -305 -4 -105 -68 -142 -175 -200 -207 -169 -3 -297 -63 -61 -451 34
8177 34 -297 -91 -276 -294 -20 -157 -358 -191 -376 -76 -25 -296 -235 178
$$ packed form
8012b21K23k13K01Q2j2k5j98M3K3K57l38M78m86K33j83n8K73k48k11J32J77j00
8034a71k92J00L3L79k82l7K47j84r3M92m89q8K77l60M35J1n5l10J16J36N9L19
8056B43n31J92p9k11n7P4n2M08Jn0J84l63j50N89j76j5J09j40j64r2K37j31L40
8079A66j49K30j93L5j91J02J30K21j92K67l57K81j35j1o1m8J15j20K78k99O2j42
8101a1K32k93N5L88j94R8j08Ol4j26J16k42J1K67j85J37K6n9J13k24N5l9J71j59
8125ArL6L68l65o5K05j93qJ45L8l31R3J0k59J72l9L72L7o2q3k90K86k7k30q5N9
8151b24P3L02l44J8o2rj19L08J7r0O0k35L01j01L7p4l3k5pL8J66k94K34Kl90M85
8177C4l31K06j85j8K74j37k01J67j85L00N1k71O1M13
8191A78
$$ Imaginary data points
##PAGE= N=2
##DATA TABLE= (X++(I..I)), XYDATA
$$ plain form
0 0 0 0 0 -8 8 0 8 -8 16 -16 24 -32 33 -40 56 -64 75 -89 107 -128 147 -171 201 -231 265 -303 345 -391 444
29 444 -501 565 -633 710 -795 885 -987 1099 -1219 1351 -1498 1659 -1836 2033 -2252 2496
45 2496 -2767 3078 -3429 3833 -4306 4863 -5535 6362 -7412 8787 -10686 13485 -18042 26727
59 26727 -49285 229679 485932 -3348 -128511 82853 289571 170164 38243 56861 201606
70 201606 204178 69355 -30223 50359 136158 141480 109990 83409 7870 -37258 -9721 49075
82 49075 80421 77785 4518 -48266 14426 78472 -6267 -88690 -9745 98058 58648 -56026
94 -56026 -107083 -44348 64293 84876 -6768 -47894 16668 34416 -34608 -45677 15102 28654
106 28654 -9778 -16925 6948 11781 -27173 -63065 -5647 91483 45002 -113400 -122669 30272
$$ packed form
0@%%%qJ6qQj6K4l2M0n6O5p3R6j20J39j64J96k35K75l18L72m32M96n68O48p36Q35
29D44r45J066j198J343j505J680j872K086k318K570k849L157l495L869m285M748
45B496n263N845o507P262q139R169j0398J1897j3774J6199j9473K4171l1527M4769
59B6727p6012K78964K56253m89280j25163K11364K06718j19407j31921J8618J44745
70B01606K572j34823r9578Q0582Q5799N322l1490k6581p5539m5128K7537N8796
82D9075L1346k636p3267n2784O2692O4046q4739q2423P8945J07803l9410j14674
94e6026n1057O2735J08641K0583r1644m1126O4562J7748o9024j1069O0779J3552
106B8654l8432p147K3873M833l8954l5892N7418R7130m6481j58402r269J52941
$$ plain form
118 30272 78674 -31409 -94799 -35267 42381 52254 -20637 -97361 -51817 66675 71504 -41397
130 -41397 -95694 -34007 43538 54536 -1552 -44951 -1356 54287 15192 -37948 -5724 28247
142 28247 2688 -1202 23759 1823 -29290 -2424 33438 29566 9233 -20947 -40805 -8683
154 -8683 24357 -7954 -38670 -5915 15441 -7934 -15150 -5828 -9249 -2435 11979 -5527 -22890
167 -22890 -10732 -6424 -2357 32101 39853 -9634 -25324 20588 44703 27536 7654 -13125 -4799
180 -4799 55213 73765 -487 -34388 42586 100527 52616 -16061 -16341 44379 88056 43364 -33027
193 -33027 -12720 72772 78990 15307 -966 24706 36098 39974 29529 -2935 -20 43307 45711
206 45711 9346 9049 27218 22663 23694 31941 13460 261 15383 16096 1494 8788 14328 1135
$$ packed form
118C0272M8402j10083o3390N9532P7648R873p2891p6724M5544J18492M829j12901
130d1397n4297O1687P7545J0998n6088m3399M3595N5643l9095n3140L2224L3971
142B8247k5559l890K4961k1936l1113K6866L5862l872k0333l0180j9858L2122
154h683L3040l2311l0716L2755K1356k3375p216R322l421O814J4414j7506j7363
167b2890J2158M308M067L4458P752m9487j5690M5912K4115j7167j9882k0779Q326
180d799O0012J8552p4252l3901P6974N7941m7911o8677k80O0720M3677m4692p6391
193c3027K0307Q5492O218o3683j6273K5672J1392L876j0445l2464K915M3327K404
206D5711l6365k97J8169m555J031Q247j8481j3199J5122P13j4602P294N540j3193
$$ plain form
220 1135 11531 28942 2765 -19472 4499 16354 -7246 -12083 -1210 -8717 -11213 -3126 -9924
233 -9924 -7949 6362 -13549 -40551 -11472 13410 -30996 -62103 -21539 15462 -1445 -31565
245 -31565 -44023 -27377 10342 8465 -40453 -49030 -4689 6347 -26298 -40141 -30845 -12529 17674
258 17674 14301 -35829 -50596 -4742 11458 -18881 -27559 -13738 -9544 -5152 -5051 -23888 -20267
271 -20267 14363 16385 -14397 -25367 -20868 -19917 -2616 8155 -17604 -26248 5662 9878 -20973
284 -20973 -20977 5109 5503 -6577 -14557 -23956 -13161 11791 1626 -21034 1873 27576 2268 -21508
298 -21508 -7366 3771 1247 5889 -3765 -17889 3901 26421 6918 -11051 6747 20417 18297
311 18297 13075 -7580 -19700 14469 39720 8066 -14692 13588 32050 17497 8123 4317 1680
$$ packed form
220A135J0396J7411k6177k2237K3971J1855k3600m837J0873p507k496Q087o798
233i924J975J4311j9911k7002K9079K4882m4406l1107M0564L7001j6907l0120
245c1565j2458J6646L7719j877m8918q577M4341J1036l2645j3843R296J8316L0203
258A7674l373n0130j4767M5854J6200l0339q678J3821M194M392J01j8837L621
271b0267L4630K022l0782j0970M499R51J7301J0771k5759q644L1910M216l0851
284b0973mK6086L94j2080p980r399J0795K4952j0165k2660K2907K5703k5308k3776
298b1508J4142J1137k524M642r654j4124K1790K2520j9503j7969J7798J3670k120
311A8297n222k0655j2120L4169K5251l1654k2758K8280J8462j4553r374l806k637
$$ plain form
324 1680 19998 29603 -1521 -17501 13254 31605 16974 8799 9738 10600 23590 22475 -9968 -13616
338 -13616 24605 29496 -3215 -7685 10687 11539 9749 13588 2554 169 15546 8347 -14541 -6569
352 -6569 11044 6168 5501 11246 -2713 -7568 15179 14674 -13633 -10602 11919 5074 -11170 -10484
366 -10484 -6247 3647 19151 3692 -21920 -5357 19808 1554 -21426 -10480 1212 1601 3126
379 3126 -10712 -24307 -168 23085 -4124 -30891 -13507 3020 -6493 -16316 -21365 -20801 763
392 763 9153 -18774 -29157 -1514 4032 -18271 -20371 -13112 -18672 -12454 -2361 -17556 -26658 -4727
406 -4727 4565 -12318 -18058 -14143 -14374 -4928 -214 -20636 -23972 6318 11481 -15860 -15851 6023 5820
421 5820 -2784 -5517 -14035 -10463 11892 7911 -16604 -9398 14383 10239 -2704 -2024 -3118 1726
$$ packed form
324A680J8318R605l1124j5980L0755J8351j4631q175R39Q62J2990j115l2443l648
338a3616L8221M891l2711m470J8372Q52j790L839j1034k385J5377p199k2888P972
352f569J7613m876o67N745j3959m855K2747n05k8307L031K2521o845j6244O86
366a0484M237R894J5504j5459k5612J6563K5165j8254k2980J0946J1692L89J525
379C126j3838j3595K4139K3253k7209k6767J7384J6527r513r823n049N64K1564
392G63Q390k7927j0383K7643N546k2303k100P259n560O218J0093j5195r102K1931
406d727R292j6883n740L915k31R446M714k0422l336L0290N163k7341RK1874k03
421E820q604k733q518L572K2355l981k4515P206K3781m144j2943O80j094M844
$$ plain form
435 1726 16697 6727 -16715 -2739 24474 13060 -5608 3398 12150 10892 12737 4524 -7883
448 -7883 7808 26017 8503 -7225 7755 18704 15075 17251 10979 -2647 11236 28245 7898
461 7898 -10296 10988 26563 12615 2150 1728 4315 18692 22301 -2970 -12342 11818 16390
474 16390 -5283 -4515 10042 8505 7580 8716 -6012 -10607 12908 16925 -6054 -10347 1979 1240
488 1240 12 3338 -4865 -2825 16911 11618 -16893 -14615 8244 7153 -1960 -897 -5724 -5065 11091
503 11091 8058 -14325 -8560 13128 5360 -12996 -13712 -10438 -5014 5510 -3522 -21156 -6204 14163
517 14163 -3861 -24846 -11564 1763 -4538 -8694 -13492 -19370 -6521 6751 -8454 -19682 -3729
530 -3729 1604 -11190 -13631 -13697 -18913 -7772 6512 -10047 -24377 -6046 5825 -7352 -12838 -8265
$$ packed form
435A726J4971r970k3442J3976K7213j1414j8668R006Q752j258J845q213j2407
448g883J5691J8209j7514j5728J4980J0949l629K176o272j3626J3883J7009k0347
461G898j8194K1284J5575j3948j0465m22K587J4377L609k5271r372K4160M572
474A6390k1673P68J4557j537r25J136j4728m595K3515M017k2979m293J2326p39
488A240j228L326q203K040J9736n293k8511K278K2859j091r113J063m827O59J6156
503A1091l033k2383N765K1688p768j8356p16L274N424J0524r032j7634J4952K0367
517A4163j8024k0985J3282J3327o301m156m798n878J2849J3272j5205j1228J5953
530c729N333j2794k441o6n216J1141J4284j6559j4330J8331J1871j3177n486M573
$$ plain form
544 -8265 -9844 -5147 -1836 -19410 -25230 -1431 8064 -9217 -13970 -4906 -6578 -5625 -2052 -12543
558 -12543 -13764 7704 8441 -16918 -15963 9255 14888 6614 2582 -2949 -271 13724 9579 -8182
572 -8182 3057 23756 13982 -558 7199 13366 12794 21990 19011 1417 5305 21255 15001 3268
586 3268 11414 17029 15641 19414 13347 -966 9266 26163 11989 -4310 7726 17262 8390 5892
600 5892 7396 4225 13547 23542 6900 -6570 7853 16743 3723 418 5571 4504 10325 14116
614 14116 -1999 -8625 12156 18811 -1229 -6529 3484 2366 618 4546 -1757 -3316 11574 11326
628 11326 -8781 -9295 3900 2108 -2382 592 -7685 -12612 3187 6816 -11151 -10256 6447 4005
642 4005 -8162 -8230 -8286 -5775 5652 2129 -14037 -8266 8082 68 -11576 -2820 1297 -4942 -2338
$$ packed form
544h265j579M697L311j7574n820K3799R495j7281m753R064j672R53L573j0491
558a2543j221K1468P37k5359R55K5218N633q274m032n531K678J3995m145j7761
572h182J1239K0699r774j4540P757O167n72R196k979j7594L888J5950o254j1733
586C268Q146N615j388L773o067j4313J0232J6897j4174j6299J2036R536q872k498
600E892J504l171R322R995j6642j3470J4423Q890j3020l305N153j067N821L791
614A4116j6115o626K0781O655k0040n300J0013j118j748L928o303j559J4890k48
628A1326k0107n14J3195j792m490K974q277m927J5799L629j7967Q95J6703k442
642D005j2167o8n6K511J1427l523j6166N771J6348q014j1644Q756M117o239K604
$$ plain form
657 -2338 -3964 -15131 -6883 9585 -243 -14690 -4904 3452 -3339 -5580 -4939 -9777 -2694 4879 -8904
672 -8904 -17594 -907 6889 -6304 -10363 -6537 -8799 -3363 4215 -8391 -17942 -1248 8412 -5299
686 -5299 -9497 -857 1404 2290 3774 -7520 -10641 8093 13552 -5288 -8082 7159 8996 4265
700 4265 5110 634 -593 12428 12674 -2676 642 14874 11107 4726 10128 8991 5762 15781 16635
715 16635 -173 1208 17844 14484 2757 7732 12585 9952 12844 11936 2547 9099 21635 11544
729 11544 -1316 6738 13693 10338 12900 11134 1506 8036 21205 7526 -7777 5556 17494
742 17494 6125 -2169 593 1457 7892 13788 1445 -6967 7109 11758 -2891 -6807 665 132
756 132 597 5177 -4372 -11280 3711 10156 -4688 -10020 -1944 -3659 -5179 -821 -6860 -11665 2347
$$ packed form
657b338j626j1167Q248J6468r828j4447R786Q356o791k241O41m838P083P573j3783
672h904q690J6687P796j3193m059L826k262N436P578j2606r551J6694R660j3711
686e299m198Q640K261Q86J484j1294l121J8734N459j8840k794J5241J837m731
700D265Q45m476j227J3021K46j5350L318J4232l767o381N402j137l229J0019Q54
715A6635j6808J381J6636l360j1727M975M853k633K892r08r389O552J2536j0091
729A1544j2860Q054O955l355K562j766r628O530J3169j3679j5303J3333J1938
742A7494j1369q294K762Q64O435N896j2343q412J4076M649j4649l916P472n33
756A32M65M580r549o908J4991O445j4844n332Q076j715j520M358o039m805J4012
$$ plain form
771 2347 7220 -8922 -11976 1043 1061 -6628 -6559 -9525 -12164 -2356 225 -12840 -11748 1617 -1406
786 -1406 -11416 -8291 -6679 -8001 -2777 -6035 -18192 -10584 6645 -1697 -16245 -6784 1568 -5295
800 -5295 -8153 -6298 -10775 -7487 1107 -5985 -14478 -4433 3082 -2475 -3122 -1796 -8359 -3979 6810
815 6810 -2780 -13404 -1001 8713 -1261 -5088 591 -876 1554 7564 -233 -8806 2565 9541
829 9541 -1458 -4326 4250 5169 5920 10193 2914 -4255 7535 14173 700 -1939 8177 8306 3042
844 3042 5292 3507 2209 12788 14448 -200 -644 11497 7488 -1240 5990 10271 5557 8340 8656
859 8656 -647 2002 14802 10077 -1798 2332 5966 1878 3048 4018 -489 5193 14938 3442 -9321
874 -9321 235 9275 2302 -275 1937 -3001 -913 6521 -223 -8962 1959 8945 -2197 -8496 -4540
$$ packed form
771B347M873j6142l054J3019J8p689O9k966k639R808K581j3065J092J3365l023
786a406j0010L125J612j322N224l258j2157P608J7229q342j4548R461Q352o863
800e295k858J855m477L288Q594p092q493J0045P515n557o47J326o563M380J0789
815F810r590j0624J2403R714r974l827N679j467K430O010p797q573J1371O976
829I541j0999k868Q576R19P51M273p279p169J1790O638j3473k639J0116J29n264
844C042K250j785j298J0579J660j4648m44J2141m009q728P230M281m714K783L16
859H656r303K649J2800m725j1875M130L634m088J170R70m507N682R745j1496j2763
874i321R556R040o973k577K212m938K088P434o744q739J0921O986j1142o299L956
$$ plain form
889 -4540 -6122 -3373 3784 -2907 -11016 -1043 4250 -7320 -9592 -1402 -2697 -5054 -1682 -7328 -13917
904 -13917 -3464 2276 -8566 -10564 -980 -2980 -9421 -6825 -9341 -11795 -1827 1263 -12695 -13005
918 -13005 699 -483 -10713 -8134 -4036 -5263 -2924 -5382 -15604 -10277 3534 -977 -11495 -6064
932 -6064 -800 -5230 -3949 -2343 -8838 -5217 5828 -841 -12124 -3578 5901 947 -710 496 -3775
947 -3775 -1189 7033 135 -8769 620 9209 2735 20 3447 680 3406 12015 5488 -5046 3575
962 3575 11926 3295 -416 5815 5262 6099 11002 4879 -2235 7148 12275 -471 -3238 8650 8780
977 8780 2701 4618 4442 2264 9471 11617 149 -1100 9132 6288 -1902 1375 3862 2438 8525
992 8525 9204 -2959 -1997 10862 7416 -3151 448 5107 973 2255 4252 -2393 411 11304 6846
$$ packed form
889d540j582K749P157o691q109R973N293j1570k272Q190j295k357L372n646o589
904a3917J0453N740j0842j998R584k000o441K596k516k454R968L090j3958l10
918a3005J3704j182j0230K579M098j227K339k458j0222N327J3811m511j0518N431
932f064N264m430J281J606o495L621J1045o669j1283Q546R479m954j657J206m271
947c775K586Q222o898q904R389Q589o474k715L427k767K726Q609o527j0534Q621
962C575Q351q631l711O231n53Q37M903o123p114R383N127j2746k767J1888J30
977H780o079J917j76k178P207K146j1468j249J0232k844q190L277K487j424O087
992H525O79j2163R62J2859l446j0567L599M659m134J282J997o645K804J0893m458
$$ plain form
1007 6846 -4031 -1002 3182 -1780 -679 1754 -4010 -3026 6049 329 -9517 -1816 6367 -818 -5136
1022 -5136 -3251 -7055 -6130 1312 -3844 -11082 -1890 4430 -5616 -10462 -4381 -5433 -6418 -1716 -6477
1037 -6477 -13834 -6111 329 -7816 -9563 -392 -824 -6064 -5119 -8412 -11097 -2091 1761 -9246 -10770
1052 -10770 -150 -951 -7928 -3462 -1335 -4358 -611 773 -9339 -9221 3505 3034 -4844 -1121 2467
1067 2467 -926 1507 2963 -4046 -2244 8352 2998 -7621 -2082 4979 1684 2559 5949 94 -246
1082 -246 7383 3998 -4290 1071 7653 1639 221 3885 1044 1734 9665 5064 -4079 2636 9449
1097 9449 872 -3133 2837 4043 3852 8523 4057 -1746 6517 11675 2236 -1577 6769 5960 2080
1112 2080 5204 3104 -881 7423 11836 912 -2943 6855 6652 -624 1157 2070 432 5102 7386
$$ packed form
1007F846j0877L029M184m962J101K433n764R84R075n720r846P701Q183p185m318
1022e136J885l804R25P442n156p238R192O320j0046m846O081j052r85M702m761
1037f477p357P723O440q145j747R171m32n240R45l293k685R006L852j1007j524
1052a0770J0620q01o977M466K127l023L747J384j0112J18J2726m71p878L723L588
1067B467l393K433J456p009J802J0596n354j0619N539P061l295Q75L390n855l40
1082b46P629l385q288N361O582o014j418L664k841O90P931m601r143O715O813
1097I449q577m005N970J206j91M671m466n803Q263N158r439l813Q346q09l880
1112B080L124k100l985Q304M413j0924l855R798k03p276J781R13j638M670K284
$$ plain form
1127 7386 -1844 -1614 8222 4929 -3411 155 2936 -1854 381 3316 -4298 -3997 6517 4134 -5366
1142 -5366 -2324 2664 -1107 -1432 -121 -5989 -4151 5565 1661 -8972 -3932 2730 -2638 -4656 -2321
1157 -2321 -6446 -6864 -503 -4419 -12355 -5450 2367 -4534 -8508 -4876 -6477 -6883 -1487 -5922 -12943
1172 -12943 -4168 1497 -8157 -11823 -2736 -774 -4528 -3160 -5609 -9851 -3032 1791 -6612 -8443 736
1187 736 1477 -3191 -1079 -1356 -4126 2621 5960 -4918 -8302 2417 3921 -2550 -563 2305 3
1202 3 2967 5401 -2612 -2587 6238 4753 -3637 194 5453 2620 4224 7036 1787 1133 10026 6514
1218 6514 -3113 1127 8289 4206 2779 5115 2432 3864 11811 7502 -1624 3727 10231 3639 -188
1233 -188 4046 3149 2977 9167 5740 -2614 2978 9779 2607 -2361 1917 1980 136 3567 1277 -2930
$$ packed form
1127G386r230K30R836l293q340L566K781m790K235K935p614L01J0514k383r500
1142e366L042M988l771l25J311n868J838R716l904j0633N040O662n368k018K335
1157b321m125m18O361l916p936O905P817o901l974L632j601m06N396m435p021
1172a2943Q775N665r654l666R087J962l754J368k449m242O819M823q403j831R179
1187G36P41m668K112k77k770O747L339j0878l384J0719J504o471J987K868k302
1202CK964K434q013K5Q825j485q390L831N259k833J604K812n249o54Q893l512
1218F514r627M240P162m083j427K336k683J432P947m309r126N351O504o592l827
1233a88M234q97j72O190l427q354N592O801p172m968M278O3j844L431k290m207
$$ plain form
1249 -2930 4942 10103 628 -3267 4919 4826 -705 1247 1788 -1617 3549 7495 -457 -2748 6410 7133
1265 7133 81 1029 1509 -2345 1816 4779 -2443 -3297 6393 5038 -3569 -1438 2683 -571 -767 366
1281 366 -6520 -7296 1257 -92 -8035 -3746 1948 -3201 -5318 -3005 -6938 -6649 359 -2732 -12225 -7722
1297 -7722 553 -3705 -6548 -3248 -4444 -4988 -1555 -5799 -12755 -5405 1968 -5038 -8995 -2888 -2381
1312 -2381 -4272 493 -663 -6739 -1975 3165 -4585 -8377 -706 1613 -1279 1380 610 -3758 1565
1327 1565 5157 -2414 -4269 4897 4886 -2120 -382 1573 648 5515 9052 531 -1943 6649 6093 -2171
1343 -2171 -161 4881 3164 4616 5739 -689 -410 9350 8285 -513 1549 6560 2714 1397 4772
1358 4772 1900 2878 10075 6982 -1794 2251 8510 3689 1285 5010 2646 1079 7073 5048 -1764
$$ packed form
1249b930P872N161r475l895Q186r3n531J952N41l405N166L946p952k291R158P23
1265G133p052R48M80l854M161K963p222q54R690j355q607K131M121l254j96J133
1281C66o886p76Q553j349p943M289N694n149k117K313l933K89P008l091r493M503
1297g722Q275m258k843L300j196n44L433m244o956P350P373p006l957O107N07
1312b381j891M765j156o076M764N140p750l792P671K319k892K659p70m368N323
1327A565L592p571j855R166j1p006J738J955r25M867L537q521k474Q592n56q264
1343b171K010N042j717J452J123o428K79R760j065q798K062N011l846j317L375
1358D772k872R78P197l093q776M045O259m821k404L725k364j567N994k025o812
$$ plain form
1373 -1764 4265 12089 5548 -786 2258 3190 2638 6401 3126 -2192 3642 8859 571 -3365 4092
1388 4092 5274 1044 2243 -362 -5457 267 6702 -184 -4663 3152 3789 -2373 -2062 -940 -3111
1403 -3111 581 2885 -4952 -7587 375 785 -5173 -3064 278 -3066 -2759 -903 -8253 -8847 1338
1418 1338 1544 -7484 -6158 -876 -3348 -3992 -1863 -5858 -6179 1164 -1719 -10822 -7763 -292 -2542 -4126
1434 -4126 -1967 -4240 -5144 92 -1891 -8919 -4264 2836 -2248 -6378 -2456 -2288 -2557 2495 250 -6652
1450 -6652 -2117 3671 -2838 -7071 -519 1530 -982 983 564 -3683 943 6176 -450 -4407 1748
1465 1748 2370 -1572 816 1262 -1663 3260 7837 10 -3519 4325 5746 -1321 -313 2850 948
1480 948 3085 5772 697 -468 7877 7433 -403 863 5253 2228 1968 4730 708 194 7825 7705
$$ packed form
1373a764O029P824o541o334L044R32n52L763l275n318N834N217q288l936P457
1388D092J182m230J199k605n095N724O435o886m479P815O37o162L11J122k171
1403c111L692K304p837k635P962M10n958K109L342l344L07J856p350n94J0185
1418A338K06r028J326N282k472o44K129l995l21P343k883r103L059P471k250j584
1434d126K159k273r04N236j983p028M655P100n084m130L922J68k69N052k245o902
1450f652M535N788o509m233O552K049k512J965m19m247M626N233o626l957O155
1465A748O22l942K388M46k925M923M577p827l529P844J421p067J008L163j902
1480I48K137K687n075j165Q345m44p836J266M390l025k60K762m022n14P631j20
$$ plain form
1496 7705 -446 1511 7013 4114 2012 4048 1468 685 7093 5670 -1289 2422 8893 4578 540
1511 540 3616 1997 -299 3969 3101 -3046 -173 6300 1634 -1719 2004 2128 -211 1984 63 -5339
1527 -5339 -845 3872 -2729 -6459 648 2213 -2844 -1672 -1339 -5668 -2940 840 -5186 -8498 -1822
1542 -1822 -87 -5393 -4266 -1400 -4021 -2335 39 -6206 -9056 -1743 -1529 -7565 -6413 -1911 -3958
1557 -3958 -3447 -1092 -5532 -7095 106 -381 -7903 -6298 -712 -3143 -4018 -426 -2350 -4088 1914 1272
1573 1272 -6535 -4510 2044 -711 -3857 -1285 -1272 -1787 3126 2054 -3735 -230 5514 79 -3980 547
1589 547 669 -1451 2261 2241 -3130 608 6674 850 -4009 1032 3044 -48 609 599 -2615 1664 6734
1606 6734 1475 -2296 3911 5300 -53 1103 2612 25 2297 6228 968 -1852 5317 6797 768
$$ packed form
1496G705q151J957N502k899k102K036k580p83O408j423o959L711O471m315m038
1511E40L076j619k296M268q68o147K873O473m666l353L723J24k339K195j921n402
1527e339M494M717o601l730P107J565n057J172L33m329K728L780o026l312O676
1542a822J735n306J127K866k621J686K374o245k850P313K14o036J152M502k047
1557c958N11K355m440j563P201m87p522J605N586k431q75L592j924j738O002o42
1573A272p807K025O554k755l146K572J3n15M913j072n789L505N744n435m059M527
1589E47J22k120L712k0n371L738O066n824m859N041K012l092O57j0l214M279N070
1606F734n259l771O207J389n353J156J509k587K272L931n260k820P169J480o029
$$ plain form
1621 768 1036 4401 2155 2917 5219 612 -1151 6477 8309 548 708 6057 3844 2368 4320 906
1637 906 -220 5540 5044 -1497 105 5928 2895 996 3188 1049 -379 4073 3473 -4145 -1601 5422
1653 5422 1786 -2768 356 954 -1208 1241 -155 -5165 -2597 2499 -2270 -5900 -1898 -690 -2863
1668 -2863 -392 -1068 -6117 -3534 1570 -3716 -8666 -2806 -822 -4422 -3720 -3067 -6115 -3607 393 -5070
1684 -5070 -8921 -2763 -1207 -6064 -5989 -2959 -4129 -2549 153 -4563 -7475 -906 531 -5861 -5636 -1833
1700 -1833 -3323 -2901 -485 -3355 -4976 1535 2230 -4830 -4450 1408 -1054 -2764 302 -823 -2220 2103
1716 2103 2890 -3127 -1570 3990 1008 -2062 317 -558 -1901 2446 2926 -2875 317 6082 1752 -2468
1732 -2468 806 2598 -120 2262 2362 -2212 693 5935 2380 -1380 3142 5077 1270 1632 2001 -1063
$$ packed form
1621G68K68L365k246P62K302m607j763P628J832p761J60N349k213j476J952l414
1637I06j126N760m96o541J602N823l033j899K192k139j428M452o00p618K544P023
1653E422l636m554L124N98k162K449j396n010K568N096m769l630M002J208k173
1668b863K471o76n049K583N104n286m950N860J984l600P02O53l048K508M000n463
1684e070l851O158J556m857P5L030j170J580K702m716k912O569J437o392K25L803
1700a833j490M22K416k870j621O511O95p060L80N858k462j710L066j125j397M323
1716B103P87o017J557N560k982l070K379q75j343M347M80n801L192N765m330m220
1732b468L274J792k718K382J00m574K905N242l555l760M522J935l807L62L69l064
$$ plain form
1748 -1063 1664 6436 1916 -1390 4462 6791 1536 2020 4130 1686 2395 5229 693 -2160 4236
1763 4236 6324 618 591 4626 2433 2278 4696 995 -1551 3780 4533 -1169 -328 4818 2836 1276
1779 1276 3410 915 -845 3453 3231 -3049 -1913 3583 1149 -1871 677 412 -957 2497 1719 -4570
1795 -4570 -3268 2225 -712 -5184 -1856 -662 -2657 -369 -885 -5129 -3050 1326 -2708 -7535 -3522
1810 -3522 -1913 -4280 -2932 -2258 -5233 -3586 1435 -2871 -7198 -2459 -611 -5045 -4492 -2610 -4685
1825 -4685 -3160 677 -3278 -6307 -902 834 -4577 -4381 -919 -2589 -2235 547 -2615 -4968 1097
1840 1097 2414 -3104 -3060 1061 -737 -2325 377 -1709 -2986 2980 3759 -2394 -1762 3109 1787 -291
1856 -291 1858 1404 -116 3531 3465 -2050 -341 6013 3997 352 2451 2673 488 3653 4073 -269
$$ packed form
1748a063K727M772m520l306N852K329n255M84K110k444P09K834m536k853O396
1763D236K088n706k7M035k193j55K418l701k546N331P53n702Q41N146j982j560
1779A276K134k495j760M298k22o280J136N496k434l020K548k65j369L454p78o289
1795d570J302N493k937m472L328J194j995K288n16m244K079M376m034m827M013
1810c522J609k367J348O74k975J647N021m306m327M739J848m434N53J882k075
1825d685J525L837l955l029N405J736n411J96L462j670L54K782l162k353O065
1840A097J317n518M4M121j798j588K702k086j277N966P79o153O32M871j322k078
1856b91K149m54j520L647o6n515J709O354k016l645K099K22k185L165M20m342
$$ plain form
1872 -269 959 6316 3600 -468 2555 4472 2405 3651 4271 285 1871 5925 2463 -1196 3806
1887 3806 5758 1975 1781 3170 963 2025 5726 1826 -1850 3183 4821 626 601 3203 1591 1816
1903 1816 4381 689 -2578 2330 3973 -1322 -1578 2111 1283 -293 1860 -588 -3057 1537 2893
1918 2893 -2859 -3537 475 -729 -2215 342 -1148 -3618 106 629 -5235 -4869 718 -1394 -4826 -2568
1934 -2568 -2594 -4019 -1501 -424 -4887 -3872 485 -2903 -6301 -3336 -1858 -3835 -2070 -1561 -5187 -4083
1950 -4083 466 -2770 -6025 -2277 -911 -4017 -3567 -2084 -4474 -2990 1420 -1386 -5058 -1705 697
1965 697 -2811 -3110 -596 -2851 -2062 1001 -1508 -4461 -308 2073 -1669 -1561 627 -1275 -1871 879
1981 879 -925 -3019 1626 3313 -1630 -1404 2936 950 -1001 1600 696 -1684 1362 2762 -1377 -713
$$ packed form
1872b69J228N357k716m068L023J917k067J246O20l986J586M054l462l659N002
1887C806J952l783j94J389k207J062L701l900l676N033J638m195k5K602j612K25
1903A816K565l692l267M908J643n295k56L689q28j576K153k448k469M594J356
1918B893n752o78M012j204j486K557j490k470L724N23n864L66N587k112l432K258
1934b568k6j425K518J077m463J015M357l388l398K965J478j977J765N09l626J104
1950d083M549l236l255L748J366l106M50J483k390J484M410k806l672L353K402
1965F97l508k99K514k255P89L063k509k953M153K381l742J08K188j902n96K750
1981H79j804k094M645J687m943K26M340j986j951K601r04k380L046J400m139O64
$$ plain form
1997 -713 4424 3100 440 2447 2080 304 2749 3517 -387 789 5355 2749 -152 2909 4030 1926
2013 1926 3604 3977 145 695 4759 2818 -962 2392 4406 1728 2376 3356 646 1279 4909 2252
2029 2252 -2007 1668 3374 201 614 2544 1007 670 3248 568 -2944 1028 2374 -2376 -2376 577
2045 577 -673 -1581 955 -907 -3471 -185 1316 -3478 -4567 -1309 -1740 -3203 -1869 -2518 -4180 -556
2061 -556 -33 -4805 -4746 -559 -2274 -4642 -2542 -2959 -4778 -1639 -546 -4349 -4462 323 -1474 -4603
2077 -4603 -3141 -2279 -3922 -1966 -835 -4377 -3537 1105 -509 -4287 -1405 -179 -2050 -1324 -299 -3314
2093 -3314 -2405 1702 -153 -3265 -456 1773 -1280 -1200 592 -1387 -1362 1934 -22 -2973 614 3401
2109 3401 -401 -724 1602 446 351 2010 218 -2481 1294 3514 -148 -697 2657 1848 647 2685
$$ packed form
1997g13N137j324k660K007l67j776K445P68l904J176M566k606k901L061J121k104
2013A926J678L73l832N50M064j941l780L354K014k678O48R80k710O33L630k657
2029B252m259L675J706l173M13J930j537l37K578k680l512L972J346m750%K953
2045E77j250r08K536j862k564L286J501m794j089L258m31j463J334o49j662L624
2061e56N23m772N9M187j715k368K100m17j819L139J093l803j13M785j797l129
2077d603J462Q62j643J956J131l542Q40M642j614l778K882J226j871P26J025l015
2093c314R09M107j855l112K809K229l053Q0J792j979K5L296j956k951L587K787
2109C401l802l23K326j156r5J659j792k699L775K220l662n49L354q09j201K038
$$ plain form
2125 2685 1384 -1709 2269 4083 209 -620 2990 2216 812 2805 2617 253 2318 3435 -474 -166
2141 -166 4031 2367 261 2761 3165 520 2687 4009 891 963 4810 3002 -391 1933 3380 1541
2157 1541 2532 3647 557 679 4021 1944 -1703 774 3045 -11 319 1860 -530 -324 2823 688
2173 688 -2522 -220 1396 -1984 -2607 -199 -1402 -2083 828 -1126 -4292 -1238 393 -3508 -3862 -1092
2189 -1092 -2362 -4042 -1915 -1895 -4393 -1734 93 -3739 -4354 -1199 -2492 -4078 -1926 -2331 -4353 -2043
2205 -2043 -651 -3960 -3684 167 -593 -3766 -1897 -1564 -3426 -1453 188 -2714 -2545 1194 -228 -3299
2221 -3299 -1101 180 -1618 -805 334 -2702 -2391 1653 886 -2641 149 2580 -264 -58 943 -997
2237 -997 -566 2609 1107 -2027 800 2835 278 271 2650 851 489 2669 1426 -1605 1121 3350
$$ packed form
2125B685j301l093L978J814l874q29L610p74j404J993j88k364K065J117l909L08
2141a66M197j664k106K500M04k645K167J322l118P2L847j808l393K324J447j839
2157A541R91J115l090J22L342k077l647K477K271l056L30J541k390K06L147k135
2173F88l210K302J616l380o23K408j203o81K911j954l166L054J631l901l54K770
2189a092j270j680K127K0k498K659J827l832o15L155j293j586K152m05k022K310
2205b043J392l309K76L851p60l173J869L33j862J973J641k902J69L739j422l071
2221c299K198J281j798Q13J139l036L11M044p67l527K790K431k844K06J001j940
2237i97M31L175j502l134K827K035k557pK379j799l62K180j243l031K726K229
$$ plain form
2253 3350 477 535 3286 2233 439 2752 2084 128 2282 3304 -238 66 3168 2070 557 2659
2269 2659 2727 349 2609 3902 157 -415 3458 2882 -212 1856 2370 1038 2645 4051 282 -414
2285 -414 3232 2016 -672 981 1938 -416 1206 2657 -365 -850 2820 1349 -1642 -367 1029 -1237
2301 -1237 -1064 770 -1286 -1408 1551 -318 -3243 -1037 569 -2119 -2692 -363 -2248 -2351 66 -1035
2317 -1035 -3550 -1171 581 -2195 -3104 -982 -2067 -3101 -1139 -1902 -4434 -1886 439 -2928 -3758 -904
2333 -904 -1560 -3505 -1390 -2049 -4008 -1706 112 -2964 -3271 -379 -692 -2642 -894 -541 -2836 -1129
2349 -1129 1008 -2127 -2261 1222 1021 -1293 227 1270 -780 467 1996 -464 -882 2553 1946 -1229
2365 -1229 774 2510 972 1060 2596 318 -137 2885 1865 -939 1772 3456 653 680 2702 823
$$ packed form
2253C350k873N8K751j053j794K313o68j956K154J022l542L04L102j098j513K102
2269B659O8k378K260J293l745n72L873n76l094K068N14j332J607J406l769o96
2285d14L646j216k688J653R57k354J622J451l022m85L670j471k991J275J396k266
2301a237J73J834k056j22K959j869k925K206J606k688n73K329j885j03K417j101
2317a035k515K379J752k776r09K122j085j034J962p63k532K548K325l367q30K854
2333i04o56j945K115o59j959K302J818l076l07K892l13j950J748L53k295J707
2349a129K137l135j34L483k01k314J520J043k050J247J529k460m18L435o07l175
2365a229K003J736j538Q8J536k278m55L022j020k804K711J684k803K7K022j879
$$ plain form
2381 823 613 3419 2479 -276 1584 3609 615 576 3102 2293 1457 3407 2856 41 1831 3999 1448
2398 1448 935 3393 2605 661 2703 2731 390 2416 4493 879 168 2743 1658 -348 2096 2703
2414 2703 432 1524 2685 95 -539 2272 1286 -886 560 1231 -607 231 1603 -1009 -1111 1882
2430 1882 742 -2488 -1153 550 -1763 -1249 84 -1549 -2412 308 -685 -3233 -1171 452 -2422 -2605
2446 -2605 -941 -2424 -2872 -330 -807 -3408 -1522 -308 -2593 -2595 -641 -1978 -2885 -1017 -1465 -3532 -1445
2463 -1445 777 -2333 -2863 -172 -770 -2299 -804 -846 -3094 -1054 843 -1964 -2371 596 82 -1817
2479 -1817 -214 354 -1882 -284 1097 -1614 -1846 1750 1111 -1346 273 1522 -270 588 1826 -224
2495 -224 -675 2226 1200 -1321 747 2494 439 1310 2530 569 -197 2911 1732 -1046 1390 3082
$$ packed form
2381H23k10K806r40k755J860K025k994l9K526q09q36J950n51k815J790K168k551
2398A448n13K458p88j944K042K8k341K026K077l614p11K575j085k006K444O07
2414B703k271J092J161k590o34K811r86k172J446O71j838Q38J372k612j02K993
2430A882j140l230J335J703k313N14J333j633q63K720r93k548K062J623k874j83
2446b605J664j483m48K542m77k601J886J214k285kJ954j337r07J868m48k067K087
2463a445K222l110n30K691n98j529J495m2k248K040J897k807m07K967n14j899
2479a817J603N68k236J598J381k711k32L596o39k457J619J249j792Q58J238k050
2495b24m51K901j026k521K068J747k055Q71J220j961p66L108j179k778K436J692
$$ plain form
2511 3082 706 642 2441 1430 730 3390 2351 -461 1600 3038 609 289 2968 1626 1234 2878
2527 2878 2895 -66 1739 3662 1226 -22 2389 1886 207 1834 2064 -16 1526 3121 310 -414
2543 -414 2001 1422 -856 869 1076 -1195 358 2357 -458 -1481 1093 996 -1539 -512 86 -1777
2559 -1777 -691 649 -2077 -2579 893 -48 -2818 -1687 -191 -1893 -2147 -538 -2044 -2926 -650 -824
2575 -824 -3303 -2351 -228 -2206 -2615 -1055 -2636 -3229 -774 -1235 -3909 -2235 -294 -2415 -2815 -686
2591 -686 -1574 -2624 -946 -1318 -3560 -1423 39 -1953 -2736 -575 -1154 -2537 -582 -285 -2368 -920
2607 -920 803 -1526 -2090 760 262 -1426 -60 651 -1366 128 1639 -1089 -1640 1083 1066 -1017 176
2624 176 1384 -301 287 2024 332 -653 2528 1851 -916 379 1955 663 1198 2578 798 18
$$ packed form
2511C082k376o4J799j011p00K660j039k812K061J438k429l20K679j342l92J644
2527B878J7k961J805J923k436j248K411n03j679J627K30k080J542J595k811p24
2543d14K415n79k278J725K07k271J553J999k815j023K574r7k535J027N98j863
2559a777J086J340k726n02L472r41k770J131J496j702k54J609j506q82K276j74
2575h24k479R52K123j978m09J560j581n93K455m61k674J674J941k121m00K129
2591f86q88j050J678l72k242K137J462j992p83K161n79j383J955K97k083J448
2607i20J723k329n64K850m98j688J366P11k017J494J511k728n51K723j7k083J193
2624A76J208j685N88J737j692r85L181o77k767J295J576j292N35J380j780p80
$$ plain form
2640 18 2904 2146 -539 1229 2976 718 332 2454 1046 398 2804 2160 -251 1498 3256 720
2656 720 25 2292 1742 523 2315 2017 -634 1238 3086 634 -212 1938 2036 -441 1430 1588 -275
2673 -275 1413 2808 -45 -1123 1713 1318 -663 528 909 -1078 -78 1693 -863 -1851 918 500
2689 500 -1699 -733 309 -1423 -771 704 -1660 -2292 537 48 -2498 -1404 -88 -1745 -1646 -38 -1935
2706 -1935 -2767 -324 -269 -2843 -1768 145 -2099 -2008 -729 -1568 -2446 -56 -456 -3289 -1326 447 -1736
2723 -1736 -2150 -79 -1093 -1992 -160 -430 -2867 -1171 901 -1284 -2314 92 -238 -1565 161 83
2739 83 -2104 -543 1086 -1217 -2198 704 897 -703 316 678 -1170 225 2003 -308 -1269 1504
2755 1504 1583 -481 1244 1785 346 1209 2816 573 -276 1905 1971 -361 826 2084 511 1027 2298
$$ packed form
2640A8K886p58k685J768J747k258l86K122j408o48K406o44k411J749J758k536
2656G20o95K267n50j219J792k98k651J872J848k452q46K150R8k477J871J58j863
2673b75J688J395k853j078K836l95j981J191L81j987J000J771k556r88K769m18
2689E00k199R66J042j732O52J475k364o32K829m89k546J094J316j657R9J608j897
2706a935q32K443N5k574J075J913k244R1J279q39q78K390m00k833J963J773k183
2723a736m14K071j014q99J832k70k437J696K072k185j030K406l30j327J726p8
2739H3k187J561J629k303r81K902J93j600J019L62j848J395J778k311r61K773
2755A504P9k064J725N41j439Q63J607k243q49K181O6k332J187J258j573N16J271
$$ plain form
2772 2298 699 283 2909 2332 -464 868 2338 1028 569 2218 1055 361 2387 2063 -461 859
2788 859 2765 718 -25 1792 967 -45 2409 2120 -671 776 2790 720 -276 1698 988 -318
2804 -318 1207 1101 -986 3 2257 -164 -1078 884 747 -892 175 309 -1411 -182 1202 -1001
2820 -1001 -2075 476 357 -1502 -676 -84 -1758 -947 735 -1353 -2447 102 206 -1904 -1583 42
2836 42 -1547 -1307 150 -1494 -2574 49 -9 -2587 -1499 281 -1655 -1730 -319 -1553 -2585 -427 -237
2853 -237 -2771 -1849 503 -1499 -2119 -405 -993 -1636 400 162 -2259 -1096 903 -785 -1785 484
2869 484 45 -898 -139 323 -1686 5 1956 3 -1292 590 764 -373 898 1264 -589 389 2134
2886 2134 40 -1107 1465 1839 -101 1037 1598 -124 818 2439 732 -443 2219 2493 -358 1278
$$ packed form
2772B298j599m16K626n77k796J332J470j310m59J649j163o94K026l24k524J320
2788H59J906k047p43J817q25j012K454k89k791J447K014k070r96J974p10j306
2804c18J525j06k087R89K254k421r14J962j37j639J067J34j720J229J384k203
2820a001j074K551j19j859Q26N92j674Q11J682k088j094K549J04k110L21J625
2836D2j589K40J457j644j080K623n8k578J088J780j936p5J411j234j032K158J90
2853b37k534R22K352k002o20J714n88o43K036k38k421J163J999j688j000K269
2869D84m39r43P59M62k009J691J951j953j295J882J74j137J271L66j853R78J745
2886B134k094j147K572L74j940J138N61j722R42J621j707j175K662K74k851J636
$$ plain form
2902 1278 2306 732 1021 2762 1006 110 2464 2543 12 811 2732 1095 1030 2610 1011 3 2514
2919 2514 2238 -463 285 2465 835 134 1558 588 -139 1897 1653 -943 -218 2092 445 -588 1063
2936 1063 564 -529 972 638 -1476 17 1849 360 -1227 388 371 -1110 167 501 -1912 -728
2952 -728 1744 -695 -2076 241 706 -1700 -657 -122 -1864 -1113 583 -1236 -2534 -40 389 -1764
2968 -1764 -1397 -372 -1559 -1201 148 -1662 -2614 -261 107 -2604 -1252 297 -1100 -1311 -2 -1564
2984 -1564 -2338 219 416 -2234 -1148 863 -303 -1076 -30 -566 -1070 495 340 -1857 -1136 1030 -367
3001 -367 -1224 793 88 -547 1061 1045 -1424 -351 1981 163 -1033 874 953 108 1120 1720 -300
3018 -300 377 2530 703 -628 1336 2093 240 1105 1943 104 902 2873 1105 -290 1643 2041 505
$$ packed form
2902A278J028j574K89J741j756q96K354P9k531P99J921j637o5J580j599j008K511
2919B514k76k701P48K180j630p01J424r70p27K036k44k596P25K310j647j033J651
2936A063m99j093J501l34k114J493J832j489j587J615j7j481J277L34k413J184
2952g28K472k439j381K317M65k406J043N35j742P51J696j819j298K494M29k153
2968a764L67J025j187L58J349j810r52K353L68k711J352J549j397k11J309j562
2984a564p74K557J97k650J086K011j166p73J046n36n04J565j55k197P21K166j397
3001c67q57K017p05o35J608j6k469J073K332j818j196J907P9q45J012O00k020
3018c00O77K153j827j331J964P57j853Q65Q38j839P98J971j768j395J933L98j536
$$ plain form
3035 505 884 1928 299 828 2684 1025 -441 1880 2470 177 486 1921 626 677 2278 790 -481
3052 -481 1562 2155 -600 -62 2028 654 22 1308 164 -716 1058 1304 -886 -411 1567 387 -791
3069 -791 441 -54 -1045 345 906 -1654 -928 874 -421 -1707 -198 -378 -1400 -389 -87 -1987 -1386
3086 -1386 590 -893 -2177 -338 -352 -1562 -705 -646 -1927 -1604 278 -1404 -2793 -356 -84 -1803 -1398
3103 -1398 -654 -1867 -1332 355 -1093 -2473 -203 352 -2055 -1679 -183 -879 -1423 -274 -1272 -2328 -90
3120 -90 379 -2083 -1582 470 -799 -1268 10 -518 -1547 355 863 -1659 -787 1207 287 -634 634
3137 634 373 -748 1043 1261 -932 -148 1550 579 -876 899 944 -11 1072 1459 -406 398 2422
3154 2422 1032 -296 913 1699 117 1101 1723 46 849 2866 1047 -790 1402 2079 461 965
$$ packed form
3035E05L79J044j629N29J856j659j466K321N90k293L09J435j295N1J601j488j271
3052d81K043N93k755N38K090j374o32J286j144q80J774K46k190M75J978j180j178
3069g91J232m95r91J390N61k560P26J802j295j286J509j80j022J011L02j900O01
3086a386J976j483j284J839j4j210Q57N9j281L23J882j682j389K437K72j719M05
3103a398P44j213N35J687j448j380K270N55k407L76J496o96n44J149r98j056K238
3120i0M69k462N01K052j269m69J278n28j029J902N08k522Q72J994r20r21J268
3137F34k61j121J791K18k193P84J698r71j455J775M5r55J083L87j865Q04K024
3154B422j390j328J209P86j582R84O22j677Q03K017j819j837K192O77j618N04
$$ plain form
3170 965 1386 87 1016 2031 623 -342 1716 2054 146 579 1321 87 507 1647 869 -443 1219
3187 1219 1634 -551 -609 1364 413 -293 721 122 -1216 984 997 -892 -623 1078 -69 -544 223 -341
3205 -341 -1370 277 399 -1759 -1359 512 -267 -1463 -378 -449 -1430 -248 26 -2184 -1776 341 -629
3222 -629 -1694 -690 -666 -1664 -990 -499 -2131 -1552 270 -1107 -2239 -790 62 -1519 -1300 48 -1903
3239 -1903 -1410 185 -1116 -2649 -767 260 -1299 -1230 -377 -1317 -1119 349 -811 -1797 -618 844 -1468
3256 -1468 -1061 379 -387 -747 595 -171 -1148 563 1060 -846 -897 759 92 -756 706 445 -560 1198
3274 1198 1557 -274 -317 1792 666 79 1251 992 304 1452 1924 -62 263 2428 1753 74 1412
3291 1412 1719 505 1575 1970 400 713 2773 1640 282 1536 1920 -32 1292 1638 399 402 2264
$$ packed form
3170I65M21j299R29J015j408r65K058L38j908M33P42j234M20J140p78j312J662
3187A219M15k185n8J973r51p06J014n99j338K200J3j889K69J701j147m75P67n64
3205c41j029J647J22k158M00J871p79j196J085p1r81J182K74k210M08K117r70
3222f29j065J004K4r98O74M91j632N79J822j377j132J449Q52j581K19J348j951
3239a903M93J595j301j533J882J027j559O9Q53r40J98J468j160r86J179J462k312
3256a468M07J440p66l60J342p66r77J711M97j906n1J656o67q48J462k61j005J758
3274A198L59j831m3K109j126n87J172k59o88J148M72j986L25K165o75j679J338
3291A412L07j214J070L95j570L13K060j133j358J254L84j952J324L46j239LJ862
$$ plain form
3308 2264 1126 -392 1384 2056 313 342 1465 386 402 1634 737 -829 1031 1438 -467 -311 1221
3325 1221 294 -219 651 273 -1371 622 1250 -994 -859 940 27 -774 23 -733 -1492 -13 611 -1746
3343 -1746 -1731 472 -593 -1307 -461 -649 -1895 -372 -188 -2028 -1605 -57 -501 -2065 -574 -182 -1199
3360 -1199 -679 -137 -1576 -1666 118 -816 -1928 -650 -147 -1459 -740 -135 -1279 -1247 480 -662 -2047
3377 -2047 -731 275 -1292 -835 -101 -1110 -853 640 -298 -1612 -85 791 -724 -785 345 -429 -307
3394 -307 1000 148 -1154 769 1572 -372 -110 995 509 325 1305 664 -634 1497 2224 369 202
3411 202 1814 1320 292 1544 1211 444 1603 2310 51 416 2151 1425 241 1628 1746 523 1272
3428 1272 1774 254 -131 2452 1288 -297 1294 1796 562 972 1202 343 399 2105 1309 -697 654
$$ packed form
3308B264j138j518J776O72j743K9J123j079J6J232q97j566J860M07j905J56J532
3325A221r27n13Q70l78j644J993O28k244J35J799r13q01P97p56p59J479O24k357
3343a746J5K203j065p14Q46j88j246J523J84j840M23J548m44j564J491L92j017
3360a199N20N42j439r0J784r34j112J278N03j312P19O05j144L2J727j142j385
3377b047J316J006j567M57P34j009K57J493r38j314J527Q76j515o1J130p74J22
3394c07J307q52j302J923Q03j944K62J105m86j84R80o41j298K131P27j855j67
3411B02J612m94j028J252l33p67J159P07k259L65J735p26j184J387J18j223P49
3428A272N02j520l85K583j164j585J591N02j234M10K30q59N6J706p96k006J351
$$ plain form
3445 654 1747 161 534 897 -17 -266 1050 436 -1329 163 966 -461 -556 367 -624 -754 312 -586
3463 -586 -1918 -253 119 -1412 -1414 69 -377 -1209 -344 -769 -1826 -482 316 -1607 -1612 -146 -602 -1767
3481 -1767 -492 -745 -1785 -698 181 -1529 -2040 -643 -671 -1659 -839 -628 -1256 -752 -46 -1983 -1893 200
3499 200 -386 -1935 -1095 -192 -1041 -881 -3 -1077 -1109 644 -461 -1766 -653 434 -914 -655 291 -886
3517 -886 -621 1009 310 -886 391 1017 -483 -270 726 -53 -146 1053 332 -655 989 1656 62 -32
3535 -32 1373 511 119 930 786 3 927 1645 218 272 1701 1262 284 921 1029 250 1205 1564 254
3554 254 312 1778 1532 222 1155 1123 41 842 1770 246 44 1557 1003 -400 747 953 275 792
3572 792 1281 -60 -257 1149 592 -838 137 1056 -474 86 508 -352 -669 675 32 -1138 -211 348
$$ packed form
3445F54J093j586L73L63r14k49J316o14j765J492Q03j427r5R23r91j30J066q98
3463e86j332J665L72j531kJ483m46q32Q65m25j057J344P98j923nJ466m56j165
3481a767J275k53j040J087Q79j710n11J397k8r88Q20K11o28N04P06j937R0K093
3499B00n86j549Q40R03q49J60Q78j074l2J753j105j305J113J087j348K59R46j177
3517h86K65J630o99j196J277O26j500K13R96p79r3J199p21r87J644O67j594r4
3535c2J405q62l92Q11j44p83R24P18j427N4J429m39r78O37J08p79R55L59j310
3554B54N8J466k46j310R33l2j082Q01R28j524k02J513n54j403J147K06o78N17
3572G92M89j341j97J406n57j430R75R19j530N60M22q60l17J344o43j170R27N59
$$ plain form
3590 348 -743 -974 -207 -882 -700 404 -471 -1807 -370 243 -1383 -1708 -528 -733 -1327 -328 -735 -1940
3608 -1940 -726 220 -1791 -1401 -621 -753 -1289 -630 -1047 -1770 -623 -11 -1377 -1631 -47 -838 -1527 -858
3626 -858 -372 -1335 -313 179 -1116 -1504 28 -240 -1353 -596 98 -807 -586 147 -964 -1246 303 260
3644 260 -1122 -262 201 -758 -298 331 -531 -402 1078 700 -747 -47 1066 -200 196 1113 265 100
3662 100 1403 1154 -126 943 1798 298 609 1363 835 328 1278 1092 126 1352 1784 654 81 1634
3680 1634 905 141 1274 1151 50 1036 1824 722 249 1330 949 492 1227 1209 -62 584 1402 -16
3698 -16 -263 907 1014 -121 751 1151 -332 347 1091 -375 -578 594 418 -804 -280 617 -656 -436
3716 -436 625 -601 -731 423 -119 -1232 -577 400 -908 -811 44 -1044 -810 380 -285 -1426 -912 108
$$ packed form
3590C48j091k31P67o75J82J104q75j336J437O13j626l25J180k05n94R99m07j205
3608a940J214R46k011L90P80j32n36O59m17p23J147O12j366k54J584p91o89O69
3626h58M86r63J022M92j295l88J532k68j113P57O94r05K21P33j111k82J549m3
3644B60j382Q60M63r59M60O29q62J29J480l78j447P00J113j266L96R17q48j65
3662A00J303k49j280J069Q55j500L11P54n28n07R50j86r66J226M32j130n73J553
3680A634p29p64J133j23j101R86P88j102m73J081l81m57P35j8j271O46Q18j418
3698a6k47J170J07j135Q72M00j483O79P44j466k03J172j76j222N24Q97j273K20
3716d36J061j226j30J154n42j113O55R77j308R7Q55j088K34J190o65j141N14J020
$$ plain form
3734 108 -1361 -1230 -283 -959 -1149 -643 -607 -1663 -995 -132 -1384 -1572 -356 -610 -1520 -301 -588 -1793
3752 -1793 -670 -143 -1459 -1440 8 -623 -1523 -629 -404 -1245 -537 -157 -871 -969 347 60 -1225 -433 137
3771 137 -590 -233 490 -676 -803 706 302 -635 258 471 -585 37 954 -87 -622 1402 885 -580
3789 -580 783 1075 466 495 1069 415 340 1282 1408 100 648 1623 593 558 1491 1069 178 1491 1151 320
3809 320 941 1849 587 605 1491 871 525 1023 1209 -59 1067 1716 360 158 1024 967 96 916 784
3828 784 -354 378 1095 27 -176 1009 844 -428 390 813 -227 326 870 -248 -686 890 312 -756
3846 -756 -264 330 -478 -61 464 -719 -856 427 75 -1091 -637 -153 -995 -888 -150 -955 -1452 -100 -392
3865 -392 -1531 -799 -180 -1189 -1186 -166 -991 -1236 -496 -406 -1575 -533 476 -744 -1287 -481 -421 -1508 -296
$$ packed form
3734A08j469J31R47o76j90N06L6j056O68Q63j252j88J216k54r10J219k87j205
3752a793J123N27j316J9J448o31r00Q94K25q41P08L80p14r8J316k87j285P92N70
3771A37p27L57P23j166j27J509m04r37Q93K13j056O22R17j041n35K024n17j465
3789e80J363K92o09K9N74o54p5R42J26j308N48R75j030l5R33m22q91J313l40q31
3809C20O21R08j262J8Q86o20l46M98J86j268J126O49j356k02Q66n7q71Q20j32
3828G84j138P32P17j068k03J185j65j272Q18M23j040N53N44j118m38J576n78j068
3846g56M92N94q08M17N25j183j37J283l52j166M54M84q42J07P38q05m97J352k92
3865c92j139P32O19j009LJ020q25k45P40R0j169J042J009j220n43Q06O0j087J212
$$ plain form
3884 -296 -461 -1363 -789 273 -861 -1036 -159 -429 -945 -602 -329 -1132 -596 282 -638 -885 -226 170 -892
3903 -892 96 368 -551 -301 317 -391 -556 669 372 -324 79 685 -57 476 887 -19 -159 973 881 -73
3923 -73 507 1424 241 363 1083 344 298 963 1201 -209 205 1482 353 373 1296 606 279 1229 509 112
3943 112 744 1813 222 21 1288 603 272 1086 925 283 661 1349 432 182 1088 794 -182 920 954
3962 954 -439 399 1168 242 -296 612 616 -326 531 579 -370 -80 352 -166 -863 564 229 -986 -360 -86
3982 -86 -714 -522 273 -620 -1194 -18 -393 -1259 -621 -28 -671 -675 -75 -393 -1017 -71 -196 -1240 -505 230
4002 230 -641 -786 -241 -985 -1539 -260 -227 -1416 -914 136 -661 -1132 -352 -721 -1066 -171 -179 -1254 -689 189
4022 189 -956 -1131 82 -497 -1168 -307 -168 -1202 -239 359 -154 -1015 357 155 -408 65 167 -396 -83
$$ packed form
3884b96j65r02N74J062j134j75Q77k70n16L43K73q03N36Q78r20k47O59L96j062
3903h92R88K72r19K50O18p08j65J225k97o96M03O06p42N33M11r06j40J132r2r54
3923g3N80R17j183J22P20p39m6O65K38j410M14J277j129K0R23o90l27R50p20l97
3943A12O32J069j591k01J267o85l31Q14j61o42L78O88r17k50R06k94r76J102L4
3962I54j393Q38P69r26n38R08Mr42Q57M8r49K90M32n18o97J427l35j215O26K74
3982h6o28J92P95q93n74J176l75q66O38N93o43mO00l18o24R46j25j044P35P35
4002B30q71j45N45p44n54J279L3j189N02J050p97m71P80l69l45Q95qj075N65Q78
4022A89j145j75J213n79o71Q61J39j034R63N98n13q61J372k02n63M73J02n63L13
$$ plain form
4041 -83 971 63 -484 560 619 -355 120 480 -160 277 1351 7 -209 790 898 0 489 963 321
4060 321 459 942 275 -7 1246 1056 -228 742 1266 455 688 980 841 24 1101 1176 -75 646 1026
4079 1026 600 135 1265 377 164 1021 778 -154 277 1172 66 -243 993 562 -215 816 315 -374
4097 -374 191 729 -51 -394 798 396 -212 60 261 -559 -149 553 -496 -514 5 37 -931 -491 88 -600
4117 -600 -367 299 -741 -1294 -30 -287 -1210 -530 163 -958 -859 -198 -951 -1337 -127 40 -1228 -752 -77
4136 -77 -793 -1188 162 -932 -920 -296 -250 -1264 -1120 172 -899 -926 -342 -479 -974 -229 -123 -1118 -406 622
4156 622 -770 -1082 -66 -239 -731 -126 122 -854 -252 622 -259 -695 282 248 -449 375 541 -620 -13
4175 -13 1077 -1 -278 697 776 -31 483 818 -209 361 1210 418 -21 1165 1330 -149 434 1241 466
$$ packed form
4041h3J054r08n47J044N9r74M75L60o40M37J074j344k16R99J08q98M89M74o42
4060C21J38M83o67k82J253j90j284R70N24q11K33K92j39q17J077P5j251P21L80
4079A026m26m65J130q88k13Q57k43r32M31Q95j106l09J236m31p77J031n01o89
4097c74N65N38p80l43J192m02o08K72K01q20M10P02j049j8N19L2r68M40N79o88
4117f00K33O66j040n53J264k57r23O80O93j121R9O61p53l86J210J67j268M76O75
4136g7p16l95J350j094J2O24M6j014J44J292j071k7N84j37m95P45J06r95P12J028
4156F22j392l12J016j73m92O05K48r76O02Q74q81m36R77l4o97Q24J66j161O07
4175a3J090j078k77R75P9q07N14L35j027N70Q49p92m39J186J65j479N83Q07p75
$$ plain form
4194 466 112 1005 393 101 1034 1088 -25 281 1096 312 371 947 649 165 1077 601 -322 88 1032 179
4214 179 54 846 502 49 669 645 -287 352 981 89 -329 744 4 -27 173 274 -612 -105 721 -149
4234 -149 -916 55 -155 -797 -317 112 -906 -538 141 -259 -806 -246 377 -888 -425 -16 -874 -574 4
4253 4 -948 -1266 -284 3 -1140 -718 127 -852 -884 16 -415 -977 -156 -90 -1177 -804 -55 -716 -791 -166 -601
4274 -601 -1208 -112 107 -1198 -566 48 -693 -963 98 -494 -646 109 -135 -822 -562 521 -234 -628 117
4293 117 -7 -398 272 382 -379 -449 592 -73 -222 327 524 -242 509 880 53 564 1010 164 -334 949
4313 949 940 64 550 915 70 395 1345 501 -73 1060 897 53 415 1160 609 314 926 889 110 1016 1081
4334 1081 76 544 1044 327 -178 900 533 -134 963 793 39 285 739 341 -219 550 433 -187 457
$$ packed form
4194D66l54Q93o12k92R33N4j113L06Q15p84N9N76k98m84R12m76r23M10R44q53
4214A79j25P92l44m53O20k4r32O39O29q92m18J073p40l1K00J01q86N07Q26q70
4234a49p67R71k10o42M80M29j018L68O79m00n47N60O23j265M63M09q58L00N78
4253Dr52l18R82K87j143M22Q45r79l2R00m31n62Q21O6j087L73P49o61p5O25m35
4274f01o07J096K19j305O32O14p41k70J061n92j52P55k44o87K60J083p55l94P45
4293A17j24l91O70J10p61p0J041o65j49N49J97p66P51L71q27N11M46q46m98J283
4313I49rq76M86L65q45L25R50q44n74J133j63q44L62P45n51k95O12l7p79R06O5
4334A081j005M68N00p17n05J078l67o67J097j70p54K46M54l98n60P69j17o20O44
$$ plain form
4353 457 862 -183 46 1087 -61 -524 528 16 -117 -23 191 -394 -245 365 -169 -643 -19 72 -990
4372 -990 -261 -37 -827 -685 546 -725 -1119 -172 -516 -969 -685 -391 -724 -852 -27 -954 -1206 -126 -364
4391 -364 -1075 -568 -156 -867 -682 -6 -446 -1387 -361 -239 -1086 -678 -269 -683 -698 -118 -826 -1028 -25 361
4411 361 -547 -543 180 -421 -797 116 -161 -774 279 132 -930 75 352 -200 -414 121 139 -506 379 459
4431 459 -347 181 817 204 -145 674 703 -38 680 1023 160 238 1310 566 -132 823 613 317 744 1059
4451 1059 253 388 1208 571 59 838 873 81 802 1036 623 185 1117 696 88 1189 914 142 797 1179
4471 1179 109 194 873 412 -83 653 653 -307 270 402 227 -74 686 237 -178 17 525 -601 -270 513
4491 513 -82 -425 -24 -41 -676 -495 145 -607 -542 229 -484 -734 -14 -167 -720 -334 -218 -1068 -887 147
$$ packed form
4353D57M05j045K29J041j148m63J052n12j33R4K14n85J49O10n34m74O24R1j062
4372i90P29K24p90J42J231j271l94R47l44m53K84K94l33j28Q25r27k52J080k38
4391c64p11N07M12p11J85O76m40r41J026J22q47M08M09m14j5N80p08k02J003L86
4411C61r08MP23o01l76R13k77o13J053j47j062J005K77n52k14N35J8o45Q85Q0
4431D59q06N28O36o13l49Q19K9p41P18L43q63P8J072p44o98R55k10k96M27L15
4451A059q06J35Q20o37n12P79L5p92P21K34m13m38R32m21o08J101k75p72O55L82
4471A179j070Q5O79m61m95P36%r60N77J32j75l01P60m49m15J95N08j126L31P83
4491E13n95l43M01j7o35J81O40p52O5P71p13k50P20j53n53L86J16q50J81J034
$$ plain form
4511 147 -300 -1011 -403 -137 -881 -644 -286 -1142 -851 -69 -795 -1248 -463 -141 -923 -958 -395 -856 -608 -324
4531 -324 -838 -797 39 -13 -820 -579 -181 -521 -326 147 -473 -817 -32 -127 -396 -606 315 -188 -383 398 9
4552 9 -154 512 377 -245 -308 403 60 -281 631 377 -411 489 734 -253 -34 988 274 224 462 454 1 420
4574 420 802 84 485 938 323 161 822 516 -8 474 860 240 313 786 251 141 337 855 13 483
4594 483 724 432 105 826 572 -302 723 602 -294 170 785 -66 105 587 285 -340 290 488 -327 -165
4614 -165 475 -113 -164 349 -43 -658 -276 323 -266 -750 -11 -65 -600 -162 162 -655 -164 112 -700 -906 -26
4635 -26 -311 -996 -226 -198 -824 -491 14 -640 -671 -352 -537 -1199 -76 -421 -989 -336 -15 -900 -812 4 -540
4656 -540 -1215 -269 -221 -874 -407 -204 -509 -546 -131 -171 -619 -374 -158 -804 -312 11 -398 -791 238 -521 -420
$$ packed form
4511A47m47p11O08K66p44K37L58q56K91P82p26m53P85L22p82l5N63m61K48K84
4531c24n14M1Q36n2q07K41L98l40J95M73o20l44P85r5k69k10R21n03j95P81l89
4552Ij63O66j35o22o3P11l43l41R12k54p88R00K45r87K19J022p14n0K38qm53M19
4574D20L82p18M01M53o15j62O61l06n24M82L86o20P3M73n35j10J96N18q42M70
4594D83K41k92l27P21k54q74J025j21q96M64O15q51J71M82l02o25O30J98q15J62
4614a65O40n88n1N13l92o15L82N99n89m84P39n4n35M38L24q17M91K76q12k06Q80
4635b6k85o85P70K8o26L33N05o54l1L19j85o62J123l45n68O53L21q85Q8Q16n44
4656e40o75R46M8o53M67K03l05l7M15m0m48K45K16o46M92L23m09l93J029p59J01
$$ plain form
4677 -420 -46 266 -707 -227 362 -81 -43 388 169 -576 349 678 -231 -102 765 425 -60 421 157 -38
4697 -38 555 613 231 183 682 735 28 458 660 194 713 617 246 -13 1222 452 161 591 909 -183 446
4718 446 886 -198 415 822 435 -312 700 912 290 284 665 52 225 845 541 -359 448 658 -15 -16 431
4739 431 -184 -126 490 0 -541 290 351 -305 -521 281 -254 -676 -41 -227 -742 -235 131 -676 -650 -114 -491
4760 -491 -413 71 -624 -980 -412 16 -743 -783 62 -658 -712 -364 -420 -1105 -375 -244 -823 -738 16 -520 -687 -379
$$ packed form
4677d20L74L12r73M80N89m43L8M31k19p45R25L29r09J29Q67l40m85M81k64j95
4697c8N93N8l82m8M99N3p07M30K02m66N19r6l71k59J235p70k91M30L18j092O29
4718D46M40j084O13M07l87p47J012K12o22oL81o13J73O20l04r00Q07K10o73jM47
4739D31o15N8O16m90n41Q31O1o56k16Q02n35m22O35j86n15N07L66q07K6N36l77
4760d91P8M84o95l56N68M28p59m0Q45p20n4L48n6o85P30J31n79Q5P54n36j67L08
$$ [...]
8191A79
##END NTUPLES=NMR FID
##END=
