##TITLE=1H_TG-2290-3
 CDCl3, 8 sc, 
 3.7.2020
##JCAMPDX= 6.0         $$ Bruker NMR JCAMP-DX V2.0
##DATA TYPE= NMR FID
##DATA CLASS= NTUPLES
##ORIGIN= UXNMR, Bruker Analytische Messtechnik GmbH
##OWNER= root
$$ XWIN-NMR		Version 3.5
$$ Mon Aug  3 12:04:39 2020 Russian Standard Time (UT+4h)  she@DPX200
##.OBSERVE FREQUENCY= 200.1314999998
##.OBSERVE NUCLEUS= ^1H
##.DELAY= (6, 6)
##.ACQUISITION MODE= SIMULTANEOUS
##.ACQUISITION SCHEME= undefined
##.AVERAGES= 8
##.DIGITISER RES= 18
##SPECTROMETER/DATA SYSTEM= spect
##.PULSE SEQUENCE= zg30
##.SOLVENT NAME= CDCl3
##.SHIFT REFERENCE= (INTERNAL, CDCl3, 0, 15.7039)
##AUDIT TRAIL= $$ (NUMBER, WHEN, WHO, WHERE, WHAT)
$$ ##TITLE= Audit trail, XWIN-NMR		Version 3.5
$$ ##JCAMPDX= 5.01
$$ ##ORIGIN= Bruker BioSpin GmbH
$$ ##OWNER= she
$$ F:/spectra/data/she/nmr/H-F/1/audita.txt
$$ ##AUDIT TRAIL=  $$ (NUMBER, WHEN, WHO, WHERE, WHAT)
(   1,<2020-08-03 12:03:07.50 +0400>,<she>,<DPX200>,
      <created by zg, POWCHK disabled, PULCHK disabled
       configuration hash MD5:
       00 E9 B6 7A A2 85 ED C7 34 08 36 98 17 FE 4E 26
       data hash MD5: 16K
       8C 2E 74 C9 B0 BC A4 DE 94 75 C9 C4 23 2A F6 FF>)
$$ ##END=
$$ 
$$ hash MD5
$$ F6 3B 13 7F BB DA D7 8D A1 16 A1 9C E3 1C 8E C3
##$RELAX= 
##$RELAX= 
##$RELAX= 
##$RELAX= 
##$RELAX= 
##$RELAX= 
$$ Bruker specific parameters
$$ --------------------------
##$DU= <F:/spectra>
##$EXPNO= 1
##$NAME= <H-F>
##$PROCNO= 1
##$TYPE= <nmr>
##$USER= <she>
##$AMP= (0..31)
100 100 100 100 100 100 100 100 100 100 100 100 100 100 100 100 100 100 
100 100 100 100 100 100 100 100 100 100 100 100 100 100 
##$AQSEQ= 0
##$AQ_mod= 1
##$AUNM= <au_zg>
##$AUTOPOS= <>
##$BF1= 200.13
##$BF2= 200.13
##$BF3= 200.13
##$BF4= 200.13
##$BF5= 200.13
##$BF6= 200.13
##$BF7= 200.13
##$BF8= 200.13
##$BYTORDA= 1
##$CFDGTYP= 0
##$CFRGTYP= 5
##$CHEMSTR= <none>
##$CNST= (0..31)
1 1 145 1 1 1 1 1 1 1 1 1 1 1 1 1 1 1 1 1 1 1 1 1 1 1 1 1 1 1 1 1 
##$CPDPRG= <>
##$CPDPRG1= <>
##$CPDPRG2= <>
##$CPDPRG3= <>
##$CPDPRG4= <mlev>
##$CPDPRG5= <mlev>
##$CPDPRG6= <mlev>
##$CPDPRG7= <mlev>
##$CPDPRG8= <mlev>
##$CPDPRGB= <>
##$CPDPRGT= <>
##$D= (0..31)
0 1.2 0 0 0 0 0 0 0 0.06 0 0.03 0 0 0 0 0.0002 0 0 0 0 0 0 0 0 0 0 0 0 
0 0 0 
##$DATE= 1596441786
##$DBL= (0..7)
120 120 120 120 120 120 120 120 
##$DBP= (0..7)
150 150 150 150 150 150 150 150 
##$DBP07= 0
##$DBPNAM0= <>
##$DBPNAM1= <>
##$DBPNAM2= <>
##$DBPNAM3= <>
##$DBPNAM4= <>
##$DBPNAM5= <>
##$DBPNAM6= <>
##$DBPNAM7= <>
##$DBPOAL= (0..7)
0.5 0.5 0.5 0.5 0.5 0.5 0.5 0.5 
##$DBPOFFS= (0..7)
0 0 0 0 0 0 0 0 
##$DE= 6
##$DECBNUC= <off>
##$DECIM= 24
##$DECNUC= <off>
##$DECSTAT= 4
##$DIGMOD= 1
##$DIGTYP= 9
##$DL= (0..7)
0 120 120 120 120 120 120 120 
##$DP= (0..7)
150 150 150 150 150 150 150 150 
##$DP07= 0
##$DPNAME0= <>
##$DPNAME1= <>
##$DPNAME2= <>
##$DPNAME3= <>
##$DPNAME4= <>
##$DPNAME5= <>
##$DPNAME6= <>
##$DPNAME7= <>
##$DPOAL= (0..7)
0.5 0.5 0.5 0.5 0.5 0.5 0.5 0.5 
##$DPOFFS= (0..7)
0 0 0 0 0 0 0 0 
##$DQDMODE= 0
##$DR= 18
##$DS= 0
##$DSLIST= <SSSSSSSSSSSSSSS>
$$ [...]
##$SUBNAM2= <"">
##$SUBNAM3= <"">
##$SUBNAM4= <"">
##$SUBNAM5= <"">
##$SUBNAM6= <"">
##$SUBNAM7= <"">
##$SUBNAM8= <"">
##$SUBNAM9= <"">
##$SW= 24.9337058888022
##$SWIBOX= (0..15)
0 0 2 0 0 0 0 0 0 0 0 0 0 0 0 0 
##$SW_h= 4990.01996007984
##$TD= 16384
##$TD0= 1
##$TE= 0
##$TE2= 300
##$TE3= 300
##$TEG= 300
##$TL= (0..7)
0 120 120 120 120 120 120 120 
##$TP= (0..7)
150 150 150 150 150 150 150 150 
##$TP07= 0
##$TPNAME0= <>
##$TPNAME1= <>
##$TPNAME2= <>
##$TPNAME3= <>
##$TPNAME4= <>
##$TPNAME5= <>
##$TPNAME6= <>
##$TPNAME7= <>
##$TPOAL= (0..7)
0.5 0.5 0.5 0.5 0.5 0.5 0.5 0.5 
##$TPOFFS= (0..7)
0 0 0 0 0 0 0 0 
##$TUNHIN= 0
##$TUNHOUT= 0
##$TUNXOUT= 0
##$USERA1= <user>
##$USERA2= <user>
##$USERA3= <user>
##$USERA4= <user>
##$USERA5= <user>
##$V9= 5
##$VALIST= <valist>
##$VCLIST= <CCCCCCCCCCCCCCC>
##$VD= 0
##$VDLIST= <DDDDDDDDDDDDDDD>
##$VPLIST= <PPPPPPPPPPPPPPP>
##$VTLIST= <TTTTTTTTTTTTTTT>
##$WBST= 1024
##$WBSW= 4
##$XGAIN= (0..3)
0 0 0 0 
##$XL= 0
##$YL= 0
##$YMAX_a= 142812
##$YMIN_a= -265113
##$ZGOPTNS= <>
##$ZL1= 120
##$ZL2= 120
##$ZL3= 120
##$ZL4= 120
##$ABSF1= 10
##$ABSF2= 0
##$ABSG= 5
##$ABSL= 3
##$ALPHA= 0
##$AQORDER= 0
##$ASSFAC= 0
##$ASSFACI= 0
##$ASSFACX= 0
##$ASSWID= 0
##$AUNMP= <proc_1d>
##$AZFE= 0.1
##$AZFW= 0.1
##$BCFW= 1
##$BC_mod= 2
##$BYTORDP= 1
##$COROFFS= 0
##$CY= 11.3945322036743
##$DATMOD= 1
##$DC= 2
##$DFILT= <>
##$DTYPP= 0
##$F1P= 16.9975609425685
##$F2P= -3.02152046262296
##$FCOR= 0.5
##$FTSIZE= 0
##$FT_mod= 4
##$GAMMA= 1
##$GB= 0.15
##$INTBC= 1
##$INTSCL= 1
##$ISEN= 128
##$LB= 0.24
##$LEV0= 0
##$LPBIN= 0
##$MAXI= 10000
##$MC2= 0
##$MEAN= 0
##$ME_mod= 0
##$MI= 1.114404
##$NCOEF= 0
##$NC_proc= 0
##$NLEV= 6
##$NOISF1= 3.799351
##$NOISF2= 2.8
##$NSP= 1
##$NTH_PI= 0
##$NZP= 0
##$OFFSET= 15.70392
##$PC= 1
##$PHC0= -9952.072
##$PHC1= 14.00093
##$PH_mod= 1
##$PKNL= yes
##$PPARMOD= 0
##$PSCAL= 0
##$PSIGN= 0
##$REVERSE= no
##$SF= 200.130013532006
##$SI= 16384
##$SIGF1= 3
##$SIGF2= 2
##$SINO= 400
##$SIOLD= 16384
##$SREGLST= <1H.CDCl3>
##$SSB= 0
##$STSI= 0
##$STSR= 0
##$SW_p= 3612.71676300578
##$SYMM= 0
##$S_DEV= 0
##$TDeff= 0
##$TDoff= 0
##$TI= <>
##$TILT= no
##$TM1= 0
##$TM2= 0
##$TOPLEV= 0
##$USERP1= <user>
##$USERP2= <user>
##$USERP3= <user>
##$USERP4= <user>
##$USERP5= <user>
##$WDW= 1
##$XDIM= 8192
##$YMAX_p= 0
##$YMIN_p= 0
$$ End of Bruker specific parameters
$$ ---------------------------------
##NTUPLES= NMR FID
##VAR_NAME=  TIME,          FID/REAL,        FID/IMAG
##SYMBOL=    X,             R,               I
##VAR_TYPE=  INDEPENDENT,   DEPENDENT,       DEPENDENT
##VAR_FORM=  AFFN,          ASDF,            ASDF
##VAR_DIM=   8192,          8192,            8192
##UNITS=     SECONDS,       ARBITRARY UNITS, ARBITRARY UNITS
##FACTOR=    0.0002004,     1,               1
##FIRST=     0,             0,               0
##LAST=      1.6414764,     0,               0
##MIN=       0,             -265113,         0
##MAX=       1.6414764,     142812,          0
$$ Real data points
##PAGE= N=1
##DATA TABLE= (X++(R..R)), XYDATA
$$ [...]
$$ plain form
1734 4611 4357 4760 4830 4464 4509 4650 4540 4623 4523 4143 4047 4344 4034 3577 3696 3771 3225 3177 3383 3247 2854 2637
1756 2637 2338 2160 2325 1972 1165 1189 1567 1176 575 428 500 257 -13 -592 -1087 -767 -515 -1313 -2014 -1675
1776 -1675 -1474 -1911 -2390 -2598 -2687 -2447 -2803 -3623 -3636 -2907 -3038 -3958 -4292 -3779 -3657 -3899 -4423 -4912 -4400 -3871
1796 -3871 -4440 -5143 -4734 -4133 -4355 -4900 -4960 -4656 -4198 -4204 -4794 -5024 -4134 -3591 -4030 -4387 -3908 -3513 -3418 -3511 -3707
1817 -3707 -3302 -2494 -2465 -3057 -2725 -1831 -1531 -1770 -1723 -1536 -1153 -667 -608 -870 -371 334 317 158 633 912 1010
1838 1010 1311 1405 1312 1833 2335 2163 2227 2723 2803 2756 3173 3372 3211 3321 3705 3720 3817 4087 4043 4030 4353 4327 3921
1861 3921 4186 4607 4484 4092 4276 4397 4531 4483 4080 3830 4226 4532 3910 3426 3744 4108 3875 3477 3041 3145
1881 3145 3540 3367 2407 2137 2818 2879 2111 1667 1674 1896 1845 1163 427 600 1112 617 -273 -271 74 -56 -560 -1175
$$ packed form
1734D611k54M03P0l66M5J41j10Q3j00l80r6K97l10m57J19P5n46m8K06j36l93k17
1756B637k99j78J65l53q07K4L78l91o01j47P2k43k70n79m95L20K52p98p01L39
1776a675K01m37m79k08q9K40l56q20j3P29j31r20l34N13J22k42n24m89N12N29
1796c871n69p03M09O01k22n45o0L04M58on90k30Q90N43m39l57M79L95R5r3j96
1817c707M05Q08K9n92L32Q94L00k39M7J87L83M86N9k62M99P05j7j59M75K79R8
1838A010L01R4r3N21N02j72O4M96Q0m7M17J99j61J10L84J5R7K70m4j3L23k6m06
1861C921K65M21j23l92J84J21J34m8m03k50L96L06o22m84L18L64k33l98m36J04
1881C145L95j73r60k70O81O1p68m44PK22n1o82p36J73N12m95q90KL45j30n04o15
$$ plain form
1903 -1175 -1461 -1081 -989 -1925 -2625 -2157 -1727 -2264 -2911 -3047 -2936 -2769 -3105 -3747 -3920 -3407 -3333 -4048 -4243 -3911
1923 -3911 -3838 -3900 -4258 -4494 -4395 -4000 -4154 -4544 -4411 -3993 -4086 -4279 -4135 -4067 -4043 -3866 -3953 -4048 -3768 -3365 -3384 -3351 -3049
1946 -3049 -2985 -2948 -2616 -2492 -2630 -2346 -1898 -1716 -1652 -1330 -1312 -1017 -518 -515 -774 -426 263 346 300 478 767 1168
1968 1168 1488 1312 1164 1741 2294 2023 1823 2285 2684 2876 2959 2775 2912 3368 3678 3157 3038 3685 3973 3814
1988 3814 3554 3645 4006 4435 4109 3473 3733 4450 4289 3670 3561 3928 4177 4008 3604 3375 3697 3975 3448 2843
2008 2843 2946 3401 3210 2769 2501 2347 2667 2489 1812 1533 1922 1877 1209 915 1090 967 772 567 156 -29
2028 -29 101 -171 -755 -891 -715 -1038 -1263 -1509 -1666 -1737 -1785 -2100 -2590 -2554 -2510 -2795 -3064 -2921 -3112 -3394 -3327 -3336 -3654
2051 -3654 -3735 -3707 -3887 -3846 -3786 -3982 -4031 -3783 -3797 -4018 -4071 -3875 -3837 -3830 -3774 -3867 -3813 -3430 -3321 -3622 -3409 -3032 -3022 -3142
$$ packed form
1903a175k86L80R2r36p00M68M30n37o47j36J11J67l36o42j73N13P4p15j95L32
1923c911P3o2l58k36R9L95j54l90J33M18r3j93J44O8K4J77q7r5K80M03j9L3L02
1946c049O4L7L32J24j38K84M48J82O4L22J8K95M99Lk59L48O89Q3m6J78K89M01
1968A168L20j76j48N77N53k71k00M62L99J92Q3j84J37M56L10n21j19O47K88j59
1988C814k60R1L61M29l26o36K60P17j61o19j09L67K49j69m04k29L22K78n27o05
2008B843J03M55j91m41k68j54L20j78o77k79L89m5o68k94J75j23j95k05m11j85
2028b9J30k72n84j36J76l23k25k46j57p1m8l15m90L6M4k85k69J43j91k82O7rl18
2051c654q1K8j80M1O0j96m9K48j4k21n3J96L8PN6r3N4L83J09l01K13L77J0j20
$$ plain form
2075 -3142 -3149 -2881 -2410 -2177 -2364 -2490 -1851 -1387 -1623 -1740 -1360 -935 -767 -766 -716 -470 183 459 40 129 730 1141
2097 1141 968 961 1190 1529 1960 2059 1819 2154 2694 2600 2400 2597 2912 3101 3200 3196 3114 3395 3771 3620 3382 3594
2119 3594 3816 3704 3657 3707 3737 3964 3990 3776 3610 3877 3940 3536 3500 3585 3404 3426 3527 3250 3002 3086 3037 2695 2588
2142 2588 2503 2288 2139 2126 1895 1612 1633 1627 1258 1048 745 625 592 529 57 -289 -80 -138 -550 -826 -899 -1020 -1199
2165 -1199 -1445 -1792 -1786 -1578 -1823 -2331 -2451 -2212 -2398 -2659 -2998 -3146 -2965 -2801 -3185 -3576 -3347 -3126 -3414 -3733
2185 -3733 -3735 -3573 -3523 -3606 -3892 -3838 -3373 -3346 -3671 -3756 -3436 -3362 -3410 -3362 -3404 -3209 -2898 -2916 -3110 -2803 -2371 -2317 -2570 -2488
2209 -2488 -2078 -1821 -1641 -1673 -1688 -1294 -843 -955 -1072 -620 -334 -354 -246 -32 241 581 737 585 741 1197 1480
2230 1480 1381 1419 1725 1926 2081 2194 2273 2462 2794 2726 2660 2884 3104 3044 3115 3226 3270 3353 3456 3517 3446 3523 3652 3415
$$ packed form
2075c142pK68M71K33j87j26O39M64k36j17L80M25J68JN0K46O53K76m19Q9O01M11
2097A141j73pK29L39M31R9k40L35N40r4k00J97L15J89R9mq2K81L76j51k38K12
2119C594K22j12m7N0L0K27K6k14j66K67O3m04l6Q5j81K2J01k77k48Q4m9l42j07
2142B588q5k15j49j3k31k83K1ol69k10l03j20l3o3m72l46K09n8m12k76p3j21j79
2165a199k46l47OK08k45n08j20K39j86k61l39j48J81J64l84l91K29K21k88l19
2185c733kJ62N0q3k86N4M65K7l25q5L20P4m8M8m2J95L11j8j94L07M32N4k53Q2
2209b488M10K57J80l2j5L94M51j12j17M52K86k0J08K14K73L40J56j52J56M56K83
2230A480r9L8L06K01J55J13P9J89L32o8o6K24K20o0P1J11M4Q3J03O1p1P7J29k37
$$ plain form
2254 3415 3479 3646 3512 3361 3434 3493 3315 3319 3339 3195 3049 3099 2761 2690 2906 2733 2421 2340 2285 2124 1982 1925 1617
2277 1617 1453 1467 1258 916 834 893 623 301 126 99 20 -151 -485 -750 -759 -788 -1092 -1310 -1271 -1377 -1682 -1809 -1989
2300 -1989 -2123 -2067 -2259 -2545 -2656 -2422 -2574 -2861 -2943 -2884 -3044 -3009 -3227 -3302 -3159 -3101 -3316 -3496 -3261 -3168 -3360 -3399
2322 -3399 -3304 -3304 -3246 -3154 -3230 -3058 -2895 -2794 -2963 -2781 -2618 -2569 -2499 -2382 -2254 -2124 -1830 -1801 -1861 -1519 -1293 -1363 -1255
2345 -1255 -1008 -820 -717 -486 -432 -257 82 274 212 287 625 848 838 979 1138 1348 1662 1737 1679 1847 2148 2144
2367 2144 2080 2267 2577 2631 2691 2743 2738 3003 3162 3016 2957 3144 3223 3126 3129 3202 3211 3257 3275 3097 3071 3118 3100 2847 2886 2931 2743
2394 2743 2718 2693 2604 2458 2423 2305 2139 1973 1902 1766 1661 1634 1373 1271 1315 1036 713 627 543 337 243 80 -139
2417 -139 -192 -193 -439 -726 -805 -940 -1142 -1294 -1460 -1605 -1592 -1646 -1881 -2095 -2132 -2101 -2328 -2446 -2538 -2588 -2693 -2658 -2793 -2973
$$ packed form
2254C415O4J67j34j51P3N9j78MK0j44j46N0l38p1K16j73l12q1n5j61j42n7l08
2277A617j64J4k09l42q2N9k70l22j75k7p9j71l34k65rk9l04k18L9j06l05j27j80
2300a989j34N6j92k86j11K34j52k87q2N9j60L5k18p5J43N8k15j80K35R3j92l9
2322c399R5%N8R2p6J72J63J01j69J82J63M9P0J17J28J30K94K9o0L42K26p0J08
2345a255K47J88J03K31N4J75L39J92o2P5L38K23j0J41J59K10L14P5n8J68L01m
2367B144o4J87L10N4O0N2nK65J59j46n9J87P9r7LP3RM6J8j78k6M7j8k53L9M5j88
2394B743k5k5q9j46l5j18j66j66p1j36j05k7k61j02M4k79l23q6q4k06r4j63k19
2417a39n3jk46k87p9j35k02j52j66j45J3n4k35k14l7L1k27j18r2n0j05L5j35j80
$$ plain form
2441 -2973 -2857 -2774 -2978 -3197 -3123 -3046 -2958 -3115 -3192 -3098 -2811 -2914 -3141 -3001 -2742 -2784 -2963 -2864 -2720 -2495 -2502 -2507 -2479 -2230
2465 -2230 -1956 -1993 -2081 -1849 -1587 -1516 -1384 -1339 -1209 -804 -708 -771 -636 -296 -51 -140 -11 174 412 631 669 665 897
2488 897 1234 1301 1205 1347 1668 1754 1809 1890 1941 2160 2428 2328 2218 2518 2725 2631 2597 2776 2841 2883 2879 2850 2883 3058 3065
2513 3065 2879 2843 3021 3019 2922 2946 2810 2804 2861 2711 2551 2518 2602 2435 2268 2187 2155 1925 1907 1872 1639 1526 1424 1323
2537 1323 1146 1067 950 801 681 647 370 302 188 -64 -200 -261 -364 -553 -675 -832 -899 -1046 -1117 -1319 -1514 -1600
2559 -1600 -1700 -1854 -1919 -2019 -2207 -2205 -2232 -2404 -2516 -2449 -2567 -2718 -2724 -2712 -2801 -2758 -2710 -2856 -2918 -2712 -2748 -2885 -2792 -2751 -2782
2584 -2782 -2699 -2646 -2632 -2562 -2352 -2426 -2447 -2298 -2127 -2115 -2103 -1984 -1899 -1731 -1550 -1464 -1426 -1278 -1034 -996 -895 -742 -621 -515
2608 -515 -311 -196 -136 161 290 291 425 693 819 844 1025 1172 1314 1516 1580 1631 1739 1948 1925 2038 2058 2266 2330
$$ packed form
2441b973J16Q3k04k19P4P7Q8j57p7R4K87j03k27J40K59m2j79R9J44K25pnK8K49
2465b230K74l7q8K32K62P1J32M5J30M05R6o3J35L40K45q9J29J85K38K19L8mK32
2488H97L37O7r6J42L21Q6N5Q1N1K19K68j00j10L00K07r4l4J79O5M2mk9L3J75P
2513C065j86l6J78kr7K4j36oN7j50j60l3Q4j67j67q1l2k30j8l5k33j13j02j01
2537A323j77p9j17j49j20l4k77o8j14k52j36o1j03j89j22j57o7j47p1k02j95q6
2559a600j00j54o5j00j88Kk7j72j12O7j18j51oJ2q9M3M8j46o2K06l6j37R3M1l1
2584b782Q3N3J4P0K10p4k1J49J71J2J2J19Q5J68J81Q6L8J48K44L8J01J53J21J06
2608e15K04J15O0K97J29JJ34K68J26K5J81J47J42K02O4N1J08K09k3J13K0K08O4
$$ plain form
2631 2330 2385 2475 2427 2653 2714 2625 2591 2787 2784 2776 2821 2833 2830 2851 2905 2785 2746 2730 2694 2613 2597 2619 2482 2387 2390 2219 2189 2183 1996
2660 1996 1822 1803 1666 1567 1438 1340 1209 1111 1022 833 646 574 468 215 172 -52 -119 -243 -277 -514 -672 -738 -815
2683 -815 -1067 -1200 -1222 -1348 -1439 -1548 -1745 -1783 -1917 -1949 -2144 -2191 -2155 -2260 -2357 -2429 -2510 -2569 -2464 -2629 -2744 -2755 -2646 -2694
2707 -2694 -2778 -2736 -2615 -2669 -2590 -2652 -2585 -2531 -2494 -2571 -2460 -2316 -2239 -2259 -2125 -2045 -2005 -1872 -1741 -1708 -1699 -1422 -1314 -1305 -1218 -1053
2733 -1053 -909 -692 -769 -635 -439 -219 -235 -116 54 216 268 440 576 688 791 958 1013 1105 1317 1497 1511 1586
2755 1586 1692 1951 1956 1992 2085 2098 2272 2278 2252 2410 2526 2467 2561 2649 2676 2606 2716 2708 2575 2523 2668 2694 2548 2554 2553 2583 2431
2782 2431 2332 2318 2282 2235 2094 2054 2026 1946 1772 1712 1645 1440 1393 1303 1201 971 932 780 715 552 396 306 254 27 -161
2807 -161 -270 -353 -397 -687 -718 -853 -969 -1117 -1209 -1383 -1454 -1494 -1539 -1720 -1855 -1839 -1883 -1961 -2151 -2197 -2177 -2215 -2385 -2444 -2339
$$ packed form
2631B330N5R0m8K26O1q9l4J96lqM5J2lK1N4j20l9j6l6q1j6K2j37r5Lj71l0oj87
2660A996j74j9j37r9j29r8j31r8q9j89j87p2j06k53m3k24o7j24l4k37j58o6p7
2683h15k52j33k2j26r1j09j97l8j34l2j95m7L6j05r7p2q1n9J05j65j15j1J09m8
2707b694q4M2J21n4P9o2O7N4L7p7J11J44P7k0J34Q0M0J33J31L3RK77J08RQ7J65
2733a053J44K17p7J34J96K20j6J19J70J62N2J72J36J12J03J67N5R2K12J80J4P5
2755A586J06K59NL6R3J3J74Ok6J58J16n9R4Q8K7p0J10qj33n2J45K6j46OjL0j52
2782B431r9j4l6m7j41m0k8q0j74o0o7k05m7r0j02k30l9j52o5j63j56r0n2k27j88
2807a61j09q3m4k90l1j35j16j48r2j74p1m0m5j81j35J6m4p8j90m6K0l8j70n9J05
$$ plain form
2832 -2339 -2403 -2523 -2507 -2464 -2428 -2544 -2541 -2510 -2519 -2448 -2416 -2405 -2459 -2320 -2155 -2211 -2169 -2141 -2023 -1819 -1914 -1908 -1711 -1441 -1491 -1465 -1335
2859 -1335 -1151 -1095 -982 -872 -764 -638 -434 -318 -291 -175 77 131 111 177 349 650 691 665 798 1111 1146 1105 1236
2882 1236 1447 1546 1528 1624 1697 1818 1912 2019 2036 2027 2138 2258 2383 2302 2319 2409 2436 2342 2382 2459 2552 2413 2344 2435 2415 2327
2908 2327 2316 2375 2242 2144 2180 2147 2029 1962 1926 1827 1755 1619 1567 1593 1402 1270 1237 1136 1005 981 897 788 555 467 418
2933 418 264 93 -65 -28 -186 -430 -466 -608 -585 -714 -1017 -1084 -1062 -1193 -1329 -1394 -1496 -1577 -1585 -1680 -1857 -1919 -1950 -1897
2957 -1897 -2154 -2245 -2166 -2129 -2220 -2337 -2356 -2253 -2199 -2383 -2430 -2289 -2265 -2305 -2272 -2329 -2204 -2233 -2165 -2120 -2056 -1961 -1917 -1913 -1934 -1818
2983 -1818 -1586 -1556 -1574 -1569 -1296 -1069 -1185 -1120 -944 -723 -730 -687 -574 -369 -263 -187 -62 25 162 408 418 467 630 734
3007 734 891 891 910 1138 1290 1292 1259 1391 1574 1751 1608 1744 1872 1883 1885 1931 2027 2106 2162 2162 2180 2218 2337 2286 2244 2266 2253
$$ packed form
2832b339o4j20J6M3L6j16LL1rP1L2J1n4J39J65n6M2K8J18K04r5OJ97K70n0K6J30
2859a335J84N6J13J10J08J26K04J16K7J16K52N4k0O6J72L01M1k6J33L13L5m1J31
2882A236K11R9j8R6P3J21R4J07J7rJ11J20J25q1J7R0K7r4M0P7R3j39o9R1k0q8
2908B327j1N9j33r8L6l3j18o7l6r9p2j36n2K6j91j32l3j01j31k4q4j09k33q8m9
2933D18j54j71j58L7j58k44l6j42K3j29l03o7K2j31j36o5j02q1qr5j77o2l1N3
2957a897k57r1P9L7r1j17j9J03N4j84m7J41K4m0L3n7J25k9O8M5O4R5M4Mk1J16
2983a818K32L0j8NK73K27j16O5J76K21pM3J13K05J06P6J25Q7J37K46J0M9J63J04
3007G34J57%J9K28J52Kl3J32J83J77j43J36J28J1KM6R6P9N6%J8L8J19n1m2K2j3
$$ plain form
3034 2253 2323 2350 2221 2183 2257 2244 2123 2030 2091 2045 1874 1731 1855 1761 1659 1546 1432 1450 1354 1181 1155 1126 914 758
3058 758 746 657 552 403 420 177 91 85 -79 -249 -313 -382 -489 -719 -727 -763 -881 -1019 -1149 -1225 -1287 -1291 -1516 -1599 -1521 -1651
3084 -1651 -1842 -1865 -1888 -1928 -1939 -2043 -2073 -2085 -2059 -2053 -2127 -2208 -2187 -2124 -2141 -2229 -2157 -2042 -2052 -2174 -2130 -2014 -1912 -1996 -2021 -1836
3110 -1836 -1731 -1710 -1679 -1734 -1531 -1375 -1326 -1338 -1265 -1062 -919 -914 -917 -739 -507 -464 -483 -441 -155 -43 39 18 188 383 524
3135 524 573 556 715 937 1004 990 1027 1237 1380 1401 1389 1490 1647 1691 1683 1663 1740 1934 1951 1894 1940 2114 2135 2024 2044 2079
3161 2079 2157 2104 2093 2021 2140 2134 2037 2030 2054 2038 2014 1942 1785 1766 1778 1715 1581 1506 1530 1377 1232 1164 1096 1079 962 812 681
3188 681 695 620 451 307 267 197 80 -60 -150 -239 -283 -473 -565 -648 -690 -823 -943 -996 -1013 -1147 -1264 -1327 -1365 -1424 -1518
3213 -1518 -1652 -1739 -1637 -1787 -1866 -1955 -1885 -1793 -1933 -2000 -2002 -2006 -1961 -2044 -2065 -2069 -1903 -1973 -2057 -2055 -1855 -1766 -1891 -1920 -1813 -1684 -1565
$$ packed form
3034B253P0K7j29l8P4j3j21r3O1m6j71j43J24r4j02j13j14J8r6j73k6k9k12j56
3058G58j2q9j05j49J7k43q6oj64j70o4o9j07k30ql6j18j38j30p6o2mk25q3P8j30
3084a651j91k3k3m0j1j04l0j2K6Op4q1K1O3j7q8P2J15j0j22M4J16J02q4k5J85
3110a836J05K1L1n5K03J56M9j2P3K03J43NlJ78K32M3j9M2K86J12Q2k1J70J95J41
3135E24M9j7J59K22O7j4L7K10J43K1j2J01J57M4qk0P7J94J7n7M6J74K1j11K0L5
3161B079P8n3j1p2J19or7pK4j6k4p2j57j9J2o3j34p5K4j53j45o8o8j7j17j50j31
3188F81J4p5j69j44m0p0j17j40r0q9m4j90r2q3m2j33j20n3j7j34j17o3l8n9r4
3213a518j34q7J02j50p9q9P0R2j40o7kmM5q3k1mJ66p0q4KK00Q9j25k9J07J29J19
$$ plain form
3240 -1565 -1622 -1653 -1466 -1369 -1338 -1368 -1250 -1150 -1042 -993 -976 -784 -621 -583 -630 -532 -345 -257 -190 -163 22 185 284 299 249
3265 249 525 694 682 693 881 996 1044 1111 1147 1315 1435 1434 1404 1457 1593 1711 1646 1692 1818 1834 1916 1841 1803 1985 2009
3290 2009 1909 1884 1937 2017 1970 1912 1868 1930 1913 1829 1749 1711 1839 1756 1587 1544 1532 1561 1452 1292 1230 1216 1173 1123 915 835
3316 835 841 733 577 430 480 373 247 99 -9 13 -60 -217 -462 -382 -469 -630 -661 -767 -799 -881 -1008 -1152 -1160 -1139
3340 -1139 -1302 -1426 -1493 -1434 -1487 -1573 -1626 -1703 -1668 -1725 -1866 -1819 -1778 -1829 -1897 -1929 -1831 -1861 -1966 -1950 -1893 -1861 -1755 -1798 -1802 -1777 -1746
3367 -1746 -1691 -1675 -1568 -1494 -1473 -1366 -1347 -1301 -1217 -1075 -1076 -1020 -857 -870 -744 -680 -490 -427 -300 -347 -169 -76 17 94 99 146
3393 146 472 418 484 573 711 847 867 853 928 1150 1194 1217 1115 1359 1498 1502 1481 1506 1600 1793 1693 1594 1741 1857 1779
3418 1779 1771 1794 1874 1814 1831 1755 1698 1777 1881 1758 1623 1711 1738 1615 1573 1446 1413 1508 1358 1237 1284 1228 1143 966 895 907
$$ packed form
3240a565n7l1J87R7L1l0J18J00J08M9J7J92J63L8m7R8J87Q8O7K7J85J63R9J5n0
3265B49K76J69j2J1J88J15M8O7L6J68J20jl0N3J36J18o5M6J26J6Q2p5l8J82K4
3290B009j00k5N3Q0m7n8m4O2j7q4q0l8J28q3j69m3j2K9j09j60o2j4m3n0k08q0
3316H35Oj08j56j47N0j07j26j48j08K2p3j57k45Q0q7j61l1j06l2q2j27j44qK1
3340a139j63j24o7N9n3q6n3p7L5n7j41M7M1n1o8l2R8l0j05J6N7L2J06m3mK5L1
3367a746N5J6J07P4K1J07J9M6Q4J42jN6J63j3J26O4J90O3J27m7J78R3R3P7NM7
3393A46L26n4O6Q9J38J36K0j4P5K22M4K3j02K44J39Mk1K5R4J93j00r9J47J16p8
3418A779qK3Q0o0J7p6n7P9J04j23j35Q8K7j23m2j27l3R5j50j21M7n6q5j77p1J2
$$ plain form
3444 907 859 704 647 459 486 488 333 180 201 140 -9 -125 -169 -236 -288 -362 -536 -579 -592 -698 -872 -956 -953 -978 -1084 -1086
3470 -1086 -1223 -1238 -1306 -1411 -1494 -1486 -1452 -1573 -1695 -1634 -1616 -1660 -1648 -1707 -1731 -1797 -1713 -1838 -1678 -1695 -1740 -1806 -1664 -1637 -1596 -1599 -1566
3497 -1566 -1563 -1492 -1394 -1457 -1323 -1286 -1199 -1214 -1119 -1052 -923 -882 -789 -784 -657 -507 -400 -468 -363 -191 -74 -81 10 60 261 294
3523 294 348 367 613 723 633 688 791 961 983 1017 1045 1155 1262 1330 1220 1374 1511 1470 1482 1525 1590 1641 1745 1656 1589
3548 1589 1674 1795 1671 1653 1753 1735 1644 1597 1625 1645 1659 1579 1460 1476 1561 1458 1282 1263 1297 1200 1152 1066 970 960 896 815
3574 815 642 665 704 581 296 365 259 332 188 -7 -57 -8 -65 -351 -413 -381 -425 -567 -660 -651 -726 -746 -845 -1010 -990 -1014
3600 -1014 -1122 -1247 -1277 -1265 -1327 -1444 -1465 -1449 -1431 -1474 -1611 -1629 -1583 -1549 -1644 -1665 -1634 -1654 -1582 -1535 -1620 -1638 -1462 -1519 -1585 -1496 -1353
3627 -1353 -1359 -1377 -1294 -1291 -1246 -1125 -1116 -1093 -935 -929 -983 -876 -659 -618 -596 -548 -460 -328 -249 -185 -186 -48 98 69 144 302 407
$$ packed form
3444I07m8j55n7j88K7Kj55j53K1o1j49j16m4o7n2p4j74m3j3j06j74q4Lk5j06k
3470a086j37j5o8j05q3QL4j21j22O1J8m4J2n9k4o6Q4j25J60j7m5o6J42K7M1lL3
3497a566LP1R8o3J34L7Q7j5R5O7J29M1R3NJ27J50J07o8J05J72J17pR1N0K01L3
3523B94N4J9K46J10r0N5J03J70K2L4K8J10J07O8j10J54J37m1J2M3O5N1J04q9o7
3548A589Q5J21j24j8J00j8r1m7K8K0J4q0j19J6Q5j03j76j9L4r7m8q6r6j0o4q1
3574H15j73K3L9j23k85O9j06P3j44j95n0M9n7k86o2L2m4j42r3Rp5k0r9j65K0k4
3600a014j08j25l0J2o2j17k1J6J8m3j37j8M6L4r5k1L1k0P2M7q5j8J76n7o6Q9J43
3627a353oj8Q3LM5J21RK3J58On4J07K17M1K2M8Q8J32P9O4jJ38J46k9P5J58J05
$$ plain form
3654 407 410 442 635 565 821 853 734 898 975 1056 1041 1041 1218 1242 1285 1286 1334 1412 1490 1413 1399 1490 1609 1560 1520 1531 1578 1525
3682 1525 1543 1531 1492 1611 1650 1524 1428 1505 1507 1398 1363 1300 1318 1230 1160 1067 1102 1081 924 800 847 797 727 611 596 440
3708 440 373 397 212 130 33 50 -25 -178 -223 -262 -294 -417 -529 -609 -566 -706 -856 -867 -835 -955 -1016 -1065 -1118 -1146 -1163 -1247
3734 -1247 -1328 -1335 -1371 -1401 -1483 -1463 -1426 -1494 -1441 -1604 -1592 -1490 -1462 -1602 -1549 -1432 -1530 -1465 -1475 -1407 -1403 -1332 -1325 -1298 -1307 -1185 -1201 -1177 -1020
3763 -1020 -887 -950 -888 -793 -818 -695 -602 -673 -599 -323 -361 -413 -203 -83 -38 -49 58 126 179 278 309 338 493 613 613 605
3789 605 739 821 849 939 947 963 1099 1155 1072 1139 1339 1285 1293 1316 1372 1424 1409 1384 1375 1449 1441 1393 1485 1472 1493 1388 1447 1422 1290
3818 1290 1326 1331 1303 1292 1280 1246 1181 1146 1083 1014 1010 944 826 774 772 643 591 548 556 316 231 274 214 91 49 18 -149 -68 -196
3847 -196 -355 -379 -444 -497 -603 -652 -694 -761 -741 -869 -960 -876 -920 -1086 -1169 -1075 -1197 -1240 -1252 -1307 -1286 -1354 -1360 -1360 -1441 -1326 -1326 -1492
$$ packed form
3654D07LL2J93p0K56L2j19J64P7Q1j5%J77K4M3JM8P8P8p7j4R1J19m9m0J1M7n3
3682A525J8j2l9J19L9j26r6P7Kj09l5o3J8q8p0r3L5k1j57j24M7n0p0j16j5j56
3708D40o7K4j85q2r7J7p5j53m5l9l2j23j12q0M3j40j50j1L2j20o1m9n3k8j7q4
3734a247q1pl6l0q2K0L7o8N3j63J2J02K8j40N3J17r8O5j0O8MP1PK7rJ22j6K4J57
3763a020J33o3O2R5k5J23R3p1P4K76l8n2K10J20M5j1J07O8N3R9L1K9J55J20%q
3789F05J34Q2K8R0QJ6J36N6q3O7K00n4QK3N6N2j5k5rP4qm8R2j3K1j05N9k5j32
3818A290L6Nk8j1j2l4o5l5o3o9mo6j18n2kj29n2m3Qk40q5M3o0j23m2l1j67Q1j28
3847a96j59k4o5n3j06m9m2o7K0j28r1Q4m4j66q3R4j22m3j2n5K1o8o%q1J15%j66
$$ plain form
3875 -1492 -1412 -1434 -1447 -1446 -1418 -1473 -1354 -1293 -1344 -1374 -1320 -1199 -1251 -1204 -1087 -1064 -1038 -970 -988 -862 -869 -763 -785 -696 -525 -601 -476
3902 -476 -440 -381 -313 -153 -89 -134 -45 150 158 142 297 372 396 474 429 588 653 758 751 778 882 992 877 1025 1066 1015
3928 1015 1148 1231 1145 1263 1334 1288 1258 1345 1343 1378 1301 1373 1309 1384 1322 1338 1294 1363 1354 1189 1174 1224 1213 1140 1087 1118 1019 993 933
3957 933 901 838 910 772 656 711 585 563 488 443 304 326 284 143 70 44 -31 -140 -98 -160 -237 -295 -350 -498 -493 -396 -597
3984 -597 -686 -681 -666 -786 -851 -931 -996 -982 -934 -1097 -1113 -1108 -1029 -1168 -1256 -1201 -1167 -1222 -1302 -1303 -1287 -1230 -1215 -1352 -1282 -1211 -1227 -1229 -1210 -1218
4014 -1218 -1187 -1153 -1094 -1172 -1043 -921 -957 -982 -918 -818 -806 -772 -727 -658 -563 -543 -570 -445 -290 -310 -302 -152 -68 -32 11 118
4040 118 70 92 280 271 351 499 550 551 620 705 704 776 839 870 881 965 1010 1037 1036 1126 1069 1154 1216 1209 1167 1214 1280 1337 1218 1314 1221
4071 1221 1249 1248 1240 1287 1241 1177 1128 1205 1139 1031 1060 1084 1020 926 928 879 798 811 828 693 553 632 583 481 454 375 242 288
$$ packed form
3875a492Q0k2j3JK8n5J19O1n1l0N4J21n2M7J17K3K6O8j8J26pJ06k2Q9J71p6J25
3902d76L6N9O8J60O4m5Q9J95Qj6J55P5K4P8m5J59O5J05pK7J04J10j15J48M1n1
3928A015J33Q3q6J18P1m6l0Q7kL5p7P2o4P5o2J6m4O9rj65j5N0j1p3n3L1r9k6o0
3957I33l2o3P2j38j16N5j26k2p5m5j39K2m2j41p3k6p5j09M2o2p7n8n5j48NR7k01
3984e97q9NJ5j20o5q0o5J4M8j63j6NP9j39q8N5L4n5q0jJ6N7J5j37P0P1j6kJ9q
4014a218L1L4N9p8J29J22l6k5O4J00J2L4M5O9R5K0k7J25J55k0QJ50Q4L6M3J07
4040A18m8K2J88rQ0J48N1JO9Q5jP2O3L1J1Q4M5K7jR0n7Q5O2pm2M7O6N7j19R6r3
4071A221K8jqM7m6o4m9P7o6j08K9K4o4r4Km9q1J3J7j35j40P9m9j02k7p9j33M6
$$ plain form
4099 288 226 111 45 -10 -52 -135 -112 -231 -258 -264 -281 -422 -466 -531 -548 -616 -631 -702 -799 -848 -858 -877 -936 -975 -1022 -1018 -1037 -1097 -1162
4128 -1162 -1037 -1140 -1124 -1200 -1166 -1163 -1258 -1172 -1123 -1174 -1199 -1156 -1199 -1123 -1036 -1067 -1037 -985 -982 -990 -992 -875 -861 -879 -806 -759 -713 -630 -598 -637
4158 -637 -553 -454 -410 -420 -304 -224 -197 -152 -83 -31 0 170 90 179 282 324 348 464 525 486 612 656 694 725 798 744 820
4185 820 807 963 911 1068 1002 973 1104 1108 1055 1077 1133 1198 1097 1159 1164 1228 1127 1197 1229 1124 1119 1154 1076 1012 1065 971 1014 988
4213 988 981 862 959 930 754 791 752 682 589 622 582 453 462 406 344 281 155 193 81 29 17 8 -49 -184 -200 -233 -340 -444
4241 -444 -514 -441 -487 -648 -595 -584 -682 -814 -778 -811 -879 -846 -866 -1001 -1015 -1065 -1063 -1081 -1041 -1151 -1116 -1042 -1174 -1204 -1139 -1059 -1216
4268 -1216 -1137 -1134 -1107 -1054 -1122 -1017 -1046 -949 -907 -966 -930 -894 -877 -755 -718 -741 -655 -557 -559 -601 -549 -438 -372 -428 -315 -257 -204 -115
4296 -115 -106 20 -25 49 122 193 231 212 329 476 442 405 569 648 574 621 779 721 707 800 846 869 902 908 995 1010 962 984
$$ packed form
4099B88o2j15o6n5m2q3K3j19k7oj7j41m4o5j7o8j5p1r7m9j0j9n9l9m7Mj9o0o5
4128a162J25j03J6p6L4Lr5Q6M9n1k5M3m3P6Q7l1L0N2LqkJ17J4j8P3M7M6Q3L2l9
4158f37Q4R9M4j0J16Q0K7M5O9N2L1J70q0Q9J03M2K4J16O1l9J26M4L8L1P3n4P6
4185H20j3J56n2J57o6k9J31Mn3K2N6O5j01O2NO4j01P0L2j05nL5p8o4N3r4M3k6
4213I88pj19R7k9j76L7l9p0r3L3m0j29Rn6o2o3j26L8j12n2j2rn7j35j6l3j07j04
4241d44p0P3m6j61N3J1r8j32L6l3o8L3k0j35j4n0Kj8M0j10L5P4j32l0O5Q0j57
4268a216P9LK7N3o8J05k9R7M2n9L6L6J7J22L7k3Q6R8km2N2J11O6n6J13N8N3Q9
4296a15RJ26m5P4P3P1L8j9J17J47l4l7J64P9p4M7J58n8j4R3M6K3L3OQ7J5m8K2
$$ plain form
4324 984 1049 1070 984 989 1100 1077 1029 999 1061 1097 936 977 1022 1004 983 967 957 877 856 903 847 754 737 720 737 641 552 594 618
4353 618 450 424 393 336 198 195 213 87 51 53 21 -81 -160 -184 -262 -280 -339 -475 -425 -414 -524 -578 -575 -629 -712 -678 -679 -792
4381 -792 -813 -821 -862 -974 -908 -915 -873 -966 -985 -1000 -964 -1021 -1094 -1004 -958 -1077 -1117 -996 -970 -1048 -1025 -940 -912 -953 -870 -887 -903 -816 -756
4410 -756 -723 -782 -697 -707 -593 -598 -613 -601 -412 -382 -494 -391 -223 -234 -267 -133 -92 -109 2 110 107 88 196 233 228 333
4436 333 291 381 474 560 499 641 752 675 711 736 734 795 825 909 853 949 1003 971 919 1010 976 988 1033 1024 940 1032 1055 931 932 1006
4466 1006 1006 889 925 985 874 861 855 823 715 756 699 690 639 561 491 570 570 383 370 392 323 136 219 214 92 67 119 -64
4494 -64 -114 -54 -148 -248 -239 -234 -356 -373 -394 -429 -547 -520 -617 -609 -608 -649 -674 -793 -675 -749 -788 -828 -805 -881 -831 -849 -923 -968 -861
4523 -861 -907 -905 -864 -867 -938 -890 -836 -926 -770 -787 -848 -909 -770 -810 -766 -756 -715 -672 -641 -611 -595 -636 -537 -442 -534 -462 -406 -393 -282
$$ packed form
4324I84O5K1q6NJ11k3m8l0O2L6j61M1M5j8k1j6j0q0k1M7n6r3j7j7J7r6q9M2K4
4353F18j68k6l1n7j38lJ8j26l6Kl2j02p9k4p8j8n9j36N0J1j10n4Ln4q3L4jj13
4381g92k1qm1j12O6pM2r3j9j5L6n7p3R0M6j19m0J21K6p8K3Q5K8m1Q3j7j6Q7O0
4410g56L3n9Q5j0J14nj5J2J89L0j12J03J68j1l3J34M1j7J11J08lj9J08L7nJ05
4436C33m2R0R3Q6o1J42J11p7L6K5kO1L0Q4n6R6N4l2n2R1l4J2M5rq4R2K3j24JP4
4466A006%j17L6O0j11j3ol2j08M1n7rn1p8p0P9%j87j3K2o9j87Q3nj22k5N2j83
4494f4n0O0r4j00RNj22j7k1l5j18K7r7QJm1k5j19J18p4l9m0K3p6N0j8p4m5J07
4523h61m6KM1lp1M8N4r0J56j7o1o1J39m0M4J0M1M3L1L0J6m1R9R5r2P2N6J3J11
$$ plain form
4552 -282 -244 -209 -173 -83 -76 -51 15 98 115 155 215 174 267 331 424 370 431 456 511 585 587 615 595 735 691 754 769 774 760 814 936
4583 936 857 855 946 912 935 977 926 877 963 934 847 876 913 858 820 871 917 808 808 760 657 694 739 642 572 529 528 458 478 483 395
4614 395 377 259 205 192 213 177 50 42 -23 -14 -82 -106 -195 -234 -248 -222 -400 -409 -395 -458 -433 -456 -537 -554 -589 -624 -693 -627 -633 -772
4644 -772 -784 -742 -747 -844 -830 -836 -825 -840 -816 -904 -893 -826 -814 -874 -836 -819 -837 -738 -781 -856 -748 -702 -748 -722 -648 -682 -720 -606 -616 -561
4674 -561 -553 -393 -415 -435 -327 -305 -362 -246 -142 -165 -129 -118 -68 -27 -7 46 43 164 204 188 248 372 415 355 404 533 521
4701 521 581 564 546 596 635 703 639 719 790 767 802 761 758 774 824 722 754 894 882 806 892 832 794 795 826 725 665 755 793
4730 793 651 705 741 700 682 566 540 475 513 527 352 409 418 357 284 263 258 176 142 107 83 82 57 -126 -70 -85 -113 -235 -201
4759 -201 -223 -319 -317 -314 -414 -501 -382 -426 -580 -544 -541 -612 -615 -605 -615 -737 -657 -765 -795 -768 -705 -840 -778 -806 -810 -765 -766 -839 -762 -774
$$ packed form
4552b82L8L5L6R0PK5O6Q3J7M0O0m1R3O4R3n4O1K5N5P4KK8k0J40m4O3J5Nj4N4J22
4583I36p9kR1l4K3M2n1m9Q6k9q7K9L7n5l8N1M6j09%m8j03L7M5r7p0m3jp0K0Nq8
4614C95j8j18n4j3K1l6j27qo5Ro8k4q9l9j4K6j78rJ4o3K5k3q1j7l5l5o9O6oj39
4644g72j2M2nr7J4oJ1j5K4q8J1O7J2o0L8J7j8R9m3p5J08M6m6K6P4l4l8J14j0N5
4674e61QJ60k2k0J08K2n7J16J04k3L6J1N0M1K0N3lJ21M0j6O0J24M3o0M9J29j2
4701E21O0j7j8N0L9O8o4Q0P1k3L5m1lJ6N0j02L2J40j2p6Q6o0l8JL1j01o0R0L8
4730G93j42N4L6m1j8j16k6o5L8J4j75N7Ro1p3k1nq2l4l5k4jk5j83N6j5k8j22L4
4759b01k2r6KLj00q7J19m4j54L6Lp1lJ0j0j22Q0j08l0K7O3j35O2k8mM5jp3P7j2
$$ plain form
4789 -774 -766 -798 -708 -695 -795 -784 -659 -699 -641 -683 -590 -584 -522 -518 -554 -431 -340 -376 -486 -286 -278 -242 -217 -223 -191 -63 -81 -78 -31 79
4819 79 133 82 61 188 274 219 389 238 379 491 475 407 469 605 538 546 587 528 671 699 617 592 720 775 673 662
4845 662 764 817 714 791 680 686 778 806 759 683 704 764 630 591 639 600 622 630 530 519 601 513 456 434 486 431 399 328
4873 328 252 248 296 157 147 103 101 111 71 -10 -63 -32 -105 -162 -205 -217 -226 -310 -346 -330 -421 -364 -424 -482 -540 -497 -546 -531 -620 -598 -612
4904 -612 -636 -584 -693 -683 -650 -669 -682 -723 -725 -794 -722 -690 -794 -799 -668 -679 -779 -734 -708 -650 -657 -626 -659 -583 -542 -560 -537 -547 -439
4933 -439 -470 -399 -376 -427 -308 -305 -284 -261 -249 -122 -144 -207 -69 -22 33 45 54 45 160 240 183 144 296 291 335 284 421 387 508
4962 508 487 383 494 601 643 568 569 601 716 660 617 569 689 734 582 657 736 662 685 705 678 683 679 657 612 612 670 608 560
4991 560 600 584 539 540 509 374 392 422 384 368 348 309 286 218 236 136 93 105 65 56 -18 -12 -144 -35 -46 -164 -206 -200 -232
$$ packed form
4789g74Ql2R0J3j00J1J25m0N8m2R3OO2Ml6J23R1l6j10K00QL6K5oL2J28j8LM7J10
4819G9N4n1k1J27Q6n5J70j51J41J12j6o8O2J36o7QM1n9J43K8q2k5J28N5j02j1
4845F62J02N3j03P7j11OR2K8m7p6K1O0j34l9M8l9K2Qj00j1Q2q8n7k2N2n5l2p1
4873C28p6mM8j39j0m4kJ0m0q1n3L1p3n7m3j2rq4l6J6r1N7o0n8n8M3m9J5q9K2j4
4904f12k4N2j09J0L3j9j3m1ko9P2L2j04nJ31j1j00M5K6N8pL1l3P6M1j8K3j0J08
4933d39l1P1K3n1J19LK1K3J2J27k2o3J38M7N5J2RrJ15Q0n7l9J52nM4n1J37l4J21
4962E08k1j04J11J07M2p5JL2J15n6m3m8J20M5j52P5P9p4K3K0k7Nmk2m5%N8o2m8
4991E60M0j6m5Jl1j35J8L0l8j6k0l9k3o8J8j00m3J2m0rp4Oj32J09j1j18m2Ol2
$$ plain form
5020 -232 -351 -314 -352 -312 -314 -442 -467 -535 -416 -475 -481 -648 -548 -555 -603 -629 -648 -623 -573 -681 -691 -625 -602 -636 -730 -655 -647 -603 -640
5049 -640 -688 -661 -565 -567 -597 -622 -596 -527 -548 -556 -530 -484 -411 -425 -499 -409 -275 -316 -221 -299 -264 -209 -139 -229 -114 -74 24 25 -32 25
5079 25 101 93 182 181 161 187 304 320 282 417 378 333 417 453 395 447 520 491 529 573 492 596 596 587 605 615 681 653 523 687
5109 687 618 616 637 587 632 689 653 546 573 645 640 548 529 479 481 495 443 411 361 441 361 248 291 285 243 215 117 95 111 153 105
5140 105 -23 -44 -18 -14 -117 -97 -154 -117 -126 -287 -313 -244 -249 -376 -370 -433 -381 -460 -426 -524 -513 -457 -464 -512 -539 -552 -497 -544 -619 -597
5170 -597 -618 -625 -568 -640 -545 -587 -609 -622 -608 -575 -576 -465 -549 -593 -556 -483 -510 -496 -516 -423 -408 -452 -444 -347 -293 -253 -277 -332 -244 -228 -169
5201 -169 -131 -167 -95 -36 -21 11 -58 61 161 182 127 184 215 260 334 258 256 314 410 378 414 330 409 438 483 381 464 548 538
5230 538 515 514 540 585 616 563 507 540 640 601 545 562 569 602 525 501 491 536 557 462 380 466 496 363 353 359 372 383 323 163
$$ packed form
5020b32j19L7l8M0kj28k5o8J19n9oj67J00pm8k6j9K5N0j08j0O6K3l4r4P5QM4l7
5049f40m8K7R6kl0k5K6O9k1qK6M6P3j4p4R0J34m1R5p8L5N5P0r0J15M0R8Jn7N7
5079B5P6qQ9jk0K6J17J6l8J35l9m5Q4L6n8N2P3k9L8M4q1J04%rJ8J0O6k8j30J64
5109F87o9kK1n0M5N7l6j07K7P2nr2j9n0KJ4n2l2n0Q0q0j13M3om2k8r8k2J6M2m8
5140A05j28k1K6Mj03K0n7L7rj61k6O9nj27Oo3N2p9L4r8J1N6pm8k7j3N5m7p5K2
5170e97k1pN7p2R5m2k2j3J4L3jJ11q4m4L7P3k7J4k0R3J5m4QR7N4M0k4n5Q8J6N9
5201a69L8l6P2N9J5L2o9J19J00K1n5N7L1M5P4p6kN8R6l2L6q4P9K9M5j02Q3Q4j0
5230E38k3jK6M5L1n3n6L3J00l9n6J7PL3p7k4j0M5K1r5q2Q6L0j33j0OJ3J1o0j60
$$ plain form
5260 163 221 304 261 161 118 192 183 97 84 3 30 26 -61 -162 -170 -91 -189 -197 -185 -193 -233 -246 -303 -357 -338 -256 -326 -496 -399 -404 -450
5291 -450 -449 -429 -517 -438 -458 -546 -527 -512 -538 -572 -532 -525 -613 -532 -523 -564 -581 -558 -524 -487 -454 -505 -488 -494 -433 -456 -338 -383 -338 -380 -344
5322 -344 -298 -338 -260 -226 -304 -254 -166 -121 -101 -115 -89 -60 -19 -3 -19 17 80 102 60 122 229 210 168 208 216 274 353 290 252 340
5352 340 391 465 383 414 424 517 491 436 402 535 543 429 531 596 526 514 569 504 484 476 471 444 443 492 445 466 435 366 351 468
5382 468 350 348 353 375 286 306 301 239 303 240 199 176 222 185 69 47 77 4 -51 -50 -6 -123 -93 -83 -124 -135 -133 -203 -220 -220 -265
5413 -265 -301 -296 -311 -340 -366 -326 -421 -450 -413 -376 -490 -432 -464 -503 -506 -558 -530 -492 -431 -508 -509 -484 -454 -473 -532 -480 -533 -484 -487 -379 -441
5444 -441 -418 -416 -432 -380 -302 -386 -342 -314 -344 -292 -180 -250 -272 -219 -51 -137 -129 -78 -68 -47 2 71 99 23 102 84 95 166 210 228
5474 228 202 251 236 182 294 263 323 416 378 314 372 387 426 407 471 467 413 444 402 488 491 436 473 454 462 452 430 503 443 431 419
$$ packed form
5260A63N8Q3m3j00m3P4rq6j3q1K7mq7j01qP9r8qJ2qm0j3n7n4J9Q2p0j70R7nm6
5291d50JK0q8P9k0q8J9J5k6l4M0Pq8Q1Rm1j7K3L4L7L3n1J7oO1k3J18m5M5m2L6
5322c44M6m0P8L4p8N0Q8M5K0j4K6K9M1J6j6L6O3K2m2O2J07j9m2M0QN8P9o3l8Q8
5352C40N1P4q2L1J0R3k6n5l4J33Qj14J02O5p0j2N5o5k0qnk7jM9m7K1l1o9j5J17
5382D68j18kNK2q9K0no2O4o3m1k3M6l7j16k2L0p3n5JM4j17L0J0m1j1Kp0j7%m5
5413b65l6Nj5k9k6M0r5k9L7L7j14N8l2l9ln2K8L8O1p7jK5L0j9n9N2n3M9lJ08o2
5444d41K3Kj6N2P8q4M4K8l0N2J12p0k2N3J68q6QN1J0K1M9O9K8p6P9j8J1P1M4J8
5474B28k6M9j5n4J12l1O0R3l8o4N8J5L9j9O4mn4L1m2Q6Ln5L7j9Qj0k2P3o0j2j2
$$ plain form
5505 419 428 425 408 350 362 348 400 358 322 369 330 305 264 302 199 154 234 127 83 140 185 34 70 9 -30 -40 -10 -67 -153
5534 -153 -101 -59 -136 -235 -123 -176 -132 -262 -248 -307 -343 -301 -383 -364 -345 -315 -413 -410 -439 -455 -450 -430 -477 -470 -373 -403 -454 -421 -467 -462 -446
5565 -446 -426 -450 -427 -405 -384 -384 -334 -374 -328 -360 -339 -316 -318 -360 -368 -313 -217 -205 -284 -141 -130 -206 -146 -85 -105 -93 -43 -50 -30 6 123
5596 123 48 21 86 134 93 222 196 195 243 230 175 254 280 324 260 349 337 364 349 345 264 359 402 402 380 424 460 397 421 385 403
5627 403 416 387 400 422 417 380 381 397 434 275 363 336 295 330 340 242 257 259 275 229 219 194 124 148 146 81 46 46 -17 24 13 -1
5659 -1 -38 -31 -84 -53 -132 -143 -118 -181 -257 -214 -210 -219 -240 -232 -278 -272 -325 -371 -281 -355 -316 -359 -343 -394 -308 -390 -365 -385 -397 -423 -350 -431 -403
5692 -403 -429 -383 -396 -377 -426 -299 -380 -359 -369 -369 -315 -289 -270 -249 -279 -252 -183 -233 -234 -160 -243 -201 -130 -187 -146 -123 -96 -118 -59 -4
5722 -4 20 -6 13 60 29 80 37 85 132 146 157 195 229 233 240 247 233 278 343 319 327 325 338 379 400 314 363 342 371 324 339 398 389 477
$$ packed form
5505D19Rlj7n8J2j4N2m2l6M7l9k5m1L8j03m5Q0j07m4N7M5j51L6o1l9j0L0n7q6
5534a53N2M2p7r9J12n3M4j30J4n9l6M2q2J9J9L0r8Lk9j6NK0m7PR7l0n1L3m6NJ6
5565d46K0k4K3K2K1%N0m0M6l2K1K3km2qN5R6J2p9J43J1p6O0O1k0J2N0pK0L6J17
5596A23p5k7O5M8m1J29k6jM8j3n5P9K6M4o4Q9j2K7j5mq1R5M3%k2M4L6o3K4l6J8
5627D03J3k9J3K2nl7JJ6L7j59Q8k7m1L5J0r8J5KJ6m6j0k5p0K4ko5l5%o3M1j1j4
5659al7Pn3L1p9j1K5o3p6M3Mrk1Qm6On3m6R0p4L9m3J6n1Q6q2K5k0j2k6P3q1K8
5692d03k6M6j3J9m9J27q1K1j0%N4K6J9K1l0K7O9n0jP4q3M2P1n7M1K3K7k2N9N5
5722dK4k6J9M7l1N1m3M8M7J4J1L8L4MPPj4M5O5k4QkJ3M1K1q6M9k1K9m7J5N9rQ8
$$ plain form
5756 477 385 337 378 325 346 324 378 331 327 278 315 349 275 277 239 298 277 251 191 254 183 76 117 232 138 120 89 94 62 78
5786 78 63 -47 -17 -16 -61 -89 -182 -118 -49 -77 -176 -171 -162 -213 -126 -185 -243 -217 -230 -295 -301 -320 -231 -301 -273 -276 -329 -337 -274 -469 -354 -338
5818 -338 -265 -351 -364 -368 -368 -356 -360 -317 -317 -312 -330 -324 -337 -283 -248 -292 -223 -319 -249 -204 -241 -249 -190 -95 -232 -155 -121 -145 -66 -106 -70 -45 13
5851 13 -8 25 -12 25 50 39 56 30 72 128 148 130 180 173 231 231 234 274 299 236 263 271 364 327 315 275 342 382 315 288 347 324
5883 324 370 292 325 351 354 318 326 301 338 305 350 304 286 267 298 244 212 217 244 200 233 174 178 164 146 193 90 144 38 65 72
5914 72 19 21 -35 30 -59 -32 -29 -26 -147 -125 -118 -155 -184 -183 -213 -213 -188 -216 -170 -229 -280 -258 -268 -253 -271 -241 -285 -257 -295 -302 -229 -283 -304
5947 -304 -344 -345 -253 -278 -342 -355 -352 -265 -287 -309 -304 -267 -267 -267 -303 -262 -231 -206 -262 -223 -216 -177 -131 -176 -192 -98 -196 -50 -128 -128 -87 -3 2
5980 2 -25 -8 -12 58 -38 110 65 101 153 117 116 147 131 167 178 176 133 213 252 255 208 187 253 290 296 279 311 225 256 255 290 327 290
$$ packed form
5756D77r2m8M1n3K1k2N4m7mm9L7L4p4Kl8N9k1k6o0O3p1j07M1J15r4j8l1Nl2J6
5786G8j5j10L0Jm5k8r3O4O9k8r9NRn1Q7n9n8K6j3o5oj9Q9p0K8ln3qO3j95J15J6
5818c38P3q6j3m%J2mM3%Nj8Oj3N4L5m4O9r6P0M5l7qN9R5j37P7L4k4P9m0L6K5N8
5851A3k1L3l7L7K5j1J7k6M2N6K0j8N0pN8%LM0K5o3K7QR3l7j2m0O7M0o7k7N9k3
5883C24M6p8L3K6Ll6Qk5L7l3M5m6j8j9L1n4l2NK7m4L3n9Mj4j8M7j03N4j06K7P
5914G2n3Kn6O5q9K7LLj21K2Pl7k9Jl0%K5k8M6n9n1K2j0J5j8L0m4K8l8pP3n4k1
5947c04m0jR2k5o4j3LQ7k2k2NL7%%l6M1L1K5n6L9PL9M6m5j6R4r8J46p8%M1Q4N
5980Bk7J7mP0r6J48m5L6N2l6jL1j6L6J1km3Q0L9Lm7k1O6L7Oj7L2q6L1jL5L7l7
$$ plain form
6013 290 296 279 363 302 271 250 274 341 331 264 245 259 265 218 223 236 215 231 197 175 130 165 124 183 146 134 45 79 95 70 64 22
6045 22 54 11 53 7 -52 -26 -117 -112 -64 -158 -64 -236 -150 -134 -188 -196 -170 -213 -184 -229 -224 -269 -252 -237 -266 -254 -275 -326 -326 -293 -284 -256
6077 -256 -309 -258 -327 -226 -237 -266 -267 -294 -296 -252 -159 -226 -238 -224 -215 -204 -235 -278 -153 -150 -185 -189 -154 -136 -32 -67 -106 -87 -78 -56 -21
6108 -21 -34 9 70 6 40 74 173 75 53 133 103 98 133 115 205 212 233 147 135 200 213 248 279 234 182 264 218 231 236 235 244 218 299
6141 299 273 226 307 332 215 321 261 267 243 157 242 239 213 189 244 190 141 214 145 182 195 182 118 108 133 81 135 50 80 50
6171 50 34 -3 48 83 27 -46 -12 -31 -121 -95 -134 -139 -171 -138 -182 -179 -154 -194 -190 -175 -186 -223 -186 -211 -248 -248 -227 -249 -196 -274 -263 -264 -265
6204 -265 -221 -290 -341 -268 -230 -263 -265 -248 -243 -245 -249 -241 -262 -244 -242 -251 -177 -148 -232 -214 -128 -121 -135 -130 -47 -77 -160 -61 -50 -52 -82 -59 -36 8 -16
6239 -16 -38 28 58 57 69 42 60 136 85 130 121 129 209 183 185 156 224 200 165 225 153 212 211 222 265 254 190 212 252 228 237 262 236
$$ packed form
6013B90Oj7Q4o1l1k1K4O7j0o7j9J4Om7NJ3k1J6l4k2m5L5m1N9l7j2q9L4J6k5om2
6045B2L2m3M2m6n9K6r1NM8r4R4j72Q6J6n4qK6m3K9m5Nm5J7J5k9J2k1n1%L3RK8
6077b56n3N1o9J01j1k9jk7kM4R3o7j2J4RJ1l1m3J25Ll5mL5J8J04l5l9J9RK2L5
6108b1j3M3O1o4L4L4R9r8k2Q0l0nL5j8R0PK1q6j2O5J3L5L1m5n2Q2m6J3NjRk6Q1
6141B99k6m7Q1K5j17J06o0Ok4q6Q5lk6k4N5n4m9P3o9L7J3j3o4j0K5n2N4q5L0l0
6171E0j6l7N1L5n6p3L4j9r0K6l9nl2L3m4LK5m0MJ5j1l7L7k5l7%K1k2N3p8J1jj
6204b65M4o9n1P3L8l3kJ7NkmQk1J8KrP4K9q4J8Q6Pj4NQ3l0q3R9J1kl0K3K3M4k4
6239a6k2O6L0jJ2k7J8P6n1M5rQQ0k6Kk9O8k4l5O0p2N9jJ1M3j1o4K2M0k4RK5k6
$$ plain form
6272 236 276 202 278 256 234 249 257 213 180 156 181 218 168 216 141 150 225 105 138 81 72 133 92 69 76 54 87 5 47 68 0
6303 0 29 -39 -45 -71 -28 -83 -106 -86 -97 -80 -113 -140 -145 -134 -105 -122 -108 -212 -192 -255 -199 -224 -216 -236 -251 -207 -236 -189 -212 -242 -212 -216
6335 -216 -228 -178 -260 -236 -250 -239 -200 -213 -230 -180 -208 -200 -125 -180 -193 -130 -142 -102 -127 -90 -129 -133 -120 -78 -69 -56 -61 25 -8 21 -44 -31
6367 -31 31 13 56 33 48 11 107 91 126 150 133 112 81 85 177 164 163 159 156 100 197 241 205 227 209 200 197 238 155 221 284 173 202
6400 202 229 193 202 237 192 184 166 216 214 227 157 217 91 173 161 147 56 85 182 133 128 65 146 94 25 21 26 88 70 32 22 -39
6432 -39 -74 36 -67 -38 -77 -78 -59 -152 -70 -148 -70 -76 -125 -181 -121 -115 -173 -185 -142 -207 -176 -197 -231 -203 -192 -187 -188 -191 -216 -159 -226 -191
6464 -191 -244 -151 -243 -223 -179 -204 -162 -208 -168 -136 -161 -195 -185 -189 -114 -128 -132 -129 -118 -108 -127 -20 -90 -25 -56 -120 -58 -50 -55 -22 -20 -78
6496 -78 -20 0 -18 100 75 129 106 58 146 107 72 100 115 64 164 166 113 126 71 111 189 207 204 179 184 161 150 257 182 255
$$ packed form
6272B36M0p4P6k2k2J5Qm4l3k4K5L7n0M8p5RP5j20L3n7rO1m1k3Pk2L3q2M2K1o8
6303@K9o8ok6M3n5k3K0j1J7l3k7nJ1K9j7J4j04K0o3N6k5Qk0j5M4k9M7k3l0L0m
6335b16j2N0q2K4j4J1L9j3j7N0k8QP5n5j3O3j2M0k5L7l9mJ3M2RJ3nQ6l3K9o5J3
6367c1O2j8M3k3J5l7R6j6L5K4j7k1l1MR2j3jmln6R7M4l6K2j8rlM1q3O6O3j11K9
6400B02K7l6RL5m5qj8N0kJ3p0O0j26Q2j2j4r1K9R7m9no3Q1n2o9mNO2j8l8j0o1
6432c9l5J10j03K9l9jJ9r3Q2p8P8om9n6O0On8j2M3o5L1k1l4K8J1Njlk5N7o7L5
6464a91n3R3r2K0M4k5M2m6M0L2k5l4J0mP5j4mLJ1J0j9J07p0O5l1o4O2QnL3Kn8
6496g8N8K0j8J18k5N4k3m8Q8l9l5K8J5n1J00Kn3J3n5M0P8J8lk5Nk3j1J07p5P3
$$ plain form
6526 255 171 224 236 204 232 201 167 217 165 177 193 195 135 153 165 151 177 110 113 79 124 125 99 11 29 67 64 56 -31 16 26 -1
6558 -1 0 15 40 21 -16 -41 17 43 -81 -2 -59 -60 -45 -115 -93 -114 -119 -97 -88 -143 -225 -156 -143 -130 -249 -143 -81 -168 -159 -160 -117 -204
6590 -204 -133 -208 -107 -177 -242 -243 -183 -139 -206 -82 -130 -159 -180 -140 -214 -169 -174 -108 -101 -84 -59 -156 -120 -127 -142 -101 -58 -63 -82 -58 -3
6621 -3 -33 -42 0 -6 25 68 78 69 14 50 89 104 58 113 89 104 156 127 131 105 100 123 196 128 173 164 216 164 256 211 194 160 214 206
6655 206 168 200 186 185 168 165 176 144 139 108 157 106 129 143 182 164 121 109 143 96 126 118 136 92 77 43 114 11 37 32 -32 33
6687 33 27 39 -50 20 28 10 -23 7 -99 -47 -51 -91 -63 -96 -109 -105 -98 -114 -99 -85 -115 -138 -99 -124 -187 -117 -158 -176 -187 -115 -141 -178
6719 -178 -154 -166 -143 -245 -175 -140 -135 -194 -142 -150 -146 -198 -148 -171 -156 -156 -117 -125 -77 -92 -40 -74 -37 -57 -88 -39 -15 -16 -42 -33 -8 -32 77
6752 77 30 -37 11 6 27 67 63 71 112 60 31 146 53 92 180 108 152 28 140 114 106 130 137 143 204 193 184 125 149 169 155 178
$$ packed form
6526B55q4N3J2l2K8l1l4N0n2J2J6Ko0J8J2j4K6o7Ll4M5Jk6q8J8L8lqq7M7J0k7
6558aJJ5K5j9l7k5N8K6j24P9n7jJ5p0K2k1nK2Rn5q2O9J3J3j19J06O2q7RjM3q7
6590b04P1p5J01p0o5jO0M4o7J24m8k9k1M0p4M5nO6PJ7K5r7L6pj5M1M3nj9K4N5
6621cl0rM2oL1M3J0rn5L6L9J5m6N5k4J5N2k9Mk6nK3P3o8M5rN2n2R2m5j7l4N4q
6655B06l8L2j4jj7lJ1l2nl1M9n1K3J4L9j8m3j2L4m7L0qJ8m4j5l4P1j03K6no4O5
6687C3oJ2q9P0Qj8l3L0j06N2mm0K8l3j3MPj6J5J4l0k3L9k5o3P0m1j8j1P2k6l7
6719a78K4j2K3j02P0L5Nn9N2qMn2N0k3J5%L9qM8j5N2l4L7k0l1M9K4jk6RK5k4J09
6752G7m7o7M8nK1M0mQM1n2k9J15r3L9Q8p2M4j24J12k6qK4POO1j1rn9K4K0j4K3
$$ plain form
6784 178 173 150 179 178 205 131 112 156 138 114 165 92 121 142 106 168 64 117 100 39 77 54 107 108 36 74 63 45 61 84 -25
6815 -25 -25 -20 16 -39 -39 -18 -52 -96 -20 -44 -53 -53 -90 -92 -78 -53 -127 -96 -175 -100 -165 -129 -130 -132 -157 -108 -157 -157 -137 -197 -199 -147 -190 -181 -105 -179
6851 -179 -186 -130 -173 -143 -135 -79 -119 -51 -119 -152 -137 -93 -118 -81 -82 -118 -89 -145 -71 -85 -93 -51 3 -43 -6 44 -27 -19 16 -2 45 34
6883 34 -25 55 42 73 117 69 93 39 153 54 114 95 116 116 123 107 84 157 193 186 183 60 136 159 151 162 108 215 152 183 136
6914 136 108 129 133 80 150 118 211 168 69 103 154 155 172 111 96 85 78 89 79 62 35 33 138 107 69 -6 3 12 25 -29 -23 -73 -14
6947 -14 -14 -10 -67 -82 -23 -28 -55 -59 -55 -103 -127 -68 -77 -62 -148 -76 -77 -159 -123 -154 -150 -166 -172 -102 -161 -164 -130 -103 -184 -116 -149 -116 -143 -110 -90
6982 -90 -125 -112 -117 -92 -82 -19 -31 -71 -32 -106 -101 -76 -118 -96 -45 -68 -32 -11 -23 -46 32 -32 -29 19 24 -19 54 23 49 -8 60 51 53
7015 53 58 41 79 22 104 87 46 83 108 88 98 127 130 122 157 149 172 130 165 155 127 147 153 142 135 188 112 189 145 181 122 133 90
$$ packed form
6784A78nk3K9jK7p4j9M4j8k4N1p3K9K1l6O2j04N3j7o1L8k3N3Jp2L8j1j8J6K3j09
6815b5%NL6n5%K1l4m4P6k4r%l7kJ4K5p4L1p9P5o5L6jkk5M9m9%K0o0kN2m3RP6p4
6851a79pN6m3L0QN6m0O8o8l3J5M4k5L7jl6K9n6P4j4qM2N4m6L7N0p1QL5j8M7j1
6883C4n9Q0j3L1M4m8K4n4J14r9O0j9K1%Pj6k3P3L6plj23P6K3qJ1n4J07o3L1m7
6914A36k8K1Mn3P0l2R3m3r9L4N1JJ7o1j5j1pJ1j0j7k7kJ05l1l8p5RRJ3n4On0N9
6947a4%Mn7j5N9nk7mMm8k4N9rJ5q6P2jq2L6l1Mj6oP0n9lL4K7q1O8l3L3k7L3K0
6982i0l5J3nK5J0O3j2m0L9p4NK5m2K2N1k3L6K1j2k3P8o4LM8Nm3P3l1K6n7O8rK
7015E3Nj7L8n7Q2j7m1L7K5k0J0K9LqL5qK3m2L5j0k8K0Oj1pN3p6P7m4L6n9J1m3
$$ plain form
7048 90 153 137 133 137 195 108 102 38 111 93 84 21 114 74 36 90 21 -25 4 83 13 -32 -3 27 -51 -18 10 -18 -80 -123 -22 -45
7080 -45 -43 -30 -32 -55 -82 -95 -122 -54 -105 -114 -141 -93 -101 -93 -132 -128 -132 -126 -148 -51 -61 -107 -153 -97 -123 -172 -105 -137 -115 -129 -108 -147 -42 -185
7114 -185 -75 -120 -104 -119 -96 -48 -46 -99 -27 -130 -80 -69 -95 -19 -31 -68 -5 -40 76 1 -28 38 13 21 45 38 62 13 58 106
7144 106 102 79 132 60 82 92 106 81 95 142 115 143 69 159 118 115 151 131 193 145 207 163 194 170 168 176 175 120 140 145 154 90 98 160
7178 160 112 119 153 72 25 118 88 121 116 68 102 70 77 7 59 16 18 16 27 -12 6 28 5 -27 8 4 -37 -57 -42 11 -85 -13 -45
7211 -45 -96 -106 -83 -147 -107 -51 -63 -89 -115 -73 -102 -157 -149 -84 -130 -134 -77 -129 -96 -134 -133 -105 -122 -135 -149 -170 -124 -106 -103 -61 -54 -129 -20
7244 -20 -70 -96 -78 -62 -117 -79 -78 -80 -57 -5 -119 -1 -64 -34 -42 -6 -30 17 -9 33 -28 23 52 -4 15 -6 22 52 133 75 84
7275 84 55 100 82 92 164 154 70 112 118 117 66 162 132 168 86 147 87 172 104 122 147 182 114 108 128 118 148 90 96 139 132 149 101
$$ packed form
7048I0O3j6mMN8q7oo4P3j8ro3R3m0l8N4o9m6K9P9p0m5K9L0p8L3K8k8o2m3J01k3
7080d5KJ3kk3k7j3k7O8n1rk7M8qQl9MmOk2R7j0m6m6N6k6m9O7l2K2j4K1l9J05j43
7114a85J10m5J6j5K3M8Kn3P2j03N0J1k6P6j2l7O3l5J16p5k9O6k5QK4pK4m9M5M8
7144A06mk3N3p2K2J0J4k5J4M7k7K8p4R0m1lL6k0O2m8O2m4L1k4kQjn5K0NRo4QO2
7178A60m8PL4q1m7R3l0L3nm8L4l2Pp0N2m3KkJ1l9J8K2k3l2L5mm1k0J5N3r6P2l2
7211d5n1j0K3o4M0N6j2k6k6M2k9n5QO5m6mN7n2L3l8JK8j7j3j4k1M6J8LM2Pp5J09
7244b0n0k6J8J6n5L8JkK3N2j14J18o3L0qL6k4M7k6M2o1N1K9n6J9k1K8L0Q1n8R
7275H4k9M5j8J0P2j0q4M2Ojn1R6l0L6q2O1o0Q5o8J8K5L5o8oK0j0L0n8OM3pJ7m8
$$ plain form
7308 101 118 93 122 120 65 68 99 79 58 -5 69 66 70 -32 58 12 13 -6 18 11 -9 5 -14 -19 -73 -55 -53 -12 -90 -72 -105 -61 -66 -116
7342 -116 -72 -134 -156 -100 -102 -133 -109 -120 -95 -120 -155 -191 -120 -92 -104 -73 -143 -78 -119 -125 -48 -112 -220 -177 -63 -114 -181 -71 -69 -110
7372 -110 -110 -62 -94 -89 -86 -67 -120 -72 -26 -117 -42 22 29 -13 -20 -48 35 9 -36 28 -21 70 56 52 64 18 63 80 54 112 118 74 97
7405 97 117 83 125 86 139 200 115 97 140 97 181 106 151 101 155 108 125 143 62 176 92 129 133 101 86 147 141 114 141 134 87
7436 87 110 111 97 125 87 87 51 39 78 44 69 24 32 20 27 16 63 -7 -7 12 46 -61 -33 53 -8 -59 -47 -14 -91 -48 -18 -114
7468 -114 -91 -72 -112 -61 -123 -118 -111 -110 -107 -123 -70 -124 -145 -165 -131 -44 -107 -112 -56 -125 -123 -96 -135 -106 -124 -106 -103 -55 -73 -98 -62 -83 -104
7501 -104 -80 -69 -80 -141 -53 -68 -44 -3 -35 -43 -96 -38 -3 -19 -9 -49 -17 11 38 53 3 39 90 48 36 96 32 12 74 70 51
7532 51 128 126 106 74 150 62 90 112 113 149 155 116 75 135 101 139 132 121 129 150 118 149 117 136 102 110 101 165 63 163 88 132 97
$$ packed form
7308A01J7k5K9kn5LL1k0k1o3P4lMj02R0m6Jj9K4pk0J4j9nn4J8KM1p8J8l3M4nn0
7342a16M4o2k2N6kl1K4j1K5k5l5l6P1K8j2L1p0O5m1oP7o4j08M3J14n1o7J10Km1
7372a10%M8l2NLJ9n3M8M6r1P5O4Pm2pk8Q3k6m5O4m9R1j4mJ2m6M5J7k6N8Om4K3
7405I7K0l4M2l9N3O1q5j8M3m3Q4p5M5n0N4m7J7J8q1J14q4L7Ml2j5O1ok7K7pm7
7436H7K3Jj4K8l8%l6j2L9l4K5m5Qj2Pj1M7p0%J9L4j07K8Q6o1n1J2L3p7M3L0r6
7468a14K3J9m0N1o2NPJLj6N3n4k1k0L4Q7o3nN6o9KK7l9K9j8J8LM8j8k5L6k1k1
7501a04K4J1j1o1Q8j5K4M1l2qn3N8L5j6J0m0L2K8K7J5n0L6N1m2j2O0o4k0O2mj9
7532E1P7kk0l2P6q8K8K2JL6Ol9m1O0l4L8pj1QK1l2L1l2J9l4QrO4j02J00p5M4l5
$$ plain form
7565 97 79 105 67 113 133 55 70 66 62 46 41 33 -17 11 -34 38 -62 10 -56 -28 -61 10 2 -57 44 -41 -104 -28 -62 -146 -63 -105
7597 -105 -85 -97 -116 -78 -99 -100 -80 -101 -147 -121 -129 -159 -91 -175 -133 -152 -129 -113 -87 -109 -156 -48 -145 -53 -144 -100 -116 -108 -78 -141 -135
7628 -135 -127 -83 -96 -112 -69 -36 -41 -35 3 -44 -29 4 -23 -12 -49 20 -42 32 -16 -9 37 73 -3 19 41 135 79 1 95 105 40 72
7660 72 69 75 152 109 33 140 124 72 126 126 173 69 81 57 73 155 142 162 115 146 158 99 168 194 148 128 191 17 149 144
7690 144 137 48 113 42 84 77 63 106 98 100 35 -17 36 61 10 10 31 47 -12 36 -62 -14 -28 -14 -31 -49 -27 -15 -67 -47 -117 -57
7722 -57 -81 -98 -101 -69 -95 -141 -76 -74 -105 -133 -110 -134 -71 -113 -77 -92 -176 -117 -59 -201 -121 -104 -146 -115 -98 -152 -119 -110 -123 -121 -101 -90
7754 -90 -112 -63 -60 -119 -93 -60 -33 -85 -35 -45 -35 -21 -3 -25 -49 2 -105 41 -36 -30 38 56 50 41 42 25 71 10 103 32 14 74
7786 74 74 17 90 101 60 66 134 53 73 90 107 87 125 102 213 148 126 165 131 78 174 113 125 113 51 184 126 152 76 145
$$ packed form
7565I7j8K6l8M6K0p8J5mmj6nqn0K8m5P2j00P2o6K8l3P1qn9J01q5o3P6l4q4Q3m2
7597a05K0j2j9L8k1jK0k1m6K6ql0O8q4M2j9K3J6K6k2m7J08r7R2r1M4j6QL0o3O
7628a35QM4j3j6M3L3nOL8m7J5L3k7J1l7O9o2P4m8PM6L6p6K2K2R4n6p8R4J0o5L2
7660G2lOP7m3p6J07j6n2N4%M7j04J2k4J6Q2j3K0m7L1J2n9O9K6m6k0O3j74J32n
7690A44pq9O5p1M2pj4M3qKo5n2N3K5n1%K1J6n9M8r8M8j4J4j7j8K2J2n2K0p0O0
7722e7k4j7lL2k6m6O5Kl1k8K3k4O3m2L6j5q4N9N8j42Q0J7m2L1J7n4L3Rj3KK0J1
7754i0k2M9Ln9K6L3K7n2N0j0J0J4J8k2k4N1j07J46p7OO8J8orJj7M6o1R3p1j8O0
7786G4%n7P3J1m1OO8q1K0J7J7k0L8k3J11o5k2L9l4n3R6o1J2j2o2J33n8K6p6O9
$$ plain form
7816 145 97 78 72 115 73 54 87 75 87 152 38 50 66 39 57 21 36 13 52 46 -21 0 -24 -14 -18 -45 12 -33 -26 -60 -5
7847 -5 -51 -53 20 -157 -60 -53 -50 -63 -90 -74 -98 -64 -104 -102 -101 -116 -109 -107 -165 -128 -155 -140 -96 -131 -149 -80 -145 -175 -109 -99 -165 -84 -121 -70
7881 -70 -168 -68 -80 -89 -129 -27 -64 -151 -79 -22 -89 -85 -71 -72 -41 -48 -28 -49 0 -13 -17 -3 19 -33 -16 -40 69 -15 55 1 31
7912 31 80 84 -6 100 47 27 80 88 85 49 79 158 92 182 174 74 115 203 110 130 171 99 105 138 142 173 173 113 132 131 92 163 117
7945 117 136 136 57 139 63 92 37 134 82 42 63 52 4 76 83 4 0 71 28 50 32 8 -98 -12 -25 -24 -50 -27 -60 -23 -39
7976 -39 -61 -23 -77 -65 -72 -140 -51 -114 -129 -54 -90 -122 -118 -132 -114 -128 -112 -173 -150 -104 -137 -135 -125 -140 -172 -131 -94 -102 -132 -116 -136 -160
8008 -160 -104 -85 -123 -194 -24 -90 -125 -59 -52 -100 -69 10 -44 3 -50 -51 -66 30 -41 -20 -6 10 8 -10 37 -63 59 0 44 12
8038 12 113 57 88 54 157 51 37 84 93 57 97 138 79 99 188 84 164 93 92 124 127 112 127 157 191 137 150 151 144 123 132
$$ packed form
7816A45m8j9oM3m2j9L3j2J2O5j14J2J6k7J8l6J5k3L9oo7K1k4J0mk7N7m5Pl4N5
7847em6kP3j77R7PLj3k7J6k4L4m0KJj5PKn8L7k7J5M4l5j8O9o5l0O6J0o6Q1l7N1
7881g0r8J00j2rm0J02l7q7P2N7o7MJ4jL1pK0k1M9j3mJ4K2n2J7k4J09q4P0n4L0
7912C1M9Mr0J06n3k0N3Qll6L0P9o6R0qj00M1Q8r3K0M1p2OL3ML1%o0J9jl9P1m6
7945A17J9%p9Q2p6K9n5R7n2m0K1j1m8P2Pp9mP1m3K2j8k4j06Q6j3Jk6K3l3L7j6
7976c9k2L8n4J2po8Q9o3j5P5l6l2Mj4J8j4J6o1K3M6l3KJ0j5l2M1L7ql0J6k0k4
8008a60N6J9l8p1J70o6l5O6Pm8L1P9n4M7n3jj5R6p1K1J4J6kj8M7j00J22n9M4l2
8038A2J01n6L1l4J03j06j4M7Rl6M0M1n9K0Q9j04Q0p1jL2Lj5J5L0L4n4J3Jpk1R
$$ plain form
8069 132 130 61 102 151 171 35 134 121 138 70 110 105 44 118 90 70 109 39 12 40 53 -8 57 91 -37 25 -14 45 -20 31
8099 31 34 -41 -56 27 -80 -76 22 -57 -86 -43 -53 -121 -55 -74 -118 -132 -158 -112 -87 -180 -124 -72 -88 -110 -64 -176 -136 -122 -122 -89 -118
8130 -118 -107 -100 -101 -87 -88 -128 -109 -142 -93 -149 -93 -60 -124 -170 -101 -81 -92 -140 -54 1 -110 -8 -36 -62 -87 33 -24 -64 -4 -7
8160 -7 -9 39 -15 34 31 70 66 63 49 52 108 71 79 84 28 47 172 33 39 95 96 39 98 141 81 81 116 115 126 134 109
$$ packed form
8069A32ko9M1M9K0j36R9j3J7o8M0no1P4k8k0L9p0k7K8J3o1O5L4j28O2l9N9o5N1
8099C1Lp5j5Q3j07MR8p9k9M3j0o8O6j9m4j4k6M6K5r3N6N2j6k2M6j12M0J4%L3k9
8130a18J1PjJ4jm0J9l3M9n6N6L3o4m6O9K0j1m8Q6N5j11J02k8k6k5J20n7m0O0l
8160gkM8n4M9lL9mlj4LN6l7QNn6J9J25j39ON6Jn7N9M3o0%L5jJ1Qk5
8191A09
$$ Imaginary data points
##PAGE= N=2
##DATA TABLE= (X++(I..I)), XYDATA
$$ plain form
0 0 0 0 0 0 0 0 0 8 -8 8 -8 8 -16 16 -24 24 -32 32 -40 48 -56 64 -79 88 -104 117 -133 152 -172 194 -219
31 -219 244 -275 307 -342 380 -424 472 -522 578 -640 709 -788 869 -965 1071 -1190 1325 -1484
49 -1484 1667 -1882 2144 -2466 2875 -3416 4164 -5268 7084 -10591 19907 -97116 -265113 -111082
63 -111082 3831 -7703 -117405 -140183 -91598 -51311 -87257 -114705 -90173 -50775 -84319 -150644
75 -150644 -163278 -90539 -23143 -35345 -109795 -141284 -96393 -46310 -63635 -100090 -91178 -57703
87 -57703 -62840 -93601 -93991 -50391 -19048 -45078 -98696 -105042 -53242 -10098 -25918 -67596 -74023
100 -74023 -33875 537 -17669 -61406 -62332 -19443 -1624 -32148 -52740 -24988 13753 14421 -15774
113 -15774 -29976 -7860 16673 7857 -16195 -16260 6422 21453 17105 6712 7712 23243 31859
$$ packed form
0@%%%%%%%Qj6J6j6J6k4L2m0M8n6O4p2Q8j04J20j43J67j92K21k50K85l24L66m13
31b19M63n19N82o49P22q04Q96r94J100j218J349j497J657j834K036k261K515k809
49a484L151l549M026m610N341o291P580r432J2352j7675L0498j17023j67997J54031
63a11082J14913j1534j09702k2778M8585M0287l5946k7448K4532L9398l3544o6325
75a50644j2634P2739O7396j2202p4450l1489M4891N0083j7325l6455Q912L3475
87e7703n137l0761l90M3600L1343k6030n3618o346N1800M3144j5820m1678o427
100g4023M0148L4412j8206m3737r26M2889J7819l0524k0592K7752L8741O68l0195
113a5774j4202K2116K4533q816k4052o5K2682J5031m348j0393J000J5531Q616
$$ plain form
126 31859 16392 483 14499 40983 41330 18547 8117 25051 47067 43143 16116 5399 29614
139 29614 53631 42919 16469 14044 39392 58580 42639 7190 -297 30192 50860 31473
151 31473 5927 11661 35035 41847 25297 8211 11741 25578 21259 745 -3743 14534 26029
164 26029 14252 -2500 -2437 11401 14711 -3113 -17433 -4806 12309 2054 -19773 -17865 3565
177 3565 11941 -5982 -30000 -30489 -6650 6699 -11067 -31993 -24136 -1921 1275 -17444 -32031
190 -32031 -24654 -8862 -11140 -28661 -31957 -15977 -7388 -15260 -21718 -19688 -17731 -18899 -21483 -24049
204 -24049 -22498 -17272 -16662 -20668 -20852 -16779 -13845 -14948 -19827 -23142 -18163 -11789 -15811 -21840 -16472
219 -16472 -8290 -9989 -16027 -18288 -17516 -13288 -6867 -6121 -11533 -13835 -10020 -4583 -2207 -6182 -12220
$$ packed form
126C1859j5467j5909J4016K6484L47k2783j0430J6934K2016l924k7027j0717K4215
139B9614K4017j0712k6450k425K5348J9188j5941l5449p487L0489K0668j9387
151C1473k5546N734K3374O812j6550j7086L530J3837m319k0514m488J8277J1495
164B6029j1777j6752O3J3838L310j7824j4320J2627J7115j0255k1827J908K1430
177C565Q376j7923k4018m89K3839J3349j7766k0926P857K2215L196j8719j4587
190c2031P377J5792k278j7521l296J5980Q589p872o458K030J957j168k584k566
204b4049J551N226O10m006j84M073K934j103m879l315M979O374m022o029N368
219a6472Q182j699o038k261P72M228O421P46n412k302L815N437K376l975o038
$$ plain form
234 -12220 -10168 -2445 -1441 -4801 -2524 2572 4023 3898 1719 -3038 -1631 7305 10440 4083 1423
249 1423 7673 14043 13798 9793 8716 12592 12505 5737 6315 19237 25146 15011 7314 13776 22110 20637
265 20637 12767 7458 11154 19726 20883 14478 13809 21158 23783 17359 8791 6107 12171 19390 16537
280 16537 7875 8818 17346 19983 16133 12265 8163 4373 4660 6516 6955 8389 9915 8813 7581 7694
296 7694 5503 2848 2747 715 -4022 -3606 1465 3429 2725 2488 677 -2108 -3284 -5545 -8838 -7211
312 -7211 -3240 -4234 -7273 -6496 -3327 -1058 -2712 -10544 -17421 -12985 -4827 -6948 -14216 -13250 -5926 -2785
328 -2785 -7412 -14810 -15942 -9853 -8700 -16903 -20452 -11618 -4005 -7015 -13420 -14955 -11451 -8363 -12109
343 -12109 -19341 -17597 -8024 -6073 -13504 -15187 -7418 -1608 -6004 -16289 -19528 -9758 -733 -6149 -15110
$$ packed form
234a2220K052P723J004l360K277N096J451j25k179m757J407Q936L135o357k660
249A423O250O370k45m005j077L876q7o768N78J2922N909j0135p697O462Q334j473
265B0637p870n309L696Q572J157o405o69P349K625o424q568k684O064P219k853
280A6537q662R43Q528K637l850l868m102l790K87J856M39J434J526j102j232J13
296G694k191k655j01k032m737M16N071J964p04k37j811k785j176k261l293J627
312g211L971r94l039P77L169K269j654p832o877M436Q158k121p268R66P324L141
328b785m627p398j132O089J153q203l549Q834P613l010o405j535L504L088l746
343a2109p232J744R573J951p431j683P769N810m396j0285l239R770R025n416q961
$$ plain form
358 -15110 -10017 1343 1842 -6929 -11609 -7202 279 516 -7543 -10510 -1122 7731 5161 -1225 -1938
373 -1938 1415 3508 1514 -1960 784 8800 9783 3090 2493 9817 12868 7952 3319 3650 7888 11193
389 11193 9838 8152 12360 16424 12950 7994 8362 10901 12265 12597 10521 8609 12397 17477 16240
404 16240 12284 11190 10847 10075 10284 10379 10412 12521 14094 12150 10664 11359 10494 8988 9040 7057 3867 5775
422 5775 10701 10556 7261 6362 6590 5167 3016 986 1100 3900 3381 -1697 -2293 3276 5256 254 -4703
439 -4703 -6237 -5261 -3067 -3594 -7087 -7169 -3341 -3698 -8389 -9924 -7566 -6661 -8806 -13049 -14778 -10315 -5285
456 -5285 -7841 -12894 -12285 -9739 -11501 -13654 -12877 -11796 -11315 -11722 -13426 -12659 -8482 -7739 -12126 -14825 -12941
473 -12941 -10603 -9521 -9820 -11382 -10371 -6847 -7172 -10804 -9918 -5762 -6289 -9640 -9399 -5924 -3117 -2621
$$ packed form
358a5110N093J1360M99q771m680M407P481K37q059k967R388Q853k570o386p13
373a938L353K093j994l474K744Q016R83o693n97P324L051m916m633L31M238L305
389A1193j355j686M208M064l474m956L68K539J364L32k076j912L788N080j237
404A6240l956j094l43p72K09R5L3K109J573j944j486O95q65j506N2j983l190J908
422E775M926j45l295q99K28j423k151k030J14K800n19n078n96N569J980n002m957
439d703j534R76K194n27l493q2L828l57m691j535K358R05k145m243j729M463N030
456e285k556n053O09K546j762k153P77J081M81m07j704P67M177P43m387k699J884
473a2941K338J082k99j562J011L524l25l632Q86M156n27l351K41L475K807M96
$$ plain form
489 -2621 -4951 -6263 -3578 -1967 -4440 -4813 -835 748 -1273 -1393 931 2733 3215 1341 -1391 308
505 308 4546 4690 2607 4380 7800 8028 6187 4919 5231 7790 8831 5600 4630 10098 14129 11538
521 11538 9195 10694 12392 11508 9417 8087 10274 14329 14121 11058 12224 16095 15969 12808 10505 9818
537 9818 11089 13259 12377 10159 12269 15699 13951 9868 9286 10386 10292 8402 5516 5309 9294 11270
553 11270 7901 5506 6628 6001 2979 1618 1437 1153 1660 1912 137 -336 1306 709 -2259 -4482 -5916
570 -5916 -6319 -4832 -4420 -6364 -6494 -4740 -5594 -8144 -8487 -8927 -10650 -10588 -9881 -10931 -11052 -8602 -7904 -9837
588 -9837 -11569 -11985 -11476 -10616 -11923 -14120 -12186 -8105 -8727 -11733 -11227 -9174 -9737 -11333 -12453 -12372 -9749
605 -9749 -7138 -8699 -11199 -9060 -5951 -6823 -9687 -10882 -9539 -6508 -5842 -8594 -8445 -3462 -1632 -5815
$$ packed form
489b621k330j312K685J611k473l73L978J583k021j20K324J802M82j874k732J699
505C08M238J44k083J773L420K28j841j268L12K559J041l231r70N468M031k591
521A1538k343J499J698q84k091j330K187M055k08l063J166L871j26l161k303o87
537I818J271K170q82k218K110L430j748m083n82J100r4j890k886k07L985J976
553A1270l369k395J122o27l022j361j81k84N07K52j775m73J642n97k968k223j434
570e916m03J487M12j944j30J754q54k550l43m40j723O2P07j050j21K450O98j933
588i837j732m16N09Q60j307k197J934M081o22l006N06K053n63j596j120Q1K623
605i749K611j561k500K139L109q72k864j195J343L031O66k752J49M983J830m183
$$ plain form
621 -5815 -8534 -6161 -3417 -3147 -4767 -5810 -3267 1088 989 -2552 -2235 1015 1241 -1327 -2254 -167 3697
638 3697 5881 3469 1134 4461 8543 6453 2555 2963 5969 7998 7977 6708 7531 11487 12641 8621
654 8621 6432 9401 11670 10331 8600 8852 11333 14356 13974 10521 9979 12340 11862 9297 8888 10346
670 10346 11191 11629 10593 8813 9906 11928 9732 5574 5111 6941 7587 6800 5343 4485 5530 6310 3702
687 3702 1301 1876 2134 556 -237 -382 -1018 -51 1064 -1376 -4602 -3970 -2326 -3306 -5311 -6118 -5528 -4259
705 -4259 -4243 -6505 -7422 -5786 -5889 -8293 -8942 -7937 -7504 -7024 -7202 -9420 -9825 -6950 -6312 -9872 -11479 -8996
723 -8996 -7023 -7756 -9699 -9984 -7701 -6012 -8520 -11441 -9395 -6189 -6968 -8973 -8845 -7578 -6131 -5258
739 -5258 -7173 -9335 -7503 -4721 -5978 -7736 -6456 -4048 -3344 -4551 -6090 -5176 -2274 -2414 -5536 -5226
$$ packed form
621e815k719K373K744K70j620j043K543M355r9l541L17L250K26k568r27K087L864
638C697K184k412k335L327M082k090l898M08L006K029k1j269Q23L956J154m020
654H621k189K969K269j339j731K52K481L023l82l453n42K361m78k565m09J458
670A0346Q45M38j036j780J093K022k196m158m63J830O46p87j457q58J045P80k608
687C702k401N75K58j578p93j45o36R67J115k440l226O32J644r80k005q07N90J269
705d259J6k262r17J636j03k404o49J005M33M80j78k218m05K875O38l560j607K483
723h996J973p33j943k85K283J689k508k921K046L206p79k005J28J267J447Q73
739e258j915k162J832K782j257j758J280K408P04j207j539R14K902j40l122L10
$$ plain form
755 -5226 -1483 -196 -1581 -1740 -643 289 954 244 -1127 210 3145 3424 2024 2589 4612 5809 5735
772 5735 4367 3687 5700 7618 6148 5320 8100 9851 8627 8020 8845 9142 8868 8857 8488 8922 10551 10592
790 10592 9613 10197 10988 10103 9349 9282 8667 8664 9687 9381 8385 9284 9846 8267 7082 7457 6804 5801 6015
809 6015 5951 5280 5469 5462 4305 3917 4010 2478 887 1374 1612 806 503 363 -330 -167 -289 -2289 -3628 -2835
829 -2835 -2692 -4014 -4203 -3778 -4110 -4320 -4225 -5427 -6334 -5923 -6424 -7808 -7498 -6547 -6649 -6997 -7144 -7734 -7925
848 -7925 -7788 -8831 -9885 -8761 -7983 -9294 -9489 -7895 -7772 -8770 -9034 -9359 -9878 -9353 -8848 -9287 -8836 -7819
866 -7819 -8108 -8171 -7324 -7632 -8579 -8091 -7382 -7780 -7234 -5956 -5937 -5852 -4578 -4444 -5536 -5212 -4158 -4139 -4042 -3289
886 -3289 -2680 -1690 -662 -1054 -1559 -162 597 -689 -591 1262 1988 1905 2704 3409 3799 4674 4601 3330 3710
$$ packed form
755e226L743J287j385j59J097R32O65p10j371J337K935K79j400N65K023J197p4
772E735j368o80K013J918j470q28K780J751j224o07Q25K97k74j1l69M34J629M1
790A0592r79N84P91q85p54o7o15lJ023l06r96Q99N62j579j185L75o53j003K14
809F015o4o71J89pj157l88R3j532j591M87K38q06l03j40o93J63j22k000j339P93
829b835J43j322j89M25l32k10R5j202r07M11n01j384L10R51j02l48j47n90j91
848g925J37j043j054J124P78j311j95J594J23r98k64l25n19N25N05m39M51J017
866g819k89o3Q47l08r47M88P09l98N46J278J9Q5J274J34j092L24J054J9R7P53
886c289O09R90J028l92n05J397P59j286R8J853P26q3P99P05L90Q75p3j271L80
$$ plain form
905 3710 5543 6218 5720 5900 6648 7664 8716 7838 6374 7418 9191 8129 6607 7987 9820 9757 9033
922 9033 8568 8403 9286 9716 8097 7174 8487 9164 8385 8042 8264 8225 8267 7559 5832 5706 7346 7080 5087
941 5087 4866 6072 5928 5184 4251 3235 3212 3853 2815 1141 1681 2625 1901 904 395 -195 -365 -154 -1494
960 -1494 -2903 -2408 -1504 -2523 -3341 -3335 -3663 -4000 -4076 -5167 -6085 -5353 -4939 -6069 -6585 -6088 -6238 -6678 -6771 -7400
980 -7400 -8037 -7209 -6858 -7971 -8270 -7487 -7390 -7700 -7768 -8334 -8552 -7302 -7081 -8497 -8456 -6953 -6441 -7241 -7390 -7437
1000 -7437 -6954 -5851 -5965 -7053 -6331 -4511 -4599 -5388 -5020 -4232 -3801 -3425 -3711 -4160 -2651 -903 -1601 -2527
1018 -2527 -1330 38 -151 -554 -447 200 1649 2013 850 1092 3371 3992 2675 2409 3353 4078 4565 4579
1036 4579 3920 4771 6600 6513 5111 5381 6732 7010 6565 6262 6212 7267 8421 7720 6697 7645 8550 7725
$$ packed form
905C710J833O75m98J80P48J016J052q78j464J044J773j062j522J380J833o3p24
922I033m65j65Q83M30j619r23J313O77p79l43K22l9M2p08j727j26J640k66j993
941E087k21J206j44p44r33j016k3O41j038j674N40R44p24r97n09n90j70K11j340
960a494j409M95R04j019q18Ol28l37p6j091r18P32M14j130n16M97j50m40r3o29
980g400o37Q28L51j113k99P83R7l10o8n66k18J250K21j416M1J503N12q00j49m7
1000g437M83J103j14j088P22J820q8p89L68P88M31L76k86m49J509J748o98r26
1018b527J197J368j89m03J07O47J449L64j163K42K279O21j317k66R44P25M87J4
1036D579o59Q51J829q7j402K70J351K78m45l03n0J055J154p01j023R48R05q25
$$ plain form
1054 7725 6975 7313 7502 7772 8002 7286 6864 7811 8093 6674 6004 6567 6455 6088 5880 5305 5260 6077 5653 3981
1074 3981 3757 4519 3929 2837 2729 2595 2435 2514 1910 848 953 1175 -29 -930 -709 -902 -1533 -1493 -1712
1093 -1712 -2689 -2863 -2668 -3552 -4310 -4130 -4359 -4945 -4863 -4930 -5446 -5383 -5365 -6416 -7028 -6401 -6320 -6990 -6940 -6888 -7197 -6563
1115 -6563 -6231 -7250 -7805 -6983 -6922 -7579 -7493 -6889 -6724 -6204 -6020 -6791 -6724 -5631 -5766 -6639 -6187 -5484 -5409 -4929
1135 -4929 -4288 -4497 -4302 -3574 -3736 -4166 -3385 -2852 -3075 -2610 -1859 -1537 -1059 -481 -767 -965 86 572 -166
1154 -166 227 1487 1950 1901 2400 2492 2732 3613 3553 2842 3328 4372 4542 4510 5159 5438 5356 5942 5870 5356 5965
1175 5965 6663 6125 5933 6855 7208 7029 7165 7070 6751 7133 7313 6461 6437 7422 7214 6575 6780 6836 6265 6257 6278 5528
1197 5528 5263 5628 5340 4611 4949 4752 3995 3790 3742 2951 2649 2644 2064 1587 1867 1466 325 299 686 -145 -1099
$$ packed form
1054G725p50L38J89K70K30p16m22R47K82j419o70N63j12l67k08n75m5Q17m24j672
1074C981k24P62n90j092j08j34j60P9o04j062J05K22j204r01K21j93o31M0k19
1093a712r77j74J95q84p58J80k29n86Q2o7n16O3J8j051o12O27Q1o70N0N2l09O34
1115f563L32j019n55Q22O1o57Q6O04J65N20J84p71O7J093j35q73M52P03P5M80
1135d929O41k09J95P28j62m30P81N33k23M65P51L22M78N78k86j98J051M86p38
1154a66L93J260M63m9M99R2K40Q81o0p11M86J044J70l2O49K79q2N86p2n14O09
1175E965O98n38j92R22L53j79J36r5l19L82J80q52k4R85k08o39K05N6n71qK1p50
1197E528k65L65k88p29L38j97p57k05m8p91l02nn80m77K80m01j141k6L87q31r54
$$ plain form
1218 -1099 -1139 -1356 -1760 -1665 -2021 -2828 -2967 -3039 -3708 -3900 -3638 -4519 -5329 -4814 -4571 -5264 -5571 -5518 -5984 -6126 -5806
1239 -5806 -6498 -6987 -6422 -6127 -6833 -6998 -6485 -6647 -6717 -6577 -7043 -7171 -6333 -6238 -6755 -6457 -5908 -6226 -6147 -5421 -5552
1260 -5552 -5934 -5401 -5017 -5134 -4678 -4124 -4388 -4240 -3591 -3499 -3345 -2845 -2689 -2948 -2240 -1538 -1676 -1511 -733 -766
1280 -766 -798 8 457 332 858 1506 1317 1665 2581 2491 2262 2908 3475 3386 3638 4089 4291 4766 5133 4648 4671
1301 4671 5737 5990 5219 5434 6242 6147 6047 6511 6472 6273 6581 6496 6155 6598 6883 6303 6074 6509 6500 6228 6229 5840
1323 5840 5531 6007 5920 4760 4552 5518 5353 4295 3921 3950 3869 3731 3330 2502 2379 2658 2104 1463 1377 1103
1343 1103 625 577 229 -787 -784 -305 -1047 -1964 -1674 -1681 -2430 -2790 -2768 -3084 -3481 -3637 -3966 -4055 -3815 -4319 -4896 -4739
1365 -4739 -4808 -5462 -5365 -4929 -5568 -6110 -5550 -5320 -6031 -5985 -5726 -5981 -6307 -5995 -6066 -6107 -5794 -5673 -5792 -5651 -5578 -5744
$$ packed form
1218a099m0k17m04R5l56q07j39p2o69j92K62q81q10N15K43o93l07N3m66j42L20
1239e806o92m89N65K95p06j65N13j62p0J40m66j28Q38R5n17K98N49l18P9P26j31
1260e552l82N33L84j17M56N54k64J48O49R2J54N00J56k59P08P02j38J65P78l3
1280g66l2Q06M49j25N26O48j89L48R16r0k29O46N67q9K52M51K02M75L67m85K3
1301D671J066K53p71K15Q08r5j00M64l9j99L08q5l41M43K85n80k29M35rk72Jl89
1323E840l09M76q7j160k08R66j65j058l74K9q1j38m01q28j23K79n54o41q6k74
1343A103m78m8l48j016LM79p42r17K90pp49l60K2l16l97j56l29q9K40n04n77J57
1365d739o9o54R7M36o39n42N60K30p11M6K59k55l26L12p1m1L13J21j19J41P3j66
$$ plain form
1387 -5744 -5251 -4969 -5563 -5609 -4351 -4089 -4698 -4486 -3603 -3646 -3781 -3439 -3278 -3004 -2439 -2387 -2599 -1909 -1090 -1029 -1133
1408 -1133 -1076 -919 -81 725 -43 -518 960 2213 1556 1047 1972 2700 2657 2513 2532 2999 3940 4162 3564 3733
1428 3733 4716 5012 4815 4727 4618 4980 5797 5536 4879 5465 6517 5979 5058 5664 6376 6131 5601 5386 5545 5934
1448 5934 6031 5307 5080 5610 5482 4919 4793 4696 4579 4738 4634 3615 3348 4247 4163 2797 2427 2944 2788 2211
1468 2211 1961 1660 1527 1458 864 399 490 276 -458 -593 -548 -1202 -1544 -1187 -1645 -2537 -2371 -2287 -3061 -3353 -2946
1489 -2946 -3286 -3990 -3982 -3865 -4159 -4340 -4697 -4859 -4658 -4683 -5362 -5327 -4670 -5056 -5899 -5453 -4976 -5535 -5716 -5402 -5520
1510 -5520 -5521 -5195 -5138 -5536 -5253 -4863 -5067 -5033 -4991 -4889 -4416 -4103 -4588 -4523 -3321 -3066 -3926 -3779 -2730 -2502 -2949
1531 -2949 -2672 -2147 -1821 -1391 -1347 -1452 -847 -123 -239 -469 -10 386 829 1253 1057 898 1967 2755 1954 1702
$$ packed form
1387e744M93K82n94m6J258K62o09K12Q83m3j35L42J61K74N65N2k12O90Q19O1j04
1408a133N7J57Q38Q06p68m75J478J253o57n09R25P28m3j44J9M67R41K22n98J69
1428C733R83K96j97q8j09L62Q17k61o57N86J052n38r21O06P12k45n30k15J59L89
1448E934R7p24k27N30j28n63j26r7j17J59j04j019k67Q99q4j366l70N17j56n77
1468B211k50l01j33o9n94m65R1k14p34j35M5o54l42L57m58q92J66Q4p74k92M07
1489b946l40p04QJ17k94j81l57j62K01k5o79L5O57l86q43M46M77n59j81L14j18
1510e520jL26N7l98K83L90k04L4M2J02M73L13m85O5J202K55q60J47J049K28m47
1531b949K77N25L26M30M4j05O05P24j16k30M59L96M43M24j96j59J069P88q01k52
$$ plain form
1551 1702 2858 3542 2945 2690 3353 3854 4186 4135 3846 4246 4882 4740 4372 4884 5147 5006 5076 5136 5105 5469 5924
1572 5924 5372 4692 5453 6014 5187 4685 5181 5442 5098 4834 4532 4776 5083 4617 3744 3873 4388 3845 3361 3348
1592 3348 3165 2913 3094 2847 2041 2091 2278 1589 923 1195 1253 685 118 -83 -103 -1 -481 -1387 -1439 -1013 -1507
1613 -1507 -2357 -2214 -2160 -2654 -2876 -2924 -3426 -3514 -3242 -3721 -4442 -4353 -4139 -4328 -4588 -4679 -4844 -4848 -4705 -5126 -5246 -4790
1635 -4790 -5005 -5631 -5421 -4670 -4852 -5331 -5003 -4949 -4993 -4634 -4643 -4897 -4694 -4254 -4421 -4359 -3826 -3712 -3724 -3623 -3421 -3332
1657 -3332 -2739 -2590 -2904 -2580 -1630 -1726 -2110 -1448 -681 -793 -1067 -698 -219 413 693 202 197 1150 1703 1378 1388
1678 1388 1882 2235 2412 2618 2391 2650 3550 3555 2839 3065 4020 4178 3748 3775 4141 4533 4697 4257 4033 4771 5299
1699 5299 4668 4155 4637 5017 4957 4845 4503 4463 5026 5115 4334 3970 4616 4734 4215 3895 3882 3963 4032 3709 3036 3131
$$ packed form
1551A702J156O84n97k55O63N01L32n1k89M00O36j42l68N12K63j41P0O0l1L64M55
1572E924n52o80P61N61q27n02M96K61l44k64l02K44L07m66q73J29N15n43m84j3
1592C348j83k52J81k47q06N0J87o89o66K72N8n68n67k01k0J02m80r06n2M26m94
1613a507q50J43N4m94k22m8n02q8K72m79p21Q9K14j89k60r1j65mJ43m21j20M56
1635d790k15o26K10P51j82m79L28N4m4L59rk54K03M40j67O2N33J14j2J01K02Q9
1657c332N93J49l14L24R50r6l84O62P67j12k74L69M79O32K80m91nR53N53l25J0
1678A388M94L53J77K06k27K59R00Np16K26R55J58m30K7L66L92J64m40k24P38N28
1699E299o31n13M82L80o0j12l42m0N63Q9p81l64O46J18n19l20j3Q1O9l23o73R5
$$ plain form
1721 3131 3400 2939 2231 2479 2626 2212 1851 1619 1297 1297 1284 629 86 322 250 -305 -532 -498 -816 -994 -1246
1742 -1246 -1692 -1904 -1840 -2092 -2651 -2594 -2535 -3007 -3309 -3047 -3288 -3700 -3941 -4015 -4127 -3980 -4174 -4718 -4660 -4097 -4378
1763 -4378 -4891 -4862 -4547 -4600 -4803 -4992 -5084 -4596 -4180 -4624 -4973 -4355 -3796 -4159 -4439 -4149 -3896 -3543 -3589 -3872 -3594
1784 -3594 -2566 -2534 -3234 -3113 -2272 -1839 -2008 -2219 -2198 -1370 -648 -946 -1405 -750 185 78 -335 -68 561 1073
1804 1073 1154 779 869 1848 2471 1933 1704 2329 2833 2794 2684 2748 3108 3770 3780 3132 3420 4314 4364 3866 3731 4081
1826 4081 4283 4581 4392 4116 4288 4860 4578 4170 4397 4603 4369 4376 4219 4060 4212 4398 4102 3774 3829 3840 3485
1847 3485 3496 3425 3060 2805 3039 2797 2486 2364 2202 1891 1789 1563 975 980 1153 708 57 91 151 -53 -374 -902
1869 -902 -1213 -1038 -893 -1599 -2219 -1874 -1677 -2145 -2718 -2881 -2882 -2610 -2824 -3710 -3839 -3142 -3095 -3988 -4283 -3852 -3708
$$ packed form
1721C131K69m61p08K48J47m14l61k32l22%j3o55n43K36p2n55k27L4l18j78k52
1742a246m46k12O4k52n59N7N9m72l02K62k41m12k41p4j12J47j94n44N8N63k81
1763d378n13K9L15n3k03j89r2M88M16m44l49O18N59l63k80K90K53L53m6k83K78
1784c594J028L2p00J21Q41M33j69k11K1Q28P22k98m59O55R35j07m13K67O29N12
1804A073Q1l75R0R79O23n38k29O25N04l9j10O4L60O62J0o48K88Q94N0m98j35L50
1826D081K02K98j89k76J72N72k82m08K27K06k34Pj57j59J52J86k96l28N5J1l55
1847C485J1p1l65k55K34k42l11j22j62l11j02k26n88NJ73m45o51L4O0k04l21n28
1869i02l11J75J45p06o20L45J97m68n73j63jK72k14q86j29O97M7q93k95M31J44
$$ plain form
1890 -3708 -3893 -4345 -4786 -4338 -3807 -4128 -4807 -4665 -3989 -3995 -4445 -4648 -4376 -3917 -3661 -4245 -4532 -3732 -3074 -3466
1910 -3466 -3926 -3613 -3172 -2840 -2876 -3188 -2944 -2157 -1910 -2292 -2250 -1646 -1241 -1335 -1390 -1262 -917 -334 -237 -494 -193
1931 -193 526 561 381 662 962 1155 1420 1542 1523 1923 2405 2332 2303 2655 2765 2759 3124 3297 3103 3270 3751 3771
1953 3771 3716 3857 3907 3924 4161 4119 3759 3913 4421 4332 4024 4051 4170 4265 4219 3933 3555 3914 4190 3689 3266 3530
1975 3530 3823 3536 3232 2962 2750 2898 2944 2296 1876 2250 2348 1813 1410 1347 1457 1313 851 105 158 675 336
1996 336 -519 -761 -469 -444 -975 -1476 -1683 -1501 -1430 -1998 -2711 -2489 -2021 -2421 -3004 -3131 -2984 -2922 -3106 -3633 -3824
2017 -3824 -3319 -3273 -3833 -4108 -3724 -3615 -3827 -4004 -4121 -4050 -3837 -3844 -4162 -4079 -3661 -3706 -3844 -3747 -3660 -3522 -3354 -3384 -3503
2040 -3503 -3229 -2807 -2890 -2910 -2638 -2389 -2452 -2286 -2003 -1987 -1810 -1498 -1356 -1187 -922 -765 -702 -305 -136 -232 -60 322
$$ packed form
1890c708j85m52m41M48N31l21o79J42O76om50k03K72M59K56n84k87Q00O58l92
1910c466m60L13M41L32l6l12K44P87K47l82M2O04M05r4n5J28L45N83R7k57L01
1931a93P19L5j80K81L00J93K65J22j9M00M82p3k9L52J10oL65J73j94J67M81K0
1953C771n5J41N0J7K37m2l60J54N08q9l08K7J19R5m6k86l78L59K76n01m23K64
1975C530K93k87l04k70k12J48M6o48m20L74R8n35m03o3J10j44m62p46N3N17l39
1996C36q55k42K92K5n31n01k07J82P1n68p13K22M68m00n83j27J47O2j84n27j91
2017c824N05M6n60k75L84J09k12j77j17P1K13pl18Q3M18m5j38R7Q7J38J68l0j19
2040c503K74M22q3k0K72K49o3J66K83J6J77L12J42J69K65J57O3L97J69r6J72L82
$$ plain form
2062 322 516 578 893 955 1129 1581 1751 1475 1770 2255 2387 2133 2273 2593 2989 3074 2909 2840 3332 3732 3375
2083 3375 3079 3483 3823 3839 3649 3684 3834 4204 4177 3604 3564 4003 4141 3745 3549 3648 3749 3865 3614 3155 3253 3508
2105 3508 3247 2696 2732 2880 2743 2504 2298 2054 2096 2154 1747 1195 1318 1344 1027 806 683 460 439 257 -149
2126 -149 -455 -403 -522 -1033 -1176 -1153 -1302 -1422 -1544 -1862 -2169 -2201 -2267 -2566 -2667 -2740 -2963 -2983 -2960 -3161 -3354 -3297 -3319
2149 -3319 -3618 -3689 -3615 -3664 -3652 -3568 -3810 -3941 -3583 -3460 -3787 -3940 -3662 -3524 -3505 -3561 -3582 -3333 -3049 -3095 -3394 -3197 -2732
2172 -2732 -2603 -2847 -2769 -2515 -2192 -1878 -1858 -2085 -1635 -1141 -1299 -1383 -1101 -637 -504 -417 -426 -195 397 653 339 346
2194 346 970 1239 1207 1193 1482 1719 2055 2116 2002 2250 2594 2643 2385 2506 2943 3150 3103 3042 3105 3411 3623 3425
2216 3425 3195 3437 3618 3458 3456 3557 3633 3700 3718 3347 3327 3522 3551 3234 3087 3162 3152 3056 2971 2791 2677 2706 2470 2132
$$ packed form
2062C22J94O2L15O2J74M52J70k76K95M85J32k54J40L20L96Q5j65o9M92M00l57
2083C375k96M04L40J6j90L5J50L70k7n73m0M39J38l96j96R9J01J16k51m59R8K55
2105C508k61n51L6J48j37k39k06k44M2N8m07n52J23K6l17k21j23k23k1j82m06
2126a49l06N2j19n11j43K3j49j20j22l18l07l2o6k99j01p3k23k0K3k01j93N7k2
2149c319k99p1P4m9J2Q4k42j31L58J23l27j53K78J38J9n6k1K49K84m6k99J97M65
2172b732J29k44P8K54L23L14K0k27M50M94j58q4K82M64J33Q7rK31N92K56l14P
2194C46O24K69l2j4K89K37L36O1j14K48L44M9k58J21M37K07m7o1O3L06K12j98
2216C425k30K42J81j60kJ01P6O7J8l71k0J95K9l17j47P5j0r6q5j80j14K9k36l38
$$ plain form
2240 2132 2044 2189 1915 1663 1668 1463 1259 1185 1084 713 660 500 131 98 97 -77 -457 -465 -559 -807 -971 -1078 -1313
2263 -1313 -1472 -1563 -1824 -1948 -1847 -1967 -2401 -2457 -2489 -2575 -2694 -2799 -3011 -3109 -2972 -3086 -3361 -3230 -3065 -3304 -3480
2284 -3480 -3476 -3359 -3334 -3329 -3503 -3532 -3324 -3063 -3346 -3336 -3163 -3042 -3108 -3024 -2987 -2874 -2621 -2527 -2665 -2533 -2098 -2013 -2125 -1974
2308 -1974 -1785 -1563 -1495 -1360 -1312 -1025 -699 -749 -746 -292 -34 -98 -25 279 438 606 876 986 1114 1361 1509 1406
2330 1406 1642 1933 1985 2026 2229 2334 2505 2738 2720 2680 2889 3017 2977 2848 3093 3237 3157 3238 3161 3237 3356 3348 3118
2353 3118 3027 3311 3316 3091 3098 3095 3011 3115 2944 2593 2653 2757 2497 2232 2242 2284 2156 1939 1801 1631 1652 1518 1191 946
2377 946 995 866 614 441 422 224 38 -81 -280 -553 -496 -721 -986 -1011 -1082 -1224 -1412 -1533 -1706 -1943 -1952 -2020 -2271
2400 -2271 -2266 -2333 -2451 -2572 -2552 -2755 -2770 -2799 -2904 -3078 -3065 -2974 -3083 -3105 -3017 -3116 -3161 -2992 -3068 -3213 -3041 -2947 -2964 -3008 -2875
$$ packed form
2240B132q8J45k74k52Nk05k04p4j01l71n3j60l69l3jj74l80qr4k48j64j07k35
2263a313j59r1k61j24J01j20m34n6l2q6j19j05k12r8J37j14k75J31J65k39j76
2284c480MJ17K5Nj74k9K08K61k83J0J73J21o6Q4L7J13K53R4j38J32M35Q5j12J51
2308a974J89K22O8J35M8K87L26n0LM54K58o4P3L04J59J68K70J10J28K47J48j03
2330A406K36K91N2M1K03J05J71K33j8m0K09J28m0j29K45J44q0Q1p7P6J19qk30
2353C118r1K84Nk25Plq4J04j71l51O0J04k60k65J0M2j28k17j38j70K1j34l27k45
2377I46M9j29k52j73j9j98j86j19j99k73N7k25k65k5p1j42j88j21j73k37ro8k51
2400b271No7j18j21K0k03j5k9j05j74J3R1j09k2Q8r9m5J69p6j45J72R4j7m4J33
$$ plain form
2425 -2875 -2849 -2718 -2499 -2535 -2554 -2384 -2175 -2131 -2126 -1964 -1816 -1608 -1401 -1393 -1372 -1073 -836 -934 -913 -566 -274 -283 -145 -71
2449 -71 178 468 587 396 680 1012 1072 1007 1195 1480 1586 1696 1730 1758 2097 2308 2219 2182 2399 2654 2619 2642 2713
2472 2713 2797 2971 2970 2820 2832 3089 3152 2984 2939 3058 3100 3079 2995 2874 2905 3009 2883 2666 2641 2777 2715 2556 2430 2312
2496 2312 2361 2351 1975 1759 1932 1894 1587 1409 1340 1278 1094 949 715 648 628 456 174 -23 90 -64 -316 -491
2518 -491 -584 -811 -875 -1024 -1236 -1305 -1430 -1621 -1772 -1826 -1901 -2010 -2108 -2227 -2402 -2477 -2410 -2519 -2694 -2667 -2667 -2730 -2777 -2718 -2919
2543 -2919 -2872 -2843 -2963 -3024 -2889 -2831 -2893 -2790 -2789 -2743 -2702 -2602 -2627 -2570 -2439 -2306 -2295 -2177 -2040 -2019 -1926 -1654 -1667 -1642 -1421
2568 -1421 -1199 -1185 -1048 -903 -715 -535 -445 -372 -290 -1 116 142 306 522 629 688 894 971 1136 1345 1389 1403 1563
2591 1563 1706 1738 1749 1944 2065 2181 2259 2330 2373 2494 2558 2463 2551 2729 2804 2712 2830 2843 2850 2919 2909 2738 2778 2820 2770 2691
$$ packed form
2425b875K6J31K19l6j9J70K09M4NJ62J48K08K07QK1K99K37r8K1L47K92rJ38P4
2449g1K49K90J19j91K84L32O0o5J88K85J06J10L4K8L39K11q9l7K17K55l5K3P1
2472B713Q4J74jj50J2K57O3j68m5J19M2k1q4j21L1J04j26k17k5J36o2j59j26j18
2496B312M9j0l76k16J73l8l07j78o9o2j84j45k34o7k0j72k82j97J13j54k52j75
2518d91r3k27o4j49k12o9j25j91j51n4p5j09r8j19j75p5O7j09j75K7%o3m7N9k01
2543b919M7K9j20o1J35N8o2J03JM6M1J00k5N7J31J33J1J18J37K1R3K72j3K5K21
2568a421K22J4J37J45J88J80R0P3Q2K89J17K6J64K16J07N9K06P7J65K09M4J4J60
2591A563J43L2J1J95J21J16P8P1M3J21O4r5Q8J78P5r2J18J3PO9j0j71M0M2n0p9
$$ plain form
2617 2691 2652 2665 2559 2563 2505 2345 2274 2349 2131 1932 1936 1954 1797 1650 1544 1411 1306 1313 1013 850 870 717 497 401
2641 401 370 234 6 -134 -329 -433 -506 -619 -868 -961 -1018 -1271 -1341 -1437 -1595 -1702 -1842 -1874 -2045 -2080 -2153 -2245 -2288 -2365
2665 -2365 -2481 -2548 -2571 -2640 -2683 -2645 -2691 -2755 -2725 -2727 -2701 -2738 -2712 -2728 -2816 -2680 -2617 -2577 -2571 -2491 -2429 -2331 -2385 -2244 -2201 -2100 -1997 -1998
2693 -1998 -1848 -1660 -1579 -1516 -1309 -1245 -1163 -991 -822 -831 -761 -423 -267 -276 -100 17 189 285 466 518 734 804 906 1043
2717 1043 1220 1411 1386 1515 1648 1726 1880 1939 2023 2030 2202 2297 2244 2335 2456 2496 2522 2530 2571 2614 2704 2633 2679 2757 2742 2704 2726
2744 2726 2714 2614 2551 2546 2533 2480 2425 2382 2343 2199 2148 2028 1935 1802 1671 1660 1597 1449 1248 1160 1163 949 802 745 603
2769 603 415 338 269 54 -101 -126 -176 -409 -508 -688 -660 -891 -1028 -1094 -1198 -1292 -1490 -1576 -1556 -1743 -1834 -1880 -1974 -2089
2793 -2089 -2202 -2155 -2208 -2386 -2382 -2377 -2425 -2553 -2551 -2480 -2497 -2562 -2644 -2581 -2435 -2479 -2634 -2523 -2433 -2394 -2362 -2282 -2261 -2204 -2188 -2041 -2033 -1936
$$ packed form
2617B691l9J3j06Mn8j60p1P5k18j99MJ8j57j47j06j33j05Pl00j63K0j53k20r6
2641D01l1j36k28j40j95j04p3j13k49r3n7k53p0r6j58j07j40l2j71l5p3r2m3p7
2665b365j16o7k3o9m3L8m6o4L0kK6l7K6j6q8J36O3M0OQ0O2R8n4J41M3J01J03j
2693a998J50J88Q1O3K07O4Q2J72J69rP0L38J56rJ76J17J72R6J81N2K16P0J02J37
2717A043J77J91k5J29J33P8J54N9Q4PJ72R5n3R1J21M0K6QM1M3R0p1M6P8j5l8K2
2744B726j2j00o3nj3n3n5m3l9j44n1j20r3j33j31j1o3j48k01q8Lk14j47n7j42
2769F03j88p7o9k15j55k5n0k33r9j80K8k31j37o6j04r4j98q6K0j87r1m6r4j15
2793b089j13M7n3j78MNm8j28KP1j7o5q2O3J46m4j55J11R0L9L2Q0K1N7J6J47QR7
$$ plain form
2821 -1936 -1770 -1598 -1608 -1613 -1415 -1255 -1089 -1144 -1065 -913 -709 -742 -615 -345 -256 -173 -83 35 156 344 505 515 647
2844 647 755 989 1097 1106 1219 1418 1519 1497 1543 1748 1990 1902 1894 2013 2206 2230 2208 2281 2349 2347 2401 2446 2397 2453 2584 2547
2870 2547 2402 2400 2452 2541 2421 2305 2333 2399 2410 2135 2118 2179 2135 1970 1912 1817 1752 1678 1624 1441 1336 1344 1231 1133 926 760
2896 760 713 686 488 291 313 251 -34 -172 -222 -281 -511 -576 -659 -742 -913 -1023 -1117 -1158 -1313 -1419 -1491 -1598 -1638 -1727 -1785
2921 -1785 -1917 -1949 -2046 -2020 -2060 -2238 -2226 -2261 -2328 -2422 -2339 -2331 -2433 -2447 -2345 -2294 -2371 -2471 -2317 -2272 -2331 -2311 -2192 -2125 -2149 -2115
2947 -2115 -2080 -1883 -1836 -1698 -1651 -1633 -1485 -1341 -1177 -1177 -1122 -977 -806 -746 -731 -586 -359 -297 -360 -219 87 175 199 237
2971 237 506 585 612 757 834 960 1065 1208 1261 1307 1440 1610 1686 1600 1680 1915 1998 1982 1935 2122 2278 2179 2087 2239
2995 2239 2374 2325 2275 2248 2274 2295 2324 2297 2175 2136 2267 2252 2139 2049 2043 2073 2041 1850 1793 1869 1751 1519 1488 1529 1382 1221
$$ packed form
2821a936J66J72j0nJ98J60J66n5P9J52K04l3J27K70Q9Q3R0J18J21J88J61J0J32
2844F47J08K34J08RJ13J99J01k2M6K05K42q8qJ19J93K4k2P3O8kN4M5m9N6J31l7
2870B547j45kN2Q9j20j16K8O6J1k75j7O1m4j65n8r5o5p4n4j83j05Qj13r8k07j66
2896G60m7k7j98j97K2o2k85j38n0n9k30o5q3q3j71j10r4m1j55j06p2j07m0q9n8
2921a785j32l2r7K6m0j78J2l5o7r4Q3Qj02j4J02N1p7j00J54M5n9K0J19O7k4L4
2947b115L5J97M7J38M7J8J48J44J64%N5J45J71O0J5J45K27O2o3J41L06Q8K4L8
2971B37K69P9K7J45P7J26J05J43N3M6J33J70P6q6Q0K35Q3j6m7J87J56r9r2J52
2995B239J35m9n0k7K6K1K9k7j22l9J31j5j13r0oL0l2j91n7P6j18k32l1M1j47j61
$$ plain form
3021 1221 1174 1196 1024 967 855 707 635 553 391 276 149 140 5 -192 -268 -416 -441 -498 -783 -832 -839 -978 -1163 -1267
3045 -1267 -1336 -1385 -1487 -1588 -1643 -1726 -1768 -1875 -1913 -1945 -2046 -2098 -2071 -2103 -2101 -2186 -2218 -2273 -2260 -2190 -2251 -2276 -2261 -2147 -2194 -2240 -2172
3072 -2172 -2097 -2027 -2066 -1992 -1979 -1793 -1783 -1811 -1706 -1527 -1453 -1462 -1419 -1209 -1176 -947 -977 -939 -767 -601 -552 -505 -396 -291 -58
3097 -58 -1 14 158 364 498 443 498 791 861 865 914 1096 1222 1317 1277 1395 1452 1651 1675 1638 1731 1860 1962 1906 1874 1971
3123 1971 2056 2131 2084 2015 2118 2304 2186 2045 2138 2157 2215 2099 2041 2107 2052 2048 1855 1822 1855 1821 1649 1520 1573 1544 1520 1319
3149 1319 1146 1135 1107 1078 866 691 826 704 450 426 333 281 233 9 -161 -146 -147 -321 -543 -594 -684 -738 -932 -1017
3173 -1017 -1074 -1125 -1172 -1402 -1400 -1385 -1478 -1664 -1718 -1710 -1828 -1829 -1887 -1921 -2012 -1928 -2009 -2010 -2034 -1988 -2129 -2098 -2060 -2087 -2060 -1986 -2081 -2015 -1934
3202 -1934 -1927 -1895 -1889 -1771 -1838 -1707 -1632 -1600 -1506 -1473 -1449 -1409 -1180 -1148 -1111 -1039 -868 -777 -779 -640 -515 -437 -296 -217 -251 -39 162
$$ packed form
3021A221m7K2j72n7j12j48p2q2j62j15j27rj35j97p6j48k5n7k85m9pj39j85j04
3045a267o9m9j02j01n5q3m2j07l8l2j01n2K7l2Kq5l2n5J3P0o1k5J5J14m7m6O8
3072b172P5P0l9P4J3J86J0k8J05J79P4rM3K10L3K29l0L8J72J66M9M7J09J05K33
3097e8N7J5J44K06J34n5N5K93P0MM9J82J26R5m0J18N7J99K4l7R3J29J02n6l2R7
3123A971Q5P5m7o9J03J86j18j41R3J9N8j16n8O6n5mj93l3L3l4j72j29N3k9k4k01
3149A319j73j1k8k9k12j75J35j22k54k4r3n2m8k24j70J5jj74k22n1r0n4j94q5
3173a017n7n1m7k30KJ5r3j86n4Qj18jn8l4r1Q4q1jk4M6j41L1L8k7K7P4r5O6Q1
3202a934PL2OJ18o7J31P5L2R4L3K4M0K29L2L7P2J71R1kJ39J25P8J41P9l4K12K01
$$ plain form
3229 162 167 225 290 541 579 636 710 770 976 1070 1046 1136 1313 1381 1400 1393 1537 1627 1682 1656 1630 1762 1882 1902 1843 1956 2055
3256 2055 2083 1988 2001 2033 2065 2054 1981 1932 1998 2045 1947 1793 1825 1866 1714 1627 1621 1613 1588 1479 1400 1249 1296 1225 1030 948 912 832
3284 832 726 605 520 487 511 259 145 105 88 -74 -192 -269 -288 -378 -480 -639 -752 -665 -799 -1005 -1203 -1082 -1143
3307 -1143 -1266 -1373 -1420 -1472 -1452 -1623 -1705 -1693 -1612 -1767 -1944 -1896 -1862 -1832 -1896 -1957 -1965 -1862 -1855 -1984 -1949 -1877 -1845 -1824 -1852 -1822 -1732
3334 -1732 -1697 -1610 -1634 -1524 -1480 -1478 -1473 -1384 -1218 -1212 -1174 -1053 -955 -896 -736 -781 -651 -542 -459 -422 -323 -141 -71 -24 79 165 284
3361 284 328 385 499 604 757 755 841 969 1133 1159 1217 1268 1352 1413 1493 1457 1518 1690 1644 1589 1725 1803 1808 1831 1823 1820 1919 1914 1870
3390 1870 1789 1821 1952 1822 1716 1744 1755 1756 1653 1599 1549 1648 1600 1425 1323 1378 1345 1268 1172 996 1005 998 894 687 667 666 581
3417 581 329 258 253 156 97 -76 -110 -167 -239 -435 -602 -516 -556 -692 -814 -956 -981 -926 -1041 -1208 -1305 -1161 -1273 -1532
$$ packed form
3229A62NN8O5K51L8N7P4O0K06R4k4R0J77O8J9pJ44R0N5k6k6J32J20K0n9J13R9
3256B055K8r5J3L2L2j1p3m9O6M7r8j54L2M1j52q7oqk5j09p9j51M7p1j95q2l6q0
3284H32j06j21q5l3K4k52j14m0j7j62j18p7j9r0j02j59j13Q7j34k06j98J21o1
3307a143j23j07m7n2K0j71q2J2Q1j55j77M8L4L0o4o1qJ03Pj29L5P2L2K1k8L0R0
3334a732L5Q7k4J10M4KNQ9J66OL8J21R8N9J60m5J30J09Q3L7R9J82P0M7J03Q6J19
3361B84M4N7J14J05J53kQ6J28J64K6N8N1Q4O1Q0l6O1J72m6n5J36P8NK3qlR9nm4
3390A870q1L2J31j30j06K8J1Jj03n4n0R9m8j75j02N5l3p7r6j76Rpj04k07k0jq5
3417E81k52p1nr7n9j73l4n7p2j96j67Q6m0j36j22j42k5N5j15j67r7J44j12k59
$$ plain form
3441 -1532 -1553 -1467 -1527 -1574 -1664 -1699 -1666 -1627 -1792 -1781 -1753 -1689 -1776 -1872 -1831 -1803 -1763 -1742 -1735 -1725 -1623 -1635 -1689 -1646 -1565 -1441 -1408 -1356
3469 -1356 -1323 -1255 -1184 -1090 -1083 -987 -816 -910 -834 -679 -538 -498 -426 -309 -213 -205 -65 -13 126 183 298 312 347 551 594 632
3495 632 802 771 922 992 1056 1043 1233 1270 1208 1270 1399 1451 1480 1501 1508 1495 1685 1724 1628 1619 1753 1687 1677 1637 1752 1699 1669
3522 1669 1628 1596 1598 1653 1591 1397 1460 1502 1396 1368 1357 1283 1304 1204 1086 1042 1080 960 811 769 811 719 618 474 418 364
3548 364 387 190 98 49 54 -155 -245 -328 -347 -440 -438 -610 -744 -664 -801 -979 -982 -986 -1063 -1148 -1258 -1305 -1302 -1271 -1383 -1505 -1468 -1445
3576 -1445 -1509 -1645 -1615 -1561 -1584 -1622 -1701 -1659 -1586 -1632 -1677 -1678 -1579 -1563 -1584 -1661 -1525 -1450 -1432 -1418 -1475 -1343 -1265 -1199 -1247 -1129 -996
3603 -996 -964 -930 -808 -786 -675 -607 -643 -506 -361 -329 -263 -210 14 53 59 163 235 318 373 445 382 593 747 760 817 909
3629 909 947 996 1010 1103 1126 1208 1283 1227 1281 1431 1537 1432 1407 1550 1514 1556 1597 1572 1572 1604 1558 1517 1667 1693 1527 1506 1432
$$ packed form
3441a532k1Q6o0m7r0l5L3L9j65J1K8O4q7r6M1K8M0K1PJ0J02j2n4M3Q1J24L3N2
3469a356L3O8P1R4PR6J71r4P6J55J41M0P2J17R6QJ40N2J39N7J15J4L5K04M3L8
3495F32J70l1J51P0O4j3J90L7o2O2J29N2K9K1Pj3J90L9r6rJ34o6j0m0J15n3l0
3522A669m1l2KN5o2j94O3M2j06k8j1p4K1j00j18m4L8j20j49m2M2r2j01j44n6n4
3548C64K3j97r2m9Nk09r0q3j9r3Kj72j34Q0j37j78lmp7q5j10m7LL1j12j22L7K3
3576a445o4j36L0N4k3l8p9M2P3m6m5jR9J6k1p7J36P5J8J4n7J32P8O6m8J18J33
3603i96L2L4J22K2J11O8l6J37J45L2O6N3K24L9OJ04P2Q3N5P2o3K11J54J3N7R2
3629I09L8M9J4R3K3Q2P5n6N4J50J06j05k5J43l6M2M1k5%L2m6m1J50K6j66k1p4
$$ plain form
3656 1432 1486 1437 1436 1350 1276 1347 1368 1111 1083 1176 1047 957 944 833 807 784 691 531 508 560 392 225 210 178 73 -10
3682 -10 -119 -195 -194 -266 -399 -481 -468 -581 -648 -743 -857 -910 -898 -1001 -1146 -1160 -1095 -1275 -1350 -1319 -1274 -1386 -1380 -1434 -1542 -1468 -1437
3709 -1437 -1451 -1584 -1476 -1550 -1580 -1580 -1480 -1462 -1491 -1511 -1492 -1478 -1369 -1369 -1391 -1370 -1206 -1217 -1235 -1144 -1063 -1075 -997 -927 -985 -812 -715
3736 -715 -792 -720 -549 -388 -409 -319 -310 -182 -107 -80 4 55 244 256 286 378 445 571 544 602 718 715 857 902 902 984 1145
3763 1145 1101 1106 1211 1274 1308 1304 1319 1284 1410 1468 1408 1407 1498 1514 1512 1474 1517 1504 1497 1413 1419 1493 1480 1414 1343 1317 1337 1293 1252 1158 1095
3794 1095 1043 1072 954 877 913 844 657 602 649 507 456 400 309 278 257 138 -43 -8 -15 -190 -279 -327 -387 -423 -526 -604
3820 -604 -648 -661 -728 -869 -912 -950 -1000 -1092 -1093 -1111 -1202 -1264 -1285 -1357 -1317 -1290 -1476 -1462 -1398 -1375 -1492 -1407 -1423 -1478 -1456 -1409 -1493 -1441 -1338
3849 -1338 -1321 -1377 -1315 -1251 -1314 -1127 -1140 -1166 -1106 -1063 -1065 -1044 -912 -783 -822 -836 -661 -580 -503 -475 -561 -480 -295 -172 -202 -204 -25
$$ packed form
3656A432N4m9jq6p4P1K1k57k8R3j29r0j3j11k6k3r3j60k3N2j68j67j5l2j05q3
3682a0j09p6Jp2j33q2J3j13o7r5j14n3J2j03j45j4O5j80p5L1M5j12On4j08P4L1
3709a437j4j33J08p4l0%J00J8k9k0J9J4J09%k2K1J64j1j8R1Q1j2P8P0n8J73R7
3736g15p7P2J71J61k1R0RJ28P5K7Q4N1J89J2L0R2O7J26k7N8J16lJ42M5%Q2J61
3763A145m4NJ05O3L4mJ5l5J26N8o0jR1J6kl8M3j3pq4OP4j3o6p1k6K0m4m1r4o3
3794A095n2K9j18p7L6o9j87n5M7j42n1n6r1l1k1j19j81L5pj75q9m8o0l6j03p8
3820f04m4j3o7j41m3l8n0r2jj8r1o2k1p2M0K7j86J4O4K3j17Q5j6n5K2M7q4N2J03
3849a338J7n6O2O4o3J87j3k6O0M3kK1J32J29l9j4J75Q1P7K8q6Q1J85J23l0kJ79
$$ plain form
3876 -25 73 133 153 194 250 422 455 412 609 712 689 673 836 922 936 983 979 1034 1163 1181 1171 1154 1323 1216 1239 1338 1275
3903 1275 1330 1394 1409 1354 1338 1432 1370 1278 1385 1404 1300 1305 1308 1286 1182 1267 1149 1129 1142 1098 911 960 940 885 832 769 761 671
3931 671 640 635 467 361 450 367 210 171 78 58 38 -55 -239 -143 -218 -425 -468 -420 -483 -575 -669 -702 -765 -789 -790 -898 -955 -916
3959 -916 -1028 -1087 -1146 -1071 -1207 -1201 -1204 -1277 -1262 -1265 -1335 -1327 -1288 -1308 -1384 -1372 -1300 -1329 -1335 -1230 -1327 -1243 -1132 -1162 -1275 -1128 -1077 -1058 -1087
3988 -1087 -990 -974 -927 -866 -802 -803 -617 -530 -560 -601 -425 -393 -300 -273 -165 -151 -36 10 -15 64 191 259 233 405 463 471 510
4015 510 635 562 714 808 799 749 932 924 915 960 1068 1105 1131 1161 1168 1150 1277 1275 1165 1221 1263 1246 1230 1273 1243 1171 1229 1252 1143
4044 1143 1191 1208 1084 1096 1073 1016 1009 1001 944 867 918 874 734 757 754 588 613 576 512 444 373 354 221 228 221 105 -8 -2 -46
4073 -46 -110 -206 -274 -291 -342 -455 -509 -574 -608 -690 -778 -732 -819 -908 -898 -901 -971 -1077 -1058 -1085 -1104 -1118 -1120 -1193 -1220 -1166 -1246 -1324 -1174 -1189
$$ packed form
3876b5R8O0K0M1N6J72L3m3J97J03k3j6J63Q6J4M7mN5J29J8j0j7J69j07K3R9o3
3903A275N5O4J5n5j6R4o2r2J07J9j04NLk2j04Q5j18k0J3m4j87M9k0n5n3o3qr0
3931F71l1nj68j06Q9q3j57l9r3k0k0r3j84R6p5k07m3M8o3r2r4l3o3k4jj08n7L9
3959i16j12n9n9P5j36Olp3J5lp0QL9k0p6J2P2k9oJ05r7Q4J11l0j13J47N1J9k9
3988a087R7J6M7O1O4jJ86Q7l0m1J76L2R3K7J08J4J15M6k5P9J27O8k6J72N8QL9
4015E10J25p3J52R4rn0J83qrM5J08L7K6L0Pj8J27kj10N6M2j7j6M3l0p2N8K3j09
4044A143M8J7j24J2k3n7pqn7p7N1m4j40K3lj66K5l7o4o8p1j9j33Ppj16j13Om4
4073d6o4r6o8j7n1j13n4o5l4q2q8M6q7q9J0lp0j06J9k7j9j4kp3k7N4q0p8J50j5
$$ plain form
4103 -1189 -1239 -1165 -1229 -1274 -1283 -1113 -1188 -1201 -1102 -1093 -1162 -1124 -1028 -1048 -909 -813 -912 -863 -774 -723 -654 -582 -565 -555 -449 -360 -465 -372
4131 -372 -122 -183 -144 -50 59 38 188 230 219 297 377 403 496 558 576 596 641 740 692 779 797 855 863 938 1037 1002 1007 1072 1107
4160 1107 1104 1137 1121 1169 1225 1211 1128 1227 1247 1172 1101 1181 1191 1104 1132 1081 1083 998 1009 976 880 939 833 840 804 785 743 755 656 548
4190 548 578 603 440 318 335 341 221 234 218 101 38 -25 -26 -171 -208 -198 -304 -395 -415 -437 -497 -559 -617 -620 -720 -773 -875
4217 -875 -889 -830 -941 -983 -930 -938 -1103 -1068 -1065 -1093 -1115 -1116 -1143 -1173 -1146 -1193 -1170 -1146 -1165 -1107 -1118 -1090 -1158 -1004 -1022 -1001 -987 -1035 -833
4246 -833 -922 -869 -864 -807 -778 -796 -652 -670 -547 -568 -523 -412 -457 -400 -302 -196 -199 -172 -47 35 -31 61 222 232 209 336 381
4273 381 404 488 534 520 560 648 627 723 810 770 802 921 915 907 975 981 1000 952 1070 1082 1059 1104 1148 1080 1074 1067 1120 1032 1046 1003 1054
4304 1054 1080 1062 954 986 1046 887 895 910 858 811 734 714 668 665 581 543 508 403 463 380 389 282 164 228 129 -15 -36 -1
$$ packed form
4103a189n0P4o4m5rJ70p5j3R9Ro9L8R6k0J39R6r9M9Q9N1O9P2J7J0J06Q9j05R3
4131c72K50o1L9R4J09k1J50M2j1P8Q0K6R3O2J8K0M5R9m8Q7J8N8QP5R9l5NO5L5
4160A107lL3j6M8N6j4q3R9K0p5p1Q0J0q7K8n1Kq5J1l3r6N9j06Pl6j9m2J2r9j08
4190E48L0K5j63j22J7Oj20J3j6j17o3o3jj45l7J0j06r1k0k2o0o2n8lj00n3j02
4217h75j4N9j11m2N3qj65L5Lk8k2jk7l0K7m7K3K4j9N8j1K8o8J54j8K1J4m8K02
4246h33q9N3NN7K9j8J44j8J23k1M5J11m5N7R8J06lK7J25Q2o6R2J61J0k3J27M5
4273C81K3Q4M6j4M0Q8k1R6Q7m0L2J19oqO8OJ9m8J18J2k3M5M4o8opN3q8J4m3N1
4304A054K6j8j08L2O0j59QJ5n2m7p7k0m6lq4l8l5j05O0q3Rj07j18O4r9j44k1L5
$$ plain form
4332 -1 -128 -280 -189 -215 -299 -374 -352 -521 -534 -574 -597 -707 -672 -722 -785 -743 -791 -922 -888 -815 -944 -1010 -997 -881 -1063 -1101 -991
4359 -991 -1048 -1083 -1047 -1017 -1034 -1072 -1055 -1049 -1033 -1021 -1055 -908 -909 -945 -936 -817 -832 -857 -817 -684 -694 -690 -559 -559 -578 -446 -404 -450 -413 -297
4389 -297 -299 -212 -246 -225 -112 32 18 -45 55 208 151 149 283 351 290 474 474 473 625 610 641 609 727 777 800 828 849 829
4417 829 945 947 927 865 1002 1045 921 900 1003 983 1011 1078 949 990 963 954 934 969 956 945 941 831 829 837 895 741 733 791 699
4446 699 643 557 605 518 406 495 386 341 340 308 216 218 111 66 7 22 -115 -142 -159 -168 -355 -313 -293 -352 -448 -454 -501 -588 -543
4475 -543 -607 -696 -754 -721 -709 -762 -804 -857 -822 -857 -858 -983 -887 -926 -920 -1070 -936 -991 -1042 -913 -929 -973 -913 -930 -915 -831 -941 -808
4503 -808 -824 -824 -797 -799 -723 -620 -724 -673 -595 -529 -549 -480 -434 -491 -301 -265 -265 -224 -130 -105 -156 -73 5 -26 94 169 126 230 330
4532 330 326 285 370 433 473 488 510 623 619 716 632 615 805 772 757 708 814 826 849 969 842 870 960 958 841 925 924 950 850
$$ packed form
4332aj27j52R1k6q4p5K2j69j3m0k3j10L5n0o3M2m8j31L4P3j29o6J3J16j82l8J10
4359i91n7l5L6L0j7l8J7OJ6J2l4J47jl6RJ19j5k5M0J33j0MJ31%j9J32M2m6L7J16
4389b97kQ7l4K1J13J44j4o3J00J53n7kJ34O8o1J84%jJ52j5L1l2J18N0K3K8K1k0
4417H29J16Kk0o2J37M3j24k1J03k0K8O7j29M1k7rk0L5j3j1mj10kQN8j54qN8r2
4446F99n6q6M8q7j12Q9j09m5jl2r2Kj07m5n9J5j37k7j7rj87M2K0n9r6om7q7M5
4475e43o4q9n8L3J2n3m2n3L5l5jj25R6l9Oj50J34n5n1J29j6m4O0j7J5Q4j10J33
4503h08j6%K7kP6J03j04N1P8O6k0O9M6n7J90L6%M1R4K5n1Q3P8l1J20P5m3J04J00
4532C30mm1Q5O3M0J5K2J13mR7q4j7J90l3j5m9J06J2K3J20j27K8R0kj17Q4jK6j00
$$ plain form
4561 850 871 875 793 876 824 785 808 782 697 707 670 700 599 694 584 559 585 520 369 437 433 260 265 262 280 120 78 47 45 22
4591 22 -1 -102 -166 -156 -252 -307 -281 -255 -402 -420 -413 -484 -474 -536 -613 -649 -644 -653 -730 -799 -746 -757 -822 -839 -857 -855 -885 -819 -908 -949 -841
4622 -841 -809 -912 -896 -912 -892 -828 -882 -869 -825 -776 -786 -826 -759 -779 -688 -650 -640 -657 -589 -536 -482 -559 -439 -366 -399 -324 -297 -279 -225
4651 -225 -148 -154 -46 15 3 26 99 182 128 206 240 299 271 416 421 389 470 564 506 500 677 582 666 697 680 719 739 809 808 783
4681 783 826 819 802 835 849 836 783 825 802 848 857 811 825 804 751 743 749 774 666 688 585 572 557 594 543 461 504 470 389 343 293
4712 293 295 270 233 195 144 119 100 27 -49 -31 -31 -175 -196 -222 -253 -248 -283 -402 -423 -412 -431 -547 -502 -543 -592 -605 -613 -661 -676 -639
4742 -639 -726 -731 -779 -776 -748 -815 -826 -862 -762 -688 -862 -859 -753 -756 -884 -754 -787 -782 -714 -766 -740 -703 -628 -649 -637 -692 -601 -560 -496 -469
4772 -469 -535 -429 -337 -412 -329 -281 -204 -251 -173 -138 -92 -80 -35 6 76 66 83 153 296 307 212 259 419 376 333 400 466 505
$$ packed form
4561H50K1Mq2Q3n2l9K3k6q5J0l7L0j01R5j10k5K6o5j51O8mj73NlJ8j60m2l1kk3
4591B2k3j01o4J0r6n5K6K6j47j8Pp1J0o2p7l6Nrp7o9N3j1o5j7j8Kl0O6q9m1J08
4622h41L2j03J6j6K0O4n4J3M4M9j0m0O7k0R1L8J0j7O8N3N4p7J20P3l3P5K7J8N4
4651b25P7oJ08O1j2K3P3Q3n4P8L4N9k8J45Nl2Q1R4n8oJ77r5Q4L1j7L9K0P0jk5
4681G83M3pj7L3J4j3n3M2k3M6Rm6J4k1n3qOK5j08K2j03j3j5L7n1q2M3l4q1m6n0
4712B93Kk5l7l8n1k5j9p3p6J8%j44k1k6l1Nl5j19k1J1j9j16M5m1m9j3qm8j5L7
4742f39q7nm8LK8o7j1l6J00P4j74LJ06lj28J30l3NO8n2K6L7P5k1J2n5R1M1O4K7
4772d69o6J06R2p5Q3M8P7m7P8L5M6J2M5M1P0j0J7P0J43J1r5M7J60m3m3O7O6L9
$$ plain form
4800 505 495 578 565 621 646 580 527 673 730 628 653 661 714 789 735 743 734 763 751 724 708 809 728 723 710 685 669 776 668
4829 668 606 595 586 588 495 527 453 486 508 363 297 365 311 250 184 181 177 179 93 2 -45 12 78 -149 -205 -144 -172 -235 -333 -320 -306
4860 -306 -368 -386 -531 -504 -376 -458 -588 -510 -597 -599 -595 -671 -714 -719 -633 -650 -781 -736 -699 -748 -736 -707 -790 -803 -704 -790 -792 -720 -711 -725
4890 -725 -700 -698 -671 -626 -559 -610 -596 -551 -466 -492 -414 -433 -361 -376 -370 -302 -283 -254 -216 -197 -179 -82 -118 -4 36 17 72 115 97 63
4920 63 203 224 275 362 343 294 369 448 499 362 443 561 592 562 538 555 583 665 576 551 692 746 686 643 692 745 740 685 661
4949 661 696 748 716 564 616 734 676 627 633 567 534 607 592 440 452 550 485 362 406 370 391 304 234 201 248 210 129 113
4977 113 106 92 -6 -50 -76 -52 -155 -156 -227 -266 -242 -220 -352 -354 -384 -416 -421 -441 -518 -518 -491 -505 -650 -608 -544 -614 -650 -583 -676 -703 -680
5008 -680 -650 -715 -800 -683 -682 -664 -604 -672 -730 -644 -645 -616 -647 -611 -584 -579 -610 -630 -549 -393 -412 -461 -379 -308 -373 -347 -277 -317 -189 -115
$$ packed form
4800E05j0Q3j3N6K5o6n3J46N7j02K5QN3P5n4QrK9j2k7j6J01q1nj3k5j6J07j08
4829F68o2j1rKr3L2p4L3K2j45o6O8n4o1o6lmKq6r1m7N7O6k27n6O1k8o3r8J3J4
4860c06o2j8j45K7J28q2j30P8q7kMp6m3nQ6j7j31M5L7m9J2K9q3j3R9q6kP2Rj4
4890g25K5KK7M5O7n1J4M5Q5k6P8j9P2j5OO8J9K9L8J9J8R7l6J14M0j9N5M3j8l4
4920F3J40K1N1Q7j9m9P5P9N1j37Q1J18L1l0k4J7K8Q2q9k5J41N4o0m3M9N3nn5k4
4949F61L5N2l2j52N2J18n8m9Oo6l3P3j5j52J2R8o5j23M4l6K1q7p0l3M7l8q1j6
4977A13pj4r8m4k6K4j03jp1l9K4K2j32kl0l2nk0p7%K7j4j45M2O4p0l6O7r3k7K3
5008f80L0o5q5J17JJ8O0o8n8Q6jK9l1L6K7Nl1k0Q1J56j9m9Q2P1o5K6P0m0J28P4
$$ plain form
5038 -115 -149 -178 -44 -19 -40 -106 -118 42 94 124 101 56 244 299 269 178 332 302 317 397 384 458 496 521 434 469 606
5065 606 598 502 547 615 634 645 639 525 655 768 717 572 628 664 652 663 638 526 602 673 612 569 621 541 543 503 442 426 472
5094 472 457 364 421 339 286 215 293 261 184 150 162 115 50 63 -10 -17 -104 -111 -164 -102 -163 -196 -207 -271 -264 -318 -344 -360 -391 -375 -410
5125 -410 -438 -468 -429 -448 -511 -517 -514 -566 -541 -560 -674 -580 -541 -598 -662 -664 -529 -597 -671 -662 -626 -651 -514 -563 -563 -551 -463 -548 -598 -524 -422
5156 -422 -460 -457 -535 -412 -294 -324 -375 -371 -258 -239 -219 -218 -150 -147 -22 -64 -150 -37 102 18 -30 78 144 144 224 245 178 238 345
5185 345 259 268 332 367 400 495 459 448 506 519 502 528 481 521 541 489 561 493 617 590 568 518 514 608 573 588 574 504 549 567
5215 567 515 416 510 472 437 368 349 405 417 296 261 232 361 322 215 211 167 219 151 110 57 41 118 26 -94 -112 -51 -74
5243 -74 -152 -207 -213 -111 -161 -329 -296 -288 -242 -324 -449 -386 -448 -351 -416 -481 -533 -501 -383 -559 -558 -511 -490 -545 -542 -544 -518 -566 -525 -681
$$ packed form
5038a15l4k9J34K5k1o6j2J60N2L0k3m5J88N5l0r1J54l0J5Q0j3P4L8K5q7L5J37
5065F06qr6M5O8J9J1oj14J30J13n1j45N6L6j2J1k5j12P6P1o1m3N2q0Km0o1j6M6
5094D72j5r3N7q2n3p1P8l2p7l4J2m7o5J3p3pq7pn3O2o1l3j1o4Pn4k6j6l1J6l5
5125d10k8l0L9j9o3oLn2K5j9j14R4L9n7o4kJ35o8p4RL6k5J37m9%J2Q8q5n0P4J02
5156d22l8Lp8J23J18l0n1MJ13J9K0JO8LJ25m2q6J13J39q4m8J08O6%Q0K1o7O0J07
5185C45q6RO4L5L3R5l6j1N8J3j7K6m7M0K0n2P2o8J24k7k2n0mR4l5J5j4p0M5J8
5215E67n2r9R4l8l5o9j9N6J2j21l5k9J29l9j07mm4N2o8m1n3j6P7r2j20j8O1k3
5243g4p8n5oJ02n0j68L3QM6q2j25O3o2R7o5o5n2L2J18j76JM7K1n5LkK6m8M1j56
$$ plain form
5273 -681 -548 -445 -506 -567 -562 -492 -521 -436 -452 -529 -482 -396 -449 -466 -392 -343 -299 -307 -351 -304 -182 -196 -158 -216 -172 -79 -89 20 -59
5302 -59 -33 61 113 0 56 16 142 145 216 208 202 260 278 294 226 323 328 347 505 417 363 460 498 419 425 487 532 435 446 497 540
5333 540 569 500 457 489 539 547 483 521 545 515 535 452 434 455 442 396 332 437 483 329 321 321 306 306 258 181 208 193 157 126 109
5364 109 137 103 59 -19 -86 -54 -1 -58 -174 -81 -63 -132 -232 -266 -207 -306 -232 -313 -343 -328 -256 -352 -393 -392 -333 -412 -399 -503 -501
5393 -501 -469 -452 -484 -502 -443 -472 -545 -534 -479 -517 -486 -477 -530 -489 -467 -391 -511 -431 -417 -428 -437 -371 -407 -371 -284 -299 -307 -281 -298 -272 -198
5424 -198 -185 -137 -137 -166 -68 -126 -2 5 -39 54 45 99 16 147 153 139 159 229 195 245 331 267 299 342 344 315 340 417 422 375 413 447
5456 447 457 474 445 387 470 487 490 426 461 423 453 555 466 381 481 410 422 396 415 365 394 437 385 386 414 334 335 303 252 230
5486 230 231 250 171 199 122 136 99 174 44 33 3 23 31 -105 -65 -105 -121 -102 -181 -193 -217 -186 -245 -242 -318 -272 -334 -386 -322 -342
$$ packed form
5273f81J33J03o1o1NP0k9Q5j6p7M7Q6n3j7P4M9M4qm4M7J22j4L8n8M4R3j0J09p9
5302e9K6R4N2j13N6m0J26LP1qoN8J8J6o8R7NJ9J58q8n4R7L8p9OO2M5r7J1N1M3
5333E40K9o9m3L2N0Qo4L8K4l0K0q3j8K1j3m6o4J05M6j54q%j5%m8p7K7j5l6l1j7
5364A09K8l4m4p8o7L2N3n7j16R3J8o9j00l4N9r9P4q1l0J5P2r6m1JN9p9J3j04K
5393e01L2J7l2j8N9k9p3J1N5l8L1Rn3M1K2P6j20Q0J4j1rO6l6L6Q7j5qK6j7K6P4
5424a98J3M8%k9R8n8J24Pm4R3rN4q3J31Oj4K0P0l4N0Q6o4L2M3Kk9K5P7Nm7L8L4
5456D47J0J7k9n8Q3J7Lo4L5l8L0J02q9q5J00p1J2k6J9n0K9M3n2JK8q0Jl2n1k2
5486B30JJ9p9K8p7J4l7P5j30j1l0K0Qj36M0m0j6J9p9j2k4L1n9Lp6M6o2n2O4k0
$$ plain form
5516 -342 -328 -380 -344 -442 -401 -409 -534 -449 -384 -456 -458 -488 -527 -425 -474 -514 -564 -467 -406 -433 -470 -455 -386 -433 -395 -426 -408 -344 -323 -329
$$ packed form
5516c42J4n2L6r8M1qj25Q5O5p2kl0l9J02m9m0n0R7O1k7l7J5O9m7L8l1J8O4K1o
$$ [...]
8191C1
##END NTUPLES=NMR FID
##END=
