##TITLE=1H_TG-2290-2
 CDCl3, 8 sc, 
 3.7.2020
##JCAMPDX= 6.0         $$ Bruker NMR JCAMP-DX V2.0
##DATA TYPE= NMR FID
##DATA CLASS= NTUPLES
##ORIGIN= UXNMR, Bruker Analytische Messtechnik GmbH
##OWNER= root
$$ XWIN-NMR		Version 3.5
$$ Mon Aug  3 11:20:54 2020 Russian Standard Time (UT+4h)  she@DPX200
##.OBSERVE FREQUENCY= 200.1314999998
##.OBSERVE NUCLEUS= ^1H
##.DELAY= (6, 6)
##.ACQUISITION MODE= SIMULTANEOUS
##.ACQUISITION SCHEME= undefined
##.AVERAGES= 8
##.DIGITISER RES= 18
##SPECTROMETER/DATA SYSTEM= spect
##.PULSE SEQUENCE= zg30
##.SOLVENT NAME= D2O
##.SHIFT REFERENCE= (INTERNAL, D2O, 0, 15.7039)
##AUDIT TRAIL= $$ (NUMBER, WHEN, WHO, WHERE, WHAT)
$$ ##TITLE= Audit trail, XWIN-NMR		Version 3.5
$$ ##JCAMPDX= 5.01
$$ ##ORIGIN= Bruker BioSpin GmbH
$$ ##OWNER= she
$$ F:/spectra/data/she/nmr/H-F/1/audita.txt
$$ ##AUDIT TRAIL=  $$ (NUMBER, WHEN, WHO, WHERE, WHAT)
(   1,<2020-08-03 11:19:29.10 +0400>,<she>,<DPX200>,
      <created by zg, POWCHK disabled, PULCHK disabled
       configuration hash MD5:
       00 E9 B6 7A A2 85 ED C7 34 08 36 98 17 FE 4E 26
       data hash MD5: 16K
       08 B2 CA B0 84 E4 EA 33 5F D4 82 8C 29 F4 34 78>)
$$ ##END=
$$ 
$$ hash MD5
$$ 06 67 8C 00 06 21 20 1E 64 BE 90 8D FC 8F F7 7D
##$RELAX= 
##$RELAX= 
##$RELAX= 
##$RELAX= 
##$RELAX= 
##$RELAX= 
$$ Bruker specific parameters
$$ --------------------------
##$DU= <F:/spectra>
##$EXPNO= 1
##$NAME= <H-F>
##$PROCNO= 1
##$TYPE= <nmr>
##$USER= <she>
##$AMP= (0..31)
100 100 100 100 100 100 100 100 100 100 100 100 100 100 100 100 100 100 
100 100 100 100 100 100 100 100 100 100 100 100 100 100 
##$AQSEQ= 0
##$AQ_mod= 1
##$AUNM= <au_zg>
##$AUTOPOS= <>
##$BF1= 200.13
##$BF2= 200.13
##$BF3= 200.13
##$BF4= 200.13
##$BF5= 200.13
##$BF6= 200.13
##$BF7= 200.13
##$BF8= 200.13
##$BYTORDA= 1
##$CFDGTYP= 0
##$CFRGTYP= 5
##$CHEMSTR= <none>
##$CNST= (0..31)
1 1 145 1 1 1 1 1 1 1 1 1 1 1 1 1 1 1 1 1 1 1 1 1 1 1 1 1 1 1 1 1 
##$CPDPRG= <>
##$CPDPRG1= <>
##$CPDPRG2= <>
##$CPDPRG3= <>
##$CPDPRG4= <mlev>
##$CPDPRG5= <mlev>
##$CPDPRG6= <mlev>
##$CPDPRG7= <mlev>
##$CPDPRG8= <mlev>
##$CPDPRGB= <>
##$CPDPRGT= <>
##$D= (0..31)
0 1.2 0 0 0 0 0 0 0 0.06 0 0.03 0 0 0 0 0.0002 0 0 0 0 0 0 0 0 0 0 0 0 
0 0 0 
##$DATE= 1596439168
##$DBL= (0..7)
120 120 120 120 120 120 120 120 
##$DBP= (0..7)
150 150 150 150 150 150 150 150 
##$DBP07= 0
##$DBPNAM0= <>
##$DBPNAM1= <>
##$DBPNAM2= <>
##$DBPNAM3= <>
##$DBPNAM4= <>
##$DBPNAM5= <>
##$DBPNAM6= <>
##$DBPNAM7= <>
##$DBPOAL= (0..7)
0.5 0.5 0.5 0.5 0.5 0.5 0.5 0.5 
##$DBPOFFS= (0..7)
0 0 0 0 0 0 0 0 
##$DE= 6
##$DECBNUC= <off>
##$DECIM= 24
##$DECNUC= <off>
##$DECSTAT= 4
##$DIGMOD= 1
##$DIGTYP= 9
##$DL= (0..7)
0 120 120 120 120 120 120 120 
##$DP= (0..7)
150 150 150 150 150 150 150 150 
##$DP07= 0
##$DPNAME0= <>
##$DPNAME1= <>
##$DPNAME2= <>
##$DPNAME3= <>
##$DPNAME4= <>
##$DPNAME5= <>
##$DPNAME6= <>
##$DPNAME7= <>
##$DPOAL= (0..7)
0.5 0.5 0.5 0.5 0.5 0.5 0.5 0.5 
##$DPOFFS= (0..7)
0 0 0 0 0 0 0 0 
##$DQDMODE= 0
##$DR= 18
##$DS= 0
##$DSLIST= <SSSSSSSSSSSSSSS>
$$ [...]
##$SUBNAM2= <"">
##$SUBNAM3= <"">
##$SUBNAM4= <"">
##$SUBNAM5= <"">
##$SUBNAM6= <"">
##$SUBNAM7= <"">
##$SUBNAM8= <"">
##$SUBNAM9= <"">
##$SW= 24.9337058888022
##$SWIBOX= (0..15)
0 0 2 0 0 0 0 0 0 0 0 0 0 0 0 0 
##$SW_h= 4990.01996007984
##$TD= 16384
##$TD0= 1
##$TE= 0
##$TE2= 300
##$TE3= 300
##$TEG= 300
##$TL= (0..7)
0 120 120 120 120 120 120 120 
##$TP= (0..7)
150 150 150 150 150 150 150 150 
##$TP07= 0
##$TPNAME0= <>
##$TPNAME1= <>
##$TPNAME2= <>
##$TPNAME3= <>
##$TPNAME4= <>
##$TPNAME5= <>
##$TPNAME6= <>
##$TPNAME7= <>
##$TPOAL= (0..7)
0.5 0.5 0.5 0.5 0.5 0.5 0.5 0.5 
##$TPOFFS= (0..7)
0 0 0 0 0 0 0 0 
##$TUNHIN= 0
##$TUNHOUT= 0
##$TUNXOUT= 0
##$USERA1= <user>
##$USERA2= <user>
##$USERA3= <user>
##$USERA4= <user>
##$USERA5= <user>
##$V9= 5
##$VALIST= <valist>
##$VCLIST= <CCCCCCCCCCCCCCC>
##$VD= 0
##$VDLIST= <DDDDDDDDDDDDDDD>
##$VPLIST= <PPPPPPPPPPPPPPP>
##$VTLIST= <TTTTTTTTTTTTTTT>
##$WBST= 1024
##$WBSW= 4
##$XGAIN= (0..3)
0 0 0 0 
##$XL= 0
##$YL= 0
##$YMAX_a= 640835
##$YMIN_a= -301850
##$ZGOPTNS= <>
##$ZL1= 120
##$ZL2= 120
##$ZL3= 120
##$ZL4= 120
##$ABSF1= 10
##$ABSF2= 0
##$ABSG= 5
##$ABSL= 3
##$ALPHA= 0
##$AQORDER= 0
##$ASSFAC= 0
##$ASSFACI= 0
##$ASSFACX= 0
##$ASSWID= 0
##$AUNMP= <proc_1d>
##$AZFE= 0.1
##$AZFW= 0.1
##$BCFW= 1
##$BC_mod= 2
##$BYTORDP= 1
##$COROFFS= 0
##$CY= 11.3945322036743
##$DATMOD= 1
##$DC= 2
##$DFILT= <>
##$DTYPP= 0
##$F1P= 16.9975609425685
##$F2P= -3.02152046262296
##$FCOR= 0.5
##$FTSIZE= 0
##$FT_mod= 4
##$GAMMA= 1
##$GB= 0.15
##$INTBC= 1
##$INTSCL= 1
##$ISEN= 128
##$LB= 0.24
##$LEV0= 0
##$LPBIN= 0
##$MAXI= 10000
##$MC2= 0
##$MEAN= 0
##$ME_mod= 0
##$MI= 1.114404
##$NCOEF= 0
##$NC_proc= 0
##$NLEV= 6
##$NOISF1= 3.799351
##$NOISF2= 2.8
##$NSP= 1
##$NTH_PI= 0
##$NZP= 0
##$OFFSET= 15.70392
##$PC= 1
##$PHC0= -9802.95
##$PHC1= 25.60093
##$PH_mod= 1
##$PKNL= yes
##$PPARMOD= 0
##$PSCAL= 0
##$PSIGN= 0
##$REVERSE= no
##$SF= 200.130013532006
##$SI= 16384
##$SIGF1= 3
##$SIGF2= 2
##$SINO= 400
##$SIOLD= 16384
##$SREGLST= <1H.CDCl3>
##$SSB= 0
##$STSI= 0
##$STSR= 0
##$SW_p= 3612.71676300578
##$SYMM= 0
##$S_DEV= 0
##$TDeff= 0
##$TDoff= 0
##$TI= <>
##$TILT= no
##$TM1= 0
##$TM2= 0
##$TOPLEV= 0
##$USERP1= <user>
##$USERP2= <user>
##$USERP3= <user>
##$USERP4= <user>
##$USERP5= <user>
##$WDW= 1
##$XDIM= 8192
##$YMAX_p= 0
##$YMIN_p= 0
$$ End of Bruker specific parameters
$$ ---------------------------------
##NTUPLES= NMR FID
##VAR_NAME=  TIME,          FID/REAL,        FID/IMAG
##SYMBOL=    X,             R,               I
##VAR_TYPE=  INDEPENDENT,   DEPENDENT,       DEPENDENT
##VAR_FORM=  AFFN,          ASDF,            ASDF
##VAR_DIM=   8192,          8192,            8192
##UNITS=     SECONDS,       ARBITRARY UNITS, ARBITRARY UNITS
##FACTOR=    0.0002004,     1,               1
##FIRST=     0,             0,               0
##LAST=      1.6414764,     0,               0
##MIN=       0,             -301850,         0
##MAX=       1.6414764,     640835,          0
$$ Real data points
##PAGE= N=1
##DATA TABLE= (X++(R..R)), XYDATA
$$ [...]
2588B389L21m037O30M647o99m916P18K941j007n14k90p64K214K660m131l993M415
2605E84L677l788k935J185J013J239K23k813j285M883J357n419j440L626N07k174
2621a560K97o59j45K851r03l363J446M423k643m237J616K500n32j32j268j822
2637d131K912L088l562l015L526K346k476r88K29j552J995K882k426k202L118
2652b56M5k222J697J536k781l37K544j199j253K386L04k555K020J885k723r38
2668a847K027o44o54L141p84l810J323K576m4k80M49k266o18M205j87m508J256
2685f65L410m86j702M19n57N20K272o42k886J084K123k467o59L842M08k564o01
2702H49q2N89K884N8n131K09N325j03m907k87K913R38R03j679m446J519N363j505
$$ y = [2389, 2710, -1327, -697, 3950, 3251, -1665, -947, 1994, 987, 473, 183, -581, 1633, 4293, 162, -3831, 584, 4261, 473, -2462, -1277, -264, 975, 1198, -1615, -2900, 1983, 3340, -2079, -3519, 107, 614, -1560, -1263, -1922, -2067, 784, -119, -3482, -2036, 2387, -256, -4493, -2877, -377, -909, -1041, -2309, -4131, -1219, 1869, -1693, -4708, -1182, 1164, -1312, -2300, -2071, -3623, -1628, 1254, -1172, -3374, -256, -211, -2433, -736, 800, -1981, -2318, 226, -973, -2226, 160, 464, -2091, -71, 1814, -909, -1847, 180, -464, -1118, 2023, 1239, -2571, -1248, 1328, 1284, 1004, 1453, -813, -1431, 2774, 2587, -1921, -665, 2745, 2259, 557, 976, 419, 939, 3211, 2569, -317, 767, 2890, 423, -236, 3606, 4014, 1450, 849, 767, 1356, 4240, 4298, -833, -624, 4701, 4598, -309, -596, 2317, 3255, 4158, 2479, -1967, -448, 4915, 3410]
2720C410m266J746K329k195j260J563r10O65J218k602j458M086M02m832q1M232
2736B047L40k320j286j607J148M190J47n757j38M394o00j957P43p8j213J775M03
2753B31k797K61K623j707m37K548n24l359J297J712r75K62P99k471p54L477M56
2770F42k638R14J362j687N52J630k305j994L403J333k038Pj20j280K248K907l241
2787c05l114K695K080j764m97Q58j132J578J573k392j127L040J55l336R15L306
2803B533j751j775M86O80J530K027k775m067L495M392l036l902J820J964K3Q61
2819B505k102j381K923K514l788j921L411K86k985R35J201o10J054j02k558R75
2835C57L825k193m460K183L065j498j105k24p24J859K665l170l012L014K223k839
$$ y = [3410, -856, 890, 3219, 1024, -236, 1327, 417, 1082, 2300, -302, -1760, 2326, 2728, -2104, -2185, 2047, 2387, 67, -1219, -2826, -1678, 2512, 2659, -3098, -3236, 1158, 558, -1399, -656, -734, -1947, -172, 231, -2566, -2305, 318, -1389, -1826, 722, 198, -3161, -1864, -152, -1127, -865, -66, -2537, -3291, 186, 642, -1996, -1082, 280, -1407, -855, 775, -1530, -3524, -121, 1212, -826, -819, -939, -2219, 29, 2936, -305, -3419, -724, 1356, -408, -905, -47, -1179, 399, 1972, -420, -1547, 1493, 1648, -1688, -773, 2533, 782, -993, -507, 173, 1703, 3730, 955, -3112, 383, 4775, 1739, -2163, -343, 1621, 1644, 2505, 403, -978, 1945, 4459, 671, -1250, 2161, 2447, -538, 397, 1598, 988, 2042, 1940, -618, 357, 4182, 1989, -2471, -288, 2777, 1279, 174, -50, -774, 1085, 3750, 580, -2432, 582, 2805, -34]
2851c4j172J446p66l2J687j296j374K709M60k882R28K265j822k071J779Q77j366
2868f64J402j58k290J286K713j959j934J543Q2j325J971M72l015M15K844m72j417
2885e06Q01m91j540K364Q56l391J9K937r32j684J484Q17j367Q90j07k368J437
2902g81K309k428k672L455J857k737o70P81j0J718L64l500q52M528O63m574k11
2919b760L043M59p17m66j400Q29L726j584m082J506L941k046k439J259J353M73
2935A095L73k040k006M173K303m711k522L766K109j999o08m60r7K772M57m169
2951a564o4L939m23l336M40K317j048l0p0j586J305K922k253l378K383K592j824
2968C22j151O65r95J090K056k079k207K499J403k001l47J159j200o36K434r68
$$ y = [-34, -1206, 240, -526, -558, 1129, -167, -1541, 1168, 1628, -1254, -326, 1939, 117, -1954, -175, 702, -664, 738, 580, -1710, -424, 2289, 330, -1604, -61, 21, -1304, 667, 1139, -1876, -1461, 1383, 911, -506, 295, -196, -1736, 628, 1484, -1907, -1888, 1049, 117, -1567, -83, 734, -633, 257, 150, -2218, -781, 1528, -900, -3572, -117, 1740, -997, -1667, -886, -896, 822, 1186, -2314, -3166, 1362, 2025, -2549, -2760, 283, 742, 25, -441, -1841, -1012, 2714, 1130, -2952, -1446, 2495, 449, -1990, -731, 622, 1095, 1468, -572, -2578, 1595, 3898, -813, -3335, 431, 2540, 541, -67, -527, -624, 2148, 2605, -1564, -1628, 2311, 1888, -1448, -1008, 1309, 261, 231, 161, -1425, -120, 2802, 549, -2829, -446, 2146, 322, -829, -164, -1159, -69, 1987, -92, -2299, 200, 1603, -398, -745, 414, -786, -1422, 1012, 44]
2984D4k174J917J693k000J67R19j276k09J718j089k252K010J794k917j67K358
3000E36pq43K74j573r44L191N73m750O0M092M05k189q80L0P10K590j133m126N86
3019c398L999r24l353J567J703j38m37n69j173J848J816l455j900L894J926l450
3035b044j591K380R05J476k20l759p22M812M82m381O1K579L45k20j76j026L50
3052g49K525q45k705J362K040j807j393K933l31j241R57j50j004J809Q39k975
3068g35o93L318m40j849J072K16j112J529J740k636r44K274k24j357J447L1k200
3085e63Q46K974j526j144J139m89m82J477k49k784J739J766j783n27J798n02j770
3102h0J382J285j674K84N36k142J78L403j651k760J637K424j023j353J16j154
$$ y = [44, -2130, -213, 1480, -520, -353, 566, -710, -919, 799, -290, -2542, -532, 1262, -1655, -1822, 536, 529, -314, -40, -1613, -2557, 634, 1207, -3543, -3483, 609, 1014, -1175, -2055, -2025, -1315, 1275, 142, -3984, -3398, 601, -323, -3676, -2109, -406, -544, -981, -1550, -2723, -875, 941, -2514, -4414, -520, 1406, -2044, -3635, -1255, -350, 1126, 906, -2853, -3575, 1237, 1719, -2662, -2601, -22, 323, 103, -73, -1099, -749, 1776, 931, -1774, -412, 1628, -179, -1572, 1361, 1030, -211, 746, 596, -408, 1401, 2240, -735, -1428, 1890, 1450, -399, 673, 889, -223, 1306, 3046, 410, -534, 1740, 1516, 159, 1606, 1637, -563, 283, 3257, 1731, 587, 1726, 1237, 755, 2232, 1983, -801, 938, 2704, 921, 394, 2192, 1690, -80, 1302, 2587, 913, 1197, 1733, -409, -231, 3172, 1521, -1239, 398, 2822, 1799, 446, 562, -592]
3118e92M83K491j389k581J788J469k134m26K171p69j234R50m75q21J274m14k671
3135b880J691L583k026l433J061J892K45L15j593j881J593K896k463k851K670
3150a181J978j844j03N62j327R66Q43j494m68K824n32l785J297L633r61j782l8
3167a412j79R88K517k134l316K369L546k138j981R21N21m9J304j329j967K324
3183a5J832k210r69K134m44j226J000M65j073J430M84k393k20K805o56k061J317
3200B00J002j097R41M91k316J92K623M61k172j2K63o57J523J166l066k85L354
3217B611j47k937L41J387o19P89J48k299K80K782j327k646J867K447j420j748
3233d91J70m9R55J873l031k606M031K402l054k315J463J487L63m72k803k85L656
$$ y = [-592, -109, 2382, 993, -1588, 200, 1669, -465, -891, 1280, 511, -723, 227, -248, -1069, 205, -209, -2880, -1189, 2394, 368, -3065, -2004, -112, 133, 448, -1145, -3026, -1433, 1463, -1000, -3851, -1181, 797, -1047, -1150, -588, -1915, -949, -106, -1600, -2068, 756, 224, -3561, -2264, 1369, 408, -1374, -1412, -1591, -603, 1914, -220, -3536, -1167, 2379, 241, -1740, -819, -298, -347, 957, -372, -2339, -15, 1817, -393, -1362, 772, 328, -898, 102, 567, -506, 924, 1408, -985, -1205, 1600, 944, -1117, 200, 1202, 105, 1046, 1537, -779, -587, 2036, 2497, 325, 313, 576, -81, 1442, 2608, -458, -743, 2611, 2464, -473, -132, 1255, 636, 1425, 1573, -726, -446, 2336, 1009, -1637, 230, 2677, 1257, -491, -321, -370, 585, 2458, -573, -3179, 852, 3254, 200, -2115, -652, 835, 1198, 726, -2077, -2362, 1294]
3250A294J039m394n20L240K23j537M6M3l47J611o72k992J626L324j905k885J756
3267a050J733o18n27j124j017K509J828l430j804K633J948j688n07M33r53Q22
3283h12J864j945j593J931N14j364Q08O93j910N08J963o89j726J574r6j603J027
3300h56J283j601M8K002j689r69K173J006k974M13J593k35k75K33j338j29L172
3317A857l32l157J65L081l06j690N99m60J95K000j211k345K254K240j830k296
3333a236K235O86q25k40m41n06K213L50k922p75L676N88k834j28J112j19N05j35
3351A204j550J17K476q45k148J484J520j747r79J940m38j36J43j131m22K356N43
3368B387k850k9K017j77j212O01k29l86J251J9k107P58J702j296r68J661K75j875
$$ y = [1294, 2333, -2061, -2581, 659, 882, -655, -609, -566, -913, 698, 26, -2966, -1340, 1984, 79, -2806, -1050, 683, 65, -462, -1586, -2603, -94, 1734, -1696, -3500, -867, 1081, -607, -1114, -681, -1634, -812, 1052, -893, -2486, -555, -41, -1405, -597, 96, -1814, -1306, 657, -32, -1758, -184, -280, -1883, -856, 427, -1174, -1126, 876, -813, -1782, 391, 1397, -1577, -1164, 429, 194, -81, 152, -1186, -1315, 1857, 1525, -1632, -1467, 1614, 1308, -382, 217, -243, -48, 1952, 741, -1604, 650, 2890, 1060, -1236, 999, 1685, 860, 620, 179, -327, 1886, 2236, -686, -1461, 2215, 2803, -31, -159, 953, 834, 1339, 1204, -346, -229, 2247, 1402, -746, 738, 2258, 511, -468, 1472, 1034, 898, 1041, -90, -512, 1844, 2387, -463, -492, 1525, 1348, 136, 737, 508, 122, 1373, 1392, -715, 43, 1745, 449, -519, 1142, 1417, -458]
3386d58K62J123l94l1O87k141j21K437l57k464Q23J667p66m37K51j397J57K212
3404A053n75k024K85J282j081K45J377j124j292J430M87j597O69L16j677Q41K263
3421H78j149j794J367P01j730J033J218j479q94J227p40q6K070o45k272J475K355
3438A535j572k184J232O08K49L23j110j225K552J734k665j594K356J225j454l99
3454c89n87j65J783O73k804M38L153l32l461L73K347j8l70r38j077J425K823k427
3472D47l026K151L393j212j242p59j84R16J342j459j603K538J137k119o78J690
3488A332P4j32J93j428j20K065j88k637L85K994m87j206Mm24k59J634q3k388J07
3507e64K090j84j737J010l39o56J812o7k819J58K327l52j573R7j43j92J686J20
$$ y = [-458, -196, 927, 533, 502, 1189, -952, -1073, 1364, 1007, -1457, -634, 1033, 267, -170, 81, -1316, -1159, 1053, 478, -1546, -1261, 21, -1060, -815, 562, -562, -1854, -424, 63, -1534, -865, -549, -2226, -1385, 878, -271, -2065, -698, 3, -1727, -694, 524, -955, -1849, -622, -1362, -1448, 622, -23, -2295, -820, 1535, -37, -2221, -989, -381, -132, 191, -919, -2144, 408, 2142, -523, -2117, 239, 1464, 10, -389, -976, -1141, 642, 1315, -1489, -1051, 2102, 1770, -1691, -1318, 1029, 1011, 641, -297, -1374, 51, 2874, 447, -2579, -428, 2965, 1753, 511, -248, -432, 484, 1826, 367, -1236, 1302, 2439, 320, -358, 1332, 1406, 1274, 1467, 39, -81, 1984, 1796, -841, -456, 2538, 2051, 845, 849, 425, 166, 1800, 1717, -671, -564, 1526, 1342, -395, 615, 276, -380, 1432, 1365, -1454, -1296, 1031, 679, -894, -797, -940, -1132, 554, 674]
3525F74k062QJ628r68j745J735R21j200M6l36r42J391J658k416j733K780J727
3542A166k142j450Q0Q95J479N89k715q83K938N99k473m15K013K80n22k97j178
3559b036M11K273j68k653R51K158j017j599J385o9J8Q67q22j404J910J617k789
3576i67p75K092P67j096K12m17r88J673N13j523k72K178k24j285J001K87j680
3593e04M66J261q41L25J227j150j384J777R25j434N64J229j389q44J294o66n60
3610B96J053M90p70Q6R53j408p82K194M1j562O19o2j099N54Q92j099K55J727r93
3629A385j861O53J222j015l12J036j195k19J071m27r20J470O12k252n02K177n42
3646C81j461M34L75l76J032L07k074L79J829q06j666J374P61j673J79N35k63L63
$$ y = [674, -1388, -1380, 248, -720, -2465, -730, 191, -1009, -963, -1299, -2241, -850, 808, -1608, -3341, -561, 1166, -976, -2426, -2346, -1451, 28, 617, -2098, -2981, -43, 556, -1917, -2332, -319, -39, -561, -858, -2036, -1625, 648, 480, -2173, -1222, 936, -81, -1680, -295, -364, -346, 521, -301, -1705, 205, 1822, -967, -1742, 350, 1117, 21, 233, -184, -1172, 501, 1014, -509, -781, 1397, 1173, -112, 889, 1176, -504, -38, 1223, 382, 707, 1934, 784, -600, 1177, 2102, 668, 1232, 2461, 1072, 228, 1522, 856, 296, 1349, 1839, 1069, 1155, 2108, 700, -82, 2112, 2153, 591, 1210, 1148, 49, 603, 1495, 396, 651, 2378, 1385, -476, 177, 1399, 384, 72, 1108, -87, -306, 765, 338, -582, 888, 1500, -752, -1254, 923, 381, -1080, -646, -271, -647, 385, 692, -1382, -1003, 826, 20, -1646, -272, 489, -1184, -1005, -470, -733, -370]
3664c70P10k095m62L049N0k481Q7J153j5n35M09q99P55J791r38j997P71J976q65
3683I4j616P59J96j5O41j258n19J864J483k272j011J753M09j119o44N86J92J292
3701H15k6k448J44K917m80j827M28Q03m52kL05j029M17J646k72j659J361O68j525
3720b16K98R41m32j13J110r16j379J440J071j090n25P47n79o3J442j070j363J301
3738F04J073p90l5r6n41L13J452j266j531J801J232k048p29J212J17l2M13j164
3756a5p23J947N94k505j06J892L8j519o5M68K38Q09m94k296Q44K764r52k463M08
3775a136J174K04Q1q37r96J223J543j917j307J760P49j883K75Q58n81M55j9j340
3793a694l4K342L8k575O0J812j39o55l51k05J44J899o88k023O30J852r42o98Q74
$$ y = [-370, 340, -1755, -2217, 832, 882, -1599, -1512, -359, -374, -909, -500, -1399, -644, 1147, 209, -1788, -1017, 959, 94, -1522, -763, -567, -582, 59, -1199, -1718, 146, 1629, -643, -1654, 99, 508, -611, -1255, -669, -477, 815, 789, -1659, -1515, 1402, 922, -905, -477, 326, -126, -128, 177, -852, -435, 1211, 939, -720, 641, 1309, -216, 82, 1023, 591, 478, 1588, 672, -707, 733, 1804, 714, 189, 936, 357, 294, 1736, 666, -697, 604, 1677, 887, 852, 756, 215, 528, 1980, 714, -817, 984, 2216, 168, -561, 651, 768, 736, 1149, -15, -738, 1209, 1803, -702, -808, 1084, 1122, -397, -462, 6, 244, 1053, 559, -1737, -893, 1871, 919, -1544, -1136, 38, 242, 323, -514, -1510, -287, 1256, -661, -1968, -208, 541, -1342, -1067, -209, -790, -335, -354, -1694, -1728, 614, 652, -1923, -1863, -51, -190, -845, -1196, -1401, -1257, 642, -46, -2069, -1439, 413, -529, -1227, -353]
3812c53j58n74J134l3j349R45M97r88k21J836j004r15R50Q28j164J15R20j128
3830f62J56J313k22j355J039M25j410O00J543j523r27J774K96q28M48m25j047
3847h05J698J105j938j062J638Q36j536K97N27o81R03K55j248l39J971n15j626
3864e20R63P21j028j90N65k68M50Q41j002j270J451J127j710n06J317k62j21M73
3882A031o47q46J656J37k132N39J762j105j096O91N04l14M36n03r64J044J217
3899A410j778j294J742R04j817M40K23o12Q56L64j340n08J693J33j837O09Q23
3916A1q94m05J114n82k37R29l69j417J210J390j442p33J231m14j01O33m60r20
3934a456J361Q50j272n52R66k49m00J136k6j231L74R67n98o95J276j62r28J362
$$ y = [-353, -511, -1085, 49, 16, -1333, -388, 109, -879, -1100, 736, -268, -1183, -233, 595, -569, -454, 466, -662, -506, 807, 585, -770, 269, 694, -716, -116, 1427, -96, -1023, 751, 1047, 219, 667, 242, -805, 893, 1998, 60, -1002, 636, 1472, -64, 233, 760, 79, 982, 1237, -11, -350, 1621, 1106, -520, 443, 1164, 136, -54, 511, 243, 693, 1534, 532, -738, 713, 1840, 130, -376, 941, 679, 558, 1031, 384, -462, 1194, 1331, -801, -262, 1500, 395, -701, -10, 494, 180, 616, 113, -851, 193, 1410, -368, -1662, 80, 984, -833, -393, -170, -782, 74, 438, -902, -1410, 283, 416, -1421, -812, 11, -883, -1288, -174, -756, -993, -64, -433, -1850, -640, 750, -692, -1425, -194, -608, -709, -76, -536, -1456, -95, 755, -517, -1069, -103, -352, -752, 384, 358, -873, -499, 468, -130, -825, 451, 289, -639, 723]
3952G23j05j566O81J107j057m25J013J42q15Q58k89q80Q69Q10j196m15J789k00
3970A044j726L25R60l38K65J38j358J02K323p99k168Q46J538n52k76j87k47L44
3988B34J213j180j252J674J203j953n37J118l2J65J31q38n21J672L22k288J10
4005g59J989k03j338J25K88k53R19j57j587Q79J557j233j538J334L74r34M69o
4023g4q93P40R00j050q44J116L98j310K49O89p84L23R64j295l91J572N7j265Q31
4042f7J65j286M75J392q53j042J403L17j056N60J55o44M72Q25q44q30R52L77j248
4061g77O34J007o91k45O47p80K5J527n90j781P85J377p83q81N14r5L71P73o16
4080D21j485J184J207j579j019J665K31n70P1Q7l43K34R44k014J76J627j19j642
$$ y = [723, 618, -948, -267, 840, -217, -642, 371, 513, -302, 556, 267, -613, 256, 1066, -130, -545, 1244, 1044, -682, -357, 603, 265, 530, 668, -690, -588, 1735, 936, -1232, -386, 1152, 600, 324, 137, -110, 234, 1447, 267, -985, 689, 1892, -61, -598, 520, 488, 653, 784, -54, -575, 1097, 1419, -869, -759, 1230, 1027, -311, -186, 102, -151, 768, 611, -976, -97, 1460, 227, -1311, 23, 397, -537, -68, -74, -967, -227, 673, -377, -1221, -105, 293, -1017, -768, -79, -863, -540, 424, -871, -1262, 310, 367, -898, -67, 98, -1188, -713, 679, -174, -1216, 187, 504, -552, 8, 163, -481, -9, 816, -28, -858, 94, 471, -777, -143, 864, 173, -72, 575, -205, -180, 1347, 757, -1024, -239, 1138, 355, -526, -12, -107, 264, 1037, 421, -1064, 120, 1327, -252, -1271, 394, 625, 55, 126, 213, -130, 104, 1048, -966, -790, 837, 718, -924]
4098i24P32O51n25K15J39p83J88J489q29j902J417R85r07l64Q33j53k71O17k71
4117C37j015J773M21j915k93J696p74o99R83k59n08R17J38j635J44J864j239m98
4135e62J031j09p24M69K30j006M81J252j422p49J452m88p07O48P73j034l35J137
4153C37j064o9R56L2j253O54O61r56K34J111j225m32J130N09r19q4K98p94O96
4172a78R35j452o13J489Q35j826j10J022l87J69L05r47j51J557l59j611N59J252
4190D89n28o48M58J55KM91q45j393J763J542j922j149J466P12p77Q5o40j71J275
4209C65L71k013j52J841L33j293J27K97ON48Q0j298R7J955p47j815J404P98r08
4228dM1K13n76N94R22r24r33J213N59j238q9J104l00k43O10n20p47J294K14j021
$$ y = [-924, -192, 459, -66, 149, 288, -495, -307, 1182, 353, -1549, -132, 853, -54, -418, 415, 262, -9, 608, 337, -678, 1095, 1516, -399, -692, 1004, 230, -469, 514, 255, -253, 664, 802, -833, -689, 1175, -64, -562, 469, 360, -364, 105, 335, -671, -190, 1062, -360, -1109, 343, -145, -852, -204, 569, -465, -800, 337, -727, -796, 160, 192, -1061, -407, 254, -702, -468, 643, -582, -1014, 116, 625, -294, -378, -80, -874, -178, 757, -695, -1308, 181, 1016, -810, -920, 102, -285, -116, 189, -758, -909, 648, 289, -1322, -763, 489, -39, -687, -229, -74, -72, 419, -426, -1819, -56, 1486, -436, -1585, -119, 593, -184, -99, -739, -910, 365, 736, -1277, -1429, 412, 745, -548, -421, -124, -118, 430, 510, -788, -691, 1264, 517, -1298, 106, 904, -4, 37, 250, -326, 268, 1190, 266, -667, 546, 1105, -133, -222, 882, 582, 339, 949, 429, -318, 976, 1190, 169]
4248A69r9P17k85m33O41L5j062J059J48r30K29P55n88k89P47m03r64J295M27j141
4268B8n18J268k70n21L14k82q57J522K60j615J57J414l69j031O26J16j94K35k7
4287B56j373P91J319j032j025J334L98j327M78J75p74M73O84j284o01J725M22
4304F39j746K19P82L0k07K69r01l52J419j23j432P40Q72p12m65P54k66m67P27
4323b20l7o48M52P53j228n62J572k6p48L66j12m63M79L33q92K64J371q10q31Q49
4343a38M00o10J54R41j286O3R24p92n56J074M01j240K17J087m64n40J191o49q43
4362f66R02Q30j398N60Q30j215O4J005j31r16Q50K56j041M71O20j067R7J190m69
4381G72n04L12N15j199j32J349p72j28K89l48l91J034O02j459L09J048n15j150
$$ y = [169, 70, 787, 502, 69, 710, 745, -317, 742, 890, -40, 189, 944, 356, 67, 814, 411, -553, 742, 1169, 28, -490, 778, 508, -13, 301, 19, -838, 684, 944, -671, -514, 900, 531, -500, 126, 242, 48, 283, 256, -1117, -326, 993, -39, -1064, 270, 668, -659, -181, -6, -780, -307, 377, -907, -1508, 217, 639, -1107, -888, -106, -76, -283, -14, -915, -1267, 152, 29, -1403, -663, 209, -503, -968, -214, -480, -947, -220, -257, -905, -453, 300, -928, -1490, 82, 56, -692, -326, -438, -901, -422, -89, -981, -717, 654, -156, -987, -138, 262, -348, -194, 747, -539, -476, 448, -344, -900, 174, 575, -665, -448, 639, 175, -365, 826, 177, -666, 236, 1066, -332, 228, 1058, -157, -93, 912, 781, -135, 715, 971, -70, 401, 1021, -46, 51, 1241, 772, 268, 580, 1095, -104, -236, 1113, 341, 213, 502, 154, -237, 797, 1399, -60, 249, 1297, 782, -368]
4399c68N00N42k31M36j94j795O88J713q70j254J218L66q10j18K18o87R34O69j709
4418g52m08J745O6j166J47L57K87m74k3q77K4J928l45j422k85J764n57m97K57
4437b31j71L05Q45p69j330Q36J410j177q04J092k31k00M88k42p13J039M79j388
4455g62l18J078K22o26M58o0p16L83P28j393m8J780q49n76J44N44r78R10Q23j211
4475d67n06J408l0j103M14L64l79M20O28j277n78J925m45j101O86Q20o35R5L2
4494B71p71O23J380r11j341P56J282j003j4L37m40N22N35r24r00J298J010j358
4512C52p94J187j30m48L94k59l81R96M09j605jJ495m63p33J08P4j95O02k7j026
4532d45P41J161j272j146J216K80n43QL28o49k7J411j214l66J072j48r89O14N26
$$ y = [-368, 132, 674, 443, 879, 685, -1110, -422, 1291, 421, -833, 385, 751, -59, -177, 41, -646, 288, 957, -752, -1160, 585, 651, -515, -368, -11, 276, -198, -221, -1098, -1074, 854, 509, -913, -1198, 566, 9, -488, -231, -402, -97, 748, -21, -1351, -515, 895, -282, -1086, 6, -225, -425, 63, -179, -892, 147, 626, -762, -1080, -2, 220, -406, 52, -8, -724, -341, 387, -1006, -1054, 726, -123, -699, -555, -11, -989, -79, 744, -467, -973, 435, 405, -698, -284, 80, -299, 121, 749, -528, -1106, 819, 374, -727, -41, 779, 144, 239, 271, -500, 123, 1503, 592, -749, 7, 1289, 286, 272, 609, 169, 691, 1226, 302, -598, 700, 1710, 352, -442, 745, 615, 167, 561, 302, -79, 917, 1326, -279, -280, 1215, 752, 19, 127, 201, 6, 608, 581, -445, 296, 1457, 185, -961, 255, 535, -8, 0, 328, -321, -348, 1063, -151, -517, 555, 407, -582, 32, 558]
4551E58p97j12R94o40n14P87k05p14O89L71q52k90R87k05q77N96P0l97M89K1q06
4572h47J15Q17m86q14Q13L00r41n7O27k15l64P01p53k91J143K96j655O24P46j83
4592d24m03K80k37j17R55m53r19M43J100q29l34Q44j57o39Q05Q4m74o5R56r31
4612e15j2R07m9j071N31Q71p09n1N73l92k4Q46p38o28J487P33j900j60J184Jp66
4633A18M96j48n34R90J88j506P49J385q22j105N46M30k99K14k55m15O16R16j198
4652C66q06J340K95r52K10P7k93N83L65j547J15J475j26j043k1Q43k62l99J38
4671C58j43l68J119l28j308O75R19r68J18K93o72l58R64k54j065R30L81o94j68
4690e69O83o35m21J415k83j313M59J020o61r90O25o1K23O24j54j239N69J195j199
$$ y = [558, -239, -351, 643, 3, -511, 276, 71, -643, 46, 417, -435, -725, 262, 57, -820, -224, -154, -551, -62, -41, -847, -732, 85, -401, -1215, -402, -102, -1043, -1100, -473, -688, -1052, -351, -1104, -1395, -252, 44, -1611, -987, -241, -424, -827, -547, -784, -901, 54, -399, -1318, -875, 225, -604, -938, -94, -251, -890, -85, -1, -475, -540, 416, -515, -527, 380, 331, -740, -209, 662, -47, -98, 475, 83, 59, 905, 167, -461, 1026, 1759, -141, -301, 883, 884, 118, 614, 466, -68, 922, 1110, -396, 353, 1738, 916, -189, 357, 787, 488, 702, 447, 32, 648, 1564, 366, -440, 900, 1195, 243, 453, 530, 237, 820, 1185, -362, -247, 1228, 1102, 59, 38, 881, 619, 220, 358, 215, -153, 966, 638, -670, 5, 924, -44, 74, 367, -305, -663, 301, 47, -1018, -88, 293, -401, -569, 114, -521, -942, 473, 190, -1123, -664, 356, -305, -1295, -670, -731, -508, 116, -38, -1277, -708, 487, -712]
4709g12r06R06K62l96L80jm37O45O06j138m82J626J7j027j44J16J09P12Q0j436
4729a220K68J689l45j009J35Q24l00J11k48n85M29J196p45r78Q38R45j070l96
4747d61O52J63j43O28q13n96J464K12j091j95R38j89j79M20n48l32Q46M53j434
4766b05Q1J013j37n46M46l92k18M97N99o53l53Q04n39k92Q01l10o98M47M17o35
4786A27k19N40K53j076Q32Pn56L45M77j037J67J077n84r31Q25K8mM4q6n96L59
4807hJ007j119n21K57J103q53j84K28l70J64O68q49n17R08K23r52K29R40q76j11
4827f33N76n13j12O34j53n13PJ292j249m48Q03J12m20N59l37o49M02P90q42k33
4847i27J051O5j158L70J156p62l52K74j07J64J000j061n96R92P67j375J8L95L13
$$ y = [-712, -1618, -712, -450, -846, -466, -467, -904, -259, 347, -791, -1273, 353, 370, -657, -801, -685, -576, 136, 216, -1220, -952, 737, 392, -617, -482, 342, 42, 153, -95, -680, -251, 945, 200, -778, 60, 1005, -65, -461, 191, 354, 211, 839, 26, -570, 894, 1106, 15, -180, 758, 569, 390, 810, 262, -70, 776, 1229, -205, -124, 889, 752, 206, 652, 260, 42, 539, 1138, 485, 132, 936, 397, 105, 906, 596, -102, 345, 762, 127, -92, 448, 701, -375, 457, 464, -92, 253, 730, -307, -140, 937, 353, -578, 247, 275, 271, 315, 229, -367, -8, 999, -120, -641, -384, 719, -134, -318, -90, -460, -296, 372, -477, -994, -86, 137, -815, -586, 354, -522, -633, -57, -570, -682, -48, -201, -714, -707, 585, -664, -1112, -309, -197, -617, -58, -395, -1044, -642, 148, -694, -927, 124, 189, -969, -599, 557, -205, -557, -283, -390, -226, 774, -287, -883, 109, 876, -499, -481, -86, 227]
4866B27l62P13n24n53J085k6j008K48J210p11m06N00p2o52O43P7p75Q32O93r42
4886A97o81J225K71q40J32L29n18K29O54q36p60J420p4q09M20J89m49m2M99m34
4906A22k83N68J74l81K27K82q95J68J107q68k26M72L30q71J61M02n25R3N82o25
4926A4n62P03L53p93n7Q75k01j17j49n04J60J020P4j573p2J291l43q80N30O9J34
4947b8O28m57j477P66R03k96r00O36J09q2q8k34m32J007M45j449k29J320p4r77
4967i09M95j05J75K81O4j080J29J246j60j078K66N78j77K25K56r74K17P28J29
4986C06j094O24M32p43L6N37n87J51O73m2o68N50J78o31M38Q2k90K5Q39k24j282
5007f90J212L33j155l4Q84k22j8K63l77p10J145O80j012o55Q81K66n97P63r97
$$ y = [227, -135, 578, 54, -499, 586, 560, -448, -200, 1010, 299, -107, 393, 321, -331, 312, 389, -386, 446, 1139, 197, -484, 741, 1012, 172, 304, 633, 115, 344, 998, 162, -598, 822, 748, -61, 359, 548, 99, 57, 556, 122, -161, 407, 581, 200, 427, 709, -186, -18, 1089, 221, -5, 467, 797, -74, 87, 489, -36, 57, 639, 14, -548, 155, 508, -285, -342, 533, 332, 215, 66, -438, -278, 742, 816, -757, -829, 462, 119, -761, -231, -162, -28, 600, 143, -1334, -568, 335, 39, -861, -225, -116, -198, -286, -520, -952, 55, 500, -949, -1178, 142, 68, -909, -414, -519, -344, -63, 1, -1079, -950, 296, 136, -942, -676, -98, -275, -50, 206, -768, -551, 177, 306, -788, -164, 268, -475, -439, 98, -489, -338, 335, 293, -375, 175, 353, -278, 160, 242, -48, -23, 816, 592, -690, 522, 855, -300, -334, 550, 328, 310, 573, 196, -514, 631, 1311, 299, -356, 525, 791, 194, 957, -40]
5026d0l34J299J20j268k66R74l0m60J94j08J42M85m6o30k03J570r14j082O00Q29
5046H32n04P5k28m5L50N93q88q34J132J23p04l7J67m6J51K61k58o29Q25j24p06
5067d94N78M95p51l39P62l7p80L73L28q16O78K35q19k11R80l86o92Q11l94m93
5087i72N22K53j67j93L64k21m78Q04R1r02L58K91R8r0R1k75n41Q70J14r64K88
5108f59O55l29j34K41j36m13R33J81q82J52O09l70m23Q39l19l86K95K42J3k08
5128i9L53n26R5O76l39p77R95J75o85k79N87j90k59P09J4p10Q07m37p50M40Q20
5149F20l45o50M41M89l71L41l88o05O66P87p33r70P54O25k91k89K92o15O15O11
5169I84q28n90J066k8n77j20O17n5k06Q2m85L64O57j21j409O39Q94l62o69P8J27
$$ y = [-40, -374, 925, 1045, -223, -489, 485, 455, -5, 189, 81, 223, 708, 662, 32, -171, 1399, 485, -597, 3, 832, 328, 403, 175, 130, 480, 1073, 185, -649, 483, 606, -98, -135, 32, -14, 137, 398, 140, -489, 336, 212, -494, 84, 579, -172, -511, 251, 214, -566, -193, 135, -681, -3, 232, -587, -798, 182, -204, -896, -85, -479, -972, -450, -197, -364, -557, -193, -414, -892, -88, 3, -899, -541, -250, -152, -242, -151, -426, -967, -97, 17, -947, -659, -4, -333, -467, -226, -362, -775, 158, 339, -543, -391, 218, -152, -575, 264, -55, -441, -146, 96, 109, -99, 254, -272, -177, 499, 160, -617, 378, 553, -132, -411, 176, -14, -273, 436, 450, -260, 547, 110, -640, -200, 620, 275, -375, 66, 555, 184, 525, 137, -468, 198, 985, 252, -718, 36, 661, 370, 81, 373, -242, 373, 984, 156, -434, 632, 604, 27, -93, 524, 469, 263, 345, -140, 224, 881, 760, -649, -10, 884, 522, -147, -69, 58]
5190E8J62J58O0j224O33P86p34k68N18r2j51R5o8m48L94K77l40n41J156l72p13
5211f54O62k16j91K50L94r13k34R34j80j85L80j83m27L37N18j060M7M39R53j186
5231e15K78J02m06P19r6n98j06R18M9q08L6L24k92M83m4l91o4J141r06m09O22
5252C7O92j008r2J81j33N36J28o11k73R86L88r27n65R29m11J22J28n42nR85J60
5273G05j130K94O00k64j03p6K22k30K57K28o75N9J089p71n25P63o1n83M84L87
5293F70o51L01L28p48j40P94L41o58l17P49o45L4N89k52n72N90L11o72K42p3m00
5314a79K72N02k14o56N12R1j33l4O0l00J49M47q02l80Q01K11p46Q2L72k62q2K11
5336g8J55l83O79m45n53J38R49k40m86M8j07J7M28k0o97M14P49r28l00L91L77
$$ y = [58, 220, 378, 438, -786, -153, 633, -101, -369, 149, 57, -94, 1, -67, -515, -121, 156, -184, -725, 431, 59, -654, 8, -208, -399, -149, 245, -668, -902, 32, -148, -333, 47, -136, -563, -226, 292, -768, -721, -282, 671, -515, -237, -135, -541, 178, 82, -516, -622, 296, 345, -463, -427, -103, -395, 88, 44, -347, -411, 730, -176, -585, 37, 729, -279, -371, -190, -323, 213, 341, -270, -543, 443, 831, -96, -661, 268, -143, -21, 107, -435, -440, 545, 705, -425, -131, 469, 205, 102, 26, 248, 18, 275, 503, -172, -113, 976, 205, -320, 443, 382, -201, 283, 670, 19, 320, 648, -100, -240, 554, 895, 237, -80, 669, 24, 58, 647, 395, -177, 413, 724, 52, 294, 221, -179, 93, 595, 381, -275, 237, 328, 195, 161, 221, -79, 70, 517, -285, -665, 136, 347, -399, -317, 55, -207, -289, -78, 77, -306, 373, -72, -625, -487, 462, 222, -264, -216, -323, -306, 122, 102, -595, -181, 568, -360, -660, -269, 108]
5357A08n76M49k27k16R3L24j49k20O86m54o79N43N51o45oM28k48j29N64m44l42
5378e89N42J08l91j05K52R4n55Q46j93l17M79j8m95J65Q69m65q43K75P20j79j07
5399I3K60r51R15K32m94k89L99O34q84O9N08o33qN92j70l57N89J71r53M53M91
5420F67o70M63J21l69k91M80j08k29J60K40k46k83N69m66j89N55J27o70K84N10
5440F55o09O4M33l30m69R54j57p21J93J74p2j2k79J05M7L97k1r90N08N93n84n09
5462f30M72p6q1M81j51n70N99K16p53m06Q19J73o08R8J24j94M21K10n27j57J013
5483D73m39n51O9O51n99Q4K74n68J46M48O9p92K16M48n34n3O35j20k61Q4N3l61
5505f28N51K41o88J27N43p4p73O14l48n1M98J43n35LM53q5nj23L28m21J37N12
$$ y = [108, -468, -19, -246, -462, -369, -45, -194, -414, 272, -182, -861, -318, 233, -412, -418, 10, -238, -367, 197, -247, -589, -47, 61, -330, -435, -183, -89, -644, 202, 9, -308, 171, 153, -342, -177, 692, 227, -616, -341, 379, 200, 93, 353, -598, 317, 549, 55, -234, 165, 799, -85, -16, 492, -141, -149, 443, 273, -84, 505, 676, -277, 176, 667, -3, 460, 581, 212, -79, 401, 293, 64, 224, 464, 218, -65, 504, 38, -151, 404, 531, -139, 145, 655, 46, 110, 543, 213, -256, 698, 541, -180, 13, 187, 115, 103, -176, -71, -24, 373, 352, -638, -130, 463, -121, -630, -158, -234, -315, 166, 15, -555, 44, 260, -493, -899, -80, 93, -515, -417, -293, -487, -66, 144, -383, -540, 473, 34, -517, -448, 203, -396, -312, -38, -606, -460, -12, 57, -735, -519, -71, -605, -658, -23, -143, -404, -320, -267, -628, -77, 164, -524, -397, 146, 72, -701, -87, -435, -486, 12, 155, -380, -377, 76, -9, -14, -137, 191, -230, -93, 419]
5527D19k66m13K31J26k26K18r2k27L97K56l80mK7NJ21J89m11K37N5J90p58J56
5549a50Q48k57r72M11P13o32K63L61p84L81N24l60n62M78J27l84j16L13p4N7M49
5570F34l1p92J90K07m52J66K52k14J2N19n35j43N49l69m10K96Q20q90m28O52N4
5591H7l70K20o1o0J70K95k86m40N27K6l49k7L45l24k27M89j38l01L22k74j59L23
5613b12K09o68J65O16m03J13K13l48k71K30M09l92j12P17q3p14L51J96o08P53
5633A61k05j62Q4L00m50m93P30M33o08J05P3k92J35L85n40J33K79%n50M44K13
5654A75n91J61Q99l01q51N71Qk21M08N1m73rO47N7p07L38M97o01M45k49l14L04
5676B44M17n17k97N50j42j37j0L11j73j23K16l90l6Q18j82p42L4R15k57o46J08
$$ y = [419, 153, -260, -29, 97, -129, 89, -3, -230, 167, 423, 43, 39, 66, 71, 192, 381, -30, 207, 262, 452, -306, -150, 698, 441, -531, -120, 593, -39, 224, 585, -199, 182, 706, 346, -216, 262, 389, 5, -111, 202, 128, 185, 634, 603, -189, 1, 208, -244, -78, 174, -40, -28, 491, -44, -187, 362, -7, -417, -121, 699, -191, -619, 33, 87, -283, -63, -124, -184, -14, 281, -5, -445, 82, 108, -241, -268, 77, -247, -474, 15, -123, -424, -102, -376, -535, -212, -3, -671, -506, 110, -293, -180, 33, -315, -586, -356, 53, -339, -451, 266, 183, -531, -180, 16, -592, 161, -44, -206, -122, 178, -272, -765, -35, 398, -210, -105, -32, -324, -189, 196, -344, -211, 68, 68, -482, -38, 175, -416, -255, 644, 343, -508, 63, 71, -150, 258, 309, -164, -173, 474, 531, -176, 162, 659, 58, 503, 254, -60, 244, 661, 144, -153, 397, 255, 118, 108, 419, 246, 123, 339, -51, -87, 731, 549, -193, -159, 756, 499, -147, -39]
5697c9L50k11L58l00m88L65L44N5m47J41l3N8k6M1n88M09M69m24n06R97l55n35
5719c65L17K21j90J2R4k28QN73l88l87J77L77k84R8l43l52N25J11k9o17N73J20
5741B3m40mN83n36l72L97M56n19K53K46l20J2K45j15m47M70J64m21L22J27m84
5762c60O4M25n24R7M19m68r6M61M34j067p5P71J00m28L37l01k11O89J37n90m41
5783f27R48k28k10r8M32n67L70M34o99Q7P01m99k47O13P4l83j37J72O8k73J92
5804A23L0q95J083K00n85L3K12k8Q8L7j38m25N00k9k03R1J26P8j24L2k13j90L09
5827A12J37k54J34M1n32P7Q12p4o59QM58k75O8O5l44k90P75K18m39J05k3n90L36
5850a34P45o15r7Q5n7m27O69l8n98J46O33n67j44M74p4n39L54M58q56N20J40n3
$$ y = [-39, 311, 100, 458, 158, -330, 35, 379, 434, -13, 128, 95, 153, 127, 168, -420, -11, 458, 34, -472, 525, 170, -365, -48, 173, -17, -5, 89, -139, -131, 442, 54, -333, -156, 221, -63, 35, -308, -660, -135, -24, -53, -670, -97, 23, -417, -421, 162, -374, -746, -349, 107, -412, -159, 87, -233, -221, 24, -91, -538, -68, 96, -325, -3, 124, -360, -296, 129, -395, -298, 121, -347, -443, 18, 452, -615, -690, 81, 181, -247, 90, -211, -422, 267, 404, -186, -627, 321, 93, -117, -215, 217, -350, 20, 454, -245, -158, 543, 44, -203, 410, 484, 101, -36, 136, 204, -69, 123, 153, -742, 341, 541, -44, -11, 201, 173, 261, 298, 160, -265, 235, 206, 3, 94, 220, 298, 174, 206, -7, -197, 112, 249, -5, 129, 170, -362, -285, 527, 453, -206, -198, 260, -15, 53, 118, -226, -516, 259, 477, 38, 143, 120, -470, -134, 611, -4, -101, -16, -73, -500, 169, 131, -467, -321, 312, -255, -399, 75, 1, -538, -184, 274, -582, -62, 78, 25]
5872B5l77K51kn44M18L46l09l09O43l29n8L80k23o93O31N15n45k25K15J60l46
5893c76M85n00M6J96M55l57k92O20j11n73N96j36k79N49n9o64K82P34l28p90L78
5914a24M48l29L52m75j11M98J48j96m60L96J53n25J46M44o75L85K94l89P5K56
5934C11J52m59L2M51j34m58K16J8o2N6M17p57K25L92l47k67O08k47q1L69l14k69
5956a48l9P15k62k10M40o83r8Q46r2n84j70N45l74L0J33K0m40N69j64k47l7M21
5978A71m20L09j98K11m46M78n0n08M67R0l66j40O53J40o39l54M17K02k1K41o23
5999c86k33Q02Pm93J04L52l14k82O41k85j11J15P9l02L23K33n40l85M23J44J94
6020H6j91m3j98M61K16p08R6M06j46j61J16M0j38L05j51l99L57K83k06m18L89
$$ y = [25, -352, -101, -103, -647, -229, 117, -192, -501, 142, -187, -245, 135, -88, -781, -150, 365, -180, -405, -190, -30, -376, 109, -391, -345, -149, 306, -51, -343, 277, 166, -407, 189, 53, -226, 323, 264, -400, -118, 616, 288, -502, -124, 324, -5, 347, -128, -239, 259, 407, 211, -249, 147, 300, -225, -79, 365, -310, 75, 369, -20, 55, 311, 463, 4, 36, 487, 353, -105, 111, 129, 67, 123, 540, -217, 8, 400, 53, -214, 394, 147, 66, 435, 121, -148, -187, 528, 266, 56, 496, -187, -285, 561, 469, -115, -285, 260, -114, -84, 49, 69, -371, 198, 34, -213, -250, 171, -249, 60, -138, 73, -373, 105, 55, -453, 14, 104, -262, -402, 251, 391, -248, -602, -185, 17, -4, 237, -386, -619, 183, 190, -303, -199, 153, -161, -443, 198, -87, -198, -83, -4, -306, 17, 250, -290, -675, -252, -108, 86, -105, -148, -346, 115, 331, -377, -281, 125, -21, -182, -66, -26, -164, 141, -10, -409, -52, 231, 25, -393, -4]
6041dL22l00o1J57j48J43J49%n99P23j18m39J79N29j89p11M24rk94L00M01n95
6063a40o9L76rk03M48j33o32N54M39n41K9L37m92J05N67n88j88L30R7r4j28J93
6085B58k57MM18ol16R6j42o5L17o9j91l90N35J04j88J69l3n79N87J20m88k00L73
6108E7L13m97K44k28j23r5L94l78J21J19P6l49M73J46l36k30J74k48o4O85l60
6129a06m76M85N22n22l78N43N7l97K69j03l93M33K19l64k31O92k54m01M11j33
6149a27LJ35j46j25k7O52p26K3L22J42j56o4m5l33L02L12r6m92M77N9M1j93J87
6172A25j50k82O56q2n56L79n2l04Q6K18j69l34P03m07j63K28N45l97L20k41R6
6193B19l23N61k73n73J029l16o58L42K56j18k49M34l18K6N05m35m70M79N34l15
$$ y = [-4, 318, 18, -43, 114, -34, 109, 258, 258, -341, 382, 264, -175, 4, 533, 344, -367, 57, 48, -246, 54, 455, -140, -209, 167, 158, -45, 403, 270, -362, 192, 631, 90, 119, 456, -36, 69, 636, 48, -140, 190, 287, 193, 65, 258, 1, 5, 423, 417, 101, 197, 55, -10, 307, 238, 47, -343, 192, 296, 108, 277, 244, -335, 252, 372, -116, -316, 57, 370, -127, 117, -111, -234, -329, 65, -313, -192, -73, 3, -346, 127, 273, -63, -293, -119, -367, -431, 254, -106, -582, -97, 425, -97, -475, 68, 125, -272, -3, -106, -499, -66, 153, -211, -442, 250, -4, -405, 6, -127, -124, 11, -135, -260, -287, 365, -361, -338, -16, 126, -30, -94, -139, -472, -170, 142, 46, -446, 31, 90, 131, -62, 125, -25, -307, 349, 267, -289, 90, 38, -266, -180, 38, -131, -465, 238, -169, -332, -104, 441, 44, 364, 123, 219, -104, 457, 184, -389, 640, 324, -334, 8, 264, 146, -103, 331, 13, 39, 544, 109, -361, 118, 652, 337]
6213C37m08K13J06l43K08J19m31j32Q07n58j7J33R6l25mK93J73J23k19k69j74
6234b72R24n61m28l2K70J97j13J32k86j0N05l83l88K35MQ9p5K88l22k53N07K13
6256B41m82OL34n74K33K66k16m27P9M60l26K77R9k07L9N67k54m05K07J27l52J63
6278a45L09m60r4N30k16J46n3m67o3M65p1J2m53Q52k63l92O41l91m30L36N99m19
6300b7q5M05k55m43K35J93j0Mm4k2L3M40n42l37M16M00j23k11J06J64j59L92m95
6323C5N8L12L56p92J93J62j5k96N1J67k77J79K63n35N47o7l45j43P61p2m63K81
6345C60j44k01L03K74r07P7P64j59m10K3K17j22oL26n35j17M67k58m01L35K67
6366A53k99J40ln2j50J41p6m28N57K45m40k11N07J6l23kL41m08L17j90l67L40
$$ y = [337, -71, 142, 248, -95, 113, 232, -199, -331, 476, -82, -99, 34, 130, -195, -199, 94, 267, 390, 171, -98, -272, 652, 91, -337, -369, -99, 98, -15, 117, -169, -179, 326, -57, -445, -210, -206, -117, -192, 96, -226, -479, 28, 241, -241, -235, 99, -475, -242, 24, -192, -619, -540, -80, -406, -129, -30, -237, -198, 369, 115, -290, -83, 44, -308, -145, 164, -296, -390, 140, -76, 70, 17, -450, -513, -48, -119, -107, -560, 292, 29, -363, 278, -113, -543, -207, 392, -27, -112, 293, 38, -405, -170, 23, 13, 17, -27, -49, -16, 424, -118, -455, -39, 361, 238, 27, 133, 297, 138, 530, 35, 93, 405, 761, -31, 162, 324, 309, 13, 64, 231, -46, 133, 396, -139, 408, 341, -4, -147, 614, 542, 79, 360, 216, 15, 318, 592, -315, -238, 526, 367, -43, -20, 197, 75, 69, 395, -140, -257, 210, -48, -449, -114, 153, -146, -6, -9, -61, -211, -70, -146, -574, -17, 228, -212, -423, 84, 100, -223, -225, 116, -292, 25, -165, -532, -192]
6388a92L7L15o18O58l79l62K2O00l25O9J87o4j71K82j19n64M19L09j68m26M02
6409h8l49K39J09m1k17P8M22m21k08L45K05o12K79M50l03K7J56k04l14Q53l20
6430H6o56Q20p0j60j47N8N6j1M52m26q5O2L64n37L03M2l3J17J31K2l37Q9j1m79
6454c50O49K96m67l89K45K46k80J35L09l71l5M46m26k02M01j65J69m8j30j70M4
6475i3N44m0n75O90n47l52N17k9j2k04M07k30j01pR8j83P2J86j83L3N24m04l77
6498b66K76K17k34k46K39J53j98J02k76O2K37J01m41J0M01j86k90M57k35m55M75
6519i7k1j69K11K57m67K9J86J25k11J46j11p5L33O4m55j53M77L7m12j53L10p8
6541b27L12j23l60P2N77m66P6J84L18p13J56K61j25K7J86l60pN79Ro39q7N20R8
$$ y = [-192, -155, 160, -458, 200, -179, -541, -519, 81, -244, -175, 12, -52, -223, 59, -60, -624, -205, 104, -64, -490, -88, -437, -198, -89, -130, -347, -269, 153, -268, -476, -131, 74, -538, -259, 191, -112, -85, 71, -133, -447, 406, 86, -570, 250, 180, 20, -127, -69, -13, -24, 428, 2, -83, -21, 343, -194, 109, 151, 118, 235, 366, 388, 51, 140, 129, -350, 299, 595, 128, -261, -16, 230, -50, 85, 394, 23, -12, 434, 8, -194, 207, 42, 211, 163, 33, -137, -93, 451, 411, -164, 526, -21, -373, 144, 115, 103, -101, 306, 76, -25, -32, 66, -117, -45, 141, -42, -9, 515, 111, -266, 10, 227, -7, -253, -14, 139, -59, 43, -233, -171, 66, 167, -274, -264, 137, -49, -339, 118, -117, -572, -97, -118, -287, -76, 181, -286, -257, -71, 54, -157, -11, -122, -197, 136, 200, -255, -408, 69, 106, -306, -459, -149, -227, 85, -38, -398, -326, 251, -215, -139, 45, 363, -350, -194, 67, -58, -31, 155, -205, -212, 367, 376, -263, -350, 170, 268]
6564B68m00L64m88J4Q21n55k24M6M71l59k41M31l4l09M36j32k72J83M93l92m5
6585G6M33j44o65P44l79M34l38jm49N39J10L3n67K10K35j35Q0J38k85J87j19k17
6607h0P1L01l75J47N5K99n33k47K04K80j05j30J47m26L93QQ9l06K07K14k76j5
6629g8J11P8j06l1j42O0L25j95m53K06L21k88j59j8K35l1J95l15j57M97j01j6
6651f2j33J8K42m43K31L05m49L70l11qj43L33k85M4J77J99p9j94J03l2j3L48l39
6674a21l64K11M81n67J98j05Q0K56j05j31L6N75l69k81J85K65m25j18L76J70l39
6695i2j9K20m12N29N8n59M40j10K23j48k11O31l59l16L9L91l93L01j17q3L31Q2
6717D26m86q4N90j9l73J32J31l80N05K5n55j31P68n08J68k49o8j9J59J12j78L66
$$ y = [268, -132, 232, -256, -242, 579, 24, -200, -154, 317, -42, -283, 148, 114, -195, 241, 109, -163, 20, 513, 121, 76, 509, 365, -300, 444, 65, 499, 161, 160, -289, 250, 360, 393, -174, 36, 271, 136, 216, 354, 69, 256, 137, -80, -9, 292, -83, 64, 119, 418, -115, -362, -158, 122, 17, -113, 34, -392, 1, 9, 98, -208, -1, 213, -63, -78, 33, 111, 5, -26, -168, -108, 217, 22, -431, -225, 96, -192, -351, -369, -134, -165, 30, -285, -442, 55, -46, -62, -195, -177, 65, -378, -147, 158, -291, 79, -232, -240, -383, -50, -335, -291, -114, 85, 6, -188, -85, -117, -130, 218, -121, -485, -274, 207, -360, -162, -267, -187, 69, -36, -167, -131, 444, 75, -206, -21, 244, -181, -299, 77, 247, -92, -111, 109, -303, 226, 284, -275, 165, 55, 278, 130, -81, 550, 191, -125, -86, 305, -88, 213, 96, 13, 344, 426, -60, -144, 446, 427, 54, 186, 317, -63, 442, 467, -88, -219, 549, 41, 209, -40, -108, -127, 32, 144, -34, 332]
6739C32p5k41J7J47J72m95J61l0jl8J3j97J50L58k08l19q4M88Qm66M61O2l74K63
6763A04K8r08P34J70l02k07N76j42l18J56J86r7OKn26L26L48j35l07L16k17n4
6785b61j5K18j67J43M30n41M4J40J37k33m4k4j48j77O06k7j32K48k21j65j62M01
6807E0m5j71Q3J44l31L69J78n22J86J54k8j19L01l08l00N71o4l23l5K51j07l8
6829a04M54k80l59P27l24J04j62J2p6J38L5k98M6K66j8j74k04K80R5k75J86k26
6851a57K17Q4K41m66K54M2k08l86K66L10O7l54P3L90k84K55o50L42J41L39o18
6872a02j1J78J8k38L10j04j31J57P2n14M52M3m99K73J25j06O1L92l76j61J37L54
6894C30o32J26K13J98l54N1j9j84N41k28j09k69K48k75K58K14j99j86k15M72l4
$$ y = [332, 257, 16, 33, 180, 352, -143, 18, -12, -13, -51, -38, -235, -85, 273, 65, -254, -338, 150, 158, -308, 153, 215, -159, 104, 132, -776, -42, 128, -174, -381, 195, 53, -265, -109, 77, -20, -14, -12, -538, -212, 136, 1, -306, 10, -207, -261, -276, -58, -225, -82, 348, -193, -149, -9, 128, -105, -149, -173, -321, -498, 108, 81, -51, 197, -24, -189, -351, 50, 5, -166, -83, 61, -270, 99, 277, -245, -59, 95, 67, -52, 249, -59, -359, 212, 148, -175, -210, 41, -66, -104, 350, 70, -289, 438, 114, 218, 56, 68, -8, 130, 165, -133, -87, 179, 161, -13, -217, 63, 158, -117, 69, -157, 60, 144, 385, -81, 173, 215, 7, -379, -113, 197, 264, -90, -17, 373, 89, 344, -306, 36, 177, 516, -102, -113, 65, 83, -155, 155, 51, -80, 77, 149, -365, 87, 130, -369, -96, 29, -77, -16, 376, 0, -161, -24, 330, -302, -176, 37, 235, -119, -68, -87, -271, 270, 42, -67, -336, -88, -363, -105, 109, -90, -276, -491, -19, -53]
6915e3J92j69j48m1O97o66j56K10j33L30l11L71J3m57K60K54l96L0K22p4j02M01
6937B74k13j12k97K61J35l90L9J15N8L12k92l46P76j60j86Q6J71k86q2L89l98
6958a46M36k4j19k28k10O63k8p43M19J35j62K44l41k16L76M73n65j36L45m19L28
6979H2M65j14m08J53j48j47J89q6M12j96m81N61o6k13j7j78o3N88j16m41K38J89
7001B03j57J65J67o73J42M32k92j09J6L48l98L10rn0j66K85N4m29J64k07K3J17
7023f4K58j40l04M30J32m24j30J66j92J65J72J31l25j22O3q1M15j51p3j34L81
7044A73N3m81N45l67l06L18K51m81j53K58Q7m21N39J6l35L48k41j54L99qk67q7
7066c14J78L2pJ09m27L23J73m8k73K06J90j3m11L73l8k06J29L14l00L8K18j32
$$ y = [-53, 139, -30, -178, -219, 478, -188, -344, -134, -267, 63, -248, 123, 136, -321, -61, 193, -203, -173, 49, -25, -127, 274, 61, -51, -348, -87, 48, -342, -303, -188, -130, 182, -110, -456, 320, 160, -26, 60, 231, -55, -137, 252, -146, 290, 266, 147, -81, -291, 372, 344, -399, 20, 155, -7, 237, -104, -320, 56, 529, -36, -172, 173, -246, 82, 547, 433, 25, 178, 30, -117, 72, -14, 398, 202, -279, 282, 216, 3, -14, -192, -255, 333, 217, -224, 14, 203, 46, 211, 378, -295, -153, 279, -13, -122, -106, 242, -156, 154, 145, 95, -71, 214, 268, -161, 3, -204, -181, -64, 194, 54, -250, 180, 312, -112, -242, -76, -268, -103, 69, 200, -125, -247, -184, -265, 150, -1, -74, -208, 173, 226, -255, 290, -77, -383, -65, 186, -295, -448, -190, -103, -524, 15, 31, -304, 44, -197, -351, 48, 40, -227, -314, -136, -104, -111, -2, -429, -106, 67, 19, -254, -48, 142, 129, -282, 91, 53, -153, -24, 290, -10, 28, 246, 114]
7088A14j07J57R3l7o86P07m19L47m3k69J63K20k7m28M73j32J17Rk17K09m41J27
7110g0L9J11l58P03j88l55K4Q7R6M19j45k78J53l34L76m32J83L76m26j03L27m14
7132b09K33J97k0k15j25J45O2m3J46Q0k76J6ok6J67K8k78J73q7q8J49K61m33p7
7156b26M82r0l42j44L80J61k71p8J07j92M1L88l97k60N86j51J3k14R1RK50m95
7178c52J18j1N49n94Q5M38m31L5j72L89k1m25L48j74l48N70o1J59m99K13Q9m6
7200a41N10j59l96Q4K77o77M21J30L8j75L39nm83J26n9J31Q9L08l82j55K52q1
7222hJ37J58r4j48k05K74j79J07K32j89j76L42Jp42M71K35R5j10Q9k82l38L40
7244A0rL28l41K01m39K73J53J02l12k0L24K01m84J49k67P4M6K51k83q4K6K09L
$$ y = [114, 7, 164, 257, 220, -466, 241, -178, 169, 126, -143, 20, 240, 213, -215, 258, 126, 243, 252, 35, 244, -197, -70, -31, 80, -278, 425, 237, -118, -94, -7, 89, 508, 363, 85, 238, -96, 280, -152, 31, 407, -19, -122, 205, -209, 24, 221, 201, -14, -139, 6, 68, 25, 171, 251, -25, -9, -15, -41, 126, 154, -124, 49, -38, -126, 23, 284, -149, -226, 256, 166, -176, -320, 60, 221, -50, -128, -21, -213, -172, 216, -181, -441, 145, -6, 7, -207, -116, -107, 143, -352, -234, -245, 304, -290, -205, 233, -198, -163, -335, 54, 33, -392, -44, -218, -566, 4, -57, 102, -397, -184, -95, -141, 369, 210, -186, -102, 175, -502, -81, 49, 87, -88, 251, 246, -237, -111, -170, -39, 50, 358, -24, -179, 73, -8, 129, 287, 193, 45, -160, 114, -65, 42, 274, 85, -91, 251, 252, -490, -19, 216, 311, 201, 290, 8, -330, 10, 1, 329, -12, 189, -250, 23, 176, 278, -34, -54, 270, 471, -13, 136, -131, -57, -11, 240, -43, -127, -101, 108, 111]
7267A11k94j30J87M97l45pp9K40j60j03J62k67j36N54k41k76L68J50k49k1J50
7288A11j04k19P1j39K19j9O3k71J31M01j25m27J23K17j10J22j16j36j87K07J6
7309a72Q3J91k88k70L67K28k26K34l55J3j21M29l09J88j63N95m04N2M8m41N12
7330A91j80K6k43K52J04k44K13l7K1m92P54k24j11k1m01J90L53J51m68j3J62J99
7352A82j88J34k61K05MK41l24j85K36M1l37N07l7j08o94Q17P1l31m7J73k23M78
7374C54j35k35r7j1K37j23NK99m36J46L51m80j95M07J03j94k72O04l49l5MK1L22
7397B91m50j6r6K56K22r3j33l5M2k22N26m58j70M24N4J8j70j40Q0M30o7m02j18
7420b27r6J81l0R4K44j68j41K41p4j50q0J46M3r5J21j85O5r2R6R3j72Q5j95K70
$$ y = [111, -183, -313, -126, 371, 26, 19, -60, 180, 20, -83, 79, -188, -324, 230, -11, -287, 81, 231, -18, -39, 111, 7, -212, -141, -280, -61, -80, -17, -288, -157, 244, 119, -308, -185, 32, -78, 44, -72, -208, -395, -188, -172, -89, 102, -186, -456, -89, 139, -87, 147, -208, -195, -316, 113, -196, -8, -171, 424, 20, 72, 120, -321, 191, 11, 37, -206, 46, 150, -94, 119, 82, 103, -389, 365, 141, 30, 9, -392, -202, 151, 302, -166, -179, -17, 182, -6, 128, -133, 72, 76, 317, -7, -192, 44, 85, -252, 255, 218, 110, -584, 233, 304, -27, -74, 99, -124, 354, 219, -16, -113, -124, 113, -10, -5, 294, -142, 4, 355, -125, -320, 87, 190, -4, -276, 328, -21, -56, -52, -31, 291, -159, -175, -271, -15, 207, 114, -19, -54, -12, -234, 292, -166, -336, 88, 142, 160, -10, -150, -70, 360, 293, -109, -227, -323, -142, -172, -78, 166, -2, -143, 98, 24, -126, -206, -60, -17, -112, 9, -176, -111, -203, -107, -14, -186, -101, -296, -26]
7444b6J95j17k60L36k7l07L28j90j62Q5J06N4k74J76K44k22O6O0k4l0M70n31m06
7467d56O62l6k83r8J51K3L9j12L02l68M46j65j52J3J67K80n02J75q2k0k30M08
7489A62j16nK8R8k30J89J10j40j71K64l62J17K13l03J66L43k50J6k2OJ44j96J92
7512B53j98r4L07m4l08J53K82l83Q3J55j22j4j37M17l61K83k48l9N2j39M0J2l2
7535h2K67m88L10L9k6j87K13J61j70k69N58n24Q4J56l7k20K77k04r7K67Q5k03
7557i0K7K84l85KP1K08m47J57J63K64m82K88j44k53J80J53l44J05L65j23r2K1
7579g2R1R6k7l75L65P4j55l30j41O83j73PJ15j66r2N4J42k45J47L01m67J69j09
7602a08J8j58K39J69m95N33n6m2l50K63J8j21J98j4M8l23K74k67K99RJ99l61j54
$$ y = [-26, 169, 52, -208, 128, 101, -206, 122, -68, -230, -145, -39, 15, -259, -83, 161, -61, 5, 65, 41, 11, 481, -50, -456, 206, 170, -113, -211, -60, -37, 2, -110, 192, -176, 270, 105, -47, -34, 133, 413, -89, 86, 4, -16, -246, 162, 46, 41, 69, 167, -63, 126, 236, 96, -75, 189, -173, -56, 157, -146, 20, 363, 113, 129, 107, 113, 257, 61, 253, 55, -39, 268, 224, -84, 69, 351, -32, 51, 206, 84, 70, -67, 350, -11, 272, 24, -15, 37, -102, -62, -50, -82, 185, -303, 7, 46, 20, -167, 46, 207, 37, -232, 326, -198, -114, 42, 5, -215, 62, -142, -239, 28, 113, -90, -63, 221, -164, -162, -91, 117, -330, -173, -10, 254, -228, 60, -84, -337, -157, -4, -348, -243, 122, -1, -93, -72, 19, 115, 88, -287, 78, 152, -3, -333, -474, 209, 36, 43, 158, -8, -100, -46, 96, -149, -2, 299, -168, 1, -108, -90, -248, -9, 160, -335, 198, 142, 100, -250, 13, 31, -90, 108, 94, 142, -181, 93, -174, 125, 134, 333, -28, -182]
7625a82K17J15q0L27k36l54L85N4j42k1l1Po0K07M2k82K4k18N47j01%l07O4K34
7649B09k28p1K48j19J45Q9n9l25M5K84j50o0j40J51j71j45O70l29j75M2O8pj10
7672a38L48l41M23Q4l29M7j81J58j88J03n7j9p6J92j52l63P48m54j60N48j79k83
7694b69L15K72p15J52K24qk73K05L38k32k23O0j70M69J03n66L17jJ16k23K10o3
7716C8j11l19O10j56j89P6J40l50L52K33l12k98J18lK50j63L06m97K49N02m44
7737C2l84K69j31l1M32L8R0m24K60k78K45O8k12j92Q5M61j33j18K7J26k46P3j40
7760h3k38K20O9J11j1l68K96j01N07k39k98K79k2m34K7O82n05J8J68J95l04K7
7782do4j09J34J91k53j4M4K94l28J49J7l71M58N4j27k12J56l8P2qk08M64n28K18
$$ y = [-182, 35, 150, 70, 397, 161, -193, 192, 246, 104, 83, 52, 59, -1, 206, 248, -34, -10, -228, 319, 218, 218, -89, -25, 209, -19, -90, 158, 39, 184, 273, 214, -111, -66, 218, 68, 8, -132, 19, -152, -297, 373, 44, -131, -89, -21, -28, -138, 210, -131, 292, 376, 47, 94, -87, 71, -117, -14, -71, -90, -166, 26, -126, -489, 259, -195, -355, 193, 14, -269, 46, 318, -397, -245, -21, -29, -302, -97, 241, 9, -214, -154, -324, 145, 248, -318, -1, -2, 114, -109, 101, 38, -73, -392, 218, 62, -127, -51, 89, -261, 91, 324, 12, -286, -168, -171, 79, -84, 222, -275, -26, 476, 32, -352, -83, -214, -245, 187, 225, 315, -109, 151, -127, 118, 186, -26, -218, -133, 328, 195, 77, 104, 230, -16, 57, -83, -321, -101, -32, 79, 68, -300, -4, -105, 402, 163, -135, 144, 122, -312, -285, 397, -108, -90, 78, 273, -31, -4, -68, -177, -43, 148, -105, -119, -75, 219, -109, 40, 57, -314, 144, 198, 71, -141, 15, -23, 49, 41, -167, 297, -231, -13]
7806a3M13p26j22N81m36L32J36k61j51P8L22l82J47J33m07K23K72k75o3O9K10
7827H0m42N43j58R9k60J77j12P0o5K7P9j33J65j06l2L08l24J54j73J03l35K74
7849f1J62l30K59O2jk99L05m4j80PL84k64J68j71k64J96K2p3m0K15K51o13J80
7872a29M97r4m44o7N74l72j20Q6O0j47K71j13j37L28R2j89o5j9q6Q4M55m29l26
7895b90P51k93k39l46O41k68k7K10j18j0L21j02m21j42M98l02j0J79j80K44O4
7916A60k89J12J33Q0k50l37L49j08j32K55n4l26L89j4qj22R4j59J50J17o5l75
7938d00N62n36J56J88j42Q5m4L82j09k52k8O3J65m02J67O7k30K73k30l0L16K76
7960B97m12n5L64k76m0j62k2M26j42k90j2J15K42j32K9l23L12K48q6j26K1J82
$$ y = [-13, 400, -326, -448, 133, -303, 29, 165, -96, -247, -169, 153, -229, -82, 51, -356, -133, 139, -136, -199, -130, 80, -362, 181, 23, 122, -138, 39, -73, -3, -68, -41, 38, -95, 70, -36, -68, 240, -84, 70, -103, 0, -335, -61, 101, -229, 30, 92, 91, -208, 97, 53, -127, -120, 264, 0, 168, -3, -267, -71, -49, -122, -162, 53, 304, -309, -129, 368, 274, -170, -237, 337, -35, -155, -69, -9, -156, 115, 2, -135, 193, 285, 96, 31, 12, -74, 10, 465, 36, -290, 461, 168, -71, -417, 224, -44, -71, 139, 21, 11, 332, 230, -191, -333, 165, -137, -147, 32, -148, 96, 160, -129, -17, 116, 196, -54, -391, -42, -150, -282, -27, -81, -407, -18, -32, -40, -162, -68, -227, -77, 40, -25, -400, 162, -374, -218, -30, -172, -87, -131, 251, 142, -110, -138, -75, 90, -312, -145, -78, -308, -35, -265, -295, 21, 297, -115, -170, 194, -82, -122, -284, -306, 120, -22, -312, -324, -209, 33, -99, -70, -393, -81, 167, 81, -45, -24, 158]
7982A58k51L32n15O05j82k46P9J39K01j3n00L09l55nL36j16J12J26o7j9m3J50
8004B35j28j97p0qM47k10O0J31p2j31k11K51K01l03P3l84L99o0K18l27k08J79
8026a15K84o9k20K79l4j02J10K16l03l9L04l76j27K27j73NQJ80r1J59Q1m10K21
8049A5J57j50o7j71M12O7j40j54k52Q5L18k65O6l1j01J54Ko9J19k38J23J98l21
8072b43L90k09j73Q8J86j24k0r9K85l31J85j33K83k31o3L41k64K12o3o5J92l9
8094A05K0j62J98k17K69p4m9l61M21j68j19K0L34r7j38J66l69N4L80l40j56K74
8116iR2p2q8J14k7j3r1j53JL74J1l81k73N89j14k2r7J88qK35j64j46L6J41J67
8141B90k24P0k04o5K95r1M6l85L81j15J05k25L82o73J91J16K28Q1j69M0k19K92
$$ y = [158, -93, 239, -276, 329, 147, -99, -20, 119, 320, 307, -193, 116, -239, -244, 92, -24, 88, 214, 147, 128, 85, 235, 107, -90, -160, -168, 279, 69, 129, 260, 188, 57, -154, 97, 298, -5, 68, -316, 83, 23, 241, -86, -294, -115, 169, 100, -120, 159, 125, 23, 133, 349, 46, 7, 311, -65, -192, 35, -138, -133, -125, 55, -36, 123, 204, -206, 15, 172, 22, -45, -216, 196, 263, 123, -31, -283, -198, 120, -145, -79, -110, -211, -57, -55, -124, -5, -243, -120, 78, -243, 147, -62, -235, -147, 39, -85, -105, -204, 81, -250, -65, -198, 85, -146, -209, 132, -132, 80, 17, -48, 144, 105, 125, -37, 161, -56, 213, 139, 90, -271, 150, -18, -137, -117, 217, 120, -18, 148, -221, -167, 213, -127, -283, -9, 83, 11, -77, 37, 10, -3, -94, -247, -246, 128, 139, -242, -515, 74, -40, -62, -159, 29, 21, 256, 92, -54, -18, 123, 290, 66, 136, -68, -133, 162, 71, 117, -268, 113, -2, 103, -122, 260, -413, -222, -106, 122, 203, 34, 74, -145, 147]
8163A47K18n80R4L94m84J87J23J04l22o9L44m64J35K53l83K15J04nk48RK65l08
8185b71J85K47k37q7O8J60
$$ y = [147, 365, -215, -121, 273, -211, -24, 99, 203, -119, -188, 156, -308, -173, 80, -303, -88, 16, 11, -237, -228, 37, -271, -86, 161, -76, -163, -95, 65]
8191F5
$$ Imaginary data points
##PAGE= N=2
##DATA TABLE= (X++(I..I)), XYDATA
0@%%%qJ6j6J6k4L2m0N6p2Q8j04J28j53J78k17K61l03L55m18M84n57O43p40Q45
27D50r60J090j233J388j561J753j963K192k444K720l022L355l722M121m561N052
43B655n594O195o870P630q490R478j0623J1962j3562J5514j7950K1098k5349L1436
57A7530m0951N8054r8366L62893L41675n50206j81241J42602K66228q975j16013
68A93230q4691J09369O1111j08829j58468P3076J68075N7538j09940j23364m0931
79C6176P6613K7706q0781k4229J40365O2902j33196j29598L6174R2218L9729m3436
91A00643p6234m528P1348j9885j09913j353J33082P2749n4578j04579p1179L4582
103b9845J13185J6851j10297n1365P7509O4152l2545p7194l4077P2388J04707
$$ y = [0, 0, 0, 0, -8, 8, -8, 8, -16, 16, -24, 32, -40, 48, -56, 72, -81, 97, -120, 141, -162, 193, -225, 259, -298, 345, -395, 450, -510, 580, -653, 735, -826, 927, -1036, 1156, -1288, 1432, -1590, 1765, -1957, 2164, -2397, 2655, -2939, 3256, -3614, 4016, -4474, 5004, -5619, 6343, -7219, 8295, -9655, 11443, -13906, 17530, -23421, 34633, -63733, 299160, 640835, 90629, -90612, 51990, 318218, 309243, 193230, 108539, 217908, 279019, 170190, 11722, 84798, 252873, 310411, 200471, 77107, 36176, 112789, 140495, 59714, 35485, 175850, 238752, 105556, -24042, 12132, 104350, 144079, 100643, 24409, 19881, 91229, 71344, -38569, -39922, 93160, 165909, 111331, 6752, -64427, -29845, 83340, 100191, -10106, -61471, 16038, 80190, 47645, -29549, -63626, 8762, 113469]
114A13469l6419j40446k9302Q2369K0520l6223Q102K8714L966j4603m9751l8250
126h7854O9051R2525m8788j19227q653Q3716M4216l8585o6841J3480J12178M1474
138H6692j23757r3903Q0498R9598j8126n7278j5462K1387L8575q78n1268R541
150b4381R1339J9605q6320m4555L7107L7802J3649p122k4294J2451M3223k3088
162D5416o0008K6072P4637K093m9683l0034m471K8052L7845k0568m3065K3839
174C0125M3376j6053k9079r667j9643J0952O2402O047p9316l8805M0355L7969
186C8663O326j7018l5593k543M2070q5n1770p454L3833M870r097k420j8650m271
200b3139L0044j898l2143J9866L3753l6467m3757K3899L4438k632j6563k1249
$$ y = [113469, 77050, -63396, -92698, -10329, 10191, -26032, -17930, 10784, 14750, 147, -49604, -87854, -18803, 73722, 24934, -94293, -102946, -19230, 24986, -13599, -80440, -66960, 45218, 86692, -37065, -130968, -50470, 49128, 31002, -26276, -41738, -20351, 18224, 17346, -33922, -24381, 66958, 86563, 243, -44312, -7205, 30597, 44246, 37124, 12830, 25281, 68504, 45416, -14592, 11480, 86117, 88210, 38527, 8493, 4022, 32074, 69919, 49351, 6286, 30125, 73501, 57448, 28369, 18702, -941, 10011, 72413, 78460, -856, -39661, 694, 38663, 44989, 27971, -7622, -10165, 31905, 31820, -19950, -27404, 6429, 11299, 2202, -218, -18868, -23139, 6905, 5007, -27136, -7270, 26483, -9984, -53741, -29842, 4596, 1964, -14599, -35848]
212c5848O6M4767J5711n8579k5958N6823L1072l8587l3822k049J8800L8132N422
225A5950n2683j9222N0126K5471k7759j7774j842R94K1453N837l9985q890M9505
238A181J4729l4015p340J2898l226Q280Q021k7029j2219L3692Q919l2074p783
251c5966K1437J8092J4174j4124m6123P63N4187N4n3589N15M6713P911k6473k0753
265c3182j302L8293L9605l6551o4207J8798N5799r935m2888j690L3274L4771l639
278B7146o1298l0485O9741N6763n6060o6160K5892N3998M164l7330l4103K7057
290b0675P3957N512q6855l6569O2004M1945k7522k9808k410J9391K7363j2755
302A3578m5235J4163O3768j776n9955j6790K8607J9558j039k1426j5754L5273
$$ y = [-35848, -35782, 8985, 24696, -33883, -59841, -3018, 28054, -10533, -44355, -46404, -27604, 10528, 15950, -36733, -55955, -5829, 19642, -8117, -25891, -27733, -26739, -5286, 551, -39434, -48324, 1181, 15910, -18105, -25445, -12547, -15773, -7493, 528, -26501, -38720, -5028, 3891, -28183, -35966, -14529, 3563, 17737, 3613, -42510, -41747, 12440, 12494, -41095, -40580, 6133, 14044, -12429, -33182, -34484, 3809, 43414, 6863, -57344, -38546, 17253, 7318, -35570, -37260, -3986, 30785, 27146, -34152, -64637, 5104, 61867, 5807, -60353, -34461, 19537, 23701, -13629, -47732, -20675, 53282, 58794, -28061, -64630, -2626, 39319, 11797, -18011, -20421, -1030, 26333, 13578, -31657, -17494, 46274, 44498, -15457, -32247, -3640, 15918, 14879, -6547, -22301, 12972]
314A2972L8292l9939n4212K6851N1999k970k8661k0947p646K6974K9566k6952
326E327l4796L2231M1195j9639l9155j2743J4193L8202J6463m8041l6324M4030
338I43M2020l2034l4592J5559K9310J1706j9948m5807k854O2197K4098n6392l2834
351c8628M0548L6554j2707l9124k5233L2483O2841j4866q4992j4663P4180L5161
363E1554l8834l6691J493K9432K1499k8567m1352K6219N0528j8735m6765O477
375b3742K6618J978q733j0760l149K5538Q548m6866k4423N1077L9620k8260l5949
388b8503l482J6984K2843l455l8345k849M9244J3000m3591k1036J6897J6557J8291
401A2555O810l2908k6366K1667K1196q459j734L787n770J0598J3591k3035k2196
$$ y = [12972, 51264, 11325, -42887, -16036, 35963, 32993, 4332, -16615, -24261, 2713, 32279, 5327, -29469, 2762, 43957, 24318, -14837, -27580, -13387, 24815, 41278, -6763, -43087, 943, 42963, 10929, -23663, -8104, 21206, 32912, 12964, -32843, -35697, 26500, 50598, -5794, -38628, 1920, 38474, 25767, -13357, -38590, -6107, 56734, 41868, -43124, -57787, 16393, 51554, 12720, -23971, -22478, 6954, 28453, -114, -41466, -15247, 35281, 16546, -30219, -23742, 2876, 4854, -3879, -14639, -17788, 7750, 16298, -30568, -54991, -3914, 35706, 7446, -28503, -31985, -15001, 7842, 4387, -33958, -36807, 12437, 25437, -18154, -39190, -22293, -5736, 12555, 19365, -13543, -39909, -18242, 2954, -5505, -7239, -3452, -9222, 1376, 14967, -8068, -30264]
414c0264K1020J9139r250l5K034j9045l805K2324O057r66J1260j2393l1307Q775
428a6456L1762m865k1363j754J0451K0163J5290l1276l9901K8820N3567j2211
440C2227m6278j0392J7947K0701J1653j9679k3959K4277L2696j7616k8310M020
452b713N787J77J1989j778j8418O419J7024q526l575J7214n649k2911N110J1244
466A1394p827r90N909j0413J049K2055J06j7673K000J030r574J2863J2241l0007
480g837k2495L1473L0987q753k0904j3700L889L1458J1318m2190k5524L4684K6499
493B8905k0297k1294K551J5261K4502J285l6053j2103L2167M904l3605k670K9533
506A3086Q163j4999j5163l653K4361K5266k7964m0342K1962M0658j8222m2003
$$ y = [-30264, -9244, 9895, 645, 610, 2644, -16401, -20206, 2118, 8175, 7209, 18469, 6076, -25231, -16456, 15306, 10441, -10922, -12676, -2225, 17938, 33228, 1952, -37949, -9129, 44438, 32227, -14051, -24443, -6496, 14205, 25858, 6179, -17780, 6497, 39193, 21577, -6733, -2713, 3074, 3251, 15240, 13462, -4956, 1463, 18487, 9961, 6386, 23600, 17951, -4960, 150, 11394, 3567, 2577, 8486, -1927, -878, 21177, 21283, 3610, 5610, 6640, -2934, 9929, 22170, -7837, -30332, 1141, 32128, 23375, 2471, -11229, -7340, 24118, 35436, -6754, -32278, 2406, 28905, 8608, -12686, -10135, 5126, 29628, 30913, -5140, -17243, 14924, 19828, -13777, -16447, 13086, 21249, 6250, -8913, -12566, 11795, 37061, 9097, -31245, -9283, 31375, 13153, -28850]
518b8850k788K6737K9712N233l8338l1442L0743L7669k1562l5674M352J8734J0688
531E214k836k4137j3012L2558K4915k5711k1647J5132Q066j1886l520r85J292
544a6557J8571M525k7281n894L0231R026k1778j0551M111J0920J6947j1425l9078
557c8233L602N1630J2783l9194j9843J6583K2827Q265k5058l3608J8370M9766
569B7890o584m8582o445L3435J7458q168k0483j1657K4891K5060l0846l8875K6622
582a6284M3702j2165l4055k642K3136K2877q167l9097n292N1233J9438m9439l1999
595c8754L1594L5690n98k3516k0338J4739M0373k344m7147p585M1384J4459k5210
608A2747j7243M464J9470J8322j3780k8112J3513L2317j2666l1537M958J7591
$$ y = [-28850, -31638, -4901, 24811, 30044, -8294, -39736, -8993, 28676, 7114, -28560, -24208, -5474, 5214, 2378, -21759, -34771, -2213, 22702, -3009, -24656, -9524, -1458, -13344, -16864, -17849, -16557, 2014, 6539, -20742, -26636, 3595, 12621, -9157, -19708, -15597, -4677, 12270, 845, -38233, -34631, 16999, 29782, -9412, -29255, -12672, 10155, 18420, -6638, -40246, -21876, 27890, 21306, -27276, -33721, -286, 17172, 9004, -11479, -23136, 1755, 26815, -4031, -42906, -16284, 27418, 15253, -18802, -21444, 1692, 24569, 16402, -22695, -27987, 23246, 42684, -6755, -38754, -7160, 28530, 27932, 4416, -15922, -1183, 39190, 36846, -10301, -17886, 23498, 37957, 12747, -4496, -32, 19438, 37760, 23980, -4132, 9381, 41698, 29032, -2505, 2453, 20044]
620B0044J384m854j0472r375J7734K1456j6356k3331R922J1217q189n000n342
633a162r220J1898J7827j6265k0324J5143J6308q641q256n161p004P638R842j9156
647a6533j3123K4269J7122j5649j2638K709M391J1012J556k6361j1153K8384J3046
660G032k6298j0342K0938J4038j304r216j5518K163K1368m720k6511M859K4416
673I05l398j3291N706O673L020M995j0575j5432J1698J3417j9365j2796K0601
686g842J4739q169n039j784J16J4196L346k2426q548J8909J777j3103O416J0728
700C316n281K456J1054m352p925m67p414j55K0826J654k6406k602K7377R904r528
715A2457n154m354R51J3868n176k4676L298K5044J49j3093N395O171l387J55k777
$$ y = [20044, 21428, 16574, 6102, -3273, 14461, 35917, 19561, -3770, 6152, 17369, 9180, 4180, -1162, -10382, 1516, 19343, 3078, -17246, -2103, 14205, 5564, -2692, -7853, -14857, -7219, 2623, -16533, -29656, -5387, 11735, -3914, -16552, -13843, -9452, 1560, 3116, -23245, -34398, -6014, 7032, -19266, -29608, -8670, 5368, 4064, -5152, -20670, -18507, 2861, -1859, -28370, -23511, 905, -2493, -15784, -10078, -3405, -385, 4610, -5965, -21397, -9699, 3718, -15647, -28443, -7842, 6897, -1272, -6311, -8095, -7979, 6217, 9563, -12863, -21411, -2502, -725, -13828, -7412, 3316, -1965, 491, 11545, 7193, -732, -1199, -8613, -8768, 12058, 13712, -12694, -15296, 12081, 21985, 12457, 7303, 2949, 3900, 17768, 12592, -12084, -8786, 16258, 16407, 3314, 8709, 14880, 11493, 11648, 8871]
730H871o389J0430N308k4665j1801K6671J5111j6905r546Q029O296M700o480k3687
744a4057l385K7549P352k5063j0261J0946R257Q294L40j9245p761J8955L740j9923
758a3262m619J0227K46L400N881r310p042J2392K643j2392M179Q798j1874j1307
772b2040O355N277P789J0649j3553k2942J4188K9105q898k8420n671J5591J8967
785F397L236k8155k2169K9291L7329j5765l3898o50J7921R155l112j7853p994
798b6267K4852J6332k6467j7701K3693J7250j3905j3425K741J1292Q414j4657
810g848k4646J5651M0307n839m2002o193L2163J7691j0896k6524j2156K8702L3121
823C1531k1631m3697O497L8775J1880j5822j8222o319J6891J9082j4045k0954
$$ y = [8871, 2482, 12912, 18220, -6445, -18246, 8425, 23536, 6631, -2915, 5114, 11410, 16110, 9630, -14057, -17442, 10107, 17459, -7604, -17865, -6919, 2338, 10632, 10972, -8273, -16034, 2921, 6661, -13262, -17881, -7654, -7408, -4008, 1873, -7437, -14479, -2087, 556, -11836, -7657, 1141, -10733, -22040, -15685, -10408, -2619, 8030, -5523, -28465, -14277, 14828, 5930, -22490, -28161, -12570, 6397, 9633, -18522, -40691, -11400, 25929, 10164, -23734, -24384, -6463, 2692, -420, -18273, -26267, -1415, 14917, -11550, -29251, -5558, 11692, -2213, -15638, -12897, -1605, 6809, -7848, -32494, -16843, 23464, 17625, -24377, -30570, 1593, 19284, 8388, -18136, -30292, -1590, 31531, 9900, -33797, -27300, 11475, 23355, 7533, -10689, -17008, -117, 18965, 4920, -16034]
835a6034J3377J7512j0508r945P327K816j415K560k794O46J3353k691k4550j846
849a2192K5226Q954j0564r948q333M746K4340M170k7387r669K2475J1862j1890
862A1790j3649o959R870K4459Q33l0416j0070K3174J2153r175p461n260L45J1553
876A1187j656j8399M193K2721m212j9821L420J1816l203o475l976L28J3280M734
890A3937k6586j5266K9216K6576j5422k4822m038R999J6229J594k3120j0562K3277
903A012J2490j8731r432R595N580K359J964j0031o987P031m89q378J2409J4519
917A2911j5675j5930R933J2846j044k847p823n911J0555P031j5353n605J7046
930A34O148q083o33j017q128N701J0834n537o585L802l952l900J3995P053j3991
$$ y = [-16034, -2657, 14855, 4347, -5598, 1729, 4545, 3130, 5690, 2896, 3542, 16895, 14204, -10346, -12192, 13034, 21988, 11424, 1476, -6857, -2111, 22229, 26399, -988, -10657, 11818, 23680, 11790, -1859, -8818, 1052, 25511, 26344, -4072, -14142, 9032, 21185, 12010, 4549, -711, -366, 11187, 9531, -8868, -4675, 18046, 13834, -5987, -2567, 9249, 6046, -429, -4405, -4077, 9203, 13937, -12649, -27915, 1301, 27877, 12455, -12367, -16405, -6406, 9823, 11417, -11703, -22265, 1012, 13502, -5229, -14661, -5066, 514, 2873, 4837, -5194, -12181, -5150, -5639, -14017, -1608, 12911, -2764, -18694, -8761, 4085, 3041, 194, -7629, -13540, -2985, 4046, -11307, -16912, 134, 6282, -1801, -2434, -3451, -11579, -5878, 4956, -581, -7166, -3364, -7316, -11216, 2779, 9832, -4159]
945d159m230J1197J776n850k195m940J686J7100K832j9721n219J5442M461k930
959E250K944m898p990N800N626n771K398P529p537m039J2027k34j1993K512Q096
974I720l362L42M195j0031o292J2657O475n985J051j401j0894L247J3309l115
988I916j0350M335L229l882K780j638q764Q296J4921j1444j8575P888J4177l064
1002G825n951k484j90Q552L558j8078q432K2352J2335j7903j2396O636P853L164
1016F841l406j2563K350J9815l176k6458j530K3952Q294j0889j0816n381R584
1029c383J5054r490k0989Q289K0802o633j6978K352R416L486O30q021o707J1910
1043b62P308j8649r575J8293J1704q212q717l786K833J5466M172k0437r236J8007
$$ y = [-4159, -8389, 2808, 4584, -1266, -3461, -8401, -6715, 10385, 13217, -6504, -11723, 3719, 8180, 5250, 8194, 3296, -4694, 1106, 6732, 961, 3359, 10888, 3351, -688, 11339, 11105, -888, 1624, 9720, 6358, 6700, 10895, 864, -5428, 7229, 13704, 7719, 8770, 7369, -3525, -278, 13031, 9916, -434, 3901, 7130, 3248, 6028, 4390, -4374, 3922, 18843, 7399, -11176, -3288, 10889, 7825, 1874, -610, -800, 7752, 11310, -6768, -15200, 7152, 19487, 1584, -10812, -4176, 3677, 6841, 3435, -9128, -6778, 13037, 9861, -16597, -18127, 5825, 14119, 3230, -7586, -12967, -3383, 11671, 2181, -18808, -10519, 10283, 3650, -13328, -10976, -1560, 1926, 2556, -5465, -12172, -262, 7046, -11603, -21178, -2885, 8819, 607, -8110, -11896, -9063, 6403, 10575, -9862, -19098, -1091]
1057a091P921j2711n060L965L611Q307K017j3402k478J3851n71j3829J341Q393
1071B64p6J189k71r230L038J7535k213j7252L97J0670j582m702k176l309Q602
1086H84J4203q201j7437P813J6358n964j1088l0J962N293M759j1441r413J7860
1100E558J6625j3166j4145M453O536L33k045p214r97J5451K062j9658k185K2650
1114A4258O430j5023q866J143N288P019o622j5758P534K2534k312j8164k269P380
1128B572K751K945l308j1756J059Q782o455n535J3889O085j2674m537P331J84
1142A333l384k678o519K253J4753k398j8452J554J6388J594n845r76m831k983
1156a0191P597p85j0055M129J0152m200k744O427l955p147O712O483n865l048
$$ y = [-1091, 6830, -5881, -10941, -6976, -3365, 4942, 6959, -6443, -8921, 4930, 4359, -9470, -8129, 264, 188, 1377, 1106, -8124, -5086, 12449, 10236, -7016, -6619, 4051, 2469, -2233, -4409, -7718, 884, 15087, 6886, -10551, -2738, 13620, 7656, -3432, -3462, -1500, 3793, 8552, -2889, -12302, 5558, 22183, 9017, -5128, -675, 5861, 6194, 4149, -3065, -4062, 11389, 13451, -6207, -8392, 14258, 20688, 5665, -3201, -2058, 3230, 10249, 3627, -12131, -4597, 17937, 15625, -2539, -4808, 2572, 5323, 8268, 4960, -6796, -5737, 3045, -3410, -8945, 4944, 11029, -1645, -6182, 1149, 1333, -2051, -4729, -11248, -8995, 5758, 3360, -15092, -13538, 2850, 4444, -1401, -2377, -7208, -10191, -2594, -3379, -13434, -9305, 847, -3353, -6097, 330, -3625, -10772, -4060, 2423, -3442, -6490]
1170f490p25o202M766J3978l602j2596O244R755n197m362j137n263L316J1594
1184D079l279j0019K653M122l336O095P975r233r294O245L008m753K451J290m482
1199f478N448Q031p707p042P364K408m544N201K693r988l488O916J637K797O097
1214I345o831q374J0458Q525j2791q345R975Q091j016m496r713k69J7568O398
1228A8525j6896m435J4314J427j1935k431L596M445N655m793j1143P070J3932
1241A7331j0084j5467J0927J5678m661j4020r666K623J8056R566j9924j3958J8088
1254D489J4965j2506j4604J032P986Q729j019j5761n840J4804N922j1296N18J0249
1268G668k343p573j439k686J866R467k714j1849N199J1857n651r108L434N032
$$ y = [-6490, -7215, -13417, -8651, 5327, 1725, -10871, -4627, 5128, -69, -4431, -5568, -10831, -7515, 4079, 800, -9219, -6566, -2444, -5780, 315, 8290, -943, -10237, -3992, -984, -5737, -3286, -1996, -6478, -1030, 7001, -706, -7748, -384, 2024, -2520, 2681, 5374, -4614, -8102, -1186, 451, 3248, 9345, 2514, -5860, 4598, 13123, 332, -8013, 1962, 10053, 9037, 4541, -5172, -5441, 12127, 18525, 1629, -2806, 11508, 12935, 1000, -1431, 2165, 6610, 12265, 7472, -3671, 3399, 17331, 7247, -8220, 2707, 18385, 13724, -296, -9962, -7339, 10717, 20283, 359, -13599, 4489, 19454, 6948, -7656, -6624, 1362, 10091, 9072, -6689, -12529, 2275, 8197, -3099, -2581, 7668, 5325, -2248, -3687, -6373, -4507, 4960, 2246, -9603, -4404, 7453, 1802, -7306, -3872, 1160]
1282A160K346L444r412j4448O983J6356j913r567N20K680M016O124q428j5113
1296a5252P359J8969m141j7090k641P140R076O153q330j1095R759J2386j2984
1309f91j4060J0096J1337l771o521l204L011J2507K064j6878l348J9953M327k0415
1323e593r941J0143J2914M856r292j4778P845K2163m561k3332O10J9015K004j1398
1337F55q576J01J3244J2366j0634j4454J0572J3303r741j2813M188O585L240q8
1351G948r450m465J3423Q365j1457n065R913R21p873k769j297O8R905K824r555
1366A436j881R321j843o260L466J166m641K627J882q843j120R863J956m171K320
1381E278p59m782L267R28r400L99J2687q88r972M38M268N93L712m59r230R64J0340
$$ y = [1160, 3506, 6950, -2462, -16910, -9927, 6429, 4516, -5051, -4531, -1851, 2165, 8289, -139, -15252, -7893, 11076, 6935, -10155, -12796, -5656, 3420, 9573, 1243, -9852, -93, 12293, -691, -14751, -4655, 6682, 2911, -3610, -6814, -3803, 8704, 10768, -6110, -9458, 10495, 14822, -5593, -15534, -5391, 7523, 12379, 3087, -11691, -3846, 18317, 13756, -9576, -8966, 10049, 12053, 655, -7921, -7820, 5424, 17790, 7156, -7298, 3274, 16577, 6836, -5977, -1789, 4796, 8036, 7948, -1502, -5967, 7456, 15821, 4364, -701, 9212, 10133, 2260, -509, -1806, -1738, 8167, 10991, 1436, -445, 8876, 7033, 773, 4239, 5405, 764, 3391, 5273, -3570, -4690, 5173, 7129, 2958, 5278, 4519, -263, 3004, 3932, -5468, -5069, 7618, 6730, -3242, -2804, 1464, 2057, 5769, 5310, -3920, -2956, 7384]
1398G384m723j2308M192R343k88j112n65n273L319P419p781p688R264O127r956
1413b646l956O559R39K56K923m895l411P868P40j0746N09Q957l175m607M828M81
1429F24l431L387O95n498K618L874p597k468J0292P66j0074k9N882P6R95l06p168
1446g362J548R946m215j2204N610J0637l575n514J732p4M82L381m308l115R875
1461B844L354j3881m590J2563N941n976m077k411L613J0224l053j6042J803J8193
1475H505K637j2541m521K121M168O138k099j0251L286J1757m502q988M425N005
1489E140l324O88J023m445J580N456n312m365R524M050r108k790L991n7L347K070
1505G468r659n283J2351P401r046o319K084L348O033J793j3441p883J4073J0679
$$ y = [7384, 2661, -9647, -5455, 3888, 3600, 2488, 1923, -3350, -31, 7388, -393, -8081, 1183, 7310, -2646, -6602, -43, 896, 1152, 4075, -820, -4231, 3637, 4377, -6369, -5860, 3097, -78, -4685, 143, 624, -2807, 580, 1275, -4223, -1605, 2269, -5328, -7796, 2496, 3262, -6812, -6841, -959, -883, 112, -194, -7362, -5814, 4132, -83, -12287, -6677, 3960, 385, -5129, -3397, -3471, -2989, 392, -3916, -7031, 2844, 6198, -7683, -12273, 290, 6231, 255, -3822, -6233, -2620, 7604, 4551, -11491, -9688, 8505, 11142, -1399, -5920, -3799, 369, 6507, 4408, -5843, -2557, 9200, 4698, -4290, 135, 5140, 1816, 2504, 3527, -918, 662, 6118, 806, -3559, 5965, 10015, 907, -1883, 2108, 2051, 5398, 7468, -2191, -7474, 4877, 12278, 3232, -3087, -1003, 2345, 8378, 10171, -3270, -11153, 2920, 13599]
1519A3599r723j0289J661O190P231M99j2655m767J3176M218j3622l680J0347K974
1533E159n026l259o94M565P726p882j4471Q118J7461o429j7988r73J2116R510
1547G933j125j4859r006J6203J5121j4204j8319P259J4489J326p411q834l92J3265
1561A446P007j3682p589J1387M887r255k783M261J296K012m07o934K949J1574
1575F169l900j3652K431J1818Q05n647m980l601P374J2616m824j4418J998J1767
1589C956K62l361l280m999L401J1736j813j2511N80R628J289j925j338l961O27
1604a709P500k286q298N374P629n742n678N613L030j052q92l680k026J0528K827
1619A1138j4344n381J3376Q005n878p563l868M573J2560o8j6595l379J4348M905
$$ y = [13599, 3876, -6413, -4752, 1438, 8669, 9168, -3487, -8254, 4922, 9140, -4482, -8162, 2185, 5159, 133, -3126, -3820, 745, 8471, 589, -13882, -5764, 11697, 5268, -12720, -13693, -1577, 7933, 6808, -8051, -17057, -854, 14267, 63, -18256, -10997, 3492, 4818, -2593, -11427, -11819, 1446, 8453, -5229, -12818, -1431, 3456, -5799, -8582, -4321, -3025, -1013, -1420, -8354, -5405, 6169, 2269, -11383, -8952, 2866, 3671, -1976, -6956, -10557, -3183, 9433, 4609, -9809, -7811, 3956, 4218, 857, -2423, -7422, -4021, 7715, 5902, -6609, -6029, 3599, 4888, 2963, 1625, -2336, -1709, 5791, 3505, -4793, 581, 8210, 2468, -3210, 2403, 5433, 4381, 3489, -191, -2217, 8311, 11138, -3206, -8587, 4789, 12794, 6916, -647, -4515, 58, 12618, 12550, -4045, -7424, 6924, 11829]
1633A1829r481m061J463K748M734q92q361J223Q315l746p364O251M069o734k866
1648b873L551J023J560J990p024m036R456M078r391l190N441k9r71J870l756k788
1664e089O896K943n516r68K395n286L53Q428j317r315L71N710P78J161j113o534
1680f103J746J0658l061j1486R36O482m54l18J927l484O3M938k897m988O298L112
1696C369q658k863O835J389k943l12j212J353Q476l91j2725k153J0255J296n589
1711c873lL1M89O015P2q764P77Q841L2n763m30j709j908N924L991o292l27P606
1729D709j423m785R71j98j747M760J137p225m22Q379j406m809L470M482j164j481
1745C248m279n948O521J0021o361j0732N630J0139r40n881l457N10P909L619j2297
$$ y = [11829, 2348, -1713, -250, 2498, 7232, 6340, -2021, -798, 7517, 3771, -3593, 2658, 6727, -7, -2873, 678, 1701, 3261, 5251, -1773, -5809, 3647, 7725, -1666, -4856, 585, 556, -415, 1455, -2301, -5089, 1807, 4750, -766, -1734, 661, -4625, -4272, 4156, 2839, -6476, -6105, -395, 383, 1544, 431, -6103, -4357, 6301, 3240, -8246, -7310, -828, -1282, -1600, 327, -3157, -3094, 1844, -1053, -6041, 257, 3369, -5289, -8152, -1317, 72, -2871, -3183, -4395, -3042, 5434, 5043, -7682, -9835, 420, 1716, -3873, -3876, -3845, -3356, 2659, 2731, -6033, -5256, 3585, 3617, -2146, -2576, -4285, -6193, -269, 3722, -2570, -2897, 4709, 3286, -1499, -528, -726, -2473, 2287, 3424, -3801, -4223, 4156, 2750, -2059, 1411, 5893, 4729, 3248, -1031, -6979, -458, 9563, 3202, -7530, -1900, 8239, 7299, 1418, -2039, -1529, 6380, 9999, -2298]
1760b298q864J2279R653q108p487L801O360L438l510j0473m91J3553J151j4999
1774e995m191J2443P370m327n458l829M665Q483m631j2524L430J2638l006r949
1788d881n42M771N156L266n438p575N197P047p570p842N902O499q52j962m085
1803b909k654P303N867p415n918O322K976o106l090O43J336P560M005j0086o929
1818i095Q112N606m875l354l74j39N712J389r859k503J1787M768q644m080K856
1833b693K023J056j906o404K684J0986k215j2148J924J0936J401o448m591m25
1847e820O087P700q052j0650O685J1850m072q136K283M389K230o48p084m261R840
1862B341N787q562m423Q131K631n173j878J232K369N020k100j0068Q13R595m03
$$ y = [-2298, -11162, 1117, 10770, 2662, -4825, -1024, 5336, 8774, 5264, -5209, -5700, 7853, 9004, -5995, -10186, 2257, 9627, 5300, -158, -3987, 678, 9161, 4530, -7994, -4564, 8074, 5068, -4881, -5423, -652, 4504, 7770, 2332, -5243, -46, 7001, -569, -8411, -2509, 3990, 3138, 1176, -2909, -5563, 1740, 7607, 192, -5726, 596, 3572, -2534, -5624, -4981, -3645, 3915, 7920, -2166, -9095, -983, 4623, -252, -3606, -3980, -4119, 1593, 2982, -6877, -9380, 2407, 7175, -1469, -5549, -2693, -670, 386, -1520, -7924, -5240, 5746, 3531, -8617, -6693, 4243, 5644, -804, -5395, -5820, 267, 7967, -85, -10735, -4050, 7800, 3728, -4408, -2125, 2264, 4494, 3846, -3238, -7499, 2341, 8128, -434, -4857, 3274, 5905, 732, -1146, 86, 2455, 7475, 5375, -4693, -3880, 5715, 5312]
1877E312p269J521N370l28l66k379n170L242P730k305p243J831K114k088K431
1892B403K973l947j855M554j63l004J270j291m276M354N310n109m257M414J275
1907B651j875K735j32n355L55L882k040p28L053l855l820N912N790n067m151J403
1923a242k71K324K478o186n217P935O326o560m794K741J469J672K239m563n769
1938g418M193M250m331j108K907j521k41N457j628o794K70L751o40R60L42n915
1954g466j245P642K181n497J3K402j871n9K551l473k575L504l21j503N298K517
1970B098q496k577Q024L531m024l583l017K210P468j95r649P1J1294K239p612
1985b218k782J442J817L073k310o387L534Q613l597p770M317O673j838l165k233
$$ y = [5312, -1957, -436, 4934, 4606, 4240, 1861, -3309, -67, 7663, 5358, -1885, -54, 2060, -28, 2403, 5376, 1429, -426, 4128, 3965, 961, 2231, 940, -3336, 1018, 6328, 1219, -3038, 1376, 2651, 776, 3511, 3379, -1976, -1621, 2261, 221, -507, 2546, -1309, -5129, 783, 6573, 1506, -2645, -1242, -1513, 811, 3289, -2897, -8114, -179, 6147, -413, -5207, -2466, -997, 675, 2914, -1649, -7418, -3225, 1025, -3306, -4414, -1507, -3028, -3269, 2188, 560, -6234, -5964, -2213, -2853, -1893, -1551, -7466, -8711, -1069, 1112, -4385, -4372, -1970, -3841, -3900, -1349, -4822, -7397, -3893, -4214, -5717, -419, 2098, -6398, -8975, -951, 2580, -1444, -5027, -8044, -5834, 1634, 1439, -8210, -8139, 3155, 5394, -2218, -5000, -3558, -1741, 1332, -978, -7365, -3831, 4782, 1185, -6585, -2268, 4405, 2567, -598, -2831]
2000b831m72M125K913p369l482J0107N395p838n286L599L316K921j648q136j647
2015f333J0303L461q283k728M686K465N28O5m461k198N624J586n682O81M465j966
2031B213j957K403N92r60K910j578o621K522P069k204n686K42K246K905L378n048
2047B426p951M620R909l071r858l78N245L981P65o862n970Q003Q855o843r941
2062g070M255O109l38l436l189o94O788K338q486k954Q735K554q472k829N595
2077a094L555j027m983n188N360J0220m193j2183J517J0640J425o378m585R2O648
2092a74O154o801r147N092Q718l212n267J121J807J621J124l936l666N932M578
2107C944n599l218M291O55j992J441j59j380L612J637n189j439M509L87k388J612
$$ y = [-2831, -3303, 822, 3735, -3634, -7116, 2991, 8386, 548, -4738, -1139, 2177, 5098, 3450, -4686, -6333, 3970, 7431, -852, -3580, 1106, 3571, 4099, 4164, -297, -2495, 3129, 4715, -967, -286, 4179, 2213, 256, 2659, 3251, 2291, 5201, 3623, -2998, -476, 6593, 4389, -1297, -1055, 1191, 4096, 7474, 2426, -5525, -905, 9004, 5933, -3925, -4303, 942, 4923, 5688, -1174, -7144, 859, 9714, 2871, -7070, -2815, 3294, 2956, -480, -3669, -4363, 2425, 4763, -3723, -6677, 2058, 4612, -3860, -6689, -1094, 2461, 1434, -3549, -8737, -3377, 6843, 2650, -9533, -8016, 2624, 4049, -2329, -6914, -6822, -174, 5980, -821, -9968, -4876, 3842, 630, -4637, -3516, -1709, -88, 1036, -2900, -6566, -634, 3944, -1655, -4873, -582, 73, -1919, -478, -637, -2017, 1595, 3232, -1957, -3396, 1113, 1500, -888, 724]
2123G24L2k124L000K319n260j257N940J096l821q48K4j59L580J126n886M58P079
2140F023m3o351o47L383R00J312j892m808K691P016k789p091L316N537k217k954
2156A386n91r79K737K931m584l481O173L530o090j898M309K17k155n22j693M25
2172b85M744j266o345K109O091k139m319J349J450p27J109j930l543K905M309
2187C512l292k610M269km124O83K459j540m60Q47k212J56M438k574m312L998M627
2204C863l598l418J165q3K03K193j988k334M492K192n244j636M979M52k945L00
2220a407L20j404L004k71m792J717P002j775n464J097J807p05J580k33l639J435
2236a728M678j806l638K070J278j274K313J387m196j306L586n95k090K809L51
$$ y = [724, 756, -1368, 1632, 3951, -1309, -2566, 3374, 4470, 649, -199, -175, -334, 3246, 4372, -1514, -1056, 6023, 5980, -371, -1018, 2365, 3265, 4577, 2685, -2123, 568, 7584, 4795, -2296, 1020, 6557, 4340, 1386, 795, -184, 2553, 5484, 900, -2581, 3592, 7122, 1032, -866, 3443, 3660, 1505, 983, -710, -285, 4459, 3193, -3152, -1043, 5048, 2909, -1410, -61, 1389, 662, 1771, -159, -3702, -797, 3512, 220, -2390, 1879, 1877, -2247, -1564, 895, -645, -1105, -258, -2470, -2314, 2124, -450, -4762, -764, 3863, 265, -3153, -1988, -2071, -1868, 325, -1663, -3997, 495, 2687, -2557, -4193, 786, 1238, -1707, -1407, -1087, -2491, 513, 242, -4550, -2833, 4169, 2394, -3070, -1973, -166, -871, 709, 476, -3163, -1728, 2950, 1144, -2494, -424, 854, -420, 1893, 3280, -916, -2222, 1364, 769, -1321, 1488, 1839]
2251A839k268J354K224k869n48L082j646k364L963J386m637r89K399R12K295O93
2267D826n488k556P249L247o772m051L376L635K061j846o349q62Q542K900p918
2282fl157M747K543j637j081l142R47M700k7n268K015M955l583m990K598L622
2298C236R3j560l877j542O493M100p503n353O386O668k883n470l659J262P088
2313C479K890p766m590O397L834l485k111P3K94K535R13n494j645N101K43l511
2329b843J561L029j826k074P69r35Q70L482l144n292K780N353j916k787J20L22
2345b531K385K927m440o822L593O634j392l633j339p4L262M204k590n671K745
2360b742M532l093l391K308Q42M05J109j727j313M698J317o008r75O125J029n376
$$ y = [1839, -429, 925, 3149, 280, -268, 2814, 1168, -1196, 2767, 4153, -484, -1473, 926, 1838, 4133, 4826, -662, -3218, 4031, 7278, 506, -3545, -169, 3466, 5527, 3681, -2668, -3530, 5012, 7912, -6, -3163, 1584, 4127, 2490, 1409, -1733, -786, 3914, 3887, -1381, 634, 5589, 2006, -2984, -386, 3236, 3329, 1769, -2108, -3650, 2843, 6943, -560, -5913, 473, 7141, 4258, -1212, -4871, -3609, 3479, 6369, -1397, -5987, 410, 4244, 759, -1352, -1279, -985, 1550, 2463, -3031, -4676, 425, 668, -2843, -1282, 1747, -79, -2153, -1384, -2319, -1449, 2033, -1111, -6403, -3623, 1730, -186, -2973, -2853, -2531, -146, 2781, -1659, -8481, -4888, 1746, 354, -3279, -4618, -4692, -1430, 2774, 184, -5487, -2742, 1790, -1303, -4694, -2386, -1544, -1139, -30, -1757, -3070, 1628, 2945, -3063, -4038, 2087, 3116, -2260]
2376b260j965J268L567M560k129p563J403R065m68p457j888L970K734O13l003
2391D47m043L243O910k050n083J964K362k920r74J588j84R86R49k877p63O180
2407E735J90o540q97N311J024k410k307k190J875N786J22n945pM373l44k052P72
2424B496j935j778L446J311l170j33K137j702K39L689j635m965J261K125j100
2439B86o08J189k242L35M139j044l891J182J756k425O57J583l499j657L180J757
2455F98j487M39p39k693K440L179l480m185K922K508j684Q5K30k085J857K903
2471I08k333j937K172n53k654J963K789k591j500K366M98J7J280k138k982M405
2487b90K639m171k441L270J530r82N63q93p02K644O91l968J31M428j470l804K397
$$ y = [-2260, -4225, -2957, 610, 5170, 3041, -4522, -3119, 5946, 5478, -1979, -3867, 103, 2837, 3450, 447, -3596, -353, 6557, 4507, -576, 1388, 3750, 830, -144, 1444, 1260, 2246, 3195, 318, -445, 5735, 5925, -615, -1512, 3799, 4823, 2413, 106, -2084, -209, 5577, 5699, -246, -253, 4120, 3776, 1724, 2496, 561, -1217, 2229, 3540, 370, 237, 2374, 672, 911, 4600, 2965, -2000, -739, 1386, 286, -322, 867, -1375, -1040, 3099, 2055, -1836, -654, 1102, -1323, -666, 917, -2582, -4239, -1059, 698, -789, -350, -1089, -3782, -1342, 1837, -1643, -5828, -2906, -398, -2082, -1997, -1767, -3852, -1995, 908, -1425, -3362, -1190, -1743, -4397, -2434, 355, -2236, -3736, -1370, -872, -855, 425, -1713, -4695, -290, 2349, -1822, -4263, -993, 537, -445, 118, -775, -1477, 1167, 1858, -2110, -1979, 2449, 979, -2825, -428]
2504d28K640j308o28k96j355L128K997m966l761M627L504l250k174J469M23J411
2520B033R93l304j757N092P13m973K0L838j059k006P80J03O82K520j867m215K546
2537A39M144k745k916J702J269j100J065r97k160K576L142l368k346K692L62j807
2553c48P91N23k418R53K504j814j540K749mk369J382K10k359P38K674k348j986
2570b662K663N97k146N01J266j491J547Q50m131j780M921J635l929m62J750M88
2586c83L46K94l349Q1M712p68n364R95M277r89j527J114J51Q25J866l477l766
2603d962M617M352m501l287K440K185M79k30k396r52M278J677n664j428M556Q41
2619B005k640K03P78k11J634l21k678R11L754k459m263K624K990p26j092l17j023
$$ y = [-428, 2212, 904, 276, -20, -1375, 1753, 4750, -216, -3977, 650, 4154, 904, -1270, 199, 622, 2033, 3026, -278, -2035, 3057, 3770, -1203, -1183, 2655, 1596, -410, 370, 473, 1155, 3675, 1808, -2407, 139, 4283, 1538, -1378, 324, 1593, 493, 1558, 561, -1599, 977, 4119, 751, -1595, 1097, 1459, -348, 443, 966, -1452, -499, 2005, 191, -1349, 1400, 1396, -973, 409, 619, -1740, -1002, 1672, -676, -2662, 1, 598, -1548, -1047, 219, -1272, 275, 1125, -3006, -4786, 135, 1770, -2159, -2621, -871, -383, -37, 257, -3092, -3011, 1701, 933, -4431, -3436, 841, -148, -1675, -561, -410, 415, 2281, -1196, -4962, -345, 4007, -494, -3781, -1341, 844, 1323, 1093, -1303, -2255, 2023, 3700, -1964, -3392, 1164, 2005, -635, -432, 346, 135, 1769, 1448, -1230, -319, 3435, 976, -3287, -663, 2327, 1601, 509, 192, -831]
2636h31K149K901l510l571M017K318k998j537J660o09J015K419j903k602K045
2651I63J746k565N26J865k379r65K804l59j636J877O46k460J043K010k731j297
2667i12K077N94j379K051j7m097J288L325l13k221K30j252j46L291m12m242P87
2684a348M045r64k523M34K95r3J942q99l006R46L018k506j315L111P33l467n45
2701b142J427L01J627j90m064o8N184N0n403N5M041O76r28j725k536J218N231
2718B754j109m861J270L034j783j467J911J95l27O64j255j577L007R45m148m42
2734c189M712N13l712j060O96J171L169o18n206O4N051k13l088K80J490r25R67
2751A02N70l158Q16K881r65j646K338K7k938O94K499q36o95J192j783o70K988
$$ y = [-831, 1318, 4219, 709, -2862, 1155, 3473, 475, -1062, 598, -11, 1004, 3423, 1520, -1082, 963, 2709, 144, 670, 2535, 156, -809, 1995, 1636, 0, 1877, 2523, 63, 1106, 3116, 385, -912, 1165, 1759, 380, 2431, 2414, -1683, -395, 2930, 2617, 396, 626, -626, -772, 2519, 2107, -2135, -1348, 2697, 1733, -790, -356, -61, -154, 1788, 889, -2117, -1171, 1847, -659, -1974, 1137, 1870, -1597, -2142, -715, -414, 1213, 1023, -3041, -3109, 2075, 2125, -3278, -3223, 818, 1494, 566, -1159, -3695, -2477, 2754, 1645, -3216, -1946, 1088, -695, -2162, -251, -56, -383, 281, -974, -2551, 456, 1401, -2747, -3189, 1523, 2036, -1676, -2736, -2040, -869, 2300, 1682, -3524, -3460, 1591, 1378, -1710, -1430, 60, -865, 102, 672, -2486, -1670, 1211, 246, -1400, 938, 965, -1973, -1279, 1220, 384, -311, 881, -902, -1572, 1416]
2768A416J034l304J41J937q64m33J643j576k071L608J446k471j047J349n71J005
2784A242K183k907l151K882K798k484r23J753l18K51J034j856j602K530J104l738
2800a202N98L355j533k704J551J905o8P64k712l018L209L969l383l561K258K895
2816B323q34m32j081j722L229K185m329k227L763J075k888j95K343l77k72J46
2832G07j732M48L260j959m462K329L959j868k277R97J66J011J578k455l186K766
2848g18K790k946j627J800K08p98J415p09k005J710J256k912K93K540j472k471
2864c646J804J290j177J70O54j979R45K400j620k521J715Q86j587J111J133k436
2880b858j44L267n38k039P12M33j465J622J373k560k25K933q77j728J360J310
$$ y = [1416, 2450, -854, -713, 1224, 360, -73, 1570, -6, -2077, 1531, 2977, 506, -541, 808, 237, 1242, 3425, 518, -2633, 249, 3047, 563, -360, 1393, 1075, 1326, 2360, 504, -1098, 1432, 2536, -1202, -604, 2751, 1218, -1486, 65, 1970, 1902, 2666, -46, -3064, 145, 4114, 731, -2830, -572, 2323, 1489, 1057, -24, -1746, 1483, 3668, -661, -2888, 875, 1950, -938, -1133, 1210, 833, 561, 707, -1025, -577, 2683, 724, -3738, -1409, 2550, 682, -1595, -598, -432, 579, 2157, -298, -3484, -718, 2072, -874, -2501, -701, -493, -1291, 124, -585, -2590, -880, 376, -2536, -2243, 297, -1175, -3646, -1842, -552, -1729, -1559, -905, -2884, -1939, 461, -1159, -3680, -1965, -1079, -2666, -1555, -422, -2858, -3002, 265, -273, -2312, -1600, -1167, -2632, -1010, 363, -2197, -2422, 511, -366, -2094, -734, 576]
2896E76j620N1R07j491O13K137j894k113L259K033k999j223J601P87N66J3k782
2913a579p81M383J030m755m96M206N21j972q33l07O73K629r13l818J537L929j538
2930A916l268K040J961q12n03j247j110L185K124m434k553M233K462k837j411
2945b54J065J37J782L9l499m91L921J50m168O97L131j338m93M1q35L54K504j960
2963G83l678K454K906k578j720J144L61O8J464j513k589K025K133k538r55J245
2979i88n79m07J744K6k690J717K075k681q63J810o26m64J166o04j985K117J932
2996G00k607q49L103l15j662j47k37o32K733O19l538m44M930R1l240m55J002J040
3014I2J296j111l857Q54N036p77l756J452K613j276j089M87r77J305J575k432
$$ y = [576, -1044, -993, -86, -1577, -964, 1173, -721, -2834, 425, 2458, -541, -1764, -163, 624, 1190, 1203, -1579, -2360, 2023, 3053, -1702, -2198, 2008, 2529, 557, -276, -583, 90, 2719, 1806, -2012, -475, 3454, 1916, -1352, 688, 2649, 1837, 1334, 87, -1023, 2162, 4286, -148, -2701, 1532, 3994, 1157, -254, 811, 948, 2730, 2769, -730, -1221, 2700, 2850, -1318, -621, 2510, 1172, 679, 720, -115, 239, 2743, 783, -2895, -441, 2465, -113, -1833, -689, -328, -260, 1204, -309, -2898, -873, 1260, -1278, -2233, -988, -1567, -1974, -230, -204, -2894, -1177, 898, -1783, -2646, -836, -1462, -1926, -760, -1364, -3349, -1232, 700, -1907, -2756, 347, 32, -1630, -1777, -2014, -2646, 87, 706, -2832, -3276, 1654, 1745, -1495, -1950, -948, 92, 1388, 277, -3580, -2726, 2310, 1533, -2223, -771, 1842, 566, -523, -36, -1013, 292, 1867, -565]
3030e65k001L825J927l466j432K646J200m60o89k366n75M418Q58m597k04M242
3046B761j16j556N8q36L13J613l3l221J245K849j875j548K599M91k074Q04K12
3063A686j043R98J051k472j118L486J68k498O96J044j140O09J161k007j052K013
3079A582L70j913J329j34k008R11K744j361k405J260J26p49R78J13k232O84K701
3096A996j538j525J635K46k154J049J727j648q07Q47q07k94K738p63l088J433
3112i53K649j715j725P05o5L27K045j355k488J633K385k409p15K383o25j744N91
3129a076O81r22J046K08j971J111L374k584l608J624K844l36j221n04r69J351
3145i52K527k338k637K712K397k167j222R37k93J9J148j012q16K690l37l389J559
$$ y = [-565, -2566, 1259, 3186, -280, -1712, 934, 2134, 1674, 985, -1381, -1956, 2462, 3320, -1277, -1481, 2761, 2645, 1089, 1147, 311, 624, 2237, 2204, -1017, 228, 3077, 1202, -346, 2253, 2744, 670, 1474, 1686, 643, 1641, 2692, 220, -898, 2588, 2756, 258, 954, 1998, 858, 1467, 2628, 621, -431, 1582, 1952, 39, 1368, 1234, -774, 137, 2881, 1520, -885, 375, 501, -248, 730, 843, -1389, -705, 1996, 458, -1067, 568, 814, -1340, -291, 1436, -212, -1019, -172, -979, -1273, 1465, 702, -2386, -953, 1696, -19, -1744, -1039, -1104, -777, 1268, -87, -2575, -942, 1443, -966, -1681, 702, 77, -1667, -1076, -395, -1317, -271, -63, -2034, -923, 2451, -133, -3741, -2117, 727, 391, -830, -1334, -2303, -952, 1575, -763, -3400, -688, 1709, -458, -1680, -743, -1036, -1017, 131, -881, -1697, 993, 656, -2733, -1174]
3162a174L289j021k512K96Q86N24J622k020k633K226M075k597k701J574J179k91
3178G22N42q54j587J619K228k197j664K257N91j981R59R43q42j7O41j751o00K926
3196A935j78k499J159J589j433k45J050j901K5K695j14k665l59J596o15O05J053
3213A698k116q16L214P7l639L71J999l47P1n9j654J23K693o21k950J435K695j904
3231B70k005R22M90R60N63k455j981L313K950l991k265K400J915j248o45j380
3247b187k35L380P26l950j042L814M33k447m06R79L90L35n50j915J283L181j819
3264c0l326K219K432j629q77o0k17J397J544k954j882L461K057k430o94R55m69
3281e03N38J155j130j690K308Q67j976L27J465j385l35K105n25j393R17P95j391
$$ y = [-1174, 2115, 1094, -1418, -1122, -236, 288, 1910, -110, -2743, -517, 3558, 961, -1740, -166, 1013, 722, 1264, 410, -1177, 442, 2670, 473, -1191, 1066, 1657, -324, 635, 1578, 736, 719, 1360, -391, -991, 1935, 1757, -742, 417, 2006, 573, 328, 1378, -523, -498, 2197, 2083, -582, -941, 655, 40, 645, 1698, -418, -1234, 1980, 2057, -1582, -1211, 788, 441, 512, 453, -1201, -1078, 1615, 994, -1956, -521, 2174, 270, -1735, -813, -323, 637, 1200, -1255, -3236, 77, 3027, -964, -3229, -829, 1086, -162, -807, -2187, -2422, 958, 1684, -2266, -3308, 506, 939, -1508, -1914, -935, -545, -210, -760, -2675, -1392, 1789, -30, -3356, -1137, 1295, -334, -1211, -1271, -1488, -91, 1453, -1501, -3383, 78, 2135, -295, -989, -34, -503, 35, 1190, 60, -1630, 678, 1545, -431, -104, 1361, -24, -359, 1746, 1221, -172, 745, 1540, 149]
3298A49O29J348j306n68J429n76j570K512N93k529m67K015L00j041M15o94k78
3315C61K576m89l230M52K896j12k355M79K49M33J159j006k208J615K501k566j888
3332a133K190J199j345p13J66j43R21R47l112n07L322P99l519k12J637J35l13
3349C19L66j758k31K696q70k440J189J844j936p85J594J02j103J5lr03K191M10
3367F97l038n86L023M9j668J72K77l66O22O43j966N94J858j261j198J650R24k045
3385a619J69J386l81k42L78p34r00K797O4k706O85K419r36j217Q05o34n1J884
3403A167l4k446K94K048p78p10J708j029j097J321Q62j770j21J461j333K96K244
3420B083j319j843J262J241j773M64J310r24j066R65L81o78J242k19k193J053
$$ y = [149, 778, 2126, 820, 252, 1681, 1105, -465, 2047, 2640, 111, -356, 1659, 1959, 918, 1333, 639, 361, 2937, 2448, -782, -330, 2566, 2454, 99, 578, 827, 1260, 2419, 1413, -795, 820, 3321, 755, -1133, 1057, 2256, 911, 198, 364, 221, 1142, 2089, -1023, -1530, 1792, 2591, -928, -1140, 497, 632, 319, 685, -1073, -1304, 1392, 522, -1918, -729, 1115, -821, -1606, -12, 90, -1013, -998, -1001, -1904, 287, 697, -2341, -2927, 96, 145, -1523, -1351, -1074, -1440, -818, -175, -2141, -1547, 311, -950, -2148, -498, 426, -1619, -1450, -64, -445, -687, -309, -1043, -1943, 854, 918, -1788, -1103, 1316, 380, -837, -32, -666, -717, 1167, 1133, -1313, -1019, 1029, 251, -459, 1249, 220, -877, 444, 1306, -464, -585, 876, -457, -161, 2083, 764, -1079, 183, 1424, -349, 115, 1425, 501, -565, 400, 781, 103, 1345, 1126, -1067, -14]
3436a4K424j767j994J172J298n93J25m14j204K182J555k826j730K895R84j871
3452B22j032N08N22Q03O37k540J31K998o77l285L18K705j91j463k98o01J397K185
3470B339k335l072K550L004j322k656L16K14N08J195r83j885K215J405k405r12
3486a824J969K10j139q7m2n55J731K93k389M67K641o21j967M8O52j26R60L12k081
3505a548j45K601k43j843O46P75o89Q95M11k577J99K775m98j789M71L46j46R56
3523E97O77k167j30K272j033j903J614J181j313o17O77j65L82J492k180j232K318
3540D70J484k332j746J528J215N74j79j792j122L063J218l093p10K484N3j204
3556h9j32k60K78K241o83k528O34K277o16j984Q91Q28o2J09n17j015J708J357
$$ y = [-14, 2410, 643, -1351, -179, 1119, 526, 651, 237, -967, 1215, 2770, -56, -1786, 1109, 2093, 222, -810, -302, 220, 1023, 1660, -880, -749, 2249, 1572, -1713, -1395, 1310, 1119, -344, -642, -1243, 154, 2339, 4, -3068, -518, 2486, 1164, -1492, -1176, -962, -454, 741, -242, -2127, 88, 1493, -912, -1824, 145, 355, -784, -871, -913, -1468, 263, 556, -1833, -1366, 1275, 654, -1313, -1265, -613, -739, 221, 533, -1548, -1693, 908, 665, -1178, -532, 243, -446, 449, 860, -1717, -1518, 1257, 759, -1030, -559, -213, -359, 597, 1274, -893, -1023, 1249, 216, -1687, -73, 1108, -205, -822, -145, -310, 72, 1564, -616, -1848, 470, 1954, -378, -2124, -596, 619, 1193, 1014, -778, -1900, 1163, 2381, -712, -1422, 1062, 1115, -89, -221, -481, -203, 2038, 1355, -1173, -539, 1738, 1122, -862, 29, 857, 795, 904, 387, -628, 1080, 2437]
3574B437k232j417K487Q65j782j30K70m80N63J329j876p16K113L39j883P84M62
3591A133j498J02J371n57l96Q80p10j558J455J538j704o26J570r84j041J606p7
3608E04j033P25Q45j278k55J281j397r14K286M02k013k7J004o84J50J299j031
3625a36j65J333n03k230P92J769j256m66J077n78m81Q60J95r53R30P91k130m80
3643a631K048j91j719Q37M43l49P90J86j739J50J906p72j610J389O63j668O9J254
3661E6l14L36m4r73n10K364M01k904j03J938K13q40J18O9j70J626n49k299R63
3680f22K203j000j653J067Q19n71L03R0q72J324J175k654q58K143N31j570J29
3697a6Q24m10R50k11j560k23K573j99k521K20J342k08j44Q00j086r8J495n22j796
$$ y = [2437, 205, -1212, 1275, 2140, 358, 228, 498, 18, 581, 1910, 34, -682, 1431, 1770, -113, 671, 1133, -365, -263, 1108, 551, 155, 1035, 325, -1233, 222, 1760, 56, -570, 1000, 16, -1025, 581, 504, -529, 196, 1041, -237, -492, 789, -608, -1522, 764, 1166, -847, -874, 130, -554, -404, 895, -136, -301, 1032, 529, -1701, -909, 860, -396, -862, 215, -363, -844, 16, 211, -742, 188, 979, -1151, -1631, 417, 226, -1493, -656, -213, -562, 228, 414, -1325, -1175, 731, -41, -1651, -262, 401, -1267, -1198, 56, -258, 78, 34, -939, -1449, 915, 1316, -1588, -1691, 247, 460, -380, -262, -193, -363, 1263, 714, -1585, -622, 1581, 581, -1072, -5, 814, 243, 546, 636, -236, 1088, 2263, -391, -1249, 894, 1425, -145, -16, 808, 398, 1348, 1137, -423, -646, 1927, 1728, -793, -573, 769, 561, 417, 1217, 131, 33, 1528, 1006, -790]
3716g90Q89J269j913PJ312l22n47Q14l97j165J097J181j504p15J334r17l36J157
3734D54r9j758J276J358j231o30K96k22k80J820j540j474J398J455j593j169J795
3751a44L20q94L89p52r26J836P52k441K54K071l73j902L31O45L03N05n85j893
3769b504J072K656j278k874J442J819l58m90l06j066J271J687j755j497J936J041
3785G96j594n66J285k13q1O25j413j09K343k58k213J01K350o09r70L22J61j28
3803a71J298l75j836O25K054j049q85Q64M3m17O72J83j294K72J105p50k86J397
3821A450o60j500J311J046r20p55R69m08m25J158j22j169Q19M16j091K70J014
3838A403q44j168J419O41j173J57M7j57P07M65j660n49J722L95j574J70Q66o55
$$ y = [-790, 99, 1368, -545, -538, 774, 452, -95, 719, 322, -843, 254, 1435, -69, -784, 550, -367, -703, 454, 355, -1403, -127, 1231, 0, -630, -334, -556, -836, 984, -556, -2030, -632, 823, -770, -1939, -144, 176, -718, -329, -1081, -2007, -171, 581, -1860, -1606, 465, 92, -1810, -1479, -834, -531, -26, -611, -2504, -1432, 1224, -54, -2928, -1486, 333, -25, -515, -821, -1887, -616, 1071, -684, -2181, -245, 796, -798, -1364, -79, -292, -373, 252, -1161, -1270, 1073, 815, -1398, -1297, 1053, 444, -526, -204, -43, -171, 1127, 752, -1084, -459, 1595, 546, -339, 525, 568, 151, 823, 1006, -288, -16, 1089, 339, 53, 1450, 790, -710, 601, 1647, 727, -28, 941, 533, 108, 1266, 1144, -25, 794, 1210, 119, 389, 1403, 559, -609, 810, 1451, 278, 435, 482, 325, 1032, 1497, -163, -712, 1010, 1405, -169, 1, 867, 212]
3856B12J85O90j463k35J661j24j715O51J165j010o87R38J18l76O85q85j192J420
3874C8J082j415j385J695P44j238M02m80n62J246P09j744j37J859o23j892J227
3891d74P67n82q0L88r63R63Q52j427j342J694R95j541j75P20n0O0M11q03o04J764
3911E73L0j871K3J577q84j42O89J3q04P69O0j210O08J225j114r79J203K36n11
3930e09M01O7j073Q57R75j099r61J307J59l42N81L81j472O77J105q35n69J258
3948I08r6o18O53J58k074J112J702j199n81R47P13j389N16L12r71N47J039j102
3966E77q52J971m05j580M38J143j68k46j52j131L87J773o52k114R77J551m95j214
3984a92J92o4Q5J049r13j168J339J125j651j024J308Q46r01r4j64o82J455N42
$$ y = [212, 397, 1087, -376, -611, 1050, 926, -789, -138, 1027, 17, -670, 268, 386, 10, 695, -190, -1382, 38, 1120, -295, -1680, 15, 759, -479, -77, -557, -1119, 127, 836, -908, -1045, 814, 191, -1701, -474, 293, -289, -369, 19, -944, 19, 871, -556, -1898, -204, 791, -750, -925, -205, -255, -195, 216, -587, -1191, 573, 603, -1268, -1245, 332, -552, -694, -5, 8, -796, -27, 33, -1177, -569, 656, -458, -1437, -234, 2, -509, -108, -41, -1114, -257, 718, -381, -1342, -35, 124, -218, 363, 744, -728, -51, 1054, 219, -350, 908, 812, 194, 847, 1005, -1069, 43, 1745, 546, -35, 912, 1625, 236, 752, 1064, 93, 640, 1679, 577, -275, 1696, 1291, -289, 149, 1292, 1124, 878, 726, -405, -18, 1755, 1103, -1011, -34, 1517, 1022, -192, 0, -64, 21, 1070, 157, -1011, 328, 1453, -198, -1222, 86, 932, 31, -63, -227, -909, 546, 1088]
4002A088k386J78K078l35j554J20L40l6N65j90j122N01J731j322j492J113P22
4019ap05j3J70m89K08Q14q95q17J412L29j492o3J003l64n24Q28j52r13J423K32
4039ij392N4O71q83J17J462p62q60O79R55j261K06N99j93m23J260q57r21J196
4058c62Q54j197K48Q95j57o79L70J11n62J307K24j623N15J564o34j454Q60P51
4076A031l11O05p02j078J247J288j330q75J398K66n80j02L00o41N83L16j063m97
4094a45J981k02j311P2J203j54n54K03l24k56R85o33j628J475J385j524n29R07
4112I51o8l62K51k70j121J534N03j704k86J356j21q39P51j22k53J68O0j326J39
4131g59J994p87j286P70N46j076K17O36p69K22M09o13q17J313J25j354M71Q60
$$ y = [1088, -1298, -1120, 958, 623, -931, -811, -471, -507, 58, -132, -1254, -753, 978, -344, -1836, -723, -1, -706, -719, -549, -1038, -830, -16, -911, -1728, -316, 13, -1479, -1542, -539, -903, -1427, -599, -751, -1664, -241, -9, -1401, -1347, -676, -1559, -1442, 20, -742, -1602, -923, 32, -1229, -1023, -424, -617, -1040, 220, -637, -1558, -362, 492, -705, -457, 438, 281, -398, -28, 83, -479, 828, 1052, -571, -56, 1508, 874, -580, 280, 1031, 720, 1325, 623, -455, 792, 2080, 750, -125, 1273, 1539, 959, 857, 1157, 516, 1099, 1415, 352, -145, 1836, 1634, 323, 395, 1598, 1444, 890, 1093, 769, 513, 1498, 865, -763, 712, 2097, 573, 44, 951, 883, 521, 772, 502, -619, 915, 1418, -286, -572, 784, 663, -176, 575, 453, 200, 368, 428, -898, -759, 1235, 448, -838, -68, 478, -598, -381, 255, -514, -292, 117, -496, -1313, 0, 125, -1229, -758, 102]
4149A02p14r70J273j57r75P15M60j172L13O73n05k45R68m12j158J197N58j072
4167a121k49Q17m55k3R81q44p66J522M00j296m56J280L9l07M77j007j34J486J90
4186E34j596L11J778n04j391P31P49o20L60l62q13J089J397j412j396J633J000
4203A488r52k04k21j0Q58M66j960m98K316M12j655k27P48J21J17Q4r72n2J818
4222A677n32k021J047J522j195m64O32l42K03N69m42j090J003R55j358m70J189
4239H83j95r46R21k21p10O74N01j061k30J096n66o80R83O9j101J047L34j011p17
4258i30J254k04p83O46J46j057J011J104j870p52J608pp33K86O8o84Q05L88j296
4277a000j43J880l26j415K58O78q50K47N65r31K93J067o09j277J254N71p07k10
$$ y = [102, -612, -1582, -309, -466, -1441, -726, -266, -1438, -1125, -452, -957, -1202, -234, -646, -1804, -607, -49, -1121, -1370, -553, -1008, -1031, -50, -894, -1660, -138, 262, -1034, -1490, -210, -171, -478, -1, -1008, -1142, 344, 534, -1062, -751, 1027, 523, -868, -137, 612, -8, 352, -10, -823, 266, 1663, 251, -1145, 488, 1488, 536, 332, 111, 101, 959, 1425, -535, -1033, 1283, 1695, 40, -187, 561, 682, 799, 883, -89, -141, 1677, 1145, -876, 171, 1693, 498, 34, 666, 324, 527, 1096, 654, -436, 567, 1522, 164, -306, 883, 688, -258, 663, 442, -268, 406, 907, -154, -384, 712, 146, -534, 449, 518, -583, 464, 798, -213, -930, 324, 120, -663, -17, 129, -928, 83, 1187, -683, -1435, 173, 166, -567, -281, -213, -897, -92, 296, -1000, -1143, 737, 411, -1004, -746, -68, -918, -671, -106, -1037, -744, 323, -286, -1563, -309, 262, -445, -655]
4295f55K06k09L12M55p55n94J674L69k059L29J172k97m32L99l44p11J697j55j697
4314a295N49J709j084o71Q45L84p58Q27q0j229R75Q27j171l73J494m1q61K32K46
4333E25m16K71O44r50q4J177o30q86O94J149j128j19Q62p81l87J105j86j258J405
4352A007M68j223k0R34m19p75Q62j76p26Q35K43j145L50P97o80n88R92O8j068
4371b64J1J145j193N10N98p76j48Q20j2j186M06P14j144L9J260k88j109O35Mo94
4391f72P19N80j600K87J369n20j326K83R53l91K48N1j351N72J438p70j327J088
4409c69P50r43p11P76l8K49L99j028l93J376L12j592M0J362j87p31L32n65L4J541
4429F14m55j945Q29J509j90j277M07M13j17M46m90j100R13J661j275p62J012N82
$$ y = [-655, -449, -658, -346, 109, -646, -1240, 434, 803, -1256, -927, 245, -52, -484, -85, -429, -1140, 557, 402, -1295, -746, 963, -121, -792, 53, 437, -321, 506, 426, -803, 172, 999, -172, -545, 949, 908, 47, 279, 525, 109, 380, 1024, 74, -10, 1167, 537, -349, 345, 1494, 366, 247, 1109, 328, -59, 1046, 860, -398, 1007, 1475, 252, 232, 1166, 747, -28, 834, 658, -68, 767, 1010, -135, 215, 1012, 332, -256, 736, 804, -264, -253, 892, -301, 209, 807, 31, -117, 703, 691, -495, -89, 625, -519, -480, 780, 492, -617, 18, 22, -672, 47, 627, -973, -686, 683, 163, -1163, -880, 73, -318, -70, -19, -1370, -798, 640, -130, -1457, -369, 381, -562, -1273, -497, -535, -286, 113, -915, -1308, 68, 380, -1212, -1172, 190, 3, -728, -396, -961, -927, 614, 159, -1786, -957, 552, 362, -915, -508, -95, -212, 234, -256, -1356, -443, 1218, -57, -819, 193, 775]
4447G75q01PL47n73K33J084j482k45J533L19j157J60N44l47j84O34n58o45J352
4466I96j98j111N44N40m69Q2M97n85q63J322J65j316N58P38p16K96q0n05l42J273
4486H26q7j025n1J040n21j53L18n44m9J162j34j751L78J613p79j112J328j3l11
4505A35N16n80j014J166J141j715q76J676M32j156J68j81k94J137Kj507J04J577
4523G31k17j391P73N13m53j17L35q53K44R43n93j014J111N38q31l03L74m09K43
4542c76O91p56o19J021M36j078L53L62n53l16J237o37l50L52M57r13N76Q25j332
4561f20J49J135l62l67q5M34n47J57P47r81L65O70q6j238Q08P90j039k52J254
4580I32m68l95L70j50o90J199K90j232j88J399n24p73O13K9o22P46N4j211M79
$$ y = [775, -26, -19, 328, -245, -12, 1072, -410, -655, 878, 1197, 40, 200, 744, 397, 213, 847, 289, -356, 996, 798, -313, 231, 771, 302, 384, 881, 296, -567, 755, 920, -396, 162, 900, 184, 480, 400, -105, -447, 826, 739, -286, -337, 703, 182, 29, 347, -197, -246, 916, 782, -969, -591, 1022, 243, -869, 459, 446, 135, 651, 71, -943, 223, 1364, -351, -1227, 449, 881, -275, -107, -288, -582, 555, 557, -950, -846, 731, 514, -877, -104, 409, -44, -161, 174, -679, -435, 508, -85, -1099, 12, 550, -281, -584, -210, -619, -376, 315, -441, -1060, -39, 397, -681, -328, 34, -519, -835, 402, -235, -585, -233, 224, -689, -113, 712, -620, -471, 664, 302, -65, -150, 284, -263, -106, 641, -340, 25, 695, 609, -629, 179, 969, -70, -322, 932, 464, 69, 439, 289, -401, 798, 1088, -144, -332, 1067, 543, -230, 383, 412, -210, 536, 590, -621, -142]
$$ [...]
8191c7
##END NTUPLES=NMR FID
##END=
