##TITLE=1H_TG-2290-1
 CDCl3, 8 sc, 
 3.7.2020
##JCAMPDX= 6.0         $$ Bruker NMR JCAMP-DX V2.0
##DATA TYPE= NMR FID
##DATA CLASS= NTUPLES
##ORIGIN= UXNMR, Bruker Analytische Messtechnik GmbH
##OWNER= root
$$ XWIN-NMR		Version 3.5
$$ Mon Aug  3 10:58:58 2020 Russian Standard Time (UT+4h)  she@DPX200
##.OBSERVE FREQUENCY= 200.1314999998
##.OBSERVE NUCLEUS= ^1H
##.DELAY= (6, 6)
##.ACQUISITION MODE= SIMULTANEOUS
##.ACQUISITION SCHEME= undefined
##.AVERAGES= 8
##.DIGITISER RES= 18
##SPECTROMETER/DATA SYSTEM= spect
##.PULSE SEQUENCE= zg30
##.SOLVENT NAME= D2O
##.SHIFT REFERENCE= (INTERNAL, D2O, 0, 15.7039)
##AUDIT TRAIL= $$ (NUMBER, WHEN, WHO, WHERE, WHAT)
$$ ##TITLE= Audit trail, XWIN-NMR		Version 3.5
$$ ##JCAMPDX= 5.01
$$ ##ORIGIN= Bruker BioSpin GmbH
$$ ##OWNER= she
$$ F:/spectra/data/she/nmr/H-F/1/audita.txt
$$ ##AUDIT TRAIL=  $$ (NUMBER, WHEN, WHO, WHERE, WHAT)
(   1,<2020-08-03 10:57:32.62 +0400>,<she>,<DPX200>,
      <created by zg, POWCHK disabled, PULCHK disabled
       configuration hash MD5:
       00 E9 B6 7A A2 85 ED C7 34 08 36 98 17 FE 4E 26
       data hash MD5: 16K
       A1 26 8F A6 C6 52 0B 79 D4 9D A7 FE 78 48 77 82>)
$$ ##END=
$$ 
$$ hash MD5
$$ A1 1B A9 3E D6 21 3E FA BB 09 7C FA 68 B1 56 F0
##$RELAX= 
##$RELAX= 
##$RELAX= 
##$RELAX= 
##$RELAX= 
##$RELAX= 
$$ Bruker specific parameters
$$ --------------------------
##$DU= <F:/spectra>
##$EXPNO= 1
##$NAME= <H-F>
##$PROCNO= 1
##$TYPE= <nmr>
##$USER= <she>
##$AMP= (0..31)
100 100 100 100 100 100 100 100 100 100 100 100 100 100 100 100 100 100 
100 100 100 100 100 100 100 100 100 100 100 100 100 100 
##$AQSEQ= 0
##$AQ_mod= 1
##$AUNM= <au_zg>
##$AUTOPOS= <>
##$BF1= 200.13
##$BF2= 200.13
##$BF3= 200.13
##$BF4= 200.13
##$BF5= 200.13
##$BF6= 200.13
##$BF7= 200.13
##$BF8= 200.13
##$BYTORDA= 1
##$CFDGTYP= 0
##$CFRGTYP= 5
##$CHEMSTR= <none>
##$CNST= (0..31)
1 1 145 1 1 1 1 1 1 1 1 1 1 1 1 1 1 1 1 1 1 1 1 1 1 1 1 1 1 1 1 1 
##$CPDPRG= <>
##$CPDPRG1= <>
##$CPDPRG2= <>
##$CPDPRG3= <>
##$CPDPRG4= <mlev>
##$CPDPRG5= <mlev>
##$CPDPRG6= <mlev>
##$CPDPRG7= <mlev>
##$CPDPRG8= <mlev>
##$CPDPRGB= <>
##$CPDPRGT= <>
##$D= (0..31)
0 1.2 0 0 0 0 0 0 0 0.06 0 0.03 0 0 0 0 0.0002 0 0 0 0 0 0 0 0 0 0 0 0 
0 0 0 
##$DATE= 1596437852
##$DBL= (0..7)
120 120 120 120 120 120 120 120 
##$DBP= (0..7)
150 150 150 150 150 150 150 150 
##$DBP07= 0
##$DBPNAM0= <>
##$DBPNAM1= <>
##$DBPNAM2= <>
##$DBPNAM3= <>
##$DBPNAM4= <>
##$DBPNAM5= <>
##$DBPNAM6= <>
##$DBPNAM7= <>
##$DBPOAL= (0..7)
0.5 0.5 0.5 0.5 0.5 0.5 0.5 0.5 
##$DBPOFFS= (0..7)
0 0 0 0 0 0 0 0 
##$DE= 6
##$DECBNUC= <off>
##$DECIM= 24
##$DECNUC= <off>
##$DECSTAT= 4
##$DIGMOD= 1
##$DIGTYP= 9
##$DL= (0..7)
0 120 120 120 120 120 120 120 
##$DP= (0..7)
150 150 150 150 150 150 150 150 
##$DP07= 0
##$DPNAME0= <>
##$DPNAME1= <>
##$DPNAME2= <>
##$DPNAME3= <>
##$DPNAME4= <>
##$DPNAME5= <>
##$DPNAME6= <>
##$DPNAME7= <>
##$DPOAL= (0..7)
0.5 0.5 0.5 0.5 0.5 0.5 0.5 0.5 
##$DPOFFS= (0..7)
0 0 0 0 0 0 0 0 
##$DQDMODE= 0
##$DR= 18
##$DS= 0
##$DSLIST= <SSSSSSSSSSSSSSS>
$$ [...]
##$SUBNAM2= <"">
##$SUBNAM3= <"">
##$SUBNAM4= <"">
##$SUBNAM5= <"">
##$SUBNAM6= <"">
##$SUBNAM7= <"">
##$SUBNAM8= <"">
##$SUBNAM9= <"">
##$SW= 24.9337058888022
##$SWIBOX= (0..15)
0 0 2 0 0 0 0 0 0 0 0 0 0 0 0 0 
##$SW_h= 4990.01996007984
##$TD= 16384
##$TD0= 1
##$TE= 0
##$TE2= 300
##$TE3= 300
##$TEG= 300
##$TL= (0..7)
0 120 120 120 120 120 120 120 
##$TP= (0..7)
150 150 150 150 150 150 150 150 
##$TP07= 0
##$TPNAME0= <>
##$TPNAME1= <>
##$TPNAME2= <>
##$TPNAME3= <>
##$TPNAME4= <>
##$TPNAME5= <>
##$TPNAME6= <>
##$TPNAME7= <>
##$TPOAL= (0..7)
0.5 0.5 0.5 0.5 0.5 0.5 0.5 0.5 
##$TPOFFS= (0..7)
0 0 0 0 0 0 0 0 
##$TUNHIN= 0
##$TUNHOUT= 0
##$TUNXOUT= 0
##$USERA1= <user>
##$USERA2= <user>
##$USERA3= <user>
##$USERA4= <user>
##$USERA5= <user>
##$V9= 5
##$VALIST= <valist>
##$VCLIST= <CCCCCCCCCCCCCCC>
##$VD= 0
##$VDLIST= <DDDDDDDDDDDDDDD>
##$VPLIST= <PPPPPPPPPPPPPPP>
##$VTLIST= <TTTTTTTTTTTTTTT>
##$WBST= 1024
##$WBSW= 4
##$XGAIN= (0..3)
0 0 0 0 
##$XL= 0
##$YL= 0
##$YMAX_a= 671231
##$YMIN_a= -308654
##$ZGOPTNS= <>
##$ZL1= 120
##$ZL2= 120
##$ZL3= 120
##$ZL4= 120
##$ABSF1= 10
##$ABSF2= 0
##$ABSG= 5
##$ABSL= 3
##$ALPHA= 0
##$AQORDER= 0
##$ASSFAC= 0
##$ASSFACI= 0
##$ASSFACX= 0
##$ASSWID= 0
##$AUNMP= <proc_1d>
##$AZFE= 0.1
##$AZFW= 0.1
##$BCFW= 1
##$BC_mod= 2
##$BYTORDP= 1
##$COROFFS= 0
##$CY= 11.3945322036743
##$DATMOD= 1
##$DC= 2
##$DFILT= <>
##$DTYPP= 0
##$F1P= 16.9975609425685
##$F2P= -3.02152046262296
##$FCOR= 0.5
##$FTSIZE= 0
##$FT_mod= 4
##$GAMMA= 1
##$GB= 0.15
##$INTBC= 1
##$INTSCL= 1
##$ISEN= 128
##$LB= 0.24
##$LEV0= 0
##$LPBIN= 0
##$MAXI= 10000
##$MC2= 0
##$MEAN= 0
##$ME_mod= 0
##$MI= 1.114404
##$NCOEF= 0
##$NC_proc= 0
##$NLEV= 6
##$NOISF1= 3.799351
##$NOISF2= 2.8
##$NSP= 1
##$NTH_PI= 0
##$NZP= 0
##$OFFSET= 15.70392
##$PC= 1
##$PHC0= -9795.913
##$PHC1= 16.40092
##$PH_mod= 1
##$PKNL= yes
##$PPARMOD= 0
##$PSCAL= 0
##$PSIGN= 0
##$REVERSE= no
##$SF= 200.130013532006
##$SI= 16384
##$SIGF1= 3
##$SIGF2= 2
##$SINO= 400
##$SIOLD= 16384
##$SREGLST= <1H.CDCl3>
##$SSB= 0
##$STSI= 0
##$STSR= 0
##$SW_p= 3612.71676300578
##$SYMM= 0
##$S_DEV= 0
##$TDeff= 0
##$TDoff= 0
##$TI= <>
##$TILT= no
##$TM1= 0
##$TM2= 0
##$TOPLEV= 0
##$USERP1= <user>
##$USERP2= <user>
##$USERP3= <user>
##$USERP4= <user>
##$USERP5= <user>
##$WDW= 1
##$XDIM= 8192
##$YMAX_p= 0
##$YMIN_p= 0
$$ End of Bruker specific parameters
$$ ---------------------------------
##NTUPLES= NMR FID
##VAR_NAME=  TIME,          FID/REAL,        FID/IMAG
##SYMBOL=    X,             R,               I
##VAR_TYPE=  INDEPENDENT,   DEPENDENT,       DEPENDENT
##VAR_FORM=  AFFN,          ASDF,            ASDF
##VAR_DIM=   8192,          8192,            8192
##UNITS=     SECONDS,       ARBITRARY UNITS, ARBITRARY UNITS
##FACTOR=    0.0002004,     1,               1
##FIRST=     0,             0,               0
##LAST=      1.6414764,     0,               0
##MIN=       0,             -308654,         0
##MAX=       1.6414764,     671231,          0
$$ Real data points
##PAGE= N=1
##DATA TABLE= (X++(R..R)), XYDATA
$$ [...]
$$ plain form
2452 2950 1322 -887 1797 4709 1441 -1302 1044 1517 -1102 -593 241 -134 2147 2753 -842 -1557
2468 -1557 3100 3128 -1517 -2324 -759 -514 509 710 -2581 -1943 3210 3030 -1698 -1509 612 -243 -546
2485 -546 -940 -3799 -2493 2051 1429 -2979 -2266 1538 1734 560 -853 -3226 -2973 1465 32 -4186
2501 -4186 -2392 1799 245 -1467 -269 -961 -264 2068 -860 -4861 -2049 1604 -928 -3189 -1100
2516 -1100 519 1327 1954 -1220 -4549 -366 3182 -837 -3874 -1684 -464 -574 -93 -712 -1200 1854
2532 1854 3250 -2030 -3885 129 1234 -1156 -1076 -998 -976 1547 1956 -1957 -1833 3350 2811 -1375 -2385
2549 -2385 -943 -643 862 919 -1924 -623 3448 2335 -2309 -1061 1972 1444 550 -942 -3565 -1595
2565 -1595 3544 2112 -2747 -820 2709 1639 394 163 -1303 -257 2679 -217 -4035 -698 2910
$$ packed form
2452B950j628k209K684K912l268k743K346M73k619N09Q34l75K281O06l595p15
2468a557M657K8m645q07J565K45J023K01l291O38N153j80m728J89K121q55l03
2485e46l94k859J306M544o22m408P13L804J96j174j413k373K53M438j433m218
2501d186J794M191j554j712J198o92O97K332k928m001K812L653k532k261K089
2516a100J619Q08O27l174l329M183L548m019l037K190J220j10M81o19m88L054
2532A854J396n280j855M014J105k390Q0P8K2K523M09l913J24N183n39m186j010
2549b385J442L00J505N7k843J301M071j113m644J248L033n28q94j492k623J970
2565a595N139j432m859J927L529j070j245k31j466J046K936k896l818L337L608
$$ plain form
2580 2910 887 -161 831 336 490 1400 -1319 -2889 1036 3161 -1450 -3515 -625 987 1625 2033
2596 2033 -465 -2145 872 1777 -3073 -3424 1064 2015 -53 -815 -2424 -1826 2291 3362 -1516 -2703
2612 -2703 955 55 -3245 -2553 -709 -172 1554 872 -3145 -2218 2086 770 -2518 -1199 -220 -1715
2628 -1715 -1637 -1690 -2988 -306 3166 239 -3434 -1418 753 -957 -1411 -1312 -2845 -1906 651 -1410 -3697
2645 -3697 342 2933 -277 -1782 -1832 -2234 -783 1114 -1141 -3977 -944 1379 -1200 -1328 1057 184
2661 184 334 780 -2236 -4256 -682 1644 -1125 -1296 894 -234 -756 712 29 -408 2394 1671 -2765
2678 -2765 -2866 445 1063 199 1542 794 -82 1640 1546 -1624 -454 3284 1342 -1455 -452 104 723
2695 723 2916 2416 -648 753 3657 1403 -1502 366 1514 789 1928 1135 -1339 897 4501 2878
$$ packed form
2580B910k023j048R92m95J54R10k719j570L925K125m611k065K890J612O38M08
2596B033k498j680L017R05m850l51M488R51k068p62j609N98M117J071m878j187
2612b703L658r00l300O92J844N37J726o82m017R27M304j316l288J319R79j495
2628a715P8n3j298K682L472k927l673K016K171j710m54R9j533R39K557k061k287
2645c697M039K591l210j505n0m02J451J897k255k836L033K323k579j28K385q73
2661A84J50M46l016k020L574K326k769j71K190j128n22J468o83m37K802p23m436
2678b765j01L311O18q64J343p48q76J722r4l170J170L738j942k797J003N56O19
2695G23K193n00l064J401K904k254k905J868J148p25J139p93k474K236L604j623
$$ plain form
2711 2878 386 1247 1997 377 1025 1527 -86 1050 3592 895 -877 2000 3664 1580 1252 1289 -509
2728 -509 274 2418 168 -958 2290 3499 187 -625 1232 914 1832 2608 -570 -2547 917 2059
2744 2059 -1108 -892 1827 1385 1186 1085 -1296 -1916 1985 2200 -2127 -2287 138 -283 -625 245 -786
2761 -786 -761 1766 719 -3378 -2567 1654 70 -1955 -1046 -1249 -1756 723 -122 -3063 -768 2477 -398
2778 -398 -3778 -1889 -711 -936 289 -1488 -3816 -1575 2164 -640 -2672 -829 387 -907 -1009 -1696
2794 -1696 -3360 -645 1933 -938 -3005 -148 1025 -1177 -835 235 -550 103 329 -2544 -2888 1745
2810 1745 2718 -1217 -1496 529 723 1560 1401 -1395 -1767 2835 2271 -1989 -1289 1745 1854 1808 1965 -102
2828 -102 11 3223 2358 -1253 287 2953 2113 361 991 912 2027 4212 2641 -1221 1086 3863 1294
$$ packed form
2711B878k492Q61P50j620O48N02j613J136K542k697j772K877J664k084l28L7j798
2728e09P83K144k250j126L248J209l312q12J857l18R18P76l178j977L464J142
2744B059l167K16K719m42j99j01k381o20L901K15m327j60K425m21l42Q70j031
2761g86K5K527j047m097Q11M221j584k025R09k03n07K479q45k941K295L245k875
2778c98l380J889J178k25J225j777k328K241L739k804k032J843J216j294j02o87
2794a696j664K715K578k871k067K857J173k202L42J070p85O53K26k873l44M633
2810A745R73l935k79K025J94Q37j59k796l72M602n64m260P00L034J09m6J57k067
2828a02J13L212q65l611J540K666q40j752O30p9J115K185j571l862K307K777k569
$$ plain form
2845 1294 -267 1463 2224 2392 2794 1542 -315 2558 5428 1585 -259 1473 2065 1142 1326 945 0
2862 0 2743 4081 481 -915 2279 3126 984 561 499 -683 1339 2371 -675 -815 2680 1928 -591
2879 -591 -102 884 -21 286 615 -1879 -1579 1925 801 -2440 -863 1582 469 -265 -456 -1943 -1650
2896 -1650 1083 -540 -3621 -1594 1013 -746 -1300 -352 -1546 -841 843 -875 -3693 -1752 551 -1379
2912 -1379 -1909 -705 -1134 -724 1218 -403 -2883 -581 1073 -1352 -2134 -378 -946 -1304 647 342 -1461
2929 -1461 784 1373 -1101 -1369 881 460 -550 539 -388 -1352 1548 2737 -261 -1159 1800 1847 724
2946 724 908 266 -589 1561 2870 -56 -536 2416 2384 722 2013 2231 578 1777 2294 -442 12
2963 12 3438 2050 -201 1046 2184 1730 2029 1940 -157 333 3170 1665 -1645 479 2244 1575 1331
$$ packed form
2845A294j561J730P61J68M02j252j857K873K870l843j844J732N92r23J84l81r45
2862@K743J338l600j396L194Q47k142m23o2j182K022J032l046j40L495p52k519
2879e91M89R86r05L07L29k494L00L504j124l241J577K445j113p34j91j487K93
2896a650K733j623l081K027K607j759n54R48j194P05J684j718k818J941K303j930
2912a379n30J204m29M10J942j621k480K302J654k425p82J756n68l58J951l05j803
2929a461K245N89k474k68K250m21j010J089r27r64K900J189k998q98K959M7j123
2946G24J84o42q55K150J309k926m80K952l2j662J291K18j653J199N17k736M54
2963A2L426j388k251J247J138m54K99q9k097M90K837j505l310K124J765o69k44
$$ plain form
2980 1331 1820 -591 171 2680 1158 -1834 129 2191 -150 -747 -207 -688 517 2200 22 -2238
2996 -2238 -295 1636 -956 -1728 -733 -1401 -495 997 -1370 -2754 111 1517 -1422 -2111 -788 -925
3012 -925 -1428 -1504 -2766 -3062 71 848 -2375 -2339 142 -432 -1833 -1992 -2658 -2498 -571 -611 -3624 -2835 515
3031 515 -179 -2451 -1595 -805 -1227 -538 -1312 -4000 -2586 663 -691 -3231 -1040 520 -624 -772 -1204
3048 -1204 -2557 -1210 1321 -1270 -3258 -819 894 -687 -810 -134 -228 973 1933 -1120 -3275 46
3064 46 1911 -547 -1222 292 160 1214 1981 -339 -1617 1428 2132 -414 -975 333 -225 387 1671
3081 1671 391 -20 2570 2702 -685 -767 1236 724 69 734 77 -191 2011 1756 -1348 -399 2943 1985
3099 1985 -229 -140 -772 -676 979 996 -1300 200 2745 741 -1033 403 862 -146 646 -406 -1994
$$ packed form
2980A331M89k411P62K509j522k992J963K062k341n97N40m81J205J683k178k260
2996b238J943J931k592p72R95o68R06J492k367j384K865J406k939o89J323j37
3012i25n03p6j262k96L133P77l223L6K481n74j401j59o66J60J927m0l013P89L350
3031E15o94k272Q56P90m22O89p74k688J414L249j354k540K191J560j144j48m32
3048a204j353J347K531k591j988K439J713j581j23O76r4J201R60l053k155L321
3064D6J865k458o75J514j32J054P67k320j278L045P04k546n61J308n58O12J284
3081A671j280m11K590J32l387q2K003n12o55O65o57k68K202k55l104R49L342r58
3099A985k214Q9o32R6J655J7k296J500K545k004j774J436M59j008P92j052j588
$$ plain form
3116 -1994 249 2397 -538 -2278 353 1787 814 61 -459 -1696 120 1392 -1509 -3084 291 2004
3132 2004 89 -250 -474 -1615 89 1173 -1240 -2228 108 705 -2026 -1497 -385 -966 297 1198 -665
3149 -665 -1730 -12 -376 -2378 -1155 730 -449 -991 -107 -1518 -1472 1394 974 -1860 -959 1152 -478
3166 -478 -1391 -778 -1133 -224 2381 1199 -2023 -1089 1352 533 -401 87 -492 -655 970 332 -1897 -133
3184 -133 2375 786 -677 692 808 148 729 58 -1337 780 2681 64 -1134 1407 1643 818 1145
3201 1145 329 -703 1278 2434 -33 -1241 1169 1696 683 927 1731 734 1679 2132 -768 -1099 1713
3218 1713 2232 140 470 1141 245 657 1764 296 177 2678 1790 -821 -232 938 405 906 1021 -330
3236 -330 387 2881 1290 -1664 -520 1776 1294 113 -432 -1563 -508 2469 1190 -1749 -138 1827
$$ packed form
3116a994K243K148k935j740K631J434r73p53n20j237J816J272k901j575L375J713
3132B004j915l39k24j141J704J084k413r88K336N97k731N29J112n81J263R01j863
3149f65j065J718l64k002J223J885j179n42Q84j411M6K866m20k834R01K111j630
3166d78r13O13l55R09K605j182l222R34K441q19r34M88n79j63J625o38k229J764
3184a33K508j589j463J369J16o60N81o71j395K117J901k617j198K541K36q25L27
3201A145q16j032J981J156k467j208K410N27j013K44Q04r97R45M53k900l31K812
3218A713N19k092L30O71q96M12J107j468j19K501q88k611N89J170n33N01J15j351
3236c30P17K494j591k954J144K296m82j181n45j131J055K977j279k939J611J965
$$ plain form
3252 1827 670 -715 -449 -1075 -517 1166 -66 -2127 -75 1836 -473 -1404 -157 149 -309 80 -898
3269 -898 -2280 -66 778 -1796 -2262 1141 839 -991 -791 -1339 -1308 373 -7 -2711 -2302 1322 1011 -1689
3287 -1689 -1715 -1127 -21 1240 624 -3093 -2525 888 466 -1755 -1470 -426 -313 465 458 -2350 -1419 1052
3305 1052 200 -1933 -567 108 -854 -522 44 -1153 -383 1773 -168 -2681 -529 902 -734 -1140 -434
3322 -434 -225 236 1137 -862 -2183 933 2277 -433 -1937 -76 540 318 546 -1263 -2097 1118 2280
3339 2280 -445 -1293 797 805 -123 417 -570 -748 1149 1517 -1623 -1089 1641 1521 -644 -339 -43 -259
3357 -259 1258 481 -1944 -1157 1830 986 -1010 -346 226 222 1148 322 -1304 -394 1577 159 -1465 -42
3375 -42 1119 92 373 508 -769 147 1912 -86 -1554 342 1057 -744 -331 417 -569 533 1534
$$ packed form
3252A827j157j385K66o26N58J683j232k061K052J911k309r31J247L06m58L89r78
3269h98j382K214Q44k574m66L403l02j830K00n48L1J681l80k704M09L624l11k700
3287a689k6N88J106J261o16l717N68L413m22k221K85J044J13P78pk808R31K471
3305A052q52k133J366O75r62L32N66j197P70K156j941k513K152J431j636m06P06
3322d34K09M61R01j999j321L116J344k710j504J861O16k22K28j809q34L215J162
3339B280k725q48K090Qr28N40r87j78J897L68l140N34K730j20k165L05K96k16
3357b59J517p77k425P87K987q44j996O64N72mR26q26j626R10J971j418j624J423
3375d2J161j027K81J35j277R16J765j998j468J896P15j801M13P48r86J102J001
$$ plain form
3392 1534 -498 -1312 1263 1367 -1305 -1620 -282 341 727 856 -1245 -1832 1280 2215 -701 -1518 292
3409 292 301 -245 30 -1757 -1725 911 1403 -963 -1306 523 -41 -299 -195 -875 -974 812 493 -1612 -1439
3428 -1439 615 107 -810 284 49 -1363 -600 -684 -1513 -327 1127 -867 -1848 -153 448 -288 -32 -660
3446 -660 -1792 -66 1494 -984 -2946 -1176 295 285 360 -368 -2268 -517 1304 -328 -1800 -373
3462 -373 39 -638 102 207 -708 -21 991 -633 -1210 992 1439 -473 -821 -695 -790 437 1336 100
3480 100 -471 1655 924 -901 -371 1240 557 560 809 -615 -537 1464 1361 -852 173 2264 1806 157
3498 157 -184 -1023 -249 2305 2034 -544 172 1486 598 137 1102 1145 930 1564 456 -1253 -33 2124
3516 2124 669 -401 890 1509 866 1305 -30 -1496 729 2563 426 -1372 -100 615 481 800
$$ packed form
3392A534k032q14K575J04k672l15J338O23L86J29k101n87L112R35k916q17J810
3409B92Rn46K75j787L2K636M92k366l43J829n64k58J04o80r9J786l19k105J73
3428a439K054n08r17J094k35j412P63q4q29J186J454j994r81J695O01p36K56o28
3446f60j132J726J560k478j962J770J471j0P5p28j900J751J821j632j472J427
3462c73M12o77P40J05r15O87J012j624n77K202M47j912l48J26r5J227Q99j236
3480A00n71K126p31j825N30J611o83LK49j424P8K001j03k213J025K091m58j649
3498A57l41q39P74K554k71k578P16J314q88m61R65M3k15O34j108j709J220K157
3516B124j455j070J291O19o43M39j335j466K225J834k137j798J272P15j34L19
$$ plain form
3532 800 -17 -763 660 1107 -865 -1639 752 942 -1053 -1454 -676 -325 967 1010 -1759 -2396 428 654
3550 654 -1360 -808 81 -911 -739 -636 -2070 -592 1451 389 -2074 -1719 -108 -872 -1399 -1042 -1323 -65
3568 -65 1690 -511 -3293 -1922 670 241 -169 -433 -1456 -1161 160 -924 -1978 430 1562 -155
3584 -155 -1296 -492 35 68 543 -638 -1597 666 1428 -502 -1039 623 700 472 1029 303 -362 1059 1015
3603 1015 -603 -601 1985 1285 259 381 798 669 2029 1659 -837 -178 2373 2128 171 192 190 731 2040
3622 2040 2244 719 883 2067 928 -504 375 1715 900 1232 1264 -116 420 2068 1144 -709 1162
3639 1162 2001 909 -47 73 -946 322 1767 976 -49 594 936 -673 -514 439 504 455 718 -784
3657 -784 -1691 225 1497 -525 -672 478 -144 -371 412 -1061 -1756 21 607 -966 -853 433 -419
$$ packed form
3532H00q17p46J423M47j972p74K391J90j995m01P78L51J292M3k769o37K824K26
3550F54k014N52Q89r92J72J03j434J478K043j062k463L55J611p64n27L57k81J258
3568f5J755k201k782J371K592m29m10k64j023K95J321j084j054K408J132j717
3584a55j141Q04N27L3M75j181r59K263P62j930n37J662P7k28N57p26o65J421m4
3603A015j618KK586p00j026J22M17j29J360l70k496O59K551k45j957K1kN41J309
3622B040K04j525J64J184j139j432Q79J340q15L32L2j380N36J648r24j853J871
3639A162Q39j092r56J20j019J268J445p91j025O43L42j609J59R53O5m9K63j502
3657g84r07J916J272k022j47J150o22k27P83j473o95J777N86j573J13J286q52
$$ plain form
3674 -419 -746 -131 -806 -911 -1 323 -1677 -1769 101 -278 -964 -609 -519 -592 524 -124 -1690 -1596 165 -329
3694 -329 -1349 -283 20 -756 98 -262 -1150 -302 989 253 -1460 -701 147 -135 25 129 -888 94
3712 94 2007 317 -1318 32 709 22 215 235 -350 -80 1124 45 -494 1063 1908 393 -152 123
3730 123 205 1024 1688 50 -545 1147 1441 -110 329 1204 878 599 880 222 44 1435 1259 -326 134
3749 134 1650 1105 920 728 -75 -115 1660 1442 -395 160 1148 921 61 531 414 435 1272 618 -902
3768 -902 -63 1696 285 -756 197 565 339 1060 47 -1163 306 1410 -168 -981 30 392 -44
3785 -44 -97 -437 -1084 149 1353 -318 -1566 315 919 -418 -892 -663 -1047 80 676 -1000 -1440 424
3803 424 800 -1081 -548 -299 -538 -580 -215 -721 -689 715 -16 -1880 -705 530 -100 -745 -626 -1039 -534
$$ packed form
3674d19l27O15o75j05R10L24k000r2J870l79o86L55R0p3J116o48j566R4J761m94
3694c29j020J066L03p76Q54l60q88Q48J291p36j713P59Q48k82J60J04j017R82
3712I4J913j690j635J350O77o87J93K0n85K70J204j079n39J557Q45j515n45K75
3730A23Q2Q19O64j638n95J692K94j551M39Q75l26k79K81o58j78J391j76j585M60
3749A34J516n45j85j92q03m0J775k18j837N55R88k27q60M70j17K1Q37o54j520
3768i02Q39J759j411j041R53L68k26P21j013j210J469J104j578q13J011L62m36
3785d4n3l40o47J233J204j671j248J881O04j337m74K29l84J127N96j676m40J864
3803D24L76j881N33K49k39m2L65n06L2J404p31j864J175J235o30o45J19m13N05
$$ plain form
3822 -534 805 -130 -1914 -755 534 106 -608 -462 -965 -665 901 -232 -1517 -280 908 -219 -810
3839 -810 -492 -110 -311 711 139 -1393 -247 983 -551 -916 59 130 -2 323 -33 -811 750 596
3857 596 -657 -919 1113 844 -721 -328 108 161 656 864 -870 -646 1191 983 -550 -643 210 24 673
3876 673 998 -816 -667 1224 791 -465 -173 947 236 181 -94 -580 -80 1230 648 -659 373 838
3894 838 -237 -489 465 -40 149 1066 -248 -1091 296 602 -23 -244 729 -47 -307 230 -297 -1466 106
3913 106 598 -333 -585 345 -238 -222 -130 -364 -837 149 624 -659 -833 294 44 -627 162 -187 -542 634
3933 634 617 -1147 -1283 157 278 -477 -69 -325 -425 349 319 -1176 -749 934 323 -884 -557 -558 -355 530
3953 530 508 -669 -852 585 548 -1043 -292 -233 -332 535 455 -553 -639 468 222 -438 456 711 -341 -272
$$ packed form
3822e34J339r35j784J159J289m28p14J46n03L00J566j133j285J237J188j127n91
3839h10L18L82k01J022n72j532J146J230j534l65R75P1j32L25l56p78J561j54
3857E96j253k62K032k69j565L93M36N3M95K08j734K24J837k08j533r3Q53j86O49
3876F73L25j814J49J891m33j256K92J120p11n5k75m86N00J310n82j307J032M65
3894H38j075k52R54n05J89R17j314q43J387L06o25k21R73p76k60N37n27j169J572
3913A06M92r31k52R30n83J6R2k34m73R86M75j283j74J127k50o71P89l49l55J176
3933F34j7j764j36J440J21p55M08k56j00P74l0j495M27J683o11j207L27jK03Q85
3953E30k2j177j83J437l7j591P51N9r9Q67q0j008q6J107k46o60Q94K55j052O9
$$ plain form
3973 -272 496 -202 99 698 -461 -542 926 1161 -300 -539 384 562 468 592 -159 -724 933 1174 -230
3992 -230 -643 537 501 1119 1254 -32 -1067 597 1185 -227 25 743 551 610 1140 -123 -498 962
4010 962 1682 -84 362 899 302 -321 437 687 329 922 631 -580 -146 1191 458 -555 521 535 352
4029 352 324 216 -541 397 1643 807 -734 334 492 -106 263 240 -326 473 1259 -317 -978 179 687
4048 687 130 138 336 -319 187 605 -448 -1113 560 868 -589 -365 451 382 230 254 -608 -758 806 982
4068 982 -645 -709 190 167 154 145 -245 -582 856 413 -1334 -770 311 250 -111 167 -264 -461 344 -179 -1352
4089 -1352 -252 1289 -84 -1000 -533 175 -149 257 -180 -920 33 798 -571 -1597 206 260 -400 -133
4107 -133 -531 -966 62 864 -486 -929 -75 -21 -460 -379 -350 -989 -219 460 -213 -671 285 31 -621 -22
$$ packed form
3973b72P68o98L01N99j159q1J468K35j461k39R23J78r4J24p51n65J657K41j404
3992b30m13J180l6O18J35j286j035J664N88j412K52P18j92N9N30j263l75J460
4010I62P20j766M46N37n97o23P58K50l58N93k91j211M34J337p33j013J076J4j83
4029C52k8j08p57R38J246q36j541J068J58n98L69k3n66P99P86j576o61J157N08
4048F87n57QJ98o55N06M18j053o65J673L08j457K24Q16o9j52K4q62j50J564J76
4068I82j627o4Q99k3j3rl90l37J438m43j747N64J081o1l61K78m31j97Q05n23j173
4089a352J100J541j373r16M67P08l24M06m37p40R53P65j369j026J803N4o60K67
4107a33l98m35J028Q02j350m43Q54N4m39Q1K9o39P70O79o73m58R56k54o52N99
$$ plain form
4127 -22 137 -507 -385 258 -444 -767 647 147 -1007 -309 419 -195 -186 78 -587 -358 537 298 -900 0
4147 0 891 -198 -212 303 -253 31 855 124 -825 -51 636 61 -478 647 360 87 1077 121 -661 -24
4167 -24 969 194 -438 450 -36 -502 815 446 -525 286 482 -292 -456 227 -55 -232 452 592 -492 86
4187 86 527 -53 -229 283 -130 -666 229 79 -459 76 378 -507 -138 582 167 -571 -22 -25 -536 50 467
4208 467 -957 -698 306 190 -526 -24 6 -428 127 277 -1112 -861 332 280 -827 -547 222 -86 95
4227 95 302 -767 -755 619 -145 -1057 -553 563 -203 -171 20 -456 -201 807 301 -773 -60 323 -290
4246 -290 -421 209 -419 -287 543 118 -241 -11 738 -750 -429 447 -45 -525 115 -31 -421 448 805 -398
4266 -398 -492 501 278 -160 82 -33 -306 589 763 -790 -632 723 252 -16 31 206 -251 389 69 -636
$$ packed form
4127b2J59o44J22O43p02l23J414n00j154O98P28o14RK64o65K29Q95k39j198R00
4147@Q91j089j4N15n56K84Q24p31r49P74O87n75n39J125k87k73R90r56p82O37
4167b4R93p75o32Q88m86m66J317l69r71Q11J96p74j64O83k82j77O84J40j084N78
4187H6M41n80j76N12m13n36Q95j50n38N35L02q85L69P20m15p38N49ln11N86M17
4208D67j424K59J004j16p16N02L0m34N55J50j389K51J193n2j107K80P69l08J81
4227I5K07j069J2J374p64r12N04J116p66L2J91m76K55J008n06j074P13L83o13
4246b90j31O30o28J32Q30m25l59K30P49j488L21Q76m92m80O40j46l90Q69L57j203
4266c98r4R93k23m38K42j15k73Q95J74j553J58J355m71k68M7J75m57O40l20p05
$$ plain form
4286 -636 -83 613 403 -567 -9 -12 69 406 595 -1005 -501 499 -80 -857 385 502 -467 -111 -9 -455
4306 -455 -582 607 -405 -935 -194 283 -391 -421 238 -20 -52 565 -531 -1236 162 376 -850 -555 264
4325 264 -380 -508 -20 -559 -796 319 66 -1230 -706 83 -64 -440 -288 -424 -775 99 267 -597 -443
4344 -443 810 113 -511 124 -300 -399 512 558 -302 -51 358 -160 -503 223 233 -325 173 404 -434 172 838
4365 838 -99 -286 378 649 -182 83 542 -545 725 1175 82 -707 239 910 172 518 570 -319 357
4384 357 847 -185 -389 593 1152 285 169 331 -7 573 881 -168 -310 435 790 -529 202 818 -38
4403 -38 -277 211 7 -264 699 444 -445 -135 581 -433 -174 124 15 -118 450 16 -703 -449 422 110
4423 110 -253 428 -326 -823 -252 156 -651 -29 307 -613 -603 -156 -358 -648 146 -198 -1132 -531 197 -676
$$ packed form
4286f36N53O96k10r70N58lQ1L37J89j600N04J000n79p77J242J17r69L56J02m46
4306d55j27J189j012n30P41M77o74l0O59k58l2O17j096p05J398K14j226K95Q19
4325B64o44j28M88n39k37J115k53j296N24P89j47l76J52j36l51Q74J68q64J54
4344d43J253o97o24O35m24r9R11M6q60K51M09n18l43P26J0n58M98K31q38O06O66
4365H38r37j87O64K71q31K65M59j087J270M50j093p89R46O71p38L46N2q89O76
4384C57M90j032k04R82N59q67j16J62l38N80L08j049j42P45L55j319P31O16q56
4403c8k39M88k04k71R63k55q89L10P16j014K59K98j09j33N68m34p19K54Q71l12
4423A10l63O81p54m97N71M08q07O22L36r20J0M47k02k90P94l44r34O01P28q73
$$ plain form
4443 -676 -708 -117 -118 -213 -124 -376 -1018 -193 825 -388 -953 -88 -38 -470 -177 -351 -590 239 760 -727 -892
4464 -892 153 315 -321 -355 50 -430 -51 401 -229 -524 255 348 -348 -292 144 -395 104 623 -113 -462 666
4485 666 354 -659 55 870 -70 -388 -5 -441 29 837 480 -1037 -205 863 83 -421 128 3 192
4504 192 768 382 -774 128 852 -47 -227 82 21 -202 453 226 -398 278 967 -46 -682 267 397 171
4524 171 -160 -113 -489 173 743 -633 -816 331 209 -172 63 -144 -690 499 390 -587 -780 316 -139
4543 -139 -673 -497 162 -337 13 128 -751 -556 667 -14 -849 -419 -241 -337 -536 -190 -673 -84 552 -617
4563 -617 -1540 -414 356 -417 -549 125 -574 -590 285 -406 -881 156 338 -593 -699 -532 -530 -254 234 -437
4583 -437 -816 37 267 -624 -909 59 15 -464 -47 -583 -651 81 401 -931 -519 -68 -222 -166 86 -19 -336
$$ packed form
4443f76l2N91jr5Q9k52o42Q25J018j213n65Q65N0m32K93j74k39Q29N21j487j65
4464h92J045J62o36l4M05m80L79M52o30k95P79R3o96N6M36n39M99N19p36l49J128
4485F66l12j013P14Q15r40l18L83m36M70Q08l57j517Q32J068p80n04N49j25J89
4504A92N76l86j156R02P24q99j80L09o1k23O55k27o24O76O89j013o36R49J30k26
4524A71l31M7l76O62N70j376j83J147j22l81K35k07n46J189j09r77j93J096m55
4543a39n34J76O59m99L50J15q79J95J223o81q35M30J78r6j99L46m83N89O36j169
4563f17r23J126P70p73j32O74o99j6Q75o91m75J037J82r31j06J67KK76M88o71
4583d37l79Q53K30q91k85R68m4m79M17n36o8P32L20j332M12M51j54N6K52j05l17
$$ plain form
4604 -336 274 205 -526 -263 727 -117 -543 408 -52 -152 484 149 -463 -58 705 236 -452 183 177 98 133 407
4626 407 -300 -16 570 284 -636 370 380 -152 365 324 -35 -74 769 198 -228 608 577 -176 22 389 -33
4647 -33 199 466 85 23 389 896 49 -139 267 366 86 648 13 -306 291 837 -104 -134 351 -169 -80 233
4669 233 -211 -758 416 705 -647 -211 488 -355 -96 201 71 -484 133 261 -711 -386 405 -43 -484
4688 -484 86 33 -415 12 362 -982 -537 149 -390 -333 -13 -391 -217 92 -372 -915 -466 531 -424 -814
4708 -814 46 71 -158 -168 -314 -818 -48 454 -520 -930 146 81 -478 -235 -21 -382 -119 415 -189 -290 239
4729 239 303 -159 -142 88 -365 -264 617 79 -398 440 527 -320 142 415 285 231 189 -607 -301 582 345 -481
4751 -481 -126 765 542 -52 129 -73 -3 381 280 -444 24 649 321 -98 353 131 424 582 514 -337 -118
$$ packed form
4604c36O10o9p31K63R90q44m26R51m60j00O36l35o12M05P63m69o88O35op9L5K74
4626D07p07K84N86k86r20J006J0n32N17m1l59l9Q43n71m26Q36l1p53J98L67m22
4647c3K32K67l81o2L66N07q47j88M06R9k80N62o35l19N97N46r41l0M85n20Q9L13
4669B33m44n47J174K89j352M36O99q43K59K97j30n55O17J28r72L25P91m48m41
4688d84N70n3m48M27L50j344M45O86n39N7L20l78J74L09m64n43M49R97r55l90
4708h14Q60K5k29j0j46n04P70N02r74m10J076o5n59K43K14l61K63N34o04j01N29
4729B39O4m62J7K30m53J01Q81n38m77Q38Q7q47M62K73j30n4m2p96L06Q83k37q26
4751d81L55Q91k23n94J81k02P0L84j01p24M68O25l28m19M51k22K93J58o8q51K19
$$ plain form
4772 -118 767 208 66 502 403 461 404 190 -197 302 696 -139 -560 465 506 -161 -166 30 -41 622 563 -190
4794 -190 -553 471 629 -246 -300 310 -98 185 155 -553 -979 559 392 -470 -669 364 9 -325 170 -587
4814 -587 -251 622 122 -784 -56 216 -373 -130 -216 -276 -236 301 -171 -934 -98 457 -327 -746 -302 -346 -57
4835 -57 213 -414 -827 -100 651 -210 -648 -42 -73 -89 177 -53 -648 -151 343 -444 -551 20 311 -52 113
4856 113 15 -745 -11 332 -578 -453 640 -94 -635 -279 205 -279 -270 235 -604 -307 616 233 -449 -262 123
4877 123 83 368 172 -360 -292 877 349 -484 160 361 192 202 492 -341 55 650 594 -298 490 685 -27
4898 -27 303 411 228 280 791 347 4 265 631 44 -91 789 327 398 742 273 -290 259 877 -29 -224
4919 -224 363 151 84 417 87 -269 496 860 -194 -319 -182 308 -74 469 199 -250 99 483 -313 -135
$$ packed form
4772a18Q85n59j42M36r9N8n7k14l87M99L94q35m21J025M1o67nJ96p1O63n9p53
4794a90l63J024J58q75n4O10m08K83l0p08m26J538j67q62j99J033l55l34M95p57
4814e87L36Q73n00r06P28K72n89K43q6o0M0N37m72p63Q36N55p84m19M44m4K89
4835e7K70o27m13P27P51q61m38O06l1j6K66k30n95M97M94p87j07N71K91l63J65
4856A13r8p60P34L43r10J25J093p34n41L56M84m84RN05q39K97R23l83o82J87L85
4877A23m0K85j96n32O8J169n28q33O44K01j69J0K90q33L96N95n6q92P88J95p12
4898b7L30J08j83N2N11m44l43K61L66n87j35Q80m62P1L44m69n63N49O18r06j95
4919b24N87k12o7L33l30l56P65L64j054j25J37M90l82N43k70m49L49L84p96J78
$$ plain form
4939 -135 415 164 -439 57 -98 -405 306 -102 -549 -314 365 -94 -483 -361 234 -332 175 19 -775 -246
4959 -246 474 -116 -876 -511 -215 -407 -288 116 -883 -398 552 -19 -792 -189 220 -226 -372 -298 -397 -260 55
4980 55 -347 -865 -203 172 -587 -591 122 -369 -485 -151 -144 -531 -71 57 -655 -262 261 27 137 23 -535 -762
5002 -762 504 519 -482 -395 245 -42 276 340 30 -183 291 564 -42 -91 432 362 91 473 208 -14 586
5023 586 471 -202 89 969 257 -212 57 654 270 326 494 -279 221 896 159 -314 491 810 71 232
5043 232 519 -321 453 767 -118 -412 481 540 -179 166 144 203 340 514 -251 -312 250 541 -69 -96 297 -241
5065 -241 -74 179 -494 -417 517 139 -383 -393 383 -36 -173 54 -234 22 156 -6 -488 -484 226 -82 -345
5086 -345 363 -322 -440 134 51 -797 -432 179 -177 -344 -108 -359 -160 -20 33 -194 -178 101 -313 -700 64
$$ packed form
4939a35N50k51o03M96j55l07P11m08m47K35O79m59l89J22N95n66N07j56p94N29
4959b46P20n90p60L65K96j92J19M04r99M85R50n71p73O03M09m46j46P4r9J37L15
4980E5m02n18O62L75p59mP13m91j16L34Pl87M60J28p12L93N23k34J10j14n58k27
5002g62J266J5j001Q7O40k87L18O4l10k13M74K73o06m9N23p0k71L82k65k22O00
5023E86j15o73K91Q80p12m69K69N97l84N6J68p73N00O75p37m73Q05L19p39J61
5043B32K87q40P74L14q85k94Q93N9p19L45k2N9J37J74p65o1N62K91o10k7L93n38
5065b41J67K53o73P7R34l78n22j0P76m19j37K27k88K56J34j62m82MP10l08k63
5086c45P08o85j18N74q3q48L65O11l56j67K36k51J99J40N3k27J6K79m14l87P64
$$ plain form
5107 64 -222 -326 -157 121 -183 58 265 -301 -446 115 133 -315 -303 -203 -224 348 265 -267 -394 397 641 -146
5129 -146 -4 305 19 -99 356 76 -107 707 676 -308 17 330 -74 365 450 11 67 709 437 115 492
5150 492 491 52 47 508 317 372 791 38 -417 325 653 384 162 321 427 230 947 496 -74 541 801 464
5172 464 -114 492 367 130 686 161 18 41 953 229 -118 366 459 -75 373 184 -265 194 339 -133 -428
5193 -428 356 507 -203 145 -41 -208 217 322 -602 -232 340 40 -411 -473 53 -102 238 -136 -424 -207
5213 -207 205 148 -660 -244 -41 -312 -137 -270 -635 -401 350 -196 -753 -330 175 -446 -318 -91 -262 -129
5233 -129 -48 -280 -598 -108 521 -393 -458 -378 -227 55 496 -653 -350 -384 110 -433 -552 -15 -147 -326 260
5254 260 -358 -701 120 284 -250 -250 237 -48 -307 125 142 72 51 442 -332 -47 428 321 -223 153 122 116 433
$$ packed form
5107F4k86j04J69K78l04K41K07n66j45N61J8m48J2J00k1N72q3n32j27P91K44p87
5129a46J42L09k86j18M55k80j83Q14l1r84L25L13m04M39Q5m39N6O42k72l22L77
5150D92jm39nM61j91N5M19p53m55P42L28k69k22J59J06j97P17m51n70O15K60l37
5172D64n78O06j25k37N56n25j43K3R12p24l47M84R3n34M48j89m49M59J45m72k95
5193d28P84J51p10L48j86j67M25J05r24L70N72l00m51o2N26j55L40l74k88K17
5213b07M12n7q08M16K03k71J75j33l65K34P51n46n57M23N05o21J28K27j71J33
5233a29Q1k32l18M90O29r14o5Q0J51K82M41j149L03l4M94n43j19N37j32j79N86
5254B60o18l43Q21J64n34%M87k85k59M32J7p0k1L91p74K85M75j07n44L76l1oL17
$$ plain form
5277 433 160 -439 -92 944 214 10 -75 593 170 531 171 -347 -283 926 522 25 337 617 346 478
5297 478 347 -159 361 475 411 -403 469 317 0 395 548 269 153 449 -11 -391 262 590 28 -219
5317 -219 133 274 -48 241 -162 81 373 407 -304 72 113 -244 -128 -29 58 -41 158 -121 -710 -171 701 253
5339 253 -319 57 -285 -397 193 205 -489 -171 545 -182 -751 -261 -42 -124 98 -216 -447 -318 272 -21 -540
5360 -540 -391 77 -99 17 -258 -314 -77 263 -350 -337 -197 92 -286 -314 -88 -237 -353 49 -205 -427 157
5381 157 207 -538 -269 60 -380 151 246 -195 -482 21 375 -373 -184 401 -28 48 -23 -79 -446 222 276 -296
5403 -296 -93 325 -119 -6 158 -40 123 817 415 -259 47 385 89 34 129 349 -135 302 180 -315 162
5424 162 513 -67 179 519 213 108 521 210 227 562 434 367 -258 433 182 143 328 180 -43 448 455 17
$$ packed form
5277D33k73n99L47J036p30k04q5O68m23L61l60n18O4J209m04m97L12K80k71J32
5297D78j31n06N20J14o4q14Q72j52l17L95J53k79j16K96m60l80O53L28n62k47
5317b19L52J41l22K89m03K43K92L4p11L76M1l57J16R9Q7r9J99k79n89N39Q72m48
5339B53n72L76l42j12N90J2o94L18P16p27n69M90K19q2K22l14k31J29N90k93n19
5360e40J49M68j76J16k75n6K37L40o13J3J40K89l78k8K26j49j16M02k54k22N84
5381A57N0p45K69L29m40N31R5m41k87N03L54p48J89N85m29P6p1n6l67O68N4n72
5403b96K03M18m44J13J64j98J63O94m02o74L06L38k96n5R5K20m84M37j22m95M77
5424A62L51n80K46L40l06j05M13l11J7L35j28o7o25O91k51l9J85j48k23M91Pm38
$$ plain form
5446 17 -232 435 516 -20 57 189 -32 215 310 -58 -471 299 319 -284 92 -54 -271 -171 319 -201 -545 286
5468 286 296 -538 -120 -182 -107 -288 123 46 -232 256 -32 -580 -107 -190 -438 -134 86 -88 -259 -182 -57 -651
5490 -651 -299 1 61 -422 -254 -215 -183 -123 -10 -536 -161 173 -617 -398 -274 -178 -152 151 43 -478 26 135
5512 135 -214 -279 -174 125 -164 -97 -149 -303 -116 220 -244 -150 555 113 -236 -168 -181 -147 158 161 -326 130 259
5535 259 179 -294 11 -63 -221 98 398 85 -223 312 366 -82 120 124 41 -191 318 122 72 501 -184 -226 -54
5558 -54 516 221 -65 335 199 12 531 173 -78 500 379 225 40 119 345 90 267 190 -190 149 412
5579 412 -488 -195 75 32 -93 249 -63 53 57 201 -9 -32 149 -237 -164 161 142 -217 105 22 -598 -373
5601 -373 371 -253 -488 -176 -367 -541 81 64 -326 -187 -3 -234 -233 224 -89 -697 -334 -269 -578 -221 48
$$ packed form
5446A7k49O67Q1n36P7J32k21K47R5l68m13P70K0o03L76j46k17J00M90n20l44Q31
5468B86J0q34M18o2P5j81M11p7k78M88k88n48M73q3k48L04K20j74j71P7J25n94
5490f51L52L00O0m83J68L9L2O0J13n26L75L34p90K19J24R6K6L03j08n21N04J09
5512A35l49o5J05K99k89O7n2j54J87L36m64R4P05m42l49O8j3L4L05Lm87M56J29
5535B59q0m73L05p4j58L19L00l13l08N35N4m48K02Mq3k32N09j96n0M29o85m2J72
5558e4N70k95k86M00j36j87N19l58k51N78j21j54j85P9K26k55J77p7l80L39K63
5579D12r00K93K70m3j25L42l12J16MJ44k10k3J81l86P3L25j9l59L22q3o20K25
5601c73P44o24k35L12j91j74O22j7l90J39J84k31JM57l13o08L63O5l09L57K69
$$ plain form
5622 48 -462 -724 -392 115 -524 -132 -181 -335 -151 -153 -618 -425 -155 219 -531 -470 -250 -200 -72 -77 -408 -585 -113
5645 -113 250 -375 -330 8 -173 -263 60 92 -298 167 32 -209 -207 216 -196 -304 421 1 -53 20 35 76 43
5668 43 261 84 -72 100 247 -36 285 69 -222 -164 337 77 -258 -6 77 361 124 -61 -364 151 782
5689 782 -11 -10 269 422 91 191 378 52 434 267 -148 -128 297 291 -100 219 128 -249 -50 329 296 -346
5711 -346 347 370 36 18 91 -53 35 381 56 -57 209 -87 -558 -397 -113 -94 -11 -88 -75 -602 209 99 -431
5734 -431 65 172 -80 -214 131 -107 -363 17 61 -562 -168 369 -150 -217 -64 -129 -482 155 -158 -484 -46
5755 -46 -50 -277 -377 -156 82 -219 -347 -147 -278 -185 159 -25 -326 249 134 -493 -165 -127 -360 -21 392 -197
5777 -197 142 -12 198 -160 -233 10 -185 41 168 -239 -363 356 415 70 -19 345 410 314 112 -169 -302 609
$$ packed form
5622D8n10k62L32N07o39L92m9j54J84km65J93K70L74p50O1K20N0J28nl31j77M72
5645a13L63o25M5L38j81r0L23L2l90M65j35k41KM23m12j08P25m20n4P3J5M1l3
5668D3K18j77j56J72J47k83L21k16k91N8N01k60l35K52Q3K84k37j85l03N15O31
5689G82p93JK79J53l31J00J87l26L82j67m15K0M25ol91L19r1l77J99L79l3o42
5711c46O93K3l34j8P3j44Q8L46l25j13K66k96m71J61K84J9Q3p7J3n27Q11j10n30
5734d31M96J07k52j34L45k38k56L80M4o23L94N37n19o7J53o5l53O37l13l26M38
5755d6mk27j00K21K38l01j28K00j31R3L44j84l01N75j15o27L28L8k33L39M13n89
5777a97L39j54K10l58p3K43j95K26J27m07j24P19N9l45q9L64O5r6k02k81j33R11
$$ plain form
5799 609 519 114 147 304 -57 20 377 166 317 377 262 -34 158 296 191 300 388 246 212 226 81 -106
5821 -106 -11 527 134 -217 441 -120 -229 183 364 -201 427 328 -130 80 329 140 107 49 214 -213 289
5842 289 277 -264 -73 302 87 -82 85 260 -281 379 151 -201 -235 330 83 -249 -21 60 -191 87 177
5863 177 -410 -205 -124 56 -371 117 19 -582 -273 -290 -94 -327 343 101 -268 -470 79 -481 -277 -205 -369
5884 -369 123 502 -157 -695 -306 -271 66 -255 244 -200 -553 45 -123 -290 54 -58 -364 -83 17 14 -52
5905 -52 -22 169 -235 266 321 -126 -361 291 47 -148 105 -355 134 230 136 -221 256 155 105 -49 318 336
5927 336 -147 74 52 -134 -13 224 105 -428 99 351 -129 305 160 35 42 192 64 28 154 218 -87 441
5949 441 219 114 175 640 106 136 79 117 10 264 -91 -244 165 220 169 -85 96 212 -67 4 245 -25
$$ packed form
5799F09r0m05L3J57l61P7L57k11J51O0j15k96J92J38j05J09Q8j42l4J4j45j87
5821a06R5N38l93l51O58n61j09M12J81n65O28r9m58K10K49j89l3n8J65m27N02
5842B89j2n41J91L75k15j69J67J75n41O60k28l52l4N65k47l32K28Q1k51K78R0
5863A77n87K05Q1J80m27M88r8o01L09j7J96k33O70k42l69k02N49n60K04P2j64
5884c69M92L79o59n38L89L5L37l21M99m44l53N98j68j67L44j12l06K81J00lo6
5905e2L0J91m04N01N5m47k35O52k44j95K53m60M89R6r4l57M77j01n0j54L67J8
5927C36m83K21k2j86J21K37j19n33N27K52m80M34j45j25PJ50j28l6J26O4l05N28
5949D41k22j05O1M65n34L0n7L8j07K54l55j53M09N5n1k54J81J16k79P1K41k70
$$ plain form
5971 -25 -6 182 -405 -154 103 355 -138 -115 86 -125 -25 216 -100 -89 84 292 -526 -89 -75 -282 -277 6
5993 6 -40 -174 105 -3 -459 27 373 -365 -308 -91 -263 -210 19 62 -214 -444 -67 -235 -23 -156 -323 -267
6015 -267 -81 -44 -621 74 123 -105 -172 33 -148 -368 242 277 1 1 -71 -192 -584 208 -317 -355 -105 322 -209
6038 -209 6 65 -459 -210 142 3 -295 -421 -142 -63 -150 373 -90 -222 455 218 72 65 168 -275 170 139
6060 139 -13 -252 231 161 -45 158 371 -79 184 225 45 -78 267 321 -14 -11 285 293 15 406 25 163
6082 163 285 87 -81 14 225 5 -265 40 -68 222 169 -103 -175 279 363 208 -43 204 -117 -18 171 202
6104 202 -184 -345 36 34 172 282 -67 -394 -75 35 -129 -77 87 -210 -267 298 -59 -17 215 144 -94 -88 -12
6127 -12 -149 -41 89 7 -477 26 156 -289 173 168 -184 122 52 -143 -202 -284 -82 -444 -451 267 -404 -494 -7
$$ packed form
5971b5J9J88n87K51K57K52m93K3K01k11J00K41l16J1J73K08q18M37J4k07NK83
5993Fm6j34K79j08m56M86L46p38N7K17j72N3K29M3k76k30L77j68K12j33j67N6
6015b67J86L7n77O95M9k28o7K05j81k20O10L5k76%p2j21l92P92n25l8K50M27n31
6038b09K15N9n24K49L52j39k98j26K79P9q7N23m63j32O77k37j46pJ03m43M45l1
6060A39j52k39M83p0k06K03K13m50K63M1j80j23L45N4l35LK96Qk78L91l81J38
6082A63J22j98j68R5K11k20k70L05j08K90n3k72p2M54Q4j55k51K47l21R9J89L1
6104B02l86j61L81kJ38J10l49l27L19J10j64N2J64k97n7N65l57M2K32p1k38OP6
6127a2j37J08J30q2m84N03J30m45M62nl52L06p0j95n9q2K02l62pP18o71r0M87
$$ plain form
6150 -7 143 -347 -32 -232 -189 -233 130 146 -166 -84 -355 -403 -72 149 -170 -179 -114 -135 -254 226 -108 164 -35 53
6174 53 214 13 -107 45 68 8 190 -44 106 500 -10 252 92 202 -243 68 324 -66 123 182 142 104
6196 104 322 -4 -348 109 464 173 270 -223 74 3 412 57 -376 83 74 -41 187 358 101 117 309 342
6218 342 -116 -28 161 -77 207 303 130 -199 364 303 -61 -12 291 -50 -26 391 -131 -37 -55 137 -459 42
6240 42 -64 -22 -47 283 55 94 233 -120 -287 -172 213 120 -175 -16 57 -158 169 -119 -210 -340 168 -259
6262 -259 -37 225 41 -84 122 170 -340 -63 -17 -269 -273 -133 -258 -279 148 -94 -176 -140 -74 -229 324 147 -43
6285 -43 -178 191 69 -460 340 -236 -106 -76 -84 151 -240 152 4 -349 74 -5 4 44 69 -126 -121 26 44 -193
6309 -193 -276 203 10 106 75 -79 61 304 394 -22 88 429 -65 18 133 -192 211 318 -65 -77 -564 320
$$ packed form
6150gJ50m90L15k00M3m4L63J6l12Q2k71m8L31K21l19rO5k1j19M80l34K72j99Q8
6174E3J61k01j20J52K3o0J82k34J50L94n10K62j60J10m45L11K56l90J89N9m0l8
6196A04K18l26l44M57L55k91R7m93K97p1M09l55m33M59rj15K28J71k57J6J92L3
6218C42m58Q8J89k38K84R6j73l29N63o1l64M9L03l41K4M17n22R4j8J92n96N01
6240D2j06M2k5L30k28L9J39l53j67J15L85r3k95J59P3k15L27k88r1j30N08m27
6262b59K22K62j84j25K06M8n10K77M6k52mJ40j25k1M27k42q2L6O6j55N53j77j90
6285d3j35L69j22n29Q00n76J30L0qK35l91L92j48l53M23p9RM0K5j95NJ47J8k37
6309a93q3M79j93R6l1j54J40K43R0m16J10L41m94Q3J15l25M03J07l83j2m87Q84
$$ plain form
6331 320 466 263 555 39 -68 348 279 -280 -99 186 86 -258 145 90 -237 -23 281 169 -75 153 -175
6352 -175 -1 271 -40 -87 -169 50 18 49 186 -114 29 40 -45 83 56 153 214 -103 210 205 -176 109 108 -468
6376 -468 -328 -76 -138 -174 144 -249 -216 -44 121 -391 -194 344 -154 -302 -7 83 -246 -119 -102 -197 177 412
6398 412 -306 -181 -133 -156 -46 -235 -142 -295 26 -154 -324 -352 -72 62 -246 -26 54 -734 187 17 -218 -608
6420 -608 -94 205 -302 129 -8 -173 -225 184 148 -254 31 -18 -235 -89 213 -60 -135 34 -17 -149 -88 -11
6442 -11 108 147 224 -103 209 313 -192 128 241 177 -95 -27 -6 -11 158 223 166 -87 224 353 392 -25 89 199
6466 199 98 144 152 71 8 310 -195 -54 191 -57 260 435 13 -25 41 -100 -119 209 291 -166 -124 42 20 -67
6490 -67 -95 -28 -177 -165 313 99 -161 47 -222 -138 278 116 64 232 106 -271 163 105 -113 -260 184 81
$$ packed form
6331C20J46k03K92n16j07M16o9n59J81K85j00l44M03n5l27K14L04j12k44K28l28
6352a75J74K72l11m7q2K19l2L1J37l00J43J1q5J28k7R7O1l17L13nl81K85jn76
6376d68J40K52o2l6L18l93L3J72J65n12J97N38m98j48K95R0l29J27J7r5L74K35
6398D12p18J25M8k3J10j89R3j53L21j80j70k8K80J34l08K20Q0p88R21j70k35l90
6420f08N14K99n07M31j37j65n2M09l6m02K85m9k17J46L02k73p5J69n1j32O1P7
6442a1J19L9P7l27L12J04n05L20J13o4k72O8K1nJ69O5n7k53L11J29L9m17J14J10
6466A99j01M6Qq1o3L02n05J41K45k48L17J75m22l8O6j41j9L28Q2m57M2J66k2q7
6490f7k8O7j49J2M78k14k60K08k69Q4M16j62n2J68j26l77M34n8k18j47M44j03
$$ plain form
6512 81 -31 -97 46 -202 -396 -210 -121 -178 95 -120 -333 -91 51 -207 -344 61 222 -62 -130 75 -282 68
6534 68 181 -227 -33 75 123 -58 -109 43 -115 -116 155 91 -171 -86 -211 -156 228 64 -157 -35 91 -65 -182
6557 -182 118 -201 -164 -117 -169 -316 -143 -123 252 93 -96 -116 -162 199 259 -75 -189 49 304 43 253 277 180
6580 180 135 29 -89 -12 364 267 -199 -130 128 125 -51 190 141 38 435 328 211 181 117 -81 113 33 170
6603 170 264 56 -78 46 44 -75 179 127 188 -44 227 365 -75 -115 470 50 -128 54 187 152 -28 -146
6625 -146 -72 -396 -78 149 -195 -192 234 -40 -171 -119 -131 -44 -284 26 -161 -208 319 89 -514 366 -75 -114 202
6648 202 -13 -18 -290 155 143 -226 -132 -123 -135 -3 64 22 -64 -37 -140 -44 -372 -1 -148 -90 127 -152 -86 208 275
6673 275 -357 145 -12 -7 -206 112 -239 10 162 -197 26 153 267 202 -110 -174 -131 38 125 -117 332 83
$$ packed form
6512H1j12o6J43k48j94J86Q9n7K73k15k13K42J42k58j37M05J61k84o8K05l57L50
6534F8J13m08J94J08M8j81n1J52j58jK71o4k62Q5j25N5L84j64k21J22J26j56j17
6557a82L00l19L7M7n2j47J73K0L75j59j89k0m6L61O0l34j14K38K55k61K10K4r7
6580A80m5j06j18P7L76r7m66O9K58lj76K41m9j03L97j07j17l0o4j98J94q0J37
6603A70R4k08j34J24kj19K54n2O1k32K71J38m40m0N85m20j78J82J33l5j80j18
6625a46P4l24L18K27l44LM26k74j31N2j2Q7k40L10j87m7N27k30o03Q80m41l9L16
6648B02k15nk72M45j2l69R4Rj2J32O7m2q6K7j03R6l28L71j47N8K17k79O6K94O7
6673B75o32N02j57Nj99L18l51K49J52l59K23J27J14o5l12o4M3J69Q7k42M49k49
$$ plain form
6695 83 -91 -120 -42 -60 77 -2 223 65 104 274 -66 -316 -71 154 354 326 181 -34 353 -34 219 -151
6717 -151 279 232 -128 -275 -41 446 215 175 237 100 69 176 167 180 92 210 -195 176 96 163 14 322 -132
6740 -132 -132 -21 137 -42 168 268 -96 22 25 255 -166 -69 292 -257 54 156 -120 198 -23 -106 -55 24 -27
6763 -27 -92 182 68 -39 -119 240 -63 -275 67 -217 -124 -38 326 59 43 29 -83 -236 77 -31 -314 -26
6785 -26 -17 92 -68 88 11 -443 -158 76 -530 -20 -298 162 96 141 -87 -173 181 -257 -157 -259 -130 -63 -370
6808 -370 11 -233 -88 304 133 -128 -14 60 -134 -178 -71 -217 250 195 -130 -102 -38 349 99 87 -106 -104 -64
6831 -64 55 267 7 179 65 -105 -56 25 94 7 373 226 339 39 -33 19 92 258 90 44 81 137 194 225
6855 225 -114 118 4 304 204 80 202 45 143 213 108 -61 181 -13 57 32 -12 314 -34 211 174 99
$$ packed form
6695H3j74k9P8j8J37p9K25j58L9J70l40k50K45K25K00k8j45k15L87l87K53l70
6717a51M30m7l60j47K34M87k31m0O2j37l1J07rJ3q8J18m05L71q0O7j49L08m54
6740a32%J11J58j79K10J00l64J18LK30m21R7L61n49L11J02k76L18k21q3N1P9n1
6763b7o5K74j14j07q0L59l03k12L42k84R3Q6L64k67j6j4j12j53L13j08k83K88
6785b6RJ09j60J56p7m54K85K34o06N10k78M60o6M5k28q6L54m38J00j02J29O7l07
6808c70L81k44J45L92j71k61J14P4j94m4J07j46M67n5l25K8O4L87k50j2j93KM0
6831f4J19K12k60J72j14j70M9Q1O9q7L66j47J13l00p2N2P3J66j68m6L7N6N7L1
6855B25l39K32j14L00j00j24J22j57R8P0j05j69K42j94P0k5m4L26l48K45l7p5
$$ plain form
6877 99 -107 149 -234 69 -97 -90 -46 223 269 -111 -49 -72 162 -73 277 223 9 -283 -15 -3 -48 -179 -73
6900 -73 -41 -69 -59 -147 -40 169 -107 -17 169 164 -312 33 -255 -47 -342 9 -84 1 -11 79 -145 -388 -154 -293
6924 -293 111 13 -193 -201 -61 -228 -35 -45 -262 -393 -235 -232 -134 77 154 -64 -7 -87 -207 -12 -165 -96 -117 -162
6948 -162 -44 -20 -340 -200 31 27 115 -169 -198 250 -35 155 -166 -91 38 18 25 225 312 -85 -128 -80 -234 34
6972 34 229 20 -97 -162 -64 155 133 150 -81 22 48 34 277 189 65 -73 63 181 -58 361 194 -115 305
6995 305 192 178 284 89 45 149 266 116 267 -200 -242 70 -173 130 165 -19 -57 127 131 -181 -123 -259 -100
7018 -100 189 199 -86 -88 -133 203 -59 6 230 121 -132 47 -276 -269 -54 -90 -83 -88 -165 -90 149 63 -225 65 39
7043 39 -46 54 175 -57 -149 -217 -90 -178 -134 45 -148 -100 21 -27 -189 -205 -311 -15 -372 127 -173 168 137
$$ packed form
6877I9k06K56l83L03j66PM4K69M6l80O2k3K34k35L50n4k14k92K68J2m5j31J06
6900g3L2k8J0q8J07K09k76R0J86nm76L45k88K08k95L51r3Q5j2R0k24k43K34j39
6924b93M04r8k06qJ40j67J93j0k17j31J58LR8K11P7k18N7q0j20J95j53O9k1m5
6948a62J18K4l20J40K31mQ8k84k9M48k85J90l21P5J29k0PK00Q7l97m3M8j54K68
6972C4J95k09j17o5R8K19k2J7k31J03K6j4K43q8j24j38J36J18k39M19j67l09M20
6995C05j13j4J06j95m4J04J17j50J51m67m2L12k43L03L5j84l8J84Ml12N8j36J59
7018a00K89J0k85km5L36k62O5K24j09k53J79l23PK15l6Pnp7P5K39q6k88K90k6
7043C9q5J00J21k32r2o8J27q8M4J79j93M8J21m8j62j6j06K96l57M99l00L41l1
$$ plain form
7066 137 -56 -26 -163 145 -163 -163 329 -140 -174 -61 126 -48 38 -59 -6 -358 10 -147 -25 167 -38 103
7088 103 53 -55 -293 62 -129 305 2 242 231 -39 311 119 240 291 -95 167 130 173 -8 236 86 359
7110 359 107 77 30 106 121 -31 331 86 127 84 162 110 -22 327 11 230 519 -43 -10 190 43 -85 116
7133 116 490 24 54 -71 53 47 71 109 -15 186 44 159 -35 -200 108 20 215 80 -156 45 -108 70
7155 70 -40 -236 -64 -19 284 -102 -167 -60 98 -156 -204 38 86 78 180 -150 -109 -190 110 -12 -39 -24 -197 -147
7179 -147 30 79 26 190 76 -253 -36 110 -10 -5 112 -322 124 26 132 -241 -34 -225 -112 -129 291 118
7201 118 -255 120 -65 -117 87 137 70 189 236 -42 -217 -97 -34 175 -165 -109 -56 28 52 -93 -12 -127 -420
7224 -420 39 191 296 -185 62 158 90 -43 -206 118 -35 223 61 -119 -124 72 162 183 113 111 2 46 -53 40
$$ packed form
7066A37j93L0j37L08l08%M92m69l4J13J87j74Q6r7N3l52L68j57J22J92k05J41
7088A03n0j08k38L55j91M34l03K40j1k70L50j92J21N1l86K62l7M3j81K44j50K73
7110C59k52l0m7P6J5j52L62k45M1m3P8n2j32L49l16K19K89n62L3K00j47j28K01
7133A16L74m66L0j25J24oK4L8j24K01j42J15j94j65L08q8J95j35k36K01j53J78
7155G0j10j96J72M5L03l86o5J07J58k54m8K42M8qJ02l30M1q1L00j22k7J5j73N0
7179a47J77M9n3J64j14l29K17J46j20NJ17m34M46r8J06l73K07j91J13j7M20j73
7201A18l73L75j85n2K04N0o7J19M7k78j75J20O3K09l40N6N3Q4K4j45Q1j15k93
7224d20M59J52J05m81K47R6o8j33j63L24j53K58j62j80nJ96R0K1p0kj09M4r9R3
$$ plain form
7248 40 -130 302 188 185 252 450 120 405 -169 -101 -34 176 -56 -230 12 -61 264 279 318 256 -116 70 3 -96
7272 -96 -89 281 -261 -114 226 14 79 -123 35 -51 -25 143 12 17 -13 -180 -70 142 44 -212 69 115 49 177
7296 177 179 -20 -221 -115 -206 -258 94 21 16 18 304 -179 -224 -372 -27 -28 198 34 -314 -98 27 26 117 -140 59
7321 59 -28 -118 -195 -40 -288 167 197 -191 -168 177 46 -21 37 74 -332 -14 152 -69 -178 -14 -131 -63 197
7344 197 305 -53 -226 -250 69 -29 345 -60 137 -207 -217 26 41 129 -142 280 -18 -14 -347 -18 65 -51 -49
7367 -49 338 -143 60 80 -50 202 99 32 150 -257 -222 -424 284 241 213 -17 113 -24 -30 201 265 11 -158
7390 -158 334 67 106 331 73 -459 46 66 220 346 96 -359 182 290 -147 109 39 182 -140 -43 -145
7411 -145 -25 176 129 -28 -80 -77 53 291 249 -271 86 -1 311 -300 -340 84 210 -159 63 170 -136 82
$$ packed form
7248D0j70M32j14lO7J98l30K85n74O8O7K10k32j74K42p3L25J5L9o2l72J86o7r9
7272i6PL70n42J47L40k12O5k02J58q6K6J68j31Nl0j67J10K12r8k56K81M6o6J28
7296A77Kj99k01J06r1n2L52p3nKK86m83m5j48L45jK26j64l48K16J25jR1k57J99
7321E9q7r0p7J55k48M55L0l88K3L45j31o7N8L7m06L18J66k21j09J64j17O8K60
7344A97J08l58j73k4L19r8L74m05J97l44j0K43J5Q8k71M22k98Ml33L29Q3j16K
7367d9L87m81K03K0j30K52j03o7J18m07L5k02P08m3k8k30J30j37oK31O4k54j69
7390a58M92k67L9K25k58n32N05K0J54J26k50m55N41J08m37K56p0J43l22R7j02
7411a45J20K01m7j57n2LJ30K38m2n20L57q7L12o11m0M24J26l69K22J07l06K18
$$ plain form
7433 82 -68 -96 -171 244 -210 -178 -157 -85 -92 -201 -48 67 74 -117 100 191 -248 -1 -86 93 -12 6 -138 -11
7457 -11 -2 -82 -120 151 13 -28 54 108 -180 -186 -39 -56 -26 214 -192 18 15 -170 103 -103 -270 82 -219 -46 -70
7482 -70 -324 -96 78 21 -111 53 -191 -103 59 -195 -42 298 258 236 -203 -177 -77 -321 490 127 48 -63
7504 -63 159 152 295 232 39 -205 72 -18 -142 298 -41 -66 243 294 133 102 45 236 44 -4 165 216 39 54
7528 54 -38 71 63 -472 -246 -17 -246 -145 -14 41 240 -130 -31 8 -16 245 60 -13 193 117 199 -172 295 252
7552 252 -239 134 164 -245 16 -4 -149 -90 91 237 -127 -26 -49 -97 -56 34 109 35 72 187 -204 -139 -223 141
7576 141 -364 -48 244 -244 133 -248 -87 -81 -130 -145 -45 94 -44 161 -49 -57 -27 67 -31 -445 -14 58 150 -116
7600 -116 -4 -133 74 327 15 -197 13 -293 -5 107 178 38 -428 -108 128 -410 -64 366 -52 198
$$ packed form
7433H2j50k8p5M15m54L2K1P2pj09J53J15Pj91K17R1m39K47q5J79j05J8j44J27
7457a1Rq0l8K71j38m1Q2N4k88oJ47j7L0K40m06K10lj85K73k06j67L52l01J73k4
7482g0k54K28J74n7j32J64k44Q8J62k54J53L40m0k2m39K6J00k44Q11l63p9j11
7504f3K22pJ43o3j93k44K77r0j24M40l39k5L09N1j61l1n7J91j92m8J69N1j77J5
7528E4r2J09qn35K26K29k29J01J31N5J99l70R9L9k4K61j85p3K06p6Q2l71M67m3
7552B52m91L73L0m09K61k0j45N9J81J46l64J01k3m8M1R0P5p4L7J15l91O5q4L64
7576A41n05L16K92m88L77l81J61Om9j5J00J39j38K05k10qL0R4r8m14M31P2R2k66
7600a16J12j29K07K53l12k12K10l06K88J12P1j40m66L20K36n38L46M30m18K50
$$ plain form
7620 198 -144 144 160 -85 257 37 123 109 362 -121 175 131 -247 30 -60 45 234 198 33 104 164 48 25
7643 25 238 -159 -87 -55 209 -218 25 -345 -104 -10 130 132 143 72 -81 60 -238 41 -170 86 -185 242 -164
7666 -164 64 170 192 -163 -42 -83 -218 86 -440 1 -18 53 51 -176 299 47 108 30 -40 354 -179 -58 -59 -265
7690 -265 88 109 312 -70 180 -74 -319 -178 -209 -155 43 5 -78 123 -62 -65 -177 152 76 55 -87 128 -163
7713 -163 170 169 -255 -59 -38 -245 -99 -230 -54 -204 81 -57 -34 -194 37 106 31 156 201 -215 110 140 -308
7736 -308 44 -59 -70 -35 -195 -147 -16 54 -130 134 -140 386 90 -110 -29 14 17 -81 37 76 10 13 64 64 30 168
7762 168 -149 -206 -50 -66 113 157 180 75 -68 44 97 -132 63 -337 5 306 280 20 -76 -43 1 -117 93
7785 93 509 65 -218 142 193 -65 -83 71 -176 -98 222 0 -228 -125 44 114 -88 20 134 -124 91 278
$$ packed form
7620A98l42K88J6k45L42k20Q6j4K53m83K96m4l78K77r0J05J89l6j65P1O0j16k3
7643B5K13l97P2L2K64m27K43l70K41R4J40KJ1p1j53J41k98K79k11K56k71M27m06
7666a64K28J06K2l55J21m1j35L04n26M41j9P1kk27M75k52O1p8p0L94n33J21jk06
7690b65L53K1K03l82K50k54k45J41l1N4J98l8q3K01j85lj12L29p6k1j42K15k91
7713a63L33jm24J96K1k07J46j31J76j50K85j38K3j60K31O9p5J25M5m16L25L0m48
7736c08L52j03j1L5j60M8J31P0j84K64k74N26k96k00Q1M3Lr8J18L9o6LN1%l4J38
7762A68l17n7J56j6J79M4K3j05j43J12N3k29J95m00L42L01k6k60r6L3M4j18K10
7785I3M16m44k83L60N1k58j8J54k47P8L20k22k28J03J69P0k02J08J14k58K15J87
$$ plain form
7807 278 -106 145 68 164 130 -233 196 -201 114 -98 59 99 -222 130 208 -25 -34 50 -157 -7 65 -392 -371
7830 -371 -145 -82 -44 -155 5 74 -53 -142 -69 -17 -223 84 -122 -44 286 -195 -117 109 -170 -112 2 -137 -44
7853 -44 5 -96 110 -248 27 -49 -117 -270 -20 114 -220 -22 -49 -73 -65 36 107 88 195 -97 -111 -151 -54 -100 193
7878 193 -60 58 -201 203 405 -118 143 61 237 52 53 -98 237 -27 -85 24 74 25 298 -11 3 -60 269
7901 269 233 97 -59 104 157 208 242 -259 26 -35 45 37 -12 187 -86 -76 -217 -110 -49 105 -68 -159 -146 375
7925 375 -78 69 -88 -198 -184 -41 -9 89 -125 -40 -235 -101 133 21 152 14 205 -129 110 278 293 -228
7947 -228 3 -335 -224 -156 -102 -185 -105 -7 227 -7 134 141 143 -184 -62 -196 60 -89 104 -109 -264 -222 -97
7970 -97 -43 86 -20 16 92 73 -230 -26 -205 239 -145 48 5 123 -277 111 -136 68 176 87 -145 -185 296
$$ packed form
7807B78l84K51p7R6l4l63M29l97L15k12J57M0l21L52P8k33rQ4k07J50P2m57K1
7830c71K26O3L8j11J60O9j27q9P3N2k06L07k06P8L30m81P8K26k79N8J14j39R3
7853d4M9j01K06l58K75p6o8j53K50J34l34J98k7k4QJ01P1j9J07k92j4m0R7m6K93
7878A93k53J18k59M04K02n23K61q2J76j85Jj51L35k64n8J09N0m9K73l09J4o3L29
7901B69l6j36j56J63N3N1L4n01K85o1Q0qm9J99k73J0j41J07O1J54j73r1J3N21
7925C75m53J47j57j10J4J43L2R8k14Q5j95J34K34j12J31j38J91l34K39J68J5n21
7947b28K31l38J11O8N4q3Q0R8K34k34J41PKl27J22j34K56j49J93k13j55M2J25
7970i7N4J29j06L6P6j9l03K04j79M44l84J93m3J18m00L88k47K04J08q9k32m0M81
$$ plain form
7993 296 125 -52 96 6 -12 54 -192 -111 -21 -40 272 -39 -46 93 -201 -74 -265 -38 144 5 -332 62 -101
8016 -101 44 -35 349 8 131 166 -26 -14 41 67 -12 -153 131 111 225 411 5 10 9 79 -55 39 -258 -115
8040 -115 -127 211 -76 -71 -151 344 266 190 -23 7 138 -10 220 -70 225 -88 -313 13 218 278 -57 -4 -113
8063 -113 -67 -106 -136 286 -218 -151 -64 6 -168 -25 -104 86 -25 145 -48 358 11 -185 63 -211 -53 163
8085 163 234 51 147 148 30 73 -17 21 112 86 18 -379 -280 -64 -31 -337 -143 -191 -162 308 16 89 -149 -229 34
8110 34 -252 49 187 -131 69 19 101 -121 29 -19 -47 151 -14 273 153 49 -400 143 8 -13 -85 -163 324
8133 324 -288 384 191 -103 -234 66 -19 -232 78 62 45 -93 58 -120 -139 79 110 106 28 307 181 286 -61
8156 -61 -75 -88 184 0 220 -13 70 -284 -424 1 -107 -8 127 -88 -18 179 56 -113 165 -144 47 -283
$$ packed form
7993B96j71j77J48r0j8O6k46Q1R0j9L12l11pJ39k94J27j91K27J82j39l37L94j63
8016a01J45p9L84l41J23L5j92J2N5K6p9j41K84k0J14J86m06NjP0j34R4k97J43
8040a15j2L38k87Nq0M95p8p6k13L0J31j48K30k90K95l13k25L26K05O0l35N3j09
8063a13M6l9l0M22n04O7Q7P0j74J43p9J90j11J70j93M06l47j96K48k74J58K16
8085A63P1j83R6Jj18M3r0L8R1k6o8l97R9K16L3l06J94m8K9M70k92P3k38q0K63
8110C4k86L01J38l18K00n0Q2k22J50m8k8J98j65K87j20j04m49N43j35k1p2p8M87
8133C24o12O72j93k94j31L00q5k13L10j6j7j38J51j78j9K18L1mp8K79j26J05l47
8156f1j4j3K72j84K20k33Q3l54j40M25j08R9J35k15P0J97j23j69K78l09J91l30
$$ plain form
8178 -283 -164 230 234 236 -252 -157 -446 133 -6 -14 61 183 35
$$ packed form
8178b83J19L94MKm88R5k89N79j39qP5J22j48
8191C5
$$ Imaginary data points
##PAGE= N=2
##DATA TABLE= (X++(I..I)), XYDATA
$$ plain form
0 0 0 0 0 -8 8 -8 8 -16 16 -24 32 -40 48 -56 72 -85 104 -122 145 -169 201 -232 267 -308 356 -406 463
27 463 -527 599 -673 760 -853 955 -1068 1195 -1328 1479 -1643 1821 -2019 2236 -2477 2742
43 2742 -3035 3363 -3732 4147 -4620 5168 -5801 6551 -7455 8563 -9969 11816 -14360 18105
57 18105 -24185 35771 -65863 308861 671231 107378 -93244 42281 328542 337777 214218
68 214218 98673 189953 272086 205804 61041 110818 261420 326737 217236 76469 36141
79 36141 147927 196992 82952 3411 142210 265798 176327 19882 10286 108542 186155
90 186155 138561 12046 -21280 83572 117330 14961 -29041 69056 148968 111420 9213
101 9213 -53916 5506 122580 96241 -71278 -131220 -268 117441 78329 -44371 -95765
$$ packed form
0@%%%qJ6j6J6k4L2m0N6p2Q8j04J28j57J89k26K67l14L70m33M99n75O64p62Q69
27D63r90J126j272J433j613J808k023K263k523K807l122L464l840M255m713N219
43B742n777O398p095P879q767R788j0969J2352j4006J6018j8532K1785k6176L2465
57A8105m2290N9956j01634L74724L62370n63853k00622J35525K86261R235j23559
68B14218j15545R1280Q2133o6282j44763M9777J50602O5317j09501j40767m0328
79C6141J11786M9065j14040p9541J38799J23588q9471j56445r596R8256P7613
90A86155m7594j26515l3326J04852L3758j02369m4002R8097P9912l7548j02207
101I213o3129N9422J17074k6339j67519n9942J30952J17709l9112j22700n1394
$$ plain form
112 -95765 302 116594 56622 -105016 -114101 9860 39307 -41402 -83117 -53945 -3520 21915
124 21915 -25428 -86629 -32447 67250 26741 -111440 -150340 -54228 47540 44547 -59341 -114162
136 -114162 -18771 78164 15816 -80695 -47080 34287 37815 -12588 -58342 -54838 15497 61996
148 61996 9791 -28333 39523 93443 40124 -31310 -33342 24932 91901 82280 -11815 -42831
160 -42831 47490 102874 48174 8601 48729 94661 89913 30656 -31162 273 98181 106295
172 106295 16355 -12589 51490 101324 90423 36035 -15148 20695 116315 109383 -7931 -51826
184 -51826 27369 91682 73311 21495 -1483 40600 95826 62726 -18165 -14432 49542 55331
196 55331 13542 -4832 2749 29922 53668 20005 -24585 17457 78371 35073 -43915 -38541
$$ packed form
112i5765R6067J16292n9972j61638r085J23961K9447q0709m1715K9172N0425K5435
124B1915m7343o1201N4182R9697m0509j38181l8900R6112J01768k993j03888n4821
136a14162R5391R6935o2348r6511L3615Q1367L528n0403m5754L504P0335M6499
148F1996n2205l8124O7856N3920n3319p1434k032N8274O6969r621r4095l1016
160d2831R0321N5384n4700l9573M0128M5932m748n9257o1818L1435R7908Q114
172A06295q9940k8944O4079M9834j0901n4388n1183L5843R5620o932j17314m3895
184e1826P9195O4313j8371n1816k2978M2083N5226l3100q0891L733O3974N789
196E5331m1789j8374P581K7173K3746l3663m4590M2042O0914m3298p8988N374
$$ plain form
208 -38541 17118 37278 6263 -44718 -43014 36216 71754 -12165 -78385 -19266 54223 32227
220 32227 -43010 -88240 -55640 30644 50180 -41443 -96612 -25439 49046 24993 -40342 -69258
232 -69258 -40967 12727 3247 -75987 -89848 -1080 40909 -19666 -64676 -39325 887 13623
244 13623 -17258 -67630 -58741 2976 4606 -56369 -67768 -16874 18617 12974 -19826 -51466 -28048
257 -28048 18958 -9620 -73258 -49355 22434 19629 -38766 -61432 -28692 31498 55424 -7718
269 -7718 -74277 -37960 31592 14114 -44921 -51437 -8972 33783 33306 -24060 -55038 8036 63998
282 63998 13236 -53413 -33139 19578 25917 -11668 -48664 -23523 57050 74435 -11929 -64108
294 -64108 -6769 51311 33447 -14069 -37561 -15812 35491 36805 -23743 -34383 34354 64336
$$ packed form
208c8541N5659K0160l1015n0981J704P9230L5538q3919o6220N9119P3489k1996
220C2227p5237m5230L2600Q6284J9536r1623n5169P1173P4485k4053o5335k8916
232f9258K8291N3694r480p9234j3861Q8768M1989o0575m5010K5351M0212J2736
244A3623l0881n0372Q889O1717J630o0975j1399N0894L5491n643l2800l1640K3418
257b8048M7006k8578o3638K3903P1789k805n8395k2666L2740O0190K3926o3142
269g718o6559L6317O9552j7478n9035o516M2465M2755m77n7366l0978O3074N5962
282F3998n0762o6649K0274N2717O339l7585l6996K5141Q0573J7385q6364n2179
294f4108N7339N8080j7864m7516k3492K1749N1303J314o0548j0640O8737K9982
$$ plain form
306 64336 14561 -27695 -18535 14305 34310 7316 -37229 -13981 50228 40087 -22296 -25064
318 -25064 21753 41152 24872 -4687 -25478 -829 35748 8918 -35684 -6953 47444 38421
330 38421 -7699 -27162 -5036 41616 50035 -16006 -61948 -4059 62003 30602 -33396 -38630
342 -38630 5504 49708 44689 -17585 -51083 3552 52009 14336 -37410 -29895 5691 26166
354 26166 15494 -22322 -27656 22868 41268 -13804 -44003 -3904 25897 8037 -20081 -32640
366 -32640 -15281 19073 13493 -28433 -22380 27406 26943 -21835 -41966 -24309 3817 20645 -5889
379 -5889 -48686 -28624 28235 18562 -35820 -38001 6620 31460 13562 -36169 -68992 -29197 27543
392 27543 12662 -34195 -25585 8637 9090 -9745 -26941 -29549 3450 28773 -11746 -59993 -37147
$$ packed form
306F4336m9775m2256R160L2840K0005k6994m4545K3248O4209j0141o2383k768
318b5064M6817J9399j6280k9559k0791K4649L6577k6830m4602K8731N4397r023
330C8421m6120j9463K2126M6652Q419o6041m5942N7889O6062l1401o3998n234
342c8630M4134M4204n019o2274l3498N4635M8457l7673n1746P515L5586K0475
354B6166j0672l7816n334N0524J8400n5072l0199M0099K9801j7860k8118j2559
366c2640J7359L4354n580m1926O053M9786m63m8778k0131J7657K8126J6828k6534
379e889m2797K0062N6859r673n4382k181M4621K4840j7898m9731l2823L9795N6740
392B7543j4881m6857Q610L4222M53j8835j7196k608L2999K5323m0519m8247K2846
$$ plain form
405 -37147 8390 7201 -13207 -15394 -1006 21845 17737 -33475 -57600 -7869 30408 -419 -34428
418 -34428 -25112 -1848 14711 12857 -14436 -18503 22582 33215 -16698 -45872 -18807 9896 12347
431 12347 -2172 -19382 -2199 41494 35851 -19762 -29460 15936 30473 -53 -22843 -19290 8325
444 8325 37156 20046 -20797 -4949 47928 48441 3240 -20013 -10798 11853 26896 3518 -25838
457 -25838 5952 60133 45571 -5988 -10237 20107 35270 25667 -3957 -21747 8940 40665
469 40665 13348 -19477 7591 48517 49045 24073 -3537 -12993 15049 33794 -1498 -27963 10429
482 10429 48138 28963 -2449 -4481 15636 40795 34590 -10790 -25373 15456 31377 -8533
494 -8533 -29128 128 33897 44558 22395 -18305 -18268 26853 30350 -20174 -37650 431 27594
$$ packed form
405c7147M5537j189k0408k187J4388K2851m108n1212k4125M9731L8277l0827l4009
418c4428R316K3264J6559j854k7293m067M1085J0633m9913k9174K7065K8703K451
431A2347j4519j7210J7183M3693n643n5613r698M5396J4537l0526k2790L553K7615
444H325K8831j7110m0843J5848N2877N13m5201k3253R215K2651J5043k3378k9356
457b5838L1790N4181j4562n1559m249L0344J5163r603k9624j7790L0687L1725
469D0665k7317l2825K7068M0926N28k4972k7610r456K8042J8745l5292k6465L8392
482A0429L7709j9175l1412k032K0117K5159o205m5380j4583M0829J5921l9910
494h533k0595K9256L3769J0661k2163m0700L7M5121L497n0524j7476L8081K7163
$$ plain form
507 27594 16256 -13156 -30692 -2311 44037 31976 -23811 -30075 7019 9994 -21006 -35541
519 -35541 -23235 8121 31327 4886 -36698 -21763 19764 11774 -25090 -32318 -13867 2108
531 2108 -1185 -33304 -49655 -6281 36027 8514 -34586 -24718 3542 2799 -18793 -41482 -38050
544 -38050 3559 23108 -17169 -46882 -14023 21799 12361 -14606 -29383 -18097 12586 10771
556 10771 -36705 -51219 -312 31973 5368 -19962 -11490 11227 24318 4382 -33878 -27286
568 -27286 22790 29390 -14957 -30348 -686 25949 27724 8261 -12451 6347 42519 24005
580 24005 -28023 -26033 20147 36033 16298 -3144 -980 28448 49634 20371 -15829 7830
592 7830 47209 31177 -7699 -13024 9973 37226 42842 11955 -7231 29764 61571 30371 -10362
$$ packed form
507B7594j1338k9412j7536K8381M6348j2061n5787o264L7094K975l1000j4535
519c5541J2306L1356K3206k6441m1584J4935M1527p990l6864p228J8451J5975
531B108l293l2119j6351M3374M2308k7513m3100R868K8260p43k1592k2689L432
544c8050M1609J9549m0277k9713L2859L5822r438k6967j4777J1286L0683j815
556A0771m7476j4514N0907L2285k6605k5330Q472K2717J3091j9936l8260O592
568b7286N0076O600m4347j5391K9662K6635J775j9463k0712J8798L6172j8514
580B4005n2028J990M6180J5886j9735j9442K164K9428K1186k9263l6200K3659
592G830L9379j6032l8876n325K2997K7253N616l0887j9186L6995L1807l1200m0733
$$ plain form
605 -10362 -2575 24442 33415 19769 -5639 -5412 36011 54810 17961 -7786 16957 38222 24969
618 24969 3195 -9727 -2422 22773 22653 -10820 -13561 28236 44052 14800 -10989 -12614 724
631 724 16089 3898 -29268 -24648 15083 16769 -17206 -23706 315 16877 12561 -12631 -40560
644 -40560 -29817 1295 -7752 -38875 -30260 906 6938 -9682 -28156 -33920 -9515 13197 -15863
657 -15863 -55693 -42798 -8858 -11718 -29688 -29982 -17618 999 4671 -25612 -48115 -23782 34
670 34 -19106 -41860 -34833 -18919 -7963 -7007 -23226 -26573 2417 11636 -22237 -43118 -24296 -7141
684 -7141 -8572 -16415 -26232 -20707 7804 14065 -13181 -21180 2524 9805 -7715 -19847 -21940 -12244
698 -12244 10068 11329 -11963 -10818 17820 22512 1073 -7962 -3502 6998 17474 5058 -22178
$$ packed form
605a0362P787K7017Q973j3646k5408K27M1423J8799l6849k5747K4743K1265j3253
618B4969k1774j2922P305K5195j20l3473k741M1797J5816k9252k5789j625J3338
631G24J5365j2191l3166M620L9731J686l3975o500K4021J6562m316k5192k7929
644d0560J0743L1112r047l1123Q615L1166O032j6620j8474n764K4405K2712k9060
657a5863l9830J2895L3940k860j7970k94J2364J8617L672l0283k2503K4333K3816
670C4j9140k2754P027J5914J0956R56j6219l347K8990R219l3873k0881J8822J7155
684g141j431p843r817N525K8511O261k7246p999K3704P281j7520j2132k093R696
698a2244K2312J261k3292J145K8638M692k1439r035M460J0500J0476j2416k7236
$$ plain form
711 -22178 -12116 26489 30788 4988 -378 11841 19285 20390 6721 -12266 -759 26871 18125
724 18125 -8514 -4197 18503 26042 20122 6391 -3425 12173 27308 2528 -23329 -2518 25890
737 25890 17865 -2753 -8177 -1384 17873 24641 -2270 -20814 1811 18707 -4244 -24999 -14281
750 -14281 5159 16147 6227 -20934 -24053 8413 19235 -13621 -31256 -11184 4790 -2237 -20324
763 -20324 -34388 -20357 14076 13977 -23636 -34851 -9386 1104 -13085 -23823 -24972 -13262 1238
776 1238 -13040 -43235 -32106 7617 12169 -17123 -32874 -25022 -8330 -1194 -20255 -40949 -21056
789 -21056 9516 -3477 -33962 -30475 -7252 3574 541 -16379 -29861 -13661 3543 -16711
801 -16711 -36070 -13538 12966 4504 -18087 -25920 -11280 16443 18082 -18353 -34891 -3321 17725
$$ packed form
711b2178J0062L8605M299k5800n366J2219P444J105j3669j8987J1507K7630q746
724A8125k6639M317K2700P539n920j3731r816J5598J5135k4780k5857K0811K8408
737B5890q025k0618n424O793J9257O768k6911j8544K2625J6896k2951k0755J0718
750a4281J9440J0988r920k7161l119L2466J0822l2856j7635K0072J5974p027j8087
763b0324j4064J4031L4433r9l7613j1215K5465J0490j4189j0738j149J1710J4500
776A238j4278l0195J1129L9723M552k9292j5751P852J6692P136j9061k0694J9893
789b1056L0572j2993l0485L487K3223J0826l033j6920j3482J6200J7204k0254
801a6711j9359K2532K6504q462k2591p833J4640K7723J639l6435j6538L1570K1046
$$ plain form
814 17725 -4084 -23207 -13328 7844 22275 12220 -17468 -18896 17442 29148 -3147 -21827
826 -21827 -5197 13116 14723 1648 -12051 3435 36179 29888 -10477 -18038 11180 25581 14787
839 14787 -557 -8692 2314 22810 17804 -1353 8722 31970 23491 147 -6038 1498 13973
852 13973 21745 6750 -10082 8559 32690 17557 -6653 1569 22680 27296 13309 -11685 -21054
865 -21054 5697 29679 13040 -8459 1691 17784 16117 6644 -4340 -5089 13796 19126 -9952
878 -9952 -26756 -1633 20161 11208 -2555 -4631 2110 13582 8846 -16436 -19616 6657 13009
891 13009 -10325 -20434 -8254 4669 11676 5198 -12982 -11245 8887 3515 -21948 -21584 554
904 554 6924 -3379 -16249 -21674 -2698 22084 10419 -21315 -21387 -1684 -72 -9280 -12473 -13731
$$ packed form
814A7725k1809j9123R879K1172J4431j0055k9688j428L6338J1706l2295j8680
826b1827J6630J8313J607j3075j3699J5486L2744o291m0365p561K9218J4401j0794
839A4787j5344q135J1006K0496n006j9157J0075K3248q479k3344o185P536J2475
852A3973P772j4995j6832J8641K4131j5133k4210Q222K1111M616j3987k4994r369
865b1054K6751K3982j6639k1499J0150J6093j667r473j0984p49J8885N330k9078
878i952j6804K5123K1794q953j3763k076O741J1472m736k5282l180K6273O352
891A3009k3334j0109J2180J2923P007o478j8180J737K0132n372k5463L64K2138
904E54O370j0303j2870n425J8976K4782j1665l1734p2J9703J612r208l193j258
$$ plain form
918 -13731 -6110 6909 -1152 -18132 -8256 10180 4700 -8685 -10664 -9975 -6728 -2054 -9300 -14925
932 -14925 4089 17538 -1759 -18633 -6946 7974 10166 4638 -11803 -21178 -3018 13752 709
945 709 -11044 1693 12591 8743 1518 -7194 -6490 12151 17801 -6456 -19731 -856 14087 8747
959 8747 2449 1957 5437 16493 13746 -7729 -11115 10394 16431 633 -4997 -50 4584 12632
973 12632 13520 2178 5315 20331 10554 -13405 -10427 10813 17626 9198 -5332 -12309 5711 29754
987 29754 19312 -8111 -5270 13152 13248 642 -8995 -11804 4622 23572 11705 -11449 -4033
1000 -4033 16663 14794 2572 -962 -1802 1121 2562 -10174 -14954 8465 24884 6465 -11725
1013 -11725 -4239 8710 11175 4146 -12089 -15914 3854 11087 -11564 -20670 2837 20713 14186
$$ packed form
918a3731P621J3019q061j6980R876J8436n480j3385j979O89L247M674p246n625
932a4925J9014J3449j9297j6874J1687J4920K192n528j6441r375J8160J6770j3043
945G09j1753J2737J0898l848p225q712P04J8641N650k4257j3275J8875J4943n340
959H747o298m92L480J1056k747k1475l386K1509O037j5798n630M947M634Q048
973A2632Q88j1342L137J5016r777k3959K978K1240O813q428j4530o977J8020K4043
987B9754j0442k7423K841J8422R6j2606r637k809J6426J8950j1867k3154P416
1000d033K0696j869j2222l534q40K923J441j2736m780K3419J6419j8419j8190
1013a1725P486J2949K465p029j6235l825J9768P233k2651r106K3507J7876o527
$$ plain form
1026 14186 -1403 -14916 -11395 8427 9442 -16625 -23204 1211 11236 -2841 -11548 -6894 5095
1039 5095 17409 7617 -18437 -21081 -955 1409 -11674 -11188 -1907 1610 2404 -2616 -9720 1197
1053 1197 15244 -563 -24691 -17567 1954 1960 -7673 -12206 -8133 9916 20727 -1092 -23600 -9539
1067 -9539 12200 7640 -9610 -19813 -17481 1155 16116 3261 -11616 1405 15219 3534
1079 3534 -10113 -9080 -4910 1188 3458 -7987 -12909 4545 14419 1767 -2203 8193 9138 -201
1093 -201 -6440 -12135 -7061 9611 10302 -8063 -7985 12501 16590 3894 -3160 -2059 5541 13625 1204
1108 1204 -20950 -13369 15147 19258 2559 -3134 1672 8682 14773 5819 -11515 -6673 10523 6619
1122 6619 -8099 -5526 4860 8528 10783 6109 -2343 3604 11725 -1679 -14207 -2305 9733
$$ packed form
1026A4186j5589j3513L521J9822J015k6067o579K4415J0025j4077q707M654J1989
1039E095J2314r792k6054k644K0126K364j3083M86R281L517P94n020p104J0917
1053A197J4047j5807k4128P124J9521Or633m533M073J8049J0811k1819k2508J4061
1067i539K1739m560j7250j0203K332J8636J4961j2855j4877J3021J3814j1685
1079C534j3647J033M170O098K270j1445m922J7454R874j2652l970J0396R45r339
1093b01o239n695N074J6672O91j8365P8K0486M089j2696p054J101P600Q084j2421
1108A204k2154P581K8516M111j6699n693M806P010O091q954j7334M842J7196l904
1122F619j4718K573J0386L668K255m674q452N947Q121j3404j2528J1902J2038
$$ plain form
1135 9733 3290 -3658 -4105 -915 10698 16444 -442 -12862 487 10497 7 -10330 -8756
1148 -8756 -3538 7100 10774 -4558 -11975 5220 14900 39 -10390 -6236 -2493 917 159 -10601
1162 -10601 -11331 6126 10976 -4550 -8830 1341 2797 -1750 -5595 -11208 -9097 3432 870 -14420
1176 -14420 -9546 8616 7052 -6101 -10221 -6583 314 5331 -6996 -23711 -12128 9562 5087
1189 5087 -11471 -11808 -2169 5849 7973 -5489 -20562 -10437 7896 993 -14077 -11659 -2292 1436
1203 1436 3597 -1222 -8337 -450 7484 -4335 -14364 -5068 482 -4885 -5527 -2064 -1159 4425 5095
1218 5095 -7754 -9739 6933 11234 -5850 -15085 -9167 -612 7507 4421 -10150 -8808 13093 17041
1232 17041 -4728 -14985 -5213 4844 7991 958 -14315 -12117 10093 14798 -1425 -5846 4789
$$ packed form
1135I733o443o948m47L190J1613N746j6886j2420J3349J0010j0490j0337J574
1148h756N218J0638L674j5332p417J7195R680j4861j0429M154L743L410p58j0760
1162a0601p30J7457M850j5526m280J0171J456m547l845n613K111J2529k562j5290
1176a4420M874J8162j564j3153m120L638O897N017j2327j6715J1583K1690m475
1189E087j6558l37R639Q018K124j3462j5073J0125J8333o903j5070K418R367L728
1203A436K161m819p115P887P934j1819j0029R296N550n367o42L463R05N584O70
1218E095j2849j985J6672M301j7084r235N918Q555Q119l086j4571J342K1901L948
1232A7041k1769j0257R772J0057L147p033j5273K198K2210M705j6223m421J0635
$$ plain form
1245 4789 7795 3706 -2233 -9760 -5302 9122 4990 -9764 -3529 12395 9604 -1557 -1769 1784
1259 1784 6285 7546 -5369 -16180 -1054 15777 5800 -9123 -4328 6703 12180 9659 -3879
1272 -3879 -12746 924 12433 -1971 -14723 -3660 8952 9009 3299 -4873 -6606 6154 11565 -4311
1286 -4311 -12584 -142 5790 -3463 -7275 -4590 1098 10255 9173 -8051 -11195 4560 7109 -7909
1300 -7909 -12501 -3311 4433 6541 -2241 -15775 -7807 14894 13083 -8891 -13830 -1866 3559 848
1314 848 -7824 -14661 -3838 14949 8595 -11970 -11157 3758 5582 -1019 -5473 -7445 -309 5968
1328 5968 -4842 -15595 -958 13844 4731 -7180 -3541 3089 4444 654 -10316 -11008 8527
1341 8527 16379 -2940 -15478 -2061 11877 11097 1988 -8083 -4525 12844 14723 -8170 -16195
$$ packed form
1245D789L006m089n939p527M458J4424m132j4754O235J5924k791j1161k12L553
1259A784M501J261j2915j0811J5126J6831r977j4923M795J1031N477k521j3538
1272c879q867J3670J1509j4404j2752J1063J2612N7n710q172j733J2760N411j5876
1286d311q273J2442N932r253l812K685N688R157j082j7224l144J5755K549j5018
1300g909m592R190P744K108q782j3534P968K2701j811k1974m939J1964N425k711
1314H48q672o837J0823J8787o354k0565Q13J4915J824o601m454j972P136O277
1328E968j0810j0753J4637J4802r113j1911L639O630J355l790j0970o92J9535
1341H527P852j9319j2538J3417J3938p80r109j0071L558J7369J879k2893q025
$$ plain form
1354 -16195 2969 15966 10121 1074 -4328 -23 13159 13380 -3542 -6083 8565 11854 1804
1367 1804 -1165 2072 5022 10307 8503 -24 4553 17040 10539 -4847 -2272 8331 9728 6924
1381 6924 2351 -1227 9095 19407 8168 -6591 2044 15819 12940 4250 -1537 -3317 5850 14772
1395 14772 4757 -5150 7724 20314 11353 -1292 -3191 728 8994 12514 809 -6933 5256
1408 5256 12295 2130 -2625 5779 10862 10228 5713 -6392 -9267 4431 9564 -3088 -5825 5976
1422 5976 9596 4347 -583 -4945 -1841 9932 7527 -9417 -12603 102 3867 -1548 -2518 -1774 1236
1437 1236 8371 4636 -10033 -9137 3242 848 -8979 -7968 -3240 509 5017 463 -9769 -4145
1451 -4145 8087 2829 -9580 -7969 -1817 -2207 -3575 -7212 -8988 2416 14131 3264 -10735 -5850
$$ packed form
1354a6195J9164J2997n845r047n402M305J3182K21j6922k541J4648L289j0050
1367A804k969L237K950N285j804q527M577J2487o501j5386K575J0603J397k804
1381F924m573l578J0322J0312j1239j4759Q635J3775k879q690n787j780R167Q922
1395A4772j0015r907J2874J2590q961j2645j899L919Q266L520j1705p742J2189
1408E256P039j0165m755Q404N083o34m515j2105k875J3698N133j2652k737J1801
1422E976L620n249m930m362L104J1773k405j6944l186J2705L765n415r70P44L010
1437A236P135l735j4669Q96J2379k394r827J011M728L749M508m554j0232N624
1451d145J2232n258j2409J611O152l90j368l637j776J1404J1715j0867j3999M885
$$ plain form
1465 -5850 3101 667 -4283 -8059 -8095 3015 9760 -3575 -13654 -200 13903 8125 -2019 -6056
1479 -6056 -5658 784 3708 -7098 -10014 6960 14738 3006 -4984 -1040 4815 7709 4720 -6473
1493 -6473 -7661 6556 8242 -5639 -6817 6416 12247 8434 2474 -3313 -251 10245 4876 -10738
1507 -10738 -7141 9723 11270 673 -3847 -308 8376 15237 4495 -11758 -5338 11510 8104
1520 8104 -6353 -8258 -1323 7481 12388 2877 -7420 1106 12449 2619 -11402 -6200 3743 4564
1534 4564 330 -6240 -7313 5655 13309 -617 -11188 -783 8362 1098 -8236 -11021 -6688 5329
1548 5329 7825 -6318 -11404 3940 9967 -2440 -10433 -5744 835 3861 -3145 -15702 -11955 7534
1562 7534 10132 -5866 -10686 -652 5180 2788 -4733 -13751 -8461 6428 3139 -12142 -9847 4558
$$ packed form
1465e850Q951k434m950l776l6J1110O745j3335j0079J3454J4103n778j0144m037
1479f056L98O442K924j0806k916J6974P778j1732p990L944N855K894k989j1193
1493f473j188J4217J686j3881j178J3233N831l813n960n787L062J0496n369j5614
1507a0738L597J6864J547j0597m520L539Q684O861j0742j6253O420J6848l406
1520H104j4457j905O935Q804M907r511j0297Q526J1343r830j4021N202R943Q21
1534D564m234o570j073J2968P654j3926j0571J0405R145p264r334k785M333J2017
1548E329K496j4143n086J5344O027j2407p993M689O579L026p006j2557L747J9489
1562G534K598j5998m820J0034N832k392p521r018N290J4889l289j5281K295J4405
$$ plain form
1576 4558 6643 -845 -5597 -5285 1896 8045 -2976 -17066 -7564 8405 5092 -5761 -6196 71
1590 71 6877 9527 -1356 -11373 -1260 9507 177 -10472 -5031 3607 6214 4174 -2152 -2815
1604 -2815 9166 12590 -3093 -11985 -130 9102 3923 -2454 -5669 -997 11104 13379 -750 -5841
1618 -5841 6538 10549 335 -5244 -3304 1156 7623 5931 -4143 -1622 12614 12101 -1727 -4257
1632 -4257 3154 5634 4037 -1671 -7937 -1426 11517 8183 -3501 -1021 8648 7913 1886 -3069 -6990
1647 -6990 -796 8213 1768 -8901 -1627 10112 7033 -1242 -2831 -1494 3922 7067 -2753 -13015
1661 -13015 -4960 5379 1330 -3445 -273 2959 4415 3625 -5438 -10872 -435 7017 -3035 -10806
1675 -10806 -4708 1175 2126 721 -4253 -4686 5674 7594 -7160 -14603 -5161 1406 -769 -2795 -4853
$$ packed form
1576D558K085p488m752L12P181O149j1021j4090R502J5969l313j0853m35O267
1590G1O806K650j0883j0017J0113J0767r330j0649N441Q638K607k040o326o63
1604b815J1981L424j5683q892J1855R232n179o377l215M672J2101K275j4129n091
1618e841J2379M011j0214n579J940M460O467j692j0074K521J4236n13j3828k530
1632d257P411K480j597n708o266O511J2943l334j1684K480R669p35o027m955l921
1647f990O194R009o445j0669P274J1739l079q275j589J337N416L145r820j0262
1661a3015Q055J0339m049m775L172L232J456p90r063n434J0437P452j0052p771
1675a0806O098N883R51j405m974m33J0360J920j4754p443R442O567k175k026k058
$$ plain form
1690 -4853 -3738 4040 4225 -7122 -7740 3875 4693 -5894 -10149 -7128 -1397 4438 575 -9237 -5099
1705 -5099 9024 6953 -6642 -8518 -1927 902 384 -4277 -9289 -1587 9755 4290 -8478 -5445
1719 -5445 4696 5269 641 -4461 -6762 516 7067 -2480 -11603 -1281 11940 8828 -732 -5075
1733 -5075 -4943 1433 6660 -1295 -7411 2403 8628 -705 -7289 -1947 4867 8847 7377 -3124 -7977
1748 -7977 1551 6180 -3394 -5827 3840 8397 4326 -1227 -5715 -2050 9363 8558 -4533 -6102 4915
1763 4915 5723 -3128 -5797 -2194 5666 11571 4008 -10231 -5852 9473 8619 -4480 -7778 -2138 4486
1778 4486 7006 -600 -9249 -2133 10320 4980 -6447 -4091 3636 4278 510 -6095 -9422 -413 8694
1793 8694 1720 -7071 -688 6076 867 -5247 -5988 -2774 4821 6582 -5218 -12208 -2425 5408 62
$$ packed form
1690d853J115P778J85j1347o18J1615Q18j0587m255L021N731N835l863r812M138
1705e099J4123k071j3595j876O591K829n18m661n012P702J1342n465j2768L033
1719e445J0141N73m628n102k301P278O551r547r123J0322J3221l112r560m343
1733e075J32O376N227p955o116R814O225r333o584N342O814L980j470j0501m853
1748g977R528M629r574k433R667M557m071n553m488L665J1413q05j3091j569J1017
1763D915Q08q851k669L603P860N905p563j4239M379J5325q54j3099l298N640O624
1778D486K520p606q649P116J2453n340j1427K356P727O42l768o605l327R009R107
1793H694o974q791O383O764n209o114p41L214P595J761j1800o990R783P833n346
$$ plain form
1808 62 -2765 1318 2888 2503 -1450 -10568 -9514 5137 9280 -2145 -7662 -2224 1955 1611 -611
1823 -611 -3834 -490 8898 4906 -11055 -11955 1530 7498 3804 -912 -3927 609 8674 3612 -8278
1838 -8278 -5125 7683 6880 -2432 -6219 -3264 3981 9683 3677 -6090 -303 10719 5665 -4150 -2716
1853 -2716 1874 2630 2477 -1298 -2670 6662 12746 2218 -6379 297 7252 5315 1098 -1340 -414
1868 -414 5608 6164 -3475 -4954 8391 14952 6287 -2260 -3606 -473 4809 5857 -2356 -2058 9125
1883 9125 9647 -1612 -5602 1416 7831 9955 4982 -5138 -6471 3791 5542 -2396 -2176 5651 7410
1898 7410 4429 -87 -5291 -2140 6985 5481 -4305 -3976 2712 1426 -2367 -1053 433 3596 6586
1913 6586 70 -8014 -2763 5018 257 -6874 -4121 246 2636 2678 -3215 -6357 1483 7398 -2309
$$ packed form
1808F2k827M083J570l85l953r118J054J4651M143j1425n517N438M179l44k222
1823f11l223L344R388l992j5961r00J3485N968l694m716l015M536Q065n062j1890
1838h278L153J2808q03r312l787K955P245N702o006r767N787J1022n054r815J434
1853b716M590P56j53l775j372R332O084j0528q597O676O955j937m217k438R26
1868d14O022N56r639j479J3345O561q665q547j346L133N282J048q213K98J1183
1883I125N22j1259l990P018O415K124m973j0120j333J0262J751p938K20P827J759
1898G410k981m516n204L151R125j504r786L29O688j286l793J314J486L163K990
1913F586o516q084N251P781m761p131K753M367K390M2n893l142P840N915r707
$$ plain form
1928 -2309 -9453 -3796 2235 332 -3200 -7110 -6260 3489 6808 -3962 -8930 -283 4411 -1374 -7206
1943 -7206 -8669 -5023 4159 4738 -6334 -10350 -557 4532 -625 -3754 -3592 -2808 8 -1585 -8940
1958 -8940 -7825 2184 4101 -2925 -3880 -1185 -1111 -358 -947 -5982 -4454 2669 710 -7146 -5305 614
1974 614 772 -98 69 -1734 -236 2011 -3458 -9524 -2368 5201 873 -5154 -4349 -579 4606 5914
1990 5914 -2488 -9132 194 8820 1449 -8311 -7508 -1078 5232 6330 -1804 -6361 2061 8913 404
2005 404 -6626 -2993 1795 2260 453 -4285 -4684 4524 7927 -486 -3880 2684 4772 340 -2785 -3628
2021 -3628 -2186 2707 3073 -3509 -2228 5790 5347 -1599 -2008 1628 2297 1360 -2971 -7399 -1760 7589
2037 7589 4100 -5440 -2906 3926 5481 2132 -3107 -7103 -1390 5867 -2 -8547 -3743 5203 4878
$$ packed form
1928b309p144N657O031j903l532l910Q50R749L319j0770m968Q647M694n785n832
1943g206j463L646R182N79j1072m016R793N089n157l129J62P84K816j593p355
1958h940J115J0009J917p026r55K695P4P53n89n035J528P123j959p856J841N919
1974F14J58q70J67j803J498K247n469o066P156P569m328o027Q05L770N185J308
1990E914q402o644R326Q626p371r760Q03O430O310J098q134m557Q422O852q509
2005D04p030L633M788M65j807m738l99R208L403q413l394O564K088m432l125q43
2021c628J442M893L66o582J281Q018m43o946m09L636O69r37m331m428N639R349
2037G589l489r540K534O832J555l349n239l996N713P257n869q545M804Q946l25
$$ plain form
2052 4878 129 -2352 -2682 2099 4777 -3874 -10435 -3173 5173 818 -4643 -4244 -260 4636 5028 -3716
2068 -3716 -8637 -392 4373 -2599 -8009 -4197 -111 1462 786 -3120 -3392 3729 3976 -5836 -8100 -1057
2084 -1057 1280 -2422 -4025 -4224 -994 4126 1844 -5974 -3661 4402 2167 -5704 -6410 -3059 -400
2099 -400 959 -2214 -5897 650 8691 1954 -7659 -5201 1435 3374 696 -5161 -7871 71 7261
2114 7261 1431 -6364 -1782 5434 4733 365 -4323 -6630 -294 5370 243 -5052 505 5245 2206
2129 2206 -441 -179 29 2592 4065 -1522 -4567 954 3087 -1331 -977 4330 5198 3626 989 -3064
2145 -3064 -1179 5644 4262 -4454 -3659 4490 5840 1527 -1597 -1994 2494 9515 5677 -5161 -5079 2981
2161 2981 4199 679 -1288 -1538 2112 6923 3726 -3580 -1948 4324 3068 -1989 -1026 -333 -45 1318
$$ packed form
2052D878m749k481l30M781K678q651o561P262Q346m355n461L99L984M896L92q744
2068c716m921Q245M765o972n410L812M086J573o76l906k72P121K47r812k264P043
2084a057K337l702j603j99L230N120k282p818K313Q063k235p871p06L351K659
2099d00J359l173l683O547Q041o737r613K458O636J939k678n857k710P942P190
2114G261n830p795M582P216p01m368m688k307O336N664n127n295N557M740l039
2129B206k647K62K08K563J473n587l045N521K133m418L54N307Q68j572k637m053
2145c064J885O823j382q716P95Q149J350m313l124l97M488P021l838j0838Q2Q060
2161B981J218l520j967k50L650M811l197p306J632O272j256n057R63O93K88J363
$$ plain form
2177 1318 63 -2867 1135 5598 1233 -2791 430 1416 -1686 -1996 -2763 -2697 1787 4190 -2468 -5555
2193 -5555 49 3182 -294 -2250 -2337 -2257 573 216 -6461 -7443 1122 4576 66 -3017 -2071 -1903 -422
2210 -422 -874 -5790 -5488 1854 1967 -5200 -6342 -1989 679 1504 -82 -3906 -3579 2122 -490 -7812
2226 -7812 -6546 671 2295 79 -1880 -4648 -2304 3468 1344 -5397 -4105 1672 1148 -2579 -3728
2241 -3728 -4456 -1030 4318 2981 -2555 -1058 2322 -656 -3045 -879 -137 -376 1390 542 -1643 1487
2257 1487 3931 -469 -1887 3400 4802 923 -2103 -3214 -1492 4487 5826 -990 -2454 5256 7291
2272 7291 1953 -2097 -2112 1537 7051 5326 -3804 -4956 4560 8502 3050 -291 702 3423 6411 4185
2288 4185 -3459 -3943 4265 5838 936 362 3215 2998 3244 2700 -248 859 5102 2076 -2783 446
$$ packed form
2177A318j255k930M002M463m365m024L221R86l102l10p67O6M484K403o658l087
2193e555N604L133l476j956q7Q0K830l57o677r82Q565L454m510l083R46J68J481
2210d22m52m916L02P342J13p167j142M353K668Q25j586l824L27N701k612p322
2226g812J266P217J624k216j959k768K344N772k124o741J292N777n24l727j149
2241c728p28L426N348j337n536J497L380k978k389K166P42k39J766q48k185L130
2257A487K444m400j418N287J402l879l026j111J722N979J339o816j464P710K035
2272G291n338m050j5L649N514j725r130j152R516L942n452l341R93K721K988k226
2288D185p644m84Q208J573m902n74K853k17K46n44k948J107M243l026m859L229
$$ plain form
2304 446 4858 1886 -1298 -299 1753 4665 5979 -91 -5892 -645 4681 906 -2977 -687 1729
2319 1729 2989 2323 -3162 -4982 2237 6560 34 -5254 -2944 -442 -404 -494 -2714 -2839 2863 3840 -3374
2336 -3374 -6011 -713 1447 -989 -1724 -2908 -2696 361 -522 -5854 -4077 3531 3466 -2870 -4595 -3008
2352 -3008 -1215 1456 -722 -6012 -4035 3017 1355 -4331 -3574 133 998 1205 -779 -4514 -2355 2731
2368 2731 208 -4499 -1483 2478 1029 57 -345 -821 1370 3768 -1138 -4855 406 4395 1076 -1408
2384 -1408 -41 1112 2961 4168 399 -1619 3737 6049 -103 -2853 468 3101 4456 5033 688
2399 688 -823 4325 6653 1868 -54 3072 3354 3002 3120 711 -360 4137 5882 2537 2433 5190
2415 5190 3207 610 1556 2336 1774 3870 2641 -1365 980 6423 4369 201 1088 2902 2414 2752
$$ packed form
2304D46M412k972l184R99K052K912J314o070n801N247N326l775l883K290K416
2319A729J260o66n485j820P219M323o526n288K310K502L8r0k220j25N702R77p214
2336c374k637N298K160k436p35j184K12L057q83n332J777P608o5o336j725J587
2352c008J793K671k178n290J977P052j662n686P57L707Q65K07j984l735K159N086
2368B731k523m707L016L961j449r72m02m76K191K398m906l717N261L989l319k484
2384a408J367J153J849J207l769k018N356K312o152k750L321K633J355N77m345
2399F88j511N148K328m785j922L126K82l52J18k409j071M497J745l345j04K757
2415E190j983k597R46P80n62K096j229m006K345N443k054m168Q87J814m88L38
$$ plain form
2431 2752 257 -3358 333 5577 2309 -2639 51 3262 3177 2023 -623 -3532 -635 3880 217
2446 217 -4853 -1900 1744 1314 713 -445 -2615 -742 2067 -1477 -4781 -1628 -548 -2803 -2661 -640
2462 -640 -1147 -526 373 -3093 -4107 -212 172 -4835 -5526 -2380 -1604 -1682 -1352 -3494 -3220 993 903 -4768
2480 -4768 -4933 -1692 -1915 -3343 -3021 -4054 -2946 1284 543 -4447 -3512 879 -4 -2618 -3367 -4452 -3267
2497 -3267 711 88 -4041 -2230 2341 560 -2282 -1395 -580 -641 154 -1357 -4331 -1290 3040 596
2513 596 -2345 60 2495 1615 1109 -1233 -3755 268 4444 231 -3415 14 2480 1480 1527 1622 308
2530 308 2676 2949 -1475 -3380 1880 3721 370 -70 1395 1881 2679 2934 -300 -797 4190 3395 -1961
2547 -1961 -1983 1218 1864 1812 2200 -81 460 4385 2577 -2293 -1070 2764 1909 -428 -903 -1389 425
$$ packed form
2431B752k495l615L691N244l268m948K690L211q5j154k646k909K897M515l663
2446B17n070K953L644m30o01j158k170J873K809l544l304L153J080k255J42K021
2462f40n07O21Q99l466j014L895L84n007o91L146P76p8L30k142K74M213r0n671
2480d768j65L241k23j428L22j033J108M230p41m990R35M391q83k614p49j085J185
2497c267L978o23m129J811M571j781k842Q87Q15o1P95j511k974L041M330k444
2513E96k941K405K435q80n06k342k522M023M176m213l646L429K466j000M7R5j314
2530C08K368K73m424j905N260J841l351m40J465M86P98K55l234m97M987p95n356
2547a961k2L201O46n2L88k281N41L925j808m870J223L834q55k337m75m86J814
$$ plain form
2564 425 4285 2704 -2496 -951 3010 1457 -760 -829 -1196 -626 1942 -238 -3394 118 3829 1105
2580 1105 -1719 -633 -302 -1131 -492 -1494 -2939 226 2321 -2247 -4479 87 2154 661 -243 -1720
2596 -1720 -3375 -772 696 -3193 -3636 1681 2579 -1335 -2282 -1573 -858 1936 2016 -2700 -4050 94 179
2613 179 -3208 -1638 1209 929 1302 304 -2848 -1739 2434 1450 -2574 -1389 995 -265 -455 565
2629 565 -2 1526 3984 1430 -2772 -243 2516 924 -558 676 61 552 3121 1446 -699 2204
2645 2204 4936 838 -1387 30 935 1244 3253 1213 -1395 1768 4457 1560 791 2920 1911 1134
2661 1134 1239 -130 -1433 2514 4737 1138 267 2665 2315 609 2035 1736 531 1953 2137 -1971
2677 -1971 -1540 2490 3166 1579 1527 1696 77 1366 1148 -1197 -777 2840 1430 -2341 -834 1797 1575
$$ packed form
2564D25L860j581n200J545L961j553k217o9l67N70K568k180l156L512L711k724
2580A105k824J086L31q29O39j002j445L165K095m568k232M566K067j493r04j477
2596a720j655K603J468l889m43N317Q98l914r47P09P15K794Q0m716j350M144Q5
2613A79l387J570K847k80L73r98l152J109M173r84m024J185K384j260j90J020
2629E65n67J528K458k554m202K529K759j592j482J234o15M91K569j675k145K903
2645B204K732m098k225J417R05L09K009k040k608L163K689k897p69K129j009p77
2661A134J05j369j303L947K223l599q71K398l50j706J426k99j205J422J84m108
2677a971M31M030O76j587n2J69j619J289k18k345M20L617j410l771J507K631k22
$$ plain form
2694 1575 2116 1505 -1644 -1490 1970 152 -3075 -1184 1254 216 -246 95 -1652 -199 3361 933
2710 933 -2740 -1358 -82 -1783 -1486 -24 -1252 -657 1545 -430 -2758 151 1907 -918 -1508 -1458
2726 -1458 -1932 -1677 691 -364 -2266 987 2181 -1739 -2550 -115 332 -33 -84 -1953 -3039 352 1934
2743 1934 -1086 -1376 1516 1211 -576 -363 -1258 -1483 1791 2394 -2015 -2354 1249 1690 -132 685 472
2760 472 189 1404 1213 -2496 -1223 2772 1865 -981 88 1127 557 1802 1597 -888 392 3571
2776 3571 913 -2420 -187 2628 2017 1158 738 -1247 690 4226 1579 -1901 289 2320 509 -95
2792 -95 184 -547 1402 3216 425 -1884 1516 2684 -71 -155 1092 275 363 599 -1302 -1196 2770 3579
2810 3579 -954 -1570 975 1382 601 666 -1584 -1605 1977 1851 -2372 -1655 2249 2026 294 86 -1398 -1073
$$ packed form
2694A575N41o11l149J54L460j818l227J891K438j038m62L41j747J453L560k428
2710I33l673J382J276j701K97J462j228N95K202j975k328K909J756k825n90N0
2726a458m74K55K368j055j902L253J194l920q11K435M47l65n1j869j086L391J582
2743A934l020k90K892l05j787K13q95k25L274O03m409l39L603M41j822Q17k13
2760D72k83J215j91l709J273L995r07k846J069J039n70J245k05k485J280L179
2776C571k658l333K233K815o11q59m20j985J937L536k647l480K190K031j811o04
2792i5K79p31J949J814k791k309L400J168k755q4J247q17Q8K36j901J06L966Q09
2810C579m533o16K545M07p81O5k250k1L582j26m223P17L904k23j732k08j484L25
$$ plain form
2828 -1073 1448 612 -2308 -1073 1823 321 -1574 -568 825 348 1245 -60 -3004 -1143 1988 -267
2844 -267 -2731 -128 1305 -112 416 -377 -1546 422 2611 -934 -3763 -411 901 -596 -738 -186
2860 -186 -751 1067 2247 -1218 -3042 615 1727 -859 -1840 -876 -1153 577 1548 -846 -1467 1960 1590
2877 1590 -1913 -1356 424 -378 -381 -68 -1306 -1150 2000 1394 -2124 -834 1951 749 -707 -730 -1565 -955
2895 -955 1459 516 -2361 -420 2656 542 -1110 4 256 -267 854 -295 -2754 -739 2242 324
2911 324 -1479 657 584 40 1004 115 -2163 -297 1759 -683 -1595 409 564 -651 1249 1315 -882
2928 -882 132 1334 -857 -1751 921 703 -952 -319 83 -609 818 2262 -616 -1990 813 1201 -1030
2945 -1030 -839 -422 -1111 958 1987 -865 -1929 1362 1524 -566 -562 132 -932 -652 353 -1613 -1455
$$ packed form
2828a073K521q36k920J235K896j502j895J006J393m77Q97j305k944J861L131k255
2844b67k464K603J433j417N28p93j169J968K189l545k829L352J312j497j42N52
2860a86n65J818J180l465j824L657J112k586r81R64k77J730R71k394o21L427l70
2877A590l503N57J780q02lL13j238J56L150o06l518J290K785j202j456k3q35O10
2895i55K414r43k877J941L076k114j652J114K52n23J121j149k459K015K981j918
2911C24j803K136p3n44R64q89k278J866K056k442r12K004J55j215J900O6k197
2928h82J014J202k191q94K672k18j655O33M02o92J427J444k878j374K803L88k231
2945a030J91M17o89K069J029k852j064L291J62k090MO94j064K80J005j966J58
$$ plain form
2962 -1455 1426 1033 -1985 -954 725 -20 -356 -273 -1590 -1543 948 -124 -3206 -1279 1528 188 -642
2979 -642 -601 -1632 -1344 664 -787 -3151 -1311 1033 -959 -2189 -876 -873 -378 909 -1109 -3563 -1372
2996 -1372 502 -1574 -2755 -1362 -618 -664 -86 -1080 -2994 -213 985 -2164 -3507 -707 -239 -1619
3012 -1619 -1434 -1737 -1997 340 1443 -2254 -2841 400 241 -1821 -1843 -1519 -1563 302 572 -2263 -1772 1834
3030 1834 934 -2000 -1310 59 -263 -517 -472 -2526 -1223 2146 723 -2025 -84 2029 408 -463 -550
3047 -550 -1387 -120 1923 -92 -1912 475 2694 427 -327 562 786 733 1504 -945 -2310 1201 2919
3064 2919 61 -787 1284 1767 1505 1769 -122 -1214 1838 2806 -180 -1042 1059 1493 1062 2477 1402
3081 1402 457 2500 2303 -904 -704 1767 1808 443 1412 1223 357 2418 1883 -713 135 2858 1698
$$ packed form
2962a455K881l93l018J031J679p45l36Q3j317M7K491j072l082J927K807j340q30
2979f42M1j031K88K008j451k364J840K344j992j230J313LM95J287k018k454K191
2996a372J874k076j181J393P44m6N78r94j914K781J198l149j343K800M68j380
3012a619J85l03k60K337J103l697n87L241j59k062k2L24m4J865K70k835M91L606
3030A834r00k934O90J369l22k54M5k054J303L369j423k748J941K113j621q71q7
3047e50q37J267K043k015j820K387K219k267p54Q89K24n3P71k449j365L511J718
3064B919k858q48K071M83k62K64j891j092L052R68k986q62K101M34m31J415j075
3081A402r45K043j97l207K00K471M1j365R69j89q66K061n35k596Q48K723j160
$$ plain form
3098 1698 -978 -371 564 265 1867 1295 -369 518 3168 862 -1735 13 1159 212 -114 -190 -1141
3115 -1141 568 2403 -150 -2297 650 2475 112 -1134 -1010 -1108 332 1332 -1293 -2546 781 2422
3131 2422 -269 -1422 -692 -777 -35 675 -1144 -2243 199 746 -1433 -1597 28 217 59 973 -1138
3148 -1138 -2459 -430 -205 -1773 -731 1062 65 -1181 -229 -919 -617 1203 951 -1697 -1045 870 -186
3165 -186 -1926 -816 438 526 2153 876 -2532 -1407 1858 1025 -1013 147 233 -407 913 837 -866
3182 -866 273 2579 1122 -845 573 947 376 673 608 -793 1056 2662 560 -1040 1676 2653 480
3199 480 315 469 5 1209 2320 -5 -1521 1444 2291 429 558 1318 321 757 1284 -753 -1300 1614
3217 1614 2243 -218 -302 779 192 35 1060 -281 -575 1464 463 -2235 -1577 831 667 7 372
$$ packed form
3098A698k676O07R35k99J602n72j664Q87K650k306k597J748J146r47l26p6r51
3115a141J709J835k553k147K947J825k363j246J24r8J440J000k625j253L327J641
3131B422k691j153P30q5P42P10j819j099K442N47k179j64J625J89j58R14k111
3148a138j321K029K25j568J042J793r97j246R52o90L02J820k52k648O52J915j056
3165a86j740J110J254Q8J627j277l408J125L265q33k038J160Q6o40J320p6j703
3182h66J139K306j457j967J418L74n71K97o5j401J849J606k102j600K716R77k173
3199D80j65J54m64J204J111k325j516K965Q47j862J29P60r97M36N27k037n47K914
3217A614O29k461q4J081n87j57J025j341k94K039j001k698O58K408j64o60L65
$$ plain form
3234 372 -505 -898 674 -303 -3008 -1490 1545 444 -1799 -1800 -1557 -645 1432 310 -2917 -1340 923
3251 923 -417 -2623 -1680 -1447 -1016 249 -775 -2609 -1286 981 -1093 -2494 -919 -488 -1506 -1299
3267 -1299 -1577 -2122 -570 409 -1693 -2422 406 578 -1796 -1956 -885 -1299 -361 -281 -2297 -1623 1709 1051
3285 1051 -1890 -2083 -87 645 745 6 -2602 -2088 1591 1516 -1115 -989 1328 989 795 285 -1229 -712
3303 -712 2109 1248 -1018 -406 1234 614 17 1088 379 764 1937 195 -1440 337 2109 563 -324
3320 -324 779 1327 998 1682 207 -880 1469 2949 -26 -1488 580 1214 861 808 -53 -309 1964
3337 1964 2822 -269 -1430 909 1619 -129 -97 83 -324 1058 1493 -1192 -999 1981 1650 -1035 -865
3354 -865 178 283 889 439 -2006 -1141 1895 858 -1766 -724 457 -97 329 -405 -1789 -1124 965
$$ packed form
3234C72q77l93J572r77k705J518L035j101k243jK43R12K077j122l227J577K263
3251I23j340k206R43K33M31J265j024j834J323K267k074j401J575M31j018K07
3267a299k78n45J552R79k102p29K828J72k374j60J071m14R38Q0k016O74L332o58
3285A051k941j93J996P32J00p39k608N14L679p5k631J26K317l39j94n10j514N17
3303g12K821q61k266O12J640o20n97J071p09L85J173j742j635J777J772j546q87
3320c24J103N48l29O84j475j087K349J480k975j462K068O34l53n3q61k56K273
3337A964Q58l091j161K339P10j748L2J80m07J382M35k685J93K980l31k685J70
3354h65J043J05O06m50k445Q65L036j037k624J042J181n54M26p34j384O65K089
$$ plain form
3371 965 -50 -1923 -281 1017 -649 -852 -282 -1184 -657 796 -719 -2239 -523 965 -963 -1393
3387 -1393 114 -354 -528 282 -807 -2014 344 576 -1698 -1900 151 628 176 -152 -1026 -1383 1251
3404 1251 1703 -1008 -1753 351 690 -17 -20 -812 -617 1724 1823 -418 -1114 740 573 -282 496 323 -121
3423 -121 1064 1186 -794 -488 1885 1460 284 1005 676 -337 268 1238 -29 978 1864 600 -855
3440 -855 1047 2208 480 518 567 18 916 2346 -19 -1691 451 2318 1243 988 378 -772 325
3457 325 2158 646 -1115 289 1372 637 442 930 -141 317 1191 219 -868 837 1206 -691 -857
3474 -857 196 -29 658 1397 176 -959 1095 793 -1345 -1073 983 556 -242 -324 -601 -1316 975 916
3492 916 -1233 -483 1044 460 -1440 -1354 -1188 -478 1568 1128 -1740 -1596 405 -102 -1069 81 144 -803
$$ packed form
3371I65j015j873J642J298j666k03N70r02N27J453j515j520J716J488j928m30
3387a393J507m68j74Q10j089j207K358K32k274k02K051M77m52l28q74l57K634
3404A251M52k711p45K104L39p07lp92J95K341R9k241o96J854j67q55P78j73m44
3423a21J185J22j980L06K373m25j176P21l29j013O05R70j267J007Q86j264j455
3440h55J902J161j728L8M9n49Q98J430k365j672K142J867j075k55o10j150J097
3457C25J833j512j761J404J083p35j95M88j071M58Q74r72j087J705L69j897j66
3474h57J053k25O87P39j221j135K054l02k138K72K056m27p98q2k77p15K291n9
3492I16k149P50J527n84j900Q6J66P10K046m40k868J44K001n07r67J150O3r47
$$ plain form
3510 -803 -501 -1047 -1983 -126 1420 29 -1810 -117 865 -41 -593 -1202 -1818 378 1550 -656 -2154
3527 -2154 -417 1054 272 269 10 -757 234 973 -634 -1417 784 1244 -495 -762 267 939 1137 1269
3545 1269 -975 -1575 1075 1567 -367 -280 667 303 71 659 116 359 2491 1361 -1632 -534 1358
3562 1358 862 -251 207 395 1537 2092 506 -2028 -156 2427 1724 -12 -174 -40 -105 1308 529
3579 529 -256 1254 2390 229 -1303 125 846 705 823 300 -926 743 1936 -179 -1004 573 1420
3596 1420 567 208 -102 -984 379 627 -630 -723 1440 793 -929 -563 461 49 233 496 -1460 -1143
3614 -1143 1589 969 -1154 -1090 -88 -6 803 870 -1013 -1236 261 -588 -1791 -490 1094 291 -443 -138
3632 -138 -1040 -663 906 -152 -1189 -47 1020 -180 -1503 -546 -476 212 1468 561 -1342 -285 653
$$ packed form
3510h03L02n46r36J857J546j391j839J693R82r06n52o09o16K196J172k206j498
3527b154J737J471p82lk59p67R91P39j607p83K201M60j739k67J029O72J98J32
3545A269k244o00K650M92j934Q7R47l64k32N88n43K43K132j130k993J098J892
3562A358m96j113M58J88J142N55j586k534J872K583p03j736j62J34o5J413p79
3579E29p85J510J136k161j532J428P21j41J18n23j226J669J193k115q25J577Q47
3596A420q53l59l10q82J363K48j257r3K163o47j722L66J024m12J84K63j956L17
3614a143K732o20k123O4J002Q2Q09O7j883k23J497q49j203J301J584q03p34L05
3632a38r02L77J569j058j037J142J067j200j323R57P0O88J256r07j903J057R38
$$ plain form
3649 653 -884 -886 551 767 -223 222 -953 -1236 670 1696 -439 -940 465 599 -375 496 -242 -689
3667 -689 807 1293 -355 -567 1048 417 -296 470 -40 -211 774 1018 -820 -576 1113 744 -182 456
3685 456 600 -364 311 561 -1126 -590 1122 478 -418 418 867 -234 141 426 -392 344 1628 -94
3703 -94 -1633 -551 693 247 274 346 -697 175 1219 180 -1675 -94 1050 351 -310 -220 -550 -196
3721 -196 655 -201 -1163 339 1255 -554 -1424 -355 -301 -387 470 -518 -1216 352 745 -954 -1228 268 6
3740 6 -677 -122 -661 -1121 79 282 -1360 -894 709 320 -937 -660 -630 -953 251 352 -1293 -1128 873
3759 873 61 -1181 -252 -179 -649 91 5 -1345 -832 671 -237 -1539 -371 545 -99 150 -384 -1261 -394
3778 -394 1103 -188 -1856 -181 282 -281 -256 -552 -952 149 997 -759 -1567 -43 854 -346 -597 -283
$$ packed form
3649F53j537kJ437K16r90M45j175k83J906J026k135n01J405J34r74Q71p38m47
3667f89J496M86j648k12J615o31p13P66n10j71R85K44j838K44J689l69r26O38
3685D56J44r64O75K50j687N36J712o44q96Q36M49j101L75K85q18P36J284j722
3703i4j539J082J244m46K7P2j043Q72J044j039j855J581J144o99o61R0l30L54
3721a96Q51q56r62J502R16j809q70J069N4q6Q57r88o98J568L93j699k74J496k62
3740Fo83N55n39m60J200K03j642M66J603l89j257K77L0l23J204J01j645J65K001
3759H73q12j242R29P3m70P40q6j350N13J503r08j302J168R16o44K49n34q77Q67
3778c94J497j291j668J675M63n63K5k96m00J101Q48j756q08J524Q97j200k51L14
$$ plain form
3796 -283 -151 271 467 -994 -1324 793 1140 -661 -695 133 -470 -277 486 -504 -374 862 493 -1324 -658
3815 -658 1184 413 -517 -166 -431 -429 971 271 -1312 -210 1897 832 -511 -59 -117 144 914 370 -1084
3834 -1084 1 1378 559 -583 91 446 513 796 181 -598 18 1157 111 -392 714 1082 209 472
3852 472 287 -263 419 980 -139 -427 1183 909 -566 -718 402 676 667 448 -731 -649 961 1223 -1139
3871 -1139 -634 608 409 698 231 -732 -602 1224 753 -860 -391 562 13 -341 -34 -425 -700 775
3889 775 157 -1001 -134 405 -870 -949 120 -215 -768 115 -13 -1046 -285 398 -381 -494 4 -278 -831
3908 -831 -292 -229 -1124 -24 951 -649 -857 135 53 -906 -366 -75 -953 -36 469 -734 -1141 -103 90
3927 90 -327 -303 -112 -658 375 303 -1159 -960 592 673 -528 -187 340 -225 171 550 -443 -419 1463 594
$$ packed form
3796b83J32M22J96j461l30K117L47j801l4Q28o03J93P63r90J30J236l69j817O66
3815f58J842p71r30L51k65KJ400p00j583J102K107j065j343M52n8K61P70n44j454
3834a084J085J377q19j142O74L55O7K83o15p79O16J139j046n03J106L68q73K63
3852D72j85n50O82N61j119k88J610k74j475j52J120K74rk19j179Q2J610K62k362
3871a139N05J242j99K89m67r63J30J826m71j613M69R53n49l54L07l91k75J475
3889G75o18j158Q67N39j275p9J069l35n53Q83j28j033P61O83p79j13M98k82n53
3908h31N39O3q95J100R75j600k08R92q2r59N40K91q78R17N05j203m07J038J93
3927I0m17K4J91n46J033p2j462J99J552Q1j201L41N27n65L96L79r93K4J882q69
$$ plain form
3947 594 -510 -519 250 408 759 1174 -266 -59 1214 899 -510 315 1188 540 631 821 -151 -189 1015 754
3967 754 206 1145 1356 -38 -32 899 577 -1 510 626 -72 890 1248 -361 -438 1000 894 531 472 -25
3987 -25 -674 764 1336 -98 -610 836 1120 626 510 -462 -1046 251 1279 -56 -837 462 325 -214
4005 -214 -63 -501 -853 202 933 -710 -1043 28 -174 -991 -24 304 -254 110 -317 -1404 -891 357
4023 357 -241 -1116 -593 -137 -862 -816 -320 -1029 -239 895 -407 -1667 -633 -56 -592 -1016 -499 -667 -140
4042 -140 276 -802 -1830 -236 477 -558 -709 -63 -942 -313 229 -743 -904 174 1054 -464 -655 183
4060 183 -196 -445 155 -427 -545 899 1127 -522 -906 477 446 259 235 -123 -281 583 638 -915 -333 1161
4080 1161 654 337 530 660 101 394 467 51 531 1586 428 -840 40 1141 688 588 986 -203
$$ packed form
3947E94j104rP69J58L51M15j440K07J273l15j409Q25Q73o48R1J90r72l8J204k61
3967G54n48R39K11j394OR31l22n78N11J16o98R62L58j609p7J438j06l63n9m97
3987b5o49J438N72j434n12J446K84m94j16r72n84J297J028j335p81J299j37n39
4005b14J51m38l52J055P31j643l33J071k02q17R67L28n58L64m27j087N13J248
4023C57n98q75N23M56p25M6M96p09P90J134j302j260J034N77n36m24N17j68N27
4042a40M16j078j028J594P13j035j51O46q79O29N42r72j61J078Q80j518j91Q38
4060A83l79k49O00n82j18J444K28j649l84J383l1j87k4l58j58Q64N5j553N82J494
4080A161n07l17J93J30n59K93P3m16M80J055j158j268Q80J101m53j00L98j189
$$ plain form
4098 -203 325 1268 -16 -497 975 1146 451 112 340 -25 404 1275 -2 -845 507 854 44 166 217
4117 217 -146 359 732 116 -527 249 440 -710 -128 333 -609 -655 224 -194 -535 477 156 -1106 -660
4136 -660 345 -249 -764 -541 -1092 -777 58 -253 -1440 -569 369 -849 -1174 -504 -930 -822 -181 -492 -1691
4155 -1691 -945 208 -888 -1442 -589 -583 -988 -371 -929 -1846 -1289 -155 -787 -1173 -942 -597 -948 -242 -231 -1277
4175 -1277 -600 185 -682 -1315 -358 -361 -822 -63 70 -823 -382 259 -548 -657 341 45 -711 -84 377 -485
4195 -485 133 668 -146 -315 873 201 -329 -52 435 34 160 682 72 -102 1016 1087 -129 119 916
4214 916 374 496 656 -12 -27 1172 1219 -340 409 903 761 798 839 96 113 946 762 -288 291 1443
4234 1443 581 425 709 395 380 860 741 -417 505 1282 272 62 872 385 39 780 327 -282 273
$$ packed form
4098b03N28R43j284m81J472J71o95l39K28l65M29Q71j277q43J352L47q10J22N1
4117B17l63N05L73o16o43P76J91j150N82M61r42m6Q79m18l41J012l21j262M46
4136f60J005n94n15K23n51L15Q35l11j187Q71R38j218l25O70m26J08O41l11j199
4155a691P46J153j096n54Q53Om05O17n58r17N57J134o32l86K31L45l51P06J1j046
4175a277O77P85q67o33R57lm61P59J33q93M41O41q07j09R98k96p56O27M61q62
4195d85O18N35q14j69J188o72n30K77M87m01J26N22o10j74J118P1j216K48P97
4214I16n42J22J60o68j5J199M7j559P49M94j42L7M1p43J7Q33j84j050N79J152
4234A443q62j56K84l14j5M80j19j158R22P77j010k10Q10m87l46P41m53o09N55
$$ plain form
4253 273 948 -66 -239 751 327 -109 60 471 -108 660 602 -847 -482 732 53 -740 -194 -344 -330 257
4273 257 130 -889 -930 315 221 -750 -586 -332 -470 -391 -180 -800 -907 428 -132 -930 -837 -147 -492 -445 -367
4294 -367 -1261 -825 254 -226 -1054 -579 343 -291 -646 -230 -640 -572 212 -292 -1148 3 461 -569 -912
4313 -912 126 -145 -304 -9 -463 -847 165 773 -562 -383 658 117 -67 626 215 -441 417 638 -714
4332 -714 -411 777 749 -106 373 258 84 887 653 -163 170 1095 685 -397 193 786 434 742 753 -37
4352 -37 91 1041 254 -71 958 819 23 277 839 172 228 1041 446 -117 575 830 -311 -17 499 169
4372 169 519 910 -227 -736 619 873 -198 51 427 -322 141 712 -42 -545 450 811 -253 -114 465
4391 465 148 -198 509 -313 -1003 27 580 -646 -228 697 -503 -588 295 -291 -773 172 177 -975 -504 127
$$ packed form
4253B73O75j014j73R90m24m36J69M11n79P68n8j449L65J214o79p93N46j50J4N87
4273B57j27j019m1J245r4r71J64K54j38P9K11o20j07J335n60p98R3O90l45M7P8
4294c67q94M36J079m80q28M75R22o34l55M16m10O8P84n04q56J151M58j030l43
4313i12J038k71j59K95m54l84J012O08j335J79J041n41j84O93m11o56Q58K21j352
4332g14L03J188k8q55M79j15j74Q03k34q16L33R25m10j082N90N93l52L08J1p90
4352c7J28R50p87l25J029j39p96K54N62o67N6Q13n95n63O92K55j141K94N16l30
4372A69L50L91j137n09J355K54j071K49L76p49M63N71p54n03R95L61j064J39N79
4391D65l17l46P07q22o90J030N53j226M18R25j200q5Q83n86m82R45Nj152M71O31
$$ plain form
4411 127 -563 -680 170 -192 -807 -276 -280 -849 -496 330 -558 -598 -61 -352 -850 -270 133 -877 -373 274 -425
4432 -425 -1311 -70 -251 -576 -291 285 -834 -633 389 -425 -872 -103 467 -724 -283 -558 -636 -91 356
4451 356 -196 -882 165 420 -465 -150 133 -530 16 762 -388 -992 374 899 -280 -124 7 172 90
4470 90 750 245 -380 341 687 -269 -208 621 171 65 497 297 -158 620 918 -454 289 1051 72 -507
4490 -507 486 757 452 1054 269 -740 48 1222 487 168 637 454 17 709 432 -398 153 974 340
4509 340 -668 401 137 -236 461 405 -14 182 603 -161 -408 700 497 -173 157 -36 -572 167 690
4528 690 -417 -627 729 330 -424 -46 141 9 365 408 -854 -536 347 321 -666 -811 114 -351 -245 -219
$$ packed form
4411A27o90j17Q50l62o15N31mn69L53Q26q88m0N37k91m98N80M03j010N04O47o99
4432d25q86J241j81l25K85N76j119K01J022q14m47P69N70j191M41k75p8N45M47
4451C56n52o86J047K55q85L15K83o63N46P46j150o04J366N25j179J56J31J65q2
4470I0O60n05o25P21L46r56O1Q29m50j06M32k00m55P78K98j372P43P62r79n79
4490e07R93K71l05O02p85j009P88J174p35l19M69j83m37O92k77q30N51Q21o34
4509C40j008J069k64l73O97n6m19J96M21p64k47J108k03o70L30j93n36P39N23
4528F90j107k10J356l99p54L78J87j32L56M3j262L18Q83k6r87j45R25m65J06K6
$$ [...]
8191b59
##END NTUPLES=NMR FID
##END=
