##TITLE=1H_TG-2288
 CDCl3, 8 sc, 
 2.6.2020
##JCAMPDX= 6.0         $$ Bruker NMR JCAMP-DX V2.0
##DATA TYPE= NMR FID
##DATA CLASS= NTUPLES
##ORIGIN= UXNMR, Bruker Analytische Messtechnik GmbH
##OWNER= root
$$ XWIN-NMR		Version 3.5
$$ Tue Jun  2 11:46:27 2020 Russian Standard Time (UT+4h)  she@DPX200
##.OBSERVE FREQUENCY= 200.1315
##.OBSERVE NUCLEUS= ^1H
##.DELAY= (6, 6)
##.ACQUISITION MODE= SIMULTANEOUS
##.ACQUISITION SCHEME= undefined
##.AVERAGES= 8
##.DIGITISER RES= 18
##SPECTROMETER/DATA SYSTEM= spect
##.PULSE SEQUENCE= zg30
##.SOLVENT NAME= CDCl3
##.SHIFT REFERENCE= (INTERNAL, CDCl3, 0, 15.7039)
##AUDIT TRAIL= $$ (NUMBER, WHEN, WHO, WHERE, WHAT)
$$ ##TITLE= Audit trail, XWIN-NMR		Version 3.5
$$ ##JCAMPDX= 5.01
$$ ##ORIGIN= Bruker BioSpin GmbH
$$ ##OWNER= she
$$ F:/spectra/data/she/nmr/H-F/1/audita.txt
$$ ##AUDIT TRAIL=  $$ (NUMBER, WHEN, WHO, WHERE, WHAT)
(   1,<2020-06-02 11:44:53.67 +0400>,<she>,<DPX200>,
      <created by zg, POWCHK disabled, PULCHK disabled
       configuration hash MD5:
       00 E9 B6 7A A2 85 ED C7 34 08 36 98 17 FE 4E 26
       data hash MD5: 16K
       43 79 EB 3B 1C 08 EE AA 83 93 18 A0 15 C0 D6 AA>)
$$ ##END=
$$ 
$$ hash MD5
$$ 1B E8 99 ED 25 7D AA 5D 12 4C AE 46 0E 0F 61 95
##$RELAX= 
##$RELAX= 
##$RELAX= 
##$RELAX= 
##$RELAX= 
##$RELAX= 
$$ Bruker specific parameters
$$ --------------------------
##$DU= <F:/spectra>
##$EXPNO= 1
##$NAME= <H-F>
##$PROCNO= 1
##$TYPE= <nmr>
##$USER= <she>
##$AMP= (0..31)
100 100 100 100 100 100 100 100 100 100 100 100 100 100 100 100 100 100 
100 100 100 100 100 100 100 100 100 100 100 100 100 100 
##$AQSEQ= 0
##$AQ_mod= 1
##$AUNM= <au_zg>
##$AUTOPOS= <>
##$BF1= 200.13
##$BF2= 200.13
##$BF3= 200.13
##$BF4= 200.13
##$BF5= 200.13
##$BF6= 200.13
##$BF7= 200.13
##$BF8= 200.13
##$BYTORDA= 1
##$CFDGTYP= 0
##$CFRGTYP= 5
##$CHEMSTR= <none>
##$CNST= (0..31)
1 1 145 1 1 1 1 1 1 1 1 1 1 1 1 1 1 1 1 1 1 1 1 1 1 1 1 1 1 1 1 1 
##$CPDPRG= <>
##$CPDPRG1= <>
##$CPDPRG2= <>
##$CPDPRG3= <>
##$CPDPRG4= <mlev>
##$CPDPRG5= <mlev>
##$CPDPRG6= <mlev>
##$CPDPRG7= <mlev>
##$CPDPRG8= <mlev>
##$CPDPRGB= <>
##$CPDPRGT= <>
##$D= (0..31)
0 1.2 0 0 0 0 0 0 0 0.06 0 0.03 0 0 0 0 0.0002 0 0 0 0 0 0 0 0 0 0 0 0 
0 0 0 
##$DATE= 1591083893
##$DBL= (0..7)
120 120 120 120 120 120 120 120 
##$DBP= (0..7)
150 150 150 150 150 150 150 150 
##$DBP07= 0
##$DBPNAM0= <>
##$DBPNAM1= <>
##$DBPNAM2= <>
##$DBPNAM3= <>
##$DBPNAM4= <>
##$DBPNAM5= <>
##$DBPNAM6= <>
##$DBPNAM7= <>
##$DBPOAL= (0..7)
0.5 0.5 0.5 0.5 0.5 0.5 0.5 0.5 
##$DBPOFFS= (0..7)
0 0 0 0 0 0 0 0 
##$DE= 6
##$DECBNUC= <off>
##$DECIM= 24
##$DECNUC= <off>
##$DECSTAT= 4
##$DIGMOD= 1
##$DIGTYP= 9
##$DL= (0..7)
0 120 120 120 120 120 120 120 
##$DP= (0..7)
150 150 150 150 150 150 150 150 
##$DP07= 0
##$DPNAME0= <>
##$DPNAME1= <>
##$DPNAME2= <>
##$DPNAME3= <>
##$DPNAME4= <>
##$DPNAME5= <>
##$DPNAME6= <>
##$DPNAME7= <>
##$DPOAL= (0..7)
0.5 0.5 0.5 0.5 0.5 0.5 0.5 0.5 
##$DPOFFS= (0..7)
0 0 0 0 0 0 0 0 
##$DQDMODE= 0
##$DR= 18
##$DS= 0
##$DSLIST= <SSSSSSSSSSSSSSS>
$$ [...]
##$SUBNAM2= <"">
##$SUBNAM3= <"">
##$SUBNAM4= <"">
##$SUBNAM5= <"">
##$SUBNAM6= <"">
##$SUBNAM7= <"">
##$SUBNAM8= <"">
##$SUBNAM9= <"">
##$SW= 24.9337058887773
##$SWIBOX= (0..15)
0 0 2 0 0 0 0 0 0 0 0 0 0 0 0 0 
##$SW_h= 4990.01996007984
##$TD= 16384
##$TD0= 1
##$TE= 0
##$TE2= 300
##$TE3= 300
##$TEG= 300
##$TL= (0..7)
0 120 120 120 120 120 120 120 
##$TP= (0..7)
150 150 150 150 150 150 150 150 
##$TP07= 0
##$TPNAME0= <>
##$TPNAME1= <>
##$TPNAME2= <>
##$TPNAME3= <>
##$TPNAME4= <>
##$TPNAME5= <>
##$TPNAME6= <>
##$TPNAME7= <>
##$TPOAL= (0..7)
0.5 0.5 0.5 0.5 0.5 0.5 0.5 0.5 
##$TPOFFS= (0..7)
0 0 0 0 0 0 0 0 
##$TUNHIN= 0
##$TUNHOUT= 0
##$TUNXOUT= 0
##$USERA1= <user>
##$USERA2= <user>
##$USERA3= <user>
##$USERA4= <user>
##$USERA5= <user>
##$V9= 5
##$VALIST= <valist>
##$VCLIST= <CCCCCCCCCCCCCCC>
##$VD= 0
##$VDLIST= <DDDDDDDDDDDDDDD>
##$VPLIST= <PPPPPPPPPPPPPPP>
##$VTLIST= <TTTTTTTTTTTTTTT>
##$WBST= 1024
##$WBSW= 4
##$XGAIN= (0..3)
0 0 0 0 
##$XL= 0
##$YL= 0
##$YMAX_a= 645100
##$YMIN_a= -264723
##$ZGOPTNS= <>
##$ZL1= 120
##$ZL2= 120
##$ZL3= 120
##$ZL4= 120
##$ABSF1= 10
##$ABSF2= 0
##$ABSG= 5
##$ABSL= 3
##$ALPHA= 0
##$AQORDER= 0
##$ASSFAC= 0
##$ASSFACI= 0
##$ASSFACX= 0
##$ASSWID= 0
##$AUNMP= <proc_1d>
##$AZFE= 0.1
##$AZFW= 0.1
##$BCFW= 1
##$BC_mod= 2
##$BYTORDP= 1
##$COROFFS= 0
##$CY= 11.3945322036743
##$DATMOD= 1
##$DC= 2
##$DFILT= <>
##$DTYPP= 0
##$F1P= 16.9975609425685
##$F2P= -3.02152046262296
##$FCOR= 0.5
##$FTSIZE= 0
##$FT_mod= 4
##$GAMMA= 1
##$GB= 0.15
##$INTBC= 1
##$INTSCL= 1
##$ISEN= 128
##$LB= 0.24
##$LEV0= 0
##$LPBIN= 0
##$MAXI= 10000
##$MC2= 0
##$MEAN= 0
##$ME_mod= 0
##$MI= 1.114404
##$NCOEF= 0
##$NC_proc= 0
##$NLEV= 6
##$NOISF1= 3.799351
##$NOISF2= 2.8
##$NSP= 1
##$NTH_PI= 0
##$NZP= 0
##$OFFSET= 15.70392
##$PC= 1
##$PHC0= -9786.435
##$PHC1= 10.60082
##$PH_mod= 1
##$PKNL= yes
##$PPARMOD= 0
##$PSCAL= 0
##$PSIGN= 0
##$REVERSE= no
##$SF= 200.130013532006
##$SI= 16384
##$SIGF1= 3
##$SIGF2= 2
##$SINO= 400
##$SIOLD= 16384
##$SREGLST= <1H.CDCl3>
##$SSB= 0
##$STSI= 0
##$STSR= 0
##$SW_p= 3612.71676300578
##$SYMM= 0
##$S_DEV= 0
##$TDeff= 0
##$TDoff= 0
##$TI= <>
##$TILT= no
##$TM1= 0
##$TM2= 0
##$TOPLEV= 0
##$USERP1= <user>
##$USERP2= <user>
##$USERP3= <user>
##$USERP4= <user>
##$USERP5= <user>
##$WDW= 1
##$XDIM= 8192
##$YMAX_p= 0
##$YMIN_p= 0
$$ End of Bruker specific parameters
$$ ---------------------------------
##NTUPLES= NMR FID
##VAR_NAME=  TIME,          FID/REAL,        FID/IMAG
##SYMBOL=    X,             R,               I
##VAR_TYPE=  INDEPENDENT,   DEPENDENT,       DEPENDENT
##VAR_FORM=  AFFN,          ASDF,            ASDF
##VAR_DIM=   8192,          8192,            8192
##UNITS=     SECONDS,       ARBITRARY UNITS, ARBITRARY UNITS
##FACTOR=    0.0002004,     1,               1
##FIRST=     0,             0,               0
##LAST=      1.6414764,     0,               0
##MIN=       0,             -264723,         0
##MAX=       1.6414764,     645100,          0
$$ Real data points
##PAGE= N=1
##DATA TABLE= (X++(R..R)), XYDATA
0@%%%%qJ6j6J6j6K4l2M0n2O0p2Q9j07J29j56J83k15K52k93L40l91M50n16N86o65
29c54P55q52R58j078J209j350J505j677J866k072K298k545K818l122L459l830
45b012M245m710N234n836O529p338Q297r455J0889j2715J5137j8526K3646l2387
59a9002N1299j63108J61237K44708k96087k07490J330J36835l805r4353n4069
70b42505J57202J64820o1217k16306o6717J11665J57571M2851o8411o6602N9513
81b8136K3233j30439p3390J55941J67329l3808j25870m2471M9417Q0654o164p7138
93d0842J8887J39534J5886j75965j13062Q0040J51975P8011n6506j17368j0133
104b9543J22515L2153j21685p5923O3309Q7854P37p5886n8923O9493J24140k4274
$$ plain form
0 0 0 0 0 0 -8 8 -8 8 -8 16 -16 24 -28 32 -40 49 -58 71 -85 98 -117 135 -158 182 -209 241 -275 311 -354
29 -354 401 -451 507 -571 638 -712 793 -884 982 -1090 1208 -1337 1481 -1641 1818 -2012
45 -2012 2233 -2477 2757 -3079 3450 -3888 4409 -5046 5843 -6872 8265 -10261 13385 -19002
59 -19002 32297 -130811 30426 275134 -20953 -228443 -227113 -90278 -94083 -188436 -242505
70 -242505 -85303 79517 18300 -198006 -264723 -153058 4513 47364 -21047 -87649 -28136
81 -28136 -4903 -135342 -208732 -52791 114538 80730 -45140 -87611 -38194 42460 36296 -40842
93 -40842 -21955 117579 133465 -42500 -155562 -75522 76453 154464 97958 -19410 -29543
104 -29543 92972 125125 3440 -72483 -9174 78680 79417 3531 -55392 14101 138241 113967
116A13967j18760j4595O0419j9856n3921J9972M7352L5106K689o6804o6916N3470
128g877J01070k0326q3989q231N7189L6199m4316r3404j0965J31677Q3736r6139
140D4624r7021M0535P7756Q017l2595m3954j6342N0611K0641o2299k5176P5634
152D0431N5386l0062l8599k3291k280L1307M011m5157J271O5968k235o8586p407
165a9243N3591L7563o275m5387n3254K0743O7593j2146n4467R733M5337P595j5014
178C6369l1782m6941L5108J02072J6650q2246m7530J7945J0920M262L034j348
190A6513L3096M1057k4816n9743J206K7915k04R230P165k2951q735K4624j1723
203C2634k4803M7051M7341l1888m7321q6J3410O936L053k5548k882N6022J9391
$$ plain form
116 113967 -4793 -19388 41031 21175 -32746 -12774 34578 69684 72373 5569 -61347 -7877
128 -7877 93193 72867 -11122 -19353 37836 74035 29719 -63685 -74650 57027 140763 44624
140 44624 -52397 -11862 65894 73911 41316 -2638 -18980 31631 52272 -10027 -35203 40431
152 40431 95817 65755 27156 3865 1585 32892 36903 -8254 -6983 58985 56750 -11836 -19243
165 -19243 34348 71911 65636 20249 -33005 -12262 55331 43185 -11282 -1549 43788 51383 36369
178 36369 4587 -42354 -7246 94826 111476 29230 -18300 -355 10565 14827 17861 16513
190 16513 49609 90666 65850 6107 7313 35228 35024 44254 51419 28468 19733 44357 32634
203 32634 7831 54882 102223 70335 23014 22928 36338 43274 46327 20779 17897 73919 93310
216I3310o2800l8497M4248M0590K951j6373m1611j4883M3851K1289n4595k8376
228a0896M9706L9882l614k4163k7995O184M6236n389p9451j6759O5917K6253l3243
241C2668j6574J4692J9710K2339k5311o3679L408O1768Q323n5864k5420K1875
253b065L5125K2484l4545m6083L4677O5572l5489q5774M011N5948J4845k7820
265H86l1979O51N3100L7021n8452n7875M5041O2198k3491o7456k8886K8480O2544
278B1782J2568p2784k7070Q6611O0626o9053q3640R878N8112L2061l7443o6237
290g4589J3142R1707K3176q1344l5974N4227M3588j5933m8998l7236K2360O1194
302A5320j0885o7935J2454Q0781J6796o2866m1687J9224N1233K0336o4389n8917
$$ plain form
216 93310 30510 -7987 36261 76851 79802 63429 21818 6935 50786 72075 17480 -10896
228 -10896 38810 78692 75078 50915 22920 29104 75340 69951 -9500 -26259 39658 65911 32668
241 32668 16094 30786 50496 72835 47524 -16155 -12747 49021 57344 1480 -23940 -2065
253 -2065 33060 55544 20999 -25084 9593 75165 39676 -46098 -42087 13861 28706 886
265 886 -31093 -30442 22658 59679 1227 -56648 -11607 50591 27100 -40356 -69242 -40762 21782
278 21782 34350 -38434 -65504 21107 81733 12680 -70960 -61082 -2970 29091 -8352 -74589
290 -74589 -61447 30260 53436 -27908 -63882 -9655 33933 18000 -30998 -68234 -45874 15320
302 15320 4435 -63500 -51046 29735 46531 -16335 -58022 -38798 12435 32771 -31618 -90535
314i0535N2481Q1518k7472p5704O517O3873M2272j7474p1348m1711N5932O5803
326D4152m1122o6473K4860O6598J9671l7642m6443M737O8456K5516p5889m8756
338f2335N2286M8909k9583l7710J2243M2519L7552k7374p2954m016P7636K5781
350F2954o8896m3934L1364N1961J6416m4957n2722L3817R0987n437r6661l4873
362e9981N2069M4340r864l7073k2936L0782M9705k0217n1153J0831M1856l366
374B4993k7019q274l980J0927J5269j7181j3195L8831K7235m6162l7929K8675
386g810L6220j29k9123l3717L434N3335J7124n4548k4115M3512L3582j1884k9088
399c207l0348k426M8536K3263m6245l3177K5121K7483j634n398j3522p667K2165
$$ plain form
314 -90535 -38054 43464 15992 -59712 -53195 10678 52950 35476 -35872 -77583 -21651 44152
326 44152 3030 -63443 -38583 28015 47686 10044 -36399 -31662 36794 62310 -13579 -62335
338 -62335 -10049 38860 9277 -28433 -16190 26329 63881 36507 -36447 -40463 37173 62954
350 62954 -5942 -49876 -18512 33449 49865 4908 -47814 -13997 76990 71553 -25108 -59981
362 -59981 -7912 36428 26564 -10509 -33445 -2663 47042 26825 -24328 -13497 28359 24993
374 24993 -2026 -10300 -14280 -3353 11916 -5265 -18460 20371 47606 1444 -36485 -7810
386 -7810 28410 28281 -842 -34559 -31125 22210 39334 -15214 -39329 4183 37765 25881 -3207
399 -3207 -33555 -35981 12555 35818 -10427 -43604 -18483 9000 7366 1968 -11554 -19221 2944
412B944O449k9466j0703K1156l457j3538J9566J2061j6402q534L858j637J5959
425a744J9540l1240l7423J7377L4976J546j7883j5080l734L7946L1816l7836m9241
438e0980J8637M4479j836k4282j9795p255L1016L6547j5094l7609O460K3440j474
451B254l706q244j5017P944K2980j1063k3261J9888J9398j0861M37J3378r151
464D976j8455k609o650O025L4028M616l4215j0940K6410J5249k599p124k1076
477a2364M333L7721j563n8654k0210N0536M1871M72k3645k7928L368L4355K87
490B8579m4380m191L8762J1515k0009j5190l575J2275L0114p79l0751N708K2810
503C0888k3284m0484R908L6720J4615q400k7249p639L8581K4547m6609m3926L2082
$$ plain form
412 2944 9393 -20073 -30776 -9620 -13077 -26615 -7049 5012 -11390 -19924 -16066 -17703 -1744
425 -1744 17796 -13444 -50867 -33490 1486 3032 -14851 -29931 -33665 4281 36097 -1739 -50980
438 -50980 -32343 12136 10300 -13982 -33777 -41032 -10016 26531 11437 -26172 -19712 3728 2254
451 2254 -1452 -9696 -24713 -16769 6211 -4852 -28113 -8225 11173 312 749 14127 4976
464 4976 -13479 -16088 -22738 -16713 17315 21931 -12284 -23224 3186 18435 15836 8712 -12364
477 -12364 -8031 29690 28127 -30527 -50737 -201 41670 42142 18497 -9431 -6063 28292 28579
490 28579 -15801 -19992 18770 30285 10276 -4914 -8489 3786 33900 33121 2370 8078 30888
503 30888 7604 -32880 -22972 13748 28363 19963 -7286 -14925 23656 48203 1594 -42332 -10250
516a0250M2545r997l7900k5281J4062N1594K4917m8504l9357L4832L7865j8964
528A5562l9522j2634J8984L4044J793m4690q497N0467K1696l8155k3923J7093
540g782J2872l051j9490k1707J9468M4682n071n0418l117M5615J7400k3072l4100
553b7771j0606L2148L5229l2756n7078K2682O6720J0247m2485k6142J0807L0377
565A1372J2521m0474l6001L5741M9085j6426m1075L092K7381J9524m293l0683
577a0236j1170L7525K2071m4732l3379L4813L8144l340k4080j0160J7387L2984
589D5827p948n2370p573M9010K1206l0859k2303R559K1047J9799j2946l5475R112
602F086M4427M48m4873j4673K1602J7530K975j5882j3978K1327L0824k0604m0736
$$ plain form
516 -10250 32295 22298 -15602 -40883 -26821 24773 49690 1186 -38171 -3339 34526 15562
528 15562 -23960 -36594 -17610 16434 18227 -26463 -34960 15507 37203 -952 -24875 -7782
540 -7782 5090 2039 -17451 -39158 -19690 24992 19921 -30497 -33614 12001 29401 6329 -27771
553 -27771 -38377 -6229 29000 -3756 -60834 -38152 28568 38815 -3670 -29812 -19005 11372
565 11372 23893 -16581 -52582 -16841 32244 15818 -25257 -22165 5216 24740 20447 -10236
577 -10236 -21406 16119 38190 -6542 -39921 -5108 33036 29696 5616 -4544 12843 45827
589 45827 37879 -14491 -22064 26946 48152 17293 -5010 4549 25596 45395 32449 -3026 6086
602 6086 50513 50961 6088 -8585 13017 30547 33522 17640 3662 24989 55813 35209 -5527
615e527Q802K8516P78j3975r146m013J4383J8522k0056k4211K0334K7070r040
628C2437k0205m458j296R327Q678j8449j1845K4999J8853k2472j3562J3297L870
641A9174l728l200j0340k768K0757L742k6818m444K1953O398q350l866o115l11
655B084J8753m103l2557l607K7418P246j2376j21o86k346J1197k532j8228J59
669i699J6657l724r256O856m487j0067J1047J2257n717R54R167j3658j2973J0068
683b575K865j0076M336J1962j387N293O303j7618j1565J6092J2502p237k743m120
697B032j4088R232J9063q407j6934J3991K0539k489j0657j8514j5557J6513K5881
710B0605r709k1636R664J3323m986k077k988p764P389J5113j3810k0043Q860N645
$$ plain form
615 -5527 3275 31791 32569 18594 9448 5435 19818 38340 18284 -5927 14407 41477 32437
628 32437 12232 7774 6478 15805 24483 6034 -5811 19188 38041 15569 2007 15304 19174
641 19174 15446 12246 1906 -862 19895 23637 -3181 -7625 14328 20726 12376 8510 2395 2084
655 2084 20837 16734 -15823 -19430 7988 15234 2858 2737 2051 -295 10902 8370 -9858 -9699
669 -9699 6958 3234 -6022 834 -3653 -13720 -2673 9584 3867 4821 13988 330 -12643 -2575
683 -2575 290 -9786 -5450 6512 5125 10418 16721 -897 -12462 3630 16132 8895 6152 2032
697 2032 -12056 -2824 16239 7832 -9102 4889 25428 22939 12282 -6232 -21789 -5276 20605
710 20605 10896 -10740 -1076 12247 7261 5184 2196 -5568 1821 16934 3124 -16919 -8059 -2414
724b414j0007L316J7277L761m514o442j6535J891K2681o164l1048J440L1801P811
738A2854j4219j3180o870J6578K7917q534m0625n282K8869Q630j2836j2554j891
751b1143J6606K4985q350l1320M314K2491o356j8536J789Q127K910M853p323n884
765a2837J9610J2198k5135j8884K1439J8506j1278k0043j2191J2038L4663Q575
777B6661l9679j9181L7793K7397k0886l4201r039K0531L0589k088m0102q106L8853
790H542J8578k1849j7402M525Q567P463q487k1589N498K8316k290k7182N729K5696
804A4115k37j7638j2863M000K1484Q904l2802k9042L1074M0093r686l2153r098
817b3849J5936K2566L054l5325k4357L2176L4123j7364l2350j081J8453J8807
$$ plain form
724 -2414 -12421 -9105 8172 11933 7419 977 -15558 -13667 9014 2850 -28198 -26758 5043 12854
738 12854 -1365 -14545 -21415 -4837 23080 14546 -26079 -31361 -2492 6138 -6698 -19252 -21143
751 -21143 -4537 20448 12098 -19222 -14908 7583 1227 -17309 -15520 -7393 -4483 370 -6953 -12837
765 -12837 6773 18971 -6164 -25048 -3609 14897 3619 -16424 -28615 -16577 18086 26661
777 26661 -13018 -32199 5594 32991 12105 -22096 -31135 -10604 19985 17897 -22205 -30311 8542
790 8542 27120 5271 -12131 -7606 961 8424 -63 -21652 -16154 12162 9872 -17310 -11581 14115
804 14115 13878 -3760 -16623 -12623 8861 17765 -15037 -44079 -13005 27088 17402 -14751 -23849
817 -23849 -7913 14653 17707 -17618 -41975 -9799 24324 6960 -25390 -26471 -8018 10789
829A0789L737k3537j4042J9774J3263k2441j2732J7125R443m130k471k481J615
842f088J0986l428k0876N875K5960l103k4790p561J2287J5456J1179j4987k5472
855b4562J2995L4076m359l3376p373J6942J3530M701j4362j7634J2307K6277m732
868A4430k1920J695R149J638K441l361j1043L542J4141q165p613J5327O646j4391
882B516n131R863O09j504p11j0753J188J9428J703k0473l025J5402L823p83j905
897A0247j2836m957J5838M879j6081k415R366j84J777N416q544j0070J0673N046
911H155j0767q42K680p631J268J4018l521j2407O514O267n463j382K311q391l068
926a2259R109k010n243Q198J879r311L377J1608q185q857N091j210k780P357o21
$$ plain form
829 10789 14526 -9011 -23053 -3279 9984 -12457 -25189 -8064 1379 -2751 -5222 -7703 -6088
842 -6088 4898 1470 -19406 -13531 12429 9326 -15464 -23025 -10738 4718 15897 910 -24562
855 -24562 -11567 22509 18150 -15226 -22599 -5657 7873 12574 -1788 -19422 -7115 19162 14430
868 14430 -7490 -5795 3354 4992 7433 4072 -6971 -3429 10712 2547 -5066 10261 16907 2516
882 2516 -2615 7248 7857 6353 5642 -5111 -3923 15505 17208 -3265 -6290 9112 12935 12152 10247
897 10247 -2589 -7546 8292 13171 -2910 -5325 4041 3857 5634 11050 2506 -7564 3109 8155
911 8155 -2612 -3454 -774 -8405 -7137 6881 3360 -9047 -2533 3734 -1729 -3111 -800 -9191 -12259
926 -12259 -3150 -5160 -10403 -2205 -326 -9637 -6260 5348 -2837 -11694 -6603 -7813 -10593 -3236 -3857
941c857j3770N476J8113k161j1223n78J238L44O706m795j5944O701J7159l906
955d97j0172N139M566k411M506l333j1701N088J1102q791r747J0623P077l906
969b457J940q7m742O070O074j5787j0027J7361Q540j0637m457N145M195O576M70
984H177j5630k273J9649J670k0312n731J2124P162L620k964j2362N434K0685m892
998A4357k6734L75K0792L372j0451q772j605J3308J5988j0881k1601J0633J9362
1011A8143p494j7779j296O424Q276N334j3454j0884J8867J5470j6492j6732J0126
1024a491J0189l623p542r174L274K0513L967k4754p512K3889J0798j4680j3700
1037i846k016Q997J3921m879k4188J718K8560O026k0319j1553M826J0276R616
$$ plain form
941 -3857 -17627 -12151 5962 3801 -7422 -8000 -6762 -6418 288 -4507 -20451 -13750 3409 -497
955 -497 -10669 -5530 -964 -3375 1131 -2202 -13903 -8815 2287 -6504 -16251 -5628 1449 -2457
969 -2457 -517 -604 -5346 724 6798 -8989 -19016 -1655 6885 -3752 -8209 -3064 1131 7707 8177
984 8177 -7453 -9726 9923 11593 -8719 -14450 -2326 4836 8456 5492 -6870 -1436 19249 14357
998 14357 -12377 -12002 8790 12162 1711 -7061 -8666 4642 20630 9749 -11852 -1219 18143
1011 18143 10649 -7130 -8426 -2002 6274 11608 -1846 -12730 6137 21607 5115 -11617 -1491
1024 -1491 8698 5075 -2467 -11641 -8367 12146 16113 -8641 -16153 7736 18534 3854 -9846
1037 -9846 -11862 -2865 11056 6177 -18011 -16293 12267 18293 -2026 -13579 -8753 1523 11139
1050A1139q332k0728M760K2196l609k0636K957J6183L507l891q912q895P700J2562
1064F001j0984j4650J4673J6323r172j4831k905P736J5218N726k2318j5203K0740
1077c646J6367j6399j6509O934J4759J1371l532k3157q818K2206J4033j6098j0833
1090a3322Q913N925k15j964r166l87J6572N409j6153k822J1860k222q650R35M083
1105a204L685O238o708j3520R050J7434o939j5885K274Q506K852L426q583j2818
1119a2192R678J8602m696j5887J169O066M181M981o911j3819M245J6641k778r125
1133A55L097J318k051N804J837j0275M27J0221m042n369N068j33p979M575P831
1148A0484k470J447J456j1261m123J3249M686j2937l204O611K062M866R6j3064
$$ plain form
1050 11139 2807 -17921 -13161 9035 5426 -15210 -12253 3930 7437 3546 -5366 -14261 -6561 6001
1064 6001 -4983 -19633 -4960 11363 2191 -12640 -15545 -7809 7409 13135 -9183 -24386 -3646
1077 -3646 12721 -3678 -20187 -13253 1506 12877 9345 -13812 -22630 -424 13609 -2489 -13322
1090 -13322 -4409 1516 1301 -663 -9829 -10216 6356 11765 -4388 -7210 4650 2428 -6222 -5287 -1204
1105 -1204 2481 8719 2011 -11509 -2459 14975 8036 -7849 -5575 2931 5783 9209 626 -12192
1119 -12192 -2514 16088 11392 -4495 -3326 2740 6921 11902 4991 -8828 -4583 12058 9280 155
1133 155 3252 4570 2519 8323 10160 -115 312 10533 6491 1122 6190 6057 -1922 2653 10484
1148 10484 8014 9461 10917 -344 -4467 8782 13468 531 -2673 3938 6000 10866 10962 -2102
1162b102n150J7325P012j3628q113J422L099P607M518j3694q131J5396P721j0427
1176B855n358K452j059K279M607r247n723J0428L706o582J889N871o582n253L755
1191a962j349R05O838n742j2953P701J6145n798j1494J069N160N207K096j3601
1205g778j5055J3906K0260n963j4849P18N764M717K551j0045j1087J2766J3983
1218I888j1346j3202O598P373j477Q99j515j017P321J98j5919k566J7845L164
1232F244j4072l596Q376P407L924p414j5271N741K2185k619k2457m860J5005R572
1246H165K70r674j1772J0748J9748p014k1405K109J4685j00n716m026j468R442
1260C992R967j0007j3368J0609J1305r924j0127N076O988L942k171j4084l748
$$ plain form
1162 -2102 -7252 10073 17085 3457 -4656 -3234 -135 7472 11990 -1704 -9835 5561 13282 2855
1176 2855 -2503 -51 -1110 1169 5776 -3471 -9194 1234 4940 -1642 247 6118 -464 -5717 -1962
1191 -1962 -3311 -2406 4432 -1310 -14263 -6562 9583 3785 -7709 -6640 -1480 3727 5823 -7778
1205 -7778 -22833 -8927 11333 5370 -9479 -8761 -2997 1720 4271 -5774 -16861 -4095 9888
1218 9888 -1458 -14660 -8062 -689 -2166 -1267 -2782 -3799 3522 3720 -12199 -14765 3080 6244
1232 6244 -7828 -11424 -3048 4359 8283 869 -14402 -8661 13524 10905 -11552 -16412 -1407 8165
1246 8165 8435 -1239 -13011 -2263 17485 10471 -10934 -8825 5860 5760 44 -3982 -5450 3992
1260 3992 13959 3952 -9416 1193 12498 2574 -7553 -2477 4511 8453 6282 -7802 -11550
1273a1550K1297J0402j8397j2476J0758J0275k815r004j1443N010K1762M172k2474
1286d483r228J6642R215o817q471m747N906J2959l798k0398J274K0689K793j3240
1300a704m270M457M658K361r585j1574J1374J7784r287j8612L986J3969K017m532
1314A042r543m456J3429J0274j5473j6508J2255J5434l612r215n292K093J1662
1327B090M090j6461q839J6162Q780j1878q150M455N465N401l57j2518k753J5301
1341G88L321j4743m532J0832M055j191l540q595L184J5492J86j5949o07J1617
1355C18Q36n405k078k381L509J1279l070j4343L677J2539j481o885J37J221J486
1370f41N741n814j0274Q110J3319n561r372L450M017J101J796o228o796R193J0341
$$ plain form
1273 -11550 9747 20149 1752 -10724 34 10309 7494 -1510 -12953 -7943 13819 17991 -4483
1286 -4483 -13711 2931 12146 5329 -3142 -7889 -1983 10976 7178 -13220 -11946 8743 11536 -1704
1300 -1704 -5974 -1517 3141 5502 -4083 -15657 -4283 13501 4214 -14398 -10412 3557 5574 1042
1314 1042 -8501 -12957 472 10746 -4727 -21235 -8980 6454 2842 -6373 -11665 -9572 2090
1327 2090 6180 -10281 -19120 -2958 5822 -6056 -14206 -9751 -4286 1115 758 -11760 -14513 788
1341 788 4109 -10634 -15166 -4334 -279 -1470 -5010 -13605 -10421 5071 5257 -10692 -11299 318
1355 318 1154 -4251 -6329 -8710 -5201 6078 3008 -11335 -7658 4881 3400 -3485 -3348 -2127 -641
1370 -641 5100 -714 -10988 -2878 10441 4880 -4492 -1042 2975 4076 5872 -356 -7152 2041 12382
1385A2382q829r949P041N240J20J185m368n930P458Q136r888p757P715M438k807
1400D187M01l18l852N161N041r416m488R223J960p604lK822j771M746J618r059
1416a352j341J2032Q71j3041k018M551K215L437j435r976M61J5132M08j3970k614
1431f640O530K524O86k666r384J582J3215m91j1786J511Q729j840l733j473l651
1446f887K926P324n774q794Q811J0116r115p662M759N226K177j796j0287n492
1460a4468J4254R349j2830q720Q523R194J05n088j0395j687J6288N885j5516q445
1474a3551J1125P566l505j935l095J521Q782m99j4087j110J3151N61q514J180
1488b410N034K587Q97n515q037Q538J4503r308j6123L054J3276L159m552p976
$$ plain form
1385 12382 3553 -6396 645 5885 6005 7190 2822 -3108 4350 12486 2598 -5159 2556 6994 4187
1400 4187 4588 4270 418 5579 10620 1204 -3284 5939 7899 295 292 3114 1343 6089 7707 -1352
1416 -1352 -2693 9339 10210 -2831 -4849 -298 1917 5354 3919 -6057 -5596 9536 9944 -4026 -6640
1431 -6640 -110 2414 3100 434 -8950 -7368 5847 5356 -6430 -4919 3810 1970 -1763 -3236 -6887
1446 -6887 -3961 3363 -2411 -11205 -2394 7722 -1393 -9055 -4296 930 3107 1311 -8976 -14468
1460 -14468 -214 9135 -3695 -12415 -3892 5302 5407 319 -10076 -11763 4525 10410 -5106 -13551
1474 -13551 -2426 5140 1635 -300 -3395 -1874 6908 6409 -7678 -8788 4363 4924 -3590 -2410
1488 -2410 2624 5211 6108 593 -7444 1094 15597 6289 -9834 -6780 6496 9655 5103 -2873
1502b873l296J4026J2050j4511j7302P802J5493r00q143o125j25J1633P467j2586
1516B610j0607J2066J0436q958q138J659L654L830p00q941K22J5250R72j6808
1530c453l262J2805N433o455p754m951Q030J4830n573j9502J389J8840L931j1130
1544C178q734j265R413J0236q160j6334N524J6888j597j1481j813L854M071K726
1558F506o869q446Q276R712r143q924P555P528k530l677m968n96J0790L045j4719
1573f460p184J3791R170p980q057j469N773J0430m30j6491m860J5789O786j0284
1587a476o808J378M836P232p41j2555j297J3903J422j0923k183N899J225m76j282
1602a846n072L921R665m436j1130M631R700l422n945j061O6N593O435p909j0456
$$ plain form
1502 -2873 -6169 7857 19907 5396 -11906 -4104 11389 10489 2346 -3779 -3904 7729 15196 2610
1516 2610 -7997 4069 14505 5547 -2591 -932 2722 6552 5852 -3089 -2867 12383 13355 -3453
1530 -3453 -6715 6090 11523 5068 -2686 -7637 393 15223 9650 -9852 -8463 10377 14308 3178
1544 3178 -5556 -6821 2592 12828 4668 -11666 -6142 10746 9149 -2332 -4145 -291 3780 6506
1558 6506 -363 -8809 -533 9179 36 -8888 -1333 6195 3665 -12 -4980 -5576 5214 8259 -6460
1573 -6460 -13644 147 9317 1337 -6720 -8189 -2416 8014 7584 -8907 -13767 2022 8808 -1476
1587 -1476 -8284 -6906 -2070 5162 4421 -8134 -9431 4472 5894 -5029 -7212 -1313 -88 -564 -1846
1602 -1846 -6918 -2997 6668 2232 -8898 -4267 5433 2011 -3934 -4995 -4929 664 7099 -810 -11266
1617a1266Q906J1944n049q402q34K680M903L987q402q254Q875R936n451p132K583
1632i76K611J702L142n942o124O723O383p082l371N887J478j177J199k617k806
1647i70O505K429j0065j763R164J449n063j158N58R10O452j74j1640n56J0103
1662F181J925q093j984J573K493O227j807j0368Q76J0930m93r346o41L868L21
1677A662J380k047o211M066J0002l682r805K657N695k192k582j614k158M969O356
1692F496p019p909P440P496n179n427J40O85L803K245q717m819J0408O927q156
1707a586n364L693K379J313j144p245j672J0822L128j1454l467Q710L862k231
1721b56l151m166J690R337k135j2785L68J2216J508o279j655J3L896N544n009
$$ plain form
1617 -11266 -2360 9584 4535 -3867 -4701 -2021 2882 6869 -1533 -9787 -912 9024 3573 -3559 -976
1632 -976 1635 3337 6479 537 -5587 1136 7519 437 -2934 2953 4431 3254 4453 1836 -970
1647 -970 5535 7964 -2101 -3864 5300 6749 1686 528 1086 1996 8448 8274 -3366 -3922 6181
1662 6181 8106 13 -1971 -398 2095 8322 6515 -3853 -2977 7953 7460 -1886 -2527 1341 1662
1677 1662 3042 995 -5216 -1150 8852 5170 -4635 -1978 3717 1525 -1057 -2671 -4829 140 6496
1692 6496 -523 -8432 -992 6504 1325 -4102 -3962 -3277 526 2771 -5946 -10765 -357 6570 -1586
1707 -1586 -6950 -3257 -878 435 -709 -7954 -9626 1196 4324 -7130 -10597 -1887 1975 -256
1721 -256 -3407 -7573 -5883 3454 1319 -11466 -11098 1118 2626 -3653 -5308 -5295 -1399 4145 -864
1736h64j0260M223J1719l231r625J196N007L606J457n504n481Q076P984r466r357
1751a0520O436Q762j156m296l451k58R750M366j2138o089J0968P559p219o769
1765d055k96M168Q217k02j1182k030J3013L474j0964m760M861M574J619l159p383
1780d105K451J1904j487j1142M39Q744J074m878l900k017N742Q238p039j0607
1794f583N836J2168k059r353k733K294O710L398q834q523Q523J0452o099r018
1808c821J911N302L701l51q057m950Q935O381q937o045O689M787k023k659l453
1823b590N58P632j09j0588j619J0242K504p926l156K042M581N063l630j0866J132
1838f730J2147j47r799k508M306M041K706l960q059K766J0839k062r126M42M731
$$ plain form
1736 -864 -11124 -6901 4818 1587 -8038 -6842 -1835 1771 3228 -2276 -7757 319 8303 -1163 -10520
1751 -10520 -4084 4678 3522 -774 -4225 -4483 5267 9633 -2505 -8594 2374 9933 2714 -4055
1765 -4055 -4351 -183 8034 7832 -3350 -5380 7633 11107 143 -4617 244 4818 6437 3278 -4105
1780 -4105 -1654 10250 8763 -2379 -1940 6804 7878 3000 -900 -2917 2825 11063 4024 -6583
1794 -6583 -747 11421 9362 9 -2724 -430 6280 9678 844 -7679 844 11296 5197 -3821
1808 -3821 -1910 3392 7093 6742 -1315 -6265 2670 9051 114 -5931 758 5545 3522 863 -2590
1823 -2590 -2032 5600 5491 -5097 -6716 3526 6030 -1896 -5052 -3010 1571 6634 3004 -7862 -6730
1838 -6730 5417 5270 -4529 -7037 -2731 1310 4016 56 -8003 -5237 5602 3540 -5586 -5144 -413
1853d13J40l89j189m033L215O656l485o053M174M385m411k294J273L18K475K755
1869C124o328l934Q315N647o424m495K690K554J868N19p542l191R600N319o859
1884H63m654L226K904J893O30o574k648P168L635o770k713M468J925n86R71k631
1900A107j975N083R15o794N71O093j910l898J447J473O02L217k630o804L419P306
1916G222l419o889J236L503J277K015l817o025N141P935m117p820J426K887P11
1931A266J177k944m185M283O639m750n571L326K449k196p64n58j965L227K857
1946B291n807k703P134K197n686k382K128J110J756m93p196o24R304K055q472
1961e388j978M574K739Q87l111o465J473Q781p4q997j37O026J672j810j285k152
$$ plain form
1853 -413 -273 -662 -1851 -5884 -2669 3987 502 -5551 -1377 3008 -1403 -3697 -2424 -2106 369 3124
1869 3124 -3204 -7138 1177 6824 400 -4095 -1405 1149 3017 3536 -4006 -7197 2403 7722 863
1884 863 -3791 -565 2339 4232 4862 -1712 -4360 2808 6443 -327 -3040 1428 3353 2767 3738 1107
1900 1107 -868 4215 5130 -1664 -1093 5000 3090 -808 639 2112 2714 5931 3301 -3503 -84 7222
1916 7222 3803 -3086 -1850 1653 2930 4945 1128 -4897 244 8179 4062 -3758 -2332 555 1266
1931 1266 2443 -501 -4686 -403 6236 1486 -4085 -759 1690 -506 -1270 -1828 -3793 -566 2291
1946 2291 -3516 -6219 915 3112 -2574 -4956 -2828 -1718 38 -455 -7651 -8275 1029 3084 -5388
1961 -5388 -7366 -2792 -53 834 -2277 -8742 -7269 1512 1438 -7559 -7696 -1670 2 -1808 -3093 -5245
1977e245J461N415l071o722L105O437k184m671K058K151J494J800n398m527P082
1992h15O267o831o176M290N167P94j562n017j231Q293M600r174n327O265M702
2007D245j613l013k421P28P454J353q535j867P601K065n406k014J629J897L377
2022E480j948o479K587Q395j345q594N69N181J349j181l747l592N440P676m818
2037D973q489L147P466l13m589l261j53M856M849o411o579N627P154m034m299
2052e6K83J576L241N18o662l371P395M491o749l613L971K794R9j484m764o23P301
2069D347J188q599j362O053J994l209j482j053J453N546j906q020O31P251n75
2084B257n194L52O68J807L001k529n670K444O729k982n945J600K771L75M14k312
$$ plain form
1977 -5245 -3784 1631 -1440 -8162 -5057 1380 -804 -5475 -3417 -1266 228 2028 -3370 -7897 -815
1992 -815 5452 -1379 -7555 -3265 1902 2696 1134 -3883 -5114 3179 7779 -1395 -6722 -457 4245
2007 4245 2632 -381 -2802 -2074 5380 6733 -1802 -3669 3932 5997 591 -1423 206 2103 5480
2022 5480 3532 -2947 -360 8035 6690 -1904 -1335 3846 5195 4014 267 -3325 2115 9791 4973
2037 4973 -3516 -369 7097 6784 2195 -1066 -1219 3637 8486 2075 -4504 1123 8277 4243 -56
2052 -56 227 1803 5044 5562 -1100 -4471 2924 7415 666 -2947 1024 3818 3917 2433 -2331 -2954 4347
2069 4347 5535 -3064 -4426 1627 3621 412 -1070 -2123 -670 4876 2970 -5050 -4419 2832 2257
2084 2257 -2937 -2585 -1917 -110 2891 362 -5308 -2864 3865 883 -5062 -3462 -691 -316 98 -2214
2100b214l184M169N822m778n477K805L982j553j054j612j252L663L829m948l587
2115e389M887K789l072j220M27j206K196K001m432j708N808J646m602l54K429
2130B00j03K39N47l874n58N929M01n140Q3L668L88n05K45l263O9M839n32n343
2148b710P03M521n39r66R90j865l07M076q36n001J706L713k315j253J615m97j76
2165H59K800p93l938K699L359l537k637J866J006P9J343k079k783L667L855l871
2181A895l676K900J215j011M51j814k603L885L522m325k775L930N13j964n2q26
2197g35j707K647K116m083j411M141K67l459P76J501o26M92o39m008Q77N604j231
2214E22n318J535L442l64n76j654k710J448N743k250o103J525M096r74p65J15
$$ plain form
2100 -2214 -5398 -1229 4593 -185 -5662 -2857 1125 -428 -1482 -3094 -4346 -683 3146 -1802 -5389
2115 -5389 -502 2287 -785 -2005 -1578 -2784 -588 1413 -3019 -4727 1081 2727 -1875 -2229 200
2130 200 97 336 883 -2991 -3549 2380 2781 -2359 -2276 1392 1780 1275 1520 -1743 -1674 3165 2633 -2710
2148 -2710 -2007 2514 1975 1009 1999 134 -173 3903 3067 -1934 -228 3485 1170 -83 1532 1035 859
2165 859 3659 2866 -1072 1627 4986 1449 -1188 678 1684 1763 3106 1027 -1756 1911 5766 1895
2181 1895 -1781 1119 2334 1323 1774 -40 -2643 1242 4764 439 -2336 1594 2107 143 91 -735
2197 -735 -2442 205 2321 -1762 -3173 968 1235 -2224 -1448 53 -573 -81 -720 -4728 -3851 1753 522
2214 522 -4796 -3261 181 -183 -759 -2413 -5123 -3675 2068 -182 -6285 -4760 -664 -1638 -2403 -2288
2230b288j745J987L220k854n099K678L428j860q36J239k89J98K037k757k123M242
2246h22K310n085j566L386J044j205J01j695J22N479P37o878j381N502J293k245
2262i03j123j217J084N010l35o201O6N951N78l671o07L43k1L290j103m534K182
2279a211M818j381m459K030J887m02m55j231j918K812M210l996m170M185L244
2294C963j765k068j201n2L273K273n096l611M827L498l106k065Q03O73K193P05
2310C244m962k211N036J977m449m91K638K28r2k21k260o98M745k23n102N06L569
2327A234o03k155o4o05J761L975k126n430J390M268j495k722O40M06J268K427
2343B169k231m997K694M513j957k912J653M35m19Q18j641k566K830L723k676k170
$$ plain form
2230 -2288 -4033 -2046 1174 -1680 -6779 -4101 -673 -2533 -3369 -2130 -2419 -2221 -184 -2941 -5064 -822
2246 -822 1488 -3597 -5163 -1777 -733 -1938 -1837 -3532 -3410 2069 2806 -4072 -5453 49 1342 -903
2262 -903 -2026 -3243 -2159 2851 2516 -3685 -3619 2332 2910 -761 -1368 -1025 -1046 2244 1141 -3393 -1211
2279 -1211 3607 2226 -2233 -203 1684 1282 827 -404 -2322 490 4700 704 -3466 719 3963
2294 3963 2198 130 -1071 -1123 2150 4423 -673 -4284 543 4041 935 -1130 -327 346 2539 3244
2310 3244 -1718 -3929 1107 3084 -1365 -1856 782 1010 918 697 -1563 -2261 2484 2261 -2841 -2335 1234
2327 1234 631 -1524 -1588 -2193 -432 3543 1417 -4013 -2623 1645 150 -2572 -1932 -1526 -258 2169
2343 2169 -62 -5059 -2365 2148 191 -2721 -1068 -633 -1052 -234 -1875 -4441 -1611 2112 -564 -2734
2359b734K228L53k024M48K75j391K851K010l721k105L451O35j993L01J253n35
2375f98J478L72m533j006N191J265k563J5P89q95J163N0l065J01M216M22l760
2392a458M96J449j072Q55J674k477M9L072p05m043J276K368j148J29J058j443
2408H0j64L054j097l223J668K559k061q75J300p22L49K127j441k777K832K417
2424D026k748j489J636L9p22J912j621k410L306K425l083j218K427k74j102Q28
2440A932j416j094K966J453l596j219L328k02j078R51m14j622K243O42l788j90
2456a104L352n97j580J413P9j067R32j8l021N54L326n48l186J584P96j021N19
2473D13l68j684J125L499k610l840K221J784j374J78O15j654J656K216k991l445
$$ plain form
2359 -2734 -506 -153 -2177 -1729 -1454 -2845 6 2016 -1705 -3810 -359 276 -1717 -1416 -163 -698
2375 -698 780 1152 -3381 -4387 804 2069 -494 -479 310 -585 578 628 -2437 -2336 1880 2302 -1458
2392 -1458 -962 487 -585 270 1944 -533 -484 2588 1883 -2160 -884 1484 336 465 1523 80
2408 80 -84 2970 1873 -1350 318 2877 816 -59 1241 519 868 2995 1554 -1223 1609 4026
2424 4026 1278 -211 1425 1464 742 2654 1033 -1377 1929 4354 1271 53 2480 2206 1104 1932
2440 1932 516 -578 2388 3841 245 -974 2354 2152 1074 2025 1611 -11 2232 2874 -914 -1104
2456 -1104 2248 1651 71 1484 1563 496 1428 1410 -1611 -1057 2269 1721 -1465 119 915 -106 413
2473 413 45 -1639 -514 2985 375 -3465 -1244 540 -834 -656 -41 -1695 -39 2177 -814 -4259
2489d259L260K043k097j46P68r61J021J218k753j286L768J311l113j186K496j150
2505a066l26P39j507K52M115j35m696k58L264l20q53J38q81J86K848k17m846J168
2523b395M301o09k077N50k31l56K112j224k946K124L582j609k428J133O29p13
2539a57R38n08j629K193K524l415k358L278J381j286j51K1j387K792Q78l895j372
2556b153M141J395k707l43K67l15J659J268l895r92M255M71l151k79J198n08J137
2573A448K86k092n22L249p41l275J125K311j385o73L43j342Q39K944j902l604
2589b991K493K679j768j903M20l4O19K357k411l433K899K844k081j921J363m77
2605a345K88J626j724k306K673J740k785r98K236m12m74J004o20j429J721P24
$$ plain form
2489 -4259 -999 1044 -1053 -1199 -431 -1392 -371 847 -1906 -3192 576 1887 -1226 -2412 84 -1066
2505 -1066 -1392 -653 -2160 -1908 2207 2072 -2624 -2882 382 62 -791 -653 -1534 -1348 1500 1283 -3563 -2395
2523 -2395 1906 1297 -780 -230 -461 -817 1295 71 -2875 -751 2831 1222 -1206 -73 556 -157
2539 -157 781 273 -1356 837 3361 -54 -2412 866 2247 961 810 831 -556 2236 3114 -781 -2153
2556 -2153 1988 3383 676 333 600 285 1944 3212 -683 -1675 2580 3051 -100 -379 819 311 1448
2573 1448 1734 -358 -880 2369 1628 -1647 -522 1789 404 -269 74 -1268 -429 2515 613 -2991
2589 -2991 -498 2181 413 -1490 -1070 -1104 -485 1872 -539 -3972 -1073 1771 -310 -2231 -868 -1345
2605 -1345 -1057 569 -1155 -3461 -788 952 -1833 -2831 -595 -1007 -1481 -477 -1097 -2526 -805 -81
2621h1k852k52K707j93j313R10m21j010J707Q20k789l96L336n98k421J082M30
2638a334n98J970N51k884j17K655m33k197J195Q13q06J043P03k584K73L022n67
2655G05j810J096Q52j835P15J197j706Q25K106j193k015K213J459k516L10J491
2671A894j180J45J684j580j327K584J263k078k85J314j172R2J834j548j954K444
2687B130J292k189r6J851j412J53J428j641j552K276Q72k513J06K038j081n35
2703A127J354r31j350K237J46l164J68K426q79q96J350l92j234K015n22k736O36
2720f45K989j297k455J110m2p35K016k27k157J078J961k243k492J924J015o09
2736h09J051q27j736R41J513j955j546L072P04k045k52K41j497J318J994k157
$$ plain form
2621 -81 -2933 -3185 -478 -671 -1984 -1074 -1495 -2505 -798 22 -2767 -3163 173 -425 -2846 -1764 -1334
2638 -1334 -1932 38 589 -2295 -2412 243 -190 -2387 -1192 -379 -1185 -142 561 -2023 -1750 1272 705
2655 705 -1105 -9 843 -992 -277 920 -786 39 2145 952 -1063 1150 2609 93 403 1894
2671 1894 714 859 2543 963 -364 2220 3483 1405 1120 2434 1262 1354 3188 1640 -314 2130
2687 2130 3422 1233 1137 2988 1576 1729 3157 1516 -36 2240 3112 599 705 2743 1662 1127
2703 1127 2481 1550 200 2437 2583 -581 -413 2013 1134 238 1588 1196 -38 1977 1455 -1281 -645
2720 -645 2344 1047 -1408 -298 -340 -1075 941 714 -1443 -365 1596 -647 -3139 -1215 -200 -809
2736 -809 242 -585 -2321 -1380 133 -1822 -3368 -296 408 -1637 -1889 -1648 -3145 -1827 167 -1990
2752a990o11K352J76k794j13J629m63J052J009k963p75K905M81k597J073J462
2768a67m95j38K5j859K85L547o09k997Q67J997r32l92N35p63O83K460j763l036
2786b752J569L232j316j246Q68j31K39J440j513j845K453K417k793k262K408N23
2802A291n25J037j332r18K247J067l066j104L221P82j713K92j026m06K284Q07
2818B938l378m47L595m0k489M98M57o15K061n67k473k20L328m17k513J004P14
2835A436o90J94M27k282J009K883j637k434J205J655j400l78R29j259O59J937
2851B254k303k845K632K177j793o43N63j038P98J665j926k124L103J569k758q94
2867a563J116n06N21J559j509j396K345M89l187l88K474j25p08J056o43j051J979
$$ plain form
2752 -1990 -2601 -249 -73 -2867 -2980 -1351 -1814 -762 247 -2716 -3491 -586 -105 -2702 -1629 -167
2768 -167 -662 -800 -775 -2634 -2349 1198 589 -2408 -1541 456 -476 -868 -333 -1096 -413 2047 284 -2752
2786 -2752 -1183 2049 733 -513 355 224 463 1903 390 -1455 998 3415 622 -1640 768 1291
2802 1291 766 1803 471 -447 1800 2867 -199 -1303 1918 2700 987 1279 253 -153 2131 2938
2818 2938 -440 -887 2708 2668 179 677 1134 519 2580 2013 -460 -680 2648 2231 -282 722 1436
2835 1436 746 940 1367 -915 94 2977 1340 -1094 111 1766 366 -12 917 -342 317 2254
2851 2254 -49 -2894 -262 1915 122 -521 42 -996 -198 1467 -459 -2583 520 2089 -669 -1563
2867 -1563 -447 -953 -432 1127 -382 -1778 567 1056 -2131 -2519 -45 -170 -878 178 -465 -1516 463
2884D63K9k975J222K505j099j445O61o4k98J538M82k528P66K470j190j973J219
2901b17j79n21J615k48j818R65K039j430j245J309m1n78J182J76j655K53J820
2918A427j612j043K435J005j663N13L05j993O47J728j918l09K390O10k417K39
2934C44M11q83J005J856k056j142K510j41k007l00J863q38R84J143j969j246J985
2951A519R5j711P87J411j154n88J030j161o12K527j15k761J194J230j452j071
2967h32J294Ok31J494l32k872J326J721j850q60Q48k43j14J655q98j982J360J577
2985A067j678j131J484m87l86J381q54j472Q01J450j681j073K226J13j367Q22
3001g85k46j227J265J129k689l13K737P9j685j36N26q54J602N18k235j13K624
$$ plain form
2884 463 492 -2483 -1261 1244 145 -1300 -639 -703 -1001 537 1019 -1509 -743 1727 537 -1436 -217
2901 -217 -396 -917 698 450 -1368 -403 1636 206 -1039 270 229 -349 833 1009 -646 -393 1427
2918 1427 -185 -1228 1207 2212 549 1062 1367 -626 21 1749 -169 -478 1912 2522 105 344
2934 344 755 -128 877 2733 677 -465 2045 1904 -103 -403 1460 622 1606 2749 780 -466 1519
2951 1519 1614 -97 690 2101 947 359 1389 228 -384 2143 2028 -733 461 1691 239 -832
2967 -832 462 468 237 1731 1399 -1473 -147 1574 -276 -1136 -288 -531 -645 1010 112 -1870 -510 1067
2985 1067 -611 -1742 -258 -745 -1131 250 -604 -2076 -1275 175 -1506 -2579 -353 -240 -1607 -785
3001 -785 -1031 -2258 -993 136 -2553 -2866 -129 -50 -1735 -1871 -1345 -2199 -597 -79 -2314 -2427 197
3018A97j43k156k9J331j23R28M9k503M14K323m90k242J397J649q48p30J47r95
3036a824P70K274j097k089K112J235k056n79Q13J00N69J667j623k206K631J499
3052B196k480p51J456L14J3O16j349j243K544R33k163l82J840K2o95M70j326k23
3070b08K135K34k428J61K272Qj582o2kj34J794m27k606O75K680j136j865R33P51
3089A193k06P77p35k185J035K363j761k343K032J246q69Q2l89j459J110J689k148
3106e68j094K379M77j841k59P80p57J161P89j954r75K491P6k329l8J309n33O55
3124b31N16j402n96K150n5k139k40J810k33j38L34j344l07K070l7k062Q21J698
3142F15j093r14N30p11J01J961o03j353Q82J628j566j060J203k52J12J348r76
$$ plain form
3018 197 54 -2102 -2131 -800 -923 5 54 -2449 -2035 288 -202 -2444 -1047 602 -246 -976 -829 -1824
3036 -1824 -1054 1220 123 -1966 146 1381 -675 -1254 -441 -341 228 1895 272 -1934 697 2196
3052 2196 -284 -1035 421 735 748 1364 15 -1228 1316 2249 86 -296 1544 1566 871 1341 15 -208
3070 -208 1927 2161 -267 -106 2166 2174 592 530 528 394 2188 1761 -845 -170 2510 1374 -491 442 1193
3089 1193 987 1764 1029 -1156 -121 2242 481 -1862 170 1416 547 629 240 -1219 -109 1580 -568
3106 -568 -1662 717 1194 -647 -906 -126 -883 278 1067 -887 -1862 629 705 -1624 -1662 -353 -886 -231
3124 -231 285 -1117 -1713 437 382 -1757 -1997 -187 -420 -558 -224 -1568 -1875 195 158 -1904 -1083 615
3142 615 -478 -1392 -862 -1573 -1472 489 -114 -1467 -585 1043 -523 -1583 -380 -632 -520 828 -148
3159a48j574J194J541j506p19J630K63m04qm87j551J586J854j446q15J647m38
3176F19q69O79L19p75J070Q03k326o10K117R9j560J380P06j229P87k09j257q5
3194c41K581n42j958P62N91q29O04Q22j459k88K139n90j811P44P87r25O73P37
3212A697j640K6J234l30j496J339O97j023k78L93r32j59J958l74j970J416J247
3229A805k110k45O60q4rJ298j218j545J643J352k016o11J454k27l10O79j038j366
3247a888J654J041j617o51J805n08p88N31l25p34J769oj927R1J978m71j691R42
3265g95M65o60J144j64k067L69K234p33j469O84P76j42M85l12j736R53K458j315
3283A75k223J117Q52l64K85L97j642J154J695j678j665J823J217j313k84Q83q10
$$ plain form
3159 -148 -1722 -528 1013 -493 -1212 418 681 277 269 -218 -1769 -183 1671 225 -590 1057 619
3176 619 -250 429 748 -27 1043 1846 -480 -1090 1027 1126 -434 946 1652 423 1210 1001 -256 -341
3194 -341 2240 1698 -260 502 1093 264 868 1690 231 -57 2082 1492 -319 425 1212 287 960 1697
3212 1697 57 83 1317 987 -509 830 1527 504 226 619 -313 -472 1486 1112 -858 558 1805
3229 1805 -305 -550 110 26 17 1315 97 -1448 195 1547 -469 -1080 374 147 -163 516 -522 -1888
3247 -1888 -234 807 -810 -1461 344 -164 -952 -421 -746 -1480 289 283 -1644 -1553 425 -46 -1737 -795
3265 -795 -330 -990 154 -10 -2077 -1708 526 -207 -1676 -992 -216 -358 127 -185 -1921 -968 1490 175
3283 175 -2048 -931 -79 -443 -158 239 -1403 -249 1446 -232 -1897 -74 1143 -170 -454 429 -381
3300c81O05N25j355p91K588P78j853q00J112l14K89N82j599k52K528K44k444j78
3318g16J751L25j38j75j337j08K118p14k167J189J486k96p72M34n57l62J268l08
3336I21j759J478J458j724j123J167M74j53O83p93j280R42J044j490j333J766
3352B78R19p99L40n87j534J537J655k246o68J233O22j599L22P7k00J039N02j661
3370g70p41J780k76j614N88Q60p53P76K4j472M03J685m41k093J074J077r27q5
3388i05o2r49N78K309j103j870R67J200j402m28R51l13O8J138p84j206Q36J035
3406F0p45n13J325n36o71M49l24p92J599N02j500J49J697n69j110O22L3q44J185
3425A7Q59k018N63J197l80o66R71l52j258J508Q02j433q3R82m34m13P81l2j108
$$ plain form
3300 -381 224 749 -606 -1397 1191 1969 116 -684 428 114 403 985 -614 -866 1662 1906 -538 -716
3318 -716 1035 1360 1222 1047 -290 -398 1720 1006 -1161 28 1514 1218 446 880 323 -39 1229 921
3336 921 -838 640 2098 374 -749 418 892 739 1422 629 -651 291 1335 -155 -1488 278
3352 278 1197 398 738 151 -1383 154 1809 -437 -1105 128 750 -849 -527 -450 -650 389 891 -770
3370 -770 -1511 269 -7 -1621 -1033 -173 -926 -150 -126 -1598 -1195 490 49 -2044 -970 107 -820 -905
3388 -905 -967 -1916 -1338 971 -132 -2002 -1035 165 -1237 -1665 -714 -1027 -959 179 -605 -1811 -975 60
3406 60 -685 -1198 127 -409 -1080 -631 -955 -1747 -148 354 -1146 -997 700 131 -979 -357 -324 -1168 17
3425 17 876 -1142 -579 618 238 -428 543 191 -1067 441 1243 -190 -273 709 275 -138 643 611 -497
3444d97J337O51j556J49J288q33n29Q48P7n20L55Q40j552j53J772r17j040R05
3462F25R58j258M14J93j186J61J734q23r82P40O89r06K94M6j031O55J046o73j127
3481d31R46L54q61L32Q38j099L20R68j070j247J432L33j043o3J193q95L95M33
3499H35j305p72J659L92j152j88J037k21m30Q9q15J11J415L72j905k06J247n39
3517c76l23O75n52P8J073j68j767L62J721o72j218J010L2n49O27n49j225J189
3535f32J861j160j655J285N70o10l49J64p89J251J525j998j049J810M8p96J36
3552c88K66n23J198L02j832k59J872p6r70K23O53l9l18jj207O01J335p1j247K01
3572b80Q68l63k67L06n86P31R22q13j955Q62J390l70m45O31m46K9N83n00j684
$$ plain form
3444 -497 840 1491 -65 84 1372 539 10 858 935 415 770 1610 58 -95 1677 760 -280 625
3462 625 1583 325 739 932 -254 -93 1641 818 -164 576 1265 359 653 699 -332 323 1369 696 -431
3481 -431 515 869 8 340 1178 79 399 1367 297 -950 482 815 -228 -291 902 7 402 835
3499 835 -470 -1242 417 809 -343 -531 506 285 -145 -56 -871 -760 655 1027 -878 -1084 163 -376
3517 -376 -699 -24 -576 -498 575 407 -1360 -998 723 51 -1167 -157 -125 -674 -47 -596 -1821 -632
3535 -632 1229 69 -1586 -301 269 -341 -690 -526 -1315 -64 1461 -537 -1586 224 272 -524 -388
3552 -388 -122 -645 553 855 -977 -1236 636 560 -410 -187 466 427 109 108 -1099 -498 837 766 -481 -280
3572 -280 588 225 -42 264 -322 409 1331 518 -1437 -575 815 445 0 631 185 214 797 297 -1387
3591a387J155J405r94m90Q03l46J27L37p01k93J127L86j352p75J173O73q59J88
3609A77l64j38J182K50j819l54J777l28j047N27r4n19J068N44j229k34J462l94
3627D67j468N05O78q04R09J93j046P5J272j164j187J544O79j215n0L76q15N12
3645e39R87r96p42J441L22r72k86N39l51K72O44q23o26J023N0o60M11O81m97m30
3665e52Q77o32q35J019N57q91O00O72p05o87O35J07p75J062K59j188O07Q43j046
3684g3m93R54m9m24J146l59j040N7J307p62m50J046k86o40J008r9r91P36L95m17
3704E66n24J243n99q69O67N82o80L5N25m02J2N91l30p89P66L21r30O72M31q52
3724D36m11R67j83m03N53J2r93M14N99p16l55Q15J12p95N74j04m27N34O84j021
$$ plain form
3591 -1387 -232 1173 179 -311 492 146 273 610 -91 -384 743 1129 -223 -998 175 848 -11 177
3609 177 -187 -325 857 1107 -712 -1066 711 383 -664 -137 -231 -750 318 862 -367 -601 861 467
3627 467 -1001 -496 182 -622 287 480 -566 -491 781 -383 -1570 -26 653 -562 -612 -236 -1051 -539
3645 -539 448 -548 -1290 151 473 -499 -785 -246 -597 -325 319 -504 -1130 -107 -57 -717 -306 375 -122 -552
3665 -552 325 -307 -1142 -123 434 -457 143 815 110 -577 58 165 -610 452 711 -477 130 973 -73
3684 -73 -566 388 339 -85 1061 702 -338 -281 1026 264 -186 860 574 -66 942 843 -148 588 983 566
3704 566 42 1285 686 -183 484 1066 386 421 946 544 556 1147 817 28 794 1115 185 857 1288 436
3724 436 25 992 809 406 959 971 -22 392 991 275 -80 735 847 52 626 522 95 629 1313 292
3744B92r76R96P7o84M65J32m05q6R12q70m32J045k49j072M66N13n30j51O08o97
3764f46J43J200p23j134K69J115n67l54K31n08J79J036k84j460R77P57q13n45
3782a127N59j45L30M12k33j045J065P05j308m63J121j9o41O55n17l41J100K60
3800C68j246k04J180N39r18K40l67j77P95M31j801PJ975l3j137P25n75J93M62
3819D57L20j206J10J155l28q75N18O41o45N37j64o06J40J077p86r45Q52R99r37
3838C14j53L69l33Q5P00r73o41J227L68j146k77P38M6j3K57n13n68J198J98j317
3858d34L60O49o30L2M49j54n66J019j54r81M61Q18r96l34N20k45m52P69K84j187
3878g72Q00O65p85l45O46j77m83M25p8p37L45P30l39p29J082k71j085P57P2o34
$$ plain form
3744 292 -684 312 389 -295 170 302 -103 -189 723 -147 -579 466 217 -855 -389 124 -406 -557 51 -646
3764 -646 -503 697 -26 -1160 -891 224 -343 -697 -466 -974 -795 241 -43 -1503 -526 231 -582 -1127
3782 -1127 -568 -713 -383 29 -204 -1249 -184 521 -787 -1250 -129 -148 -789 -134 -651 -992 108 368
3800 368 -878 -1082 98 637 -281 -41 -408 -585 210 641 -1160 -1153 822 789 -348 377 -198 -5 457
3819 457 777 -429 -319 836 508 -367 151 792 147 684 520 -86 54 1131 345 -600 252 1251 314
3838 314 161 530 197 282 982 9 -632 595 963 -183 -460 278 324 311 568 55 -513 685 883 -434
3858 -434 -74 575 -55 -23 426 272 -294 725 571 -410 51 869 -127 -461 59 -186 -638 131 415 -772
3878 -772 28 693 -92 -437 209 32 -451 -26 -104 -841 -496 234 -105 -834 248 -23 -1108 -351 -279 -913
3898i13P26K31n40l80J187l30j123Q14N24o55K04j5n93m5R63j65j075P16K37j49
3918c81l38M43l99R4O28l46l25L19O95r92L7R80l64n26M27j74l08O81L51j248
3938g46O1J061k09q53Q99j64k55N56J55r63j74J484l24j002P76N78q29J25L23
3957D99o90J71N82o24j87Q36K00q27Q3P75l49j31N33n36l05Q56O8r96K73N94o65
3978A60RO53n85p5R26m59r06N19P90j458K57Q63k02m58P96j22p45N47P28j040
3998A98n70J177k30p23L59j82n13P25N71p92l20P35k72o86K05O53o73O92N0j059
4018f55K41J161k71j432P69N67o44k20M65n02K15Q25q06r03J088N37m28p95O17
4037a71m01J63N72p30k33O56R98j353l10N53J56k22N34p33m60J128j20r63K66
$$ plain form
3898 -913 -187 44 -496 -876 311 -19 -1142 -328 196 -459 -255 -270 -863 -908 55 -110 -1185 -469 -232 -381
3918 -381 -719 -276 -675 -581 47 -299 -624 -305 390 -602 -565 415 51 -475 -48 -222 -530 151 502 -746
3938 -746 -685 376 167 -686 213 49 -206 350 505 -458 -632 852 528 -474 302 880 51 176 499
3957 499 -191 -20 562 -62 -249 587 787 -40 43 818 469 338 871 335 30 886 954 -42 231 825 160
3978 160 169 822 237 162 1088 629 -277 242 1032 -426 -169 694 492 34 830 708 -37 510 1238 198
3998 198 -372 805 575 -148 211 29 -484 241 812 20 -300 435 163 -523 -318 335 -338 354 404 -655
4018 -655 -414 747 476 -956 -187 380 -264 -484 -19 -521 -306 519 -287 -1190 -102 435 7 -788 -171
4037 -171 -572 -409 163 -567 -800 -144 854 -499 -809 -256 -100 -322 212 -521 -981 147 27 -936 -670
4056f70J106j43o50K27j93O1N56q8r95L36J234n76n73L17J57NM79k73o30L49R82
4077A018p79o58R44l0j92J62J68n91L39O84r55j65Q72r8q47M04N70n49J39M69
4097I05l52n46J063J84j141K62O09n31mQ73j408J07J079k35j083M09P20n25k64
4116A22K92o2l9M33l04p19N16O11o91l99O42k2m27P79o82k73N33M6o89j01R21
4137D87o92j5M6p6m83N48O36j109L55M79m66l82J76N6l65K33M10n21L48M99j099
4158i35l79R32M48n19k68M55k88j61O98n71p09J193N33j382K23N69l62l2O83l75
4178b47q04R41P8p98M44N34l94l87N39j63m37P30J12j165R03L78p71j62O89J53
4198A73p80P21k36m94M02O99q76j84J040N8p91N38J44q99Q15J67o20L8O51k72
$$ plain form
4056 -670 436 293 -357 -130 -323 -262 294 206 -789 -453 781 205 -368 -51 106 111 590 317 -313 36 1018
4077 1018 239 -419 525 495 303 465 633 42 381 1065 110 -55 817 719 -128 276 846 297 436 905
4097 905 553 7 1070 1254 113 375 984 453 449 1322 -86 21 1100 865 -218 191 911 386 122
4116 122 414 352 313 746 442 -277 239 850 159 -240 402 380 -47 732 50 -223 310 356 -333 -434 487
4137 487 -205 -220 -174 -250 -733 -185 451 -658 -303 176 -290 -672 -496 -440 -805 -572 -162 -683 -335 164 -935
4158 -935 -1314 -382 66 -453 -721 -266 -554 -715 -17 -588 -1297 -104 429 -953 -730 -161 -523 -555 128 -247
4178 -247 -1051 -110 -32 -830 -386 148 -246 -633 -94 -257 -694 36 148 -1017 -114 264 -507 -669 20 173
4198 173 -607 114 -122 -616 -214 485 -391 -575 465 523 -268 270 414 -485 330 497 -123 -85 566 294
4218B94o39M08O59o07O3L41p19J16O81n4r89L47J022o46j78N43n69l4R33n11q64
4239d03P17M16n23k26M16k96n9O51n73o91Q42L75j038r6R77l91m34N43J82m66
4259g7M94K69j364N9J340n01p66L40jk6L90J1j074R5J252m91o69M43M96m99J56
4280a23k15n39M42Q33m90r89J097O46j451M40Q2l73K33Q69j075l22J065k11r30
4299a011N93M28p0k57K05n53l14J241M5j020L36N58m07J79m9m34J06R20k49j007
4319g60L93R29q16N3L80k26j60M88j77o98P29O02j175o9P93p5l45O96m53l86Q22
4340E45N30j315k43R16K79l72J14j82n96Q33O46j471O5J016n41j17N10j02n27
4359a2O85ln32kP39k53r69Q22J44m24j92L42j07j59P33k07q23Q28K18p56Q3M13
$$ plain form
4218 294 -345 63 722 115 178 519 -200 -84 597 543 -446 -99 923 277 99 642 73 39 972 461 -403
4239 -403 314 730 207 -19 397 101 42 693 120 -571 271 646 -392 -488 489 98 -336 207 389 -77
4259 -77 417 686 -678 -619 721 220 -546 -206 -207 -233 157 168 -906 -811 441 -50 -719 -276 220 -279 -123
4280 -123 -338 -877 -435 398 -92 -1081 16 662 -789 -349 -267 -640 -407 462 -613 -935 130 -81 -1011
4299 -1011 -418 10 -60 -317 -112 -665 -979 262 307 -713 -377 181 -226 -47 -96 -530 -424 496 247 -760
4319 -760 -367 562 -254 -201 179 -47 -207 281 104 -594 135 737 -438 -507 286 211 -134 562 109 -277 545
4340 545 1075 -240 -483 433 712 340 454 272 -324 509 1155 -316 -251 765 224 107 617 515 -12
4359 -12 673 670 138 136 875 622 -347 475 619 195 3 345 238 79 812 605 -218 610 828 72 155 568
4381E68m54j97P60n75m31M96L91q26L51K94j56n86Q99j15o69N98k88o84P49L27
4401D52n83j67M75l1o76M97J1q98O80L89n46p1N14L27j086M91M77p22J39L36m35
4422d27k90P30k32l32J81L86k05j82N68n45j28L92j03p40O14M50l49l08L52k23
4442c91J43O06n11n65N15N25p90J32O89m04p0L13k10m30N51K13p91K51M54P2n77
4463b75J93J53pL39K70r09O2O38l82o65O40L77l80K42K20o57K46P74n46q97J117
4484E53R0n69L5J2J73Q6L77m98m05N07L68j055K44N31k04j61N47m10l69Q50k3
4505F79r43M37N18q55L7K18J34n88Q52m19o40K07O04j26n97O12l98k05N26k84
4525b31r11J011N20n19m67N34N1n29J08ql08O49L73p37l90N73K16p21P66O1p91
$$ plain form
4381 568 114 -83 677 102 -329 167 558 -268 83 377 221 -365 534 419 -250 348 60 -624 125 452
4401 452 -131 -298 177 146 -530 -33 -22 -920 -240 149 -397 -468 46 373 -713 -222 255 -467 -328 8 -427
4422 -427 -717 13 -219 -551 -370 16 -189 -371 197 -348 -476 -84 -187 -927 -313 137 -212 -520 -168 -391
4442 -391 -248 358 -153 -718 -203 322 -468 -336 353 -51 -121 192 -18 -448 103 316 -475 -224 230 302 -275
4463 -275 -82 71 64 403 673 -236 -174 464 82 -583 57 434 54 296 516 -141 105 879 333 -564 553
4484 553 643 74 109 121 294 380 757 259 -146 361 729 -326 -82 449 245 84 631 221 -148 702 679
4505 679 -264 173 691 -164 -127 91 225 -363 489 70 -570 -363 241 115 -482 130 -268 -473 53 -231
4525 -231 -1142 -131 389 -130 -597 -63 -12 -541 -433 -441 -749 -100 273 -464 -854 -281 -65 -786 -20 41 -750
4546g50M97L21p52k00R63j98p08O9N60j80j61M52p19j4O03l4p47N39O58n88l8
4567d27L86n61m9P33k96k36K50L57n17M1K33M6m74L85q9m52O61L66q50M84J84
4588A75l78q9M08M3k85L04L41o72k15N93l4j64M28L37j103Q65J12p18M6P65o06
4609A53j49Q09m67o54M87P03p48M61R5k84j66L83k12n53L98N81q49J27L27j10
4629C32m89Q53l1o06J13J76l12p7L94j64l73N93m8o93O62J11o17j72Q48k47l71
4650a18M21l62m49Q46J18p96K4M09N0o58M75K47k84J88L0m91j61J233q38j73%
4671b89M62l43OJ45n50K20O82j77q94P64N4l96k34L36M8K58J8m32m68P21K29o13
4693d53j89N39N5J3l2l20k89O01M89p01J8O65l59k94L61m3k35M86j50m83N0P55
$$ plain form
4546 -750 -253 68 -684 -884 79 -119 -827 -758 -198 -378 -539 -87 -806 -820 -217 -251 -998 -459 199 -389 -427
4567 -427 -41 -602 -651 82 -214 -450 -200 157 -360 -319 -86 -40 -514 -129 -218 -670 -9 357 -493 -9 175
4588 175 -203 -292 116 159 -126 178 519 -153 -368 225 191 27 455 792 -311 554 666 -52 -6 759 153
4609 153 4 813 346 -308 179 882 134 595 690 406 240 623 411 -142 256 837 -12 115 442 332
4629 332 -157 696 665 59 172 348 36 -41 353 189 -184 409 361 -332 330 441 -176 -348 500 253 -118
4650 -118 303 -59 -508 338 456 -340 -316 93 143 -515 -40 207 -77 111 141 -350 -511 722 -116 -289 -289
4671 -289 173 -170 -164 -19 -569 -349 333 156 -738 26 80 -316 -550 -214 -166 92 110 -322 -790 -69 160 -453
4693 -453 -642 -103 -48 -35 -67 -387 -676 -75 414 -287 -269 396 37 -257 104 61 -174 312 162 -321 -271 484
4715D84o23m10R56m50K17J85k48m54L78M84o32k44N38l1j72jJ41m10L72O00n02
4736A78m64P98p4o74L42j30j88L76N21o42o9O48k27q24K99M83j04j6j00k32J37
4757C8O31m10p73O29N16m41k41J09k97O0P53m74p51O79R20p66o78P95k55l43O52
4778C53j11n87L47M68r47r1Q22k41k32J42J64o90M05K13n48k99R83p9m25P2M10
4799A29m26j95L67n99J73J175o02n59L21J84n89N42k37l47K73O39m84m10N42j5
4819a18k26L6M21k64k72N28m15l94Q58K24r90M54J93j74r5L76k89j99L62J76o68
4840d76K74K51m44N8L54j36k13N74N4o27L15O02n55m26R50l44k95O62k59l19K7
4861B7N4K29l39M38o0k92R5J68n10M29K3l51L18K90l25o25L72O55n79M03J4m21
$$ plain form
4715 484 -139 -549 407 -43 174 359 111 -343 35 519 -113 -357 181 150 -22 -23 118 -292 80 680 178
4736 178 -286 512 438 -236 106 -24 -212 164 685 43 -26 622 395 -429 -130 353 249 233 133 -99 38
4757 38 669 259 -514 115 631 190 -51 58 -239 -179 574 100 -651 28 948 182 -496 299 44 -299 353
4778 353 242 -345 2 470 -477 -568 254 13 -219 -77 87 -603 -198 15 -533 -832 151 72 -353 -281 129
4799 129 -297 -492 -125 -724 -551 624 22 -537 -216 -32 -621 -79 -316 -663 -390 249 -235 -645 -103 -118
4819 -118 -344 -308 113 -151 -423 105 -310 -704 154 378 -612 -158 35 -139 -234 142 -147 -346 16 192 -476
4840 -476 -202 49 -395 -337 17 -119 -332 242 296 -331 -16 586 31 -395 555 211 -84 578 319 0 27
4861 27 81 310 -29 409 349 57 152 320 -190 239 262 -89 229 519 194 -431 -59 596 17 420 434 13
4883A3QN50k73o43M62P1J27k63K60l61J92j4O0n01M59L85r15K77M53l44j04M67
4905C66m50k38M91K24j128N05P89o24l33K88k12J42K04P9p89O51M52m47l99N10
4925H1Q4m82M36q2l83Q4M48l46l32J09J15n1K51k6l04K22K7j01k16N21o1q59N50
4948c15L55m12J06M09l65l2O92qr23J09M53j28k22M35q29L26Q43k56p50L75M07
4969B70m52j09M22j33k21O40l97l24O06J43n37l38P18J55n75K27j5m97Q35L25
4989G43q65K13L39J26m33j15R8o9N39k2o05M5N11j76o11L87jP5Q5M5l64O3P04
5012G12l64q10O90L61l98k48p8J74J15O04o20m12N96M19p75n53R68k39Q6K83n86
5033g5l01P02Qm44q8O69l71l23M35l61k96N93J53l26l18R35o85l84j9N27k33N5
$$ plain form
4883 13 21 571 298 -345 117 188 315 52 312 -49 143 129 189 -312 147 532 -383 -106 347 3 -101 366
4905 366 -84 -322 169 393 -735 -230 559 -65 -398 -110 -322 -180 24 103 -686 -35 417 -30 -429 81
4925 81 165 -317 119 37 -346 -262 186 -160 -492 -383 -268 -319 -68 -94 -398 -176 -149 -250 -466 55 -6 -865 -315
4948 -315 40 -372 -266 143 -222 -254 438 430 -493 -384 69 -59 -281 154 -675 -349 494 238 -512 -137 270
4969 270 -182 -291 131 -2 -223 417 20 -304 302 445 -92 -430 288 443 -132 95 80 -417 418 743
4989 743 -122 91 430 556 123 8 106 37 576 554 -51 -6 505 329 -282 105 104 179 264 309 -55 8 712
5012 712 348 -462 228 589 191 -57 -135 39 154 758 138 -274 322 741 -34 -587 381 142 228 511 -75
5033 -75 -376 326 334 -110 -198 471 100 -223 212 -149 -445 148 301 -25 -343 592 -93 -477 -496 31 -202 -147
5055a47O5p24O51L24m38k88L08L35K91m39j45l61L79N02o89j53M18l3n5J10K5
5076f4m91L27N15m66k87O03k69l86l7O94m13K30L01m03j69M14m0o17L86K95k05
5097h2J27j65p1n0O60l0n33J46M27m60P1K1j43rM44l82k79M54Ok09k6N53k85k82
5121i7J72J17l19K73J15l04q0O38j57o92O26j68J05j96M53q92M65J71j26p6N33
5142E61%n98j59J96J19n1K63j90j71K53j07l96J37M78k25k99M86k69J76J78l69
5163A3l17K7N62l63oL03o3k12M29l65n03K85M01k49l88N21k06j76L96J8m27N60
5185B40q5m07k73N94l9k12mK98OJ70l25p11N63K40J14o67L47n2R6J1J27o41L95
5208b15P33l88m42Q8J5L2J66K65m07J51M16j68p46J84N86m25L92L9O0l77J77k77
$$ plain form
5055 -147 -82 -806 -155 169 -269 -557 -249 86 377 -62 -207 -568 -189 313 -376 -529 -111 -144 -199 -89 -64
5076 -64 -555 -228 287 -179 -466 137 -132 -518 -555 139 -274 -44 257 -146 -315 99 59 -558 -172 123 -82
5097 -82 45 -120 -191 -241 419 389 -144 2 429 -31 40 61 -82 -91 353 -29 -308 146 152 -57 -83 470 185 -97
5121 -97 75 192 -127 146 261 -43 -123 515 358 -334 292 124 229 33 486 -406 59 230 104 28 561
5142 561 561 -37 -196 0 119 68 331 141 -30 223 116 -280 -143 335 110 -189 297 28 204 382 13
5163 13 -304 -277 285 -78 -84 219 156 -56 373 8 -495 -210 191 -58 -446 75 -131 -307 89 107 -320 240
5185 240 155 -252 -525 69 30 -182 -186 112 118 288 -37 -748 -185 55 169 -498 -151 -203 -107 -96 31 -610 -215
5208 -215 518 130 -312 -224 -209 -177 -11 254 -153 -2 414 246 -500 -316 270 -155 237 276 336 -41 136 -141
5230a41k8O49K67m91k63L60k04l40L17j44J40L87k40m43%O40l57j63N65m19L12
5251D04n7o4l50J15L88j30k64L44K13r19K92K58l42M4O97l69k32L33J8j31j07
5272A41Q3KJ3K68n41k44O10M0m87OM13k54J0K50k84k17N00K00p64J60J98j03q7
5295h7L67k95k37K30Q8m52L96M61l21l15J60Nm14K99P6m51N90K43r06J63J63J26
5317a11l40L34j05l20M78J48l45l63L17L0J61J93k78k00R1L25n96M79P00k22o42
5338b66j57L02m18M27M1N6J30P3n13m15O43J98k96M65k69P9m39J46K91m53N35
5359A60j8j46j2J62j77J98J15k46j7J30L88o94J86K14j35m10O04M20m71l51K18
5380A18p8j60N85l31n53O00L94n09J36p9M0k28O97m63k82O59k16n40L13J44n59
$$ plain form
5230 -141 -169 480 747 256 -7 353 149 -191 126 -18 122 509 269 -174 -174 466 109 -54 511 92 404
5251 404 347 283 -67 48 436 306 42 386 599 -320 -28 230 -112 -68 629 260 28 361 379 248 141
5272 141 224 226 239 507 -34 -278 332 372 -115 -109 304 50 60 310 26 -191 309 509 -255 -95 103 0 -87
5295 -87 280 -15 -252 -22 66 -386 10 471 150 -165 -5 0 -414 -115 -39 -490 100 343 -563 -400 -237 -111
5317 -111 -451 -117 -222 -542 -64 84 -261 -624 -307 -277 -116 77 -201 -401 -310 15 -581 -102 598 376 -266
5338 -266 -423 -121 -539 -112 -71 -15 115 188 -325 -740 -97 101 -195 270 1 80 -359 -213 78 -375 160
5359 160 142 -4 -16 146 -31 167 282 36 19 149 537 -157 29 243 108 -302 302 722 251 -100 118
5380 118 40 -120 465 134 -419 181 575 66 202 123 163 -65 632 169 -113 546 330 -210 103 247 -312
5401c12O04k6L1k28L59m91j78L58L82p2o55N40l23o1M19l41o5M30K59n60m50M26
5423D6j95M34M8m51p3K77P8j01n42M96Mk45N75m74m3RJ38m09K58M49l16l72M66
5446E7l8j99L84m2l95R7M66l49o35O11K10l81L31m31k56K27N61j50n08M98j36
5467g8k91J14N25n37L04J22j52n94Q83q1l42Q5J49j37j37K50l35J88M19m1o13
5488b99L23O8k0k17L48k13mK10L5m03J32M26l73pL2m1J76K73m3j60O7m1m79K42
5512C2K7n9p7O07k55l19L16K27p08K03O00l78m39L06L45n87M49J37p21L13M34
5533D53j92o00L27J80l75L27K76o97r8O24j73k34L90j37l59J54K73n43J16M98
5553B10j02L9nJ22m23l08O27j2n27K20p8j42L35Q9l52k13K83J03l39M06l10J25
$$ plain form
5401 -312 292 266 297 69 428 -63 -241 117 499 427 -228 312 -11 -72 347 6 -59 371 630 70 -380 46
5423 46 -149 285 333 -118 -191 86 164 63 -479 17 21 -224 351 -123 -166 -157 -19 -428 -170 279 -37 -409 57
5446 57 19 -180 204 162 -233 -136 330 -19 -654 -43 167 -214 117 -314 -570 -343 218 68 -440 58 -78
5467 -78 -369 -255 270 -267 37 159 7 -587 296 215 -127 -42 107 -30 -167 83 -252 -64 355 314 -299
5488 -299 24 92 72 -145 203 -10 -14 196 231 -172 -40 386 13 6 38 -3 173 446 403 243 310 269 -210 32
5512 32 59 0 -77 530 275 -44 272 499 -209 -6 594 216 -223 83 428 -159 290 427 -294 19 453
5533 453 261 -339 -12 168 -207 120 396 -301 -399 225 52 -182 208 71 -288 -134 139 -404 -288 210
5553 210 108 147 142 264 -159 -467 160 148 -379 -159 -237 -379 -44 45 -307 -520 -237 -134 -473 -67 -377 -252
5575b52L04L1l99j0M69j89q2J66M4k35j73K32j77P8K63l86M3L98J54m97Q6o0J62
5598c0q7L6Q8m64N68L99q07K68j5m1j01K98p1l37N32k23l78N00n9k91lL77M8n9
5622A48m79L79k55R8N64j40q07P11M0j83k4p1q1L71o2j18j83L10j76j20QO2RL27
5646C28J05m31J60lo1k68n5M75n27L55Oj93K09k7j1k07M53J75m75m1n4j40L22
5669I5J80j60m01K38L18o74K21j76J99J72Q0r3l83M10j11k38J40J5J36J3j6j9
5691e4q0L37k56j68j5L28J24o24L49j49J55pk8m20M11L01k70k86M2M84n96O87
5713B65n63j53K38K38j56j33j45M98l17J22K92o17L29K70p09M55J74J87p07O90
5733B58J10k23K9j52l00M03K67l4r35Q55j58k78K64k02K49q2L76k15q26L45P03
$$ plain form
5575 -252 52 83 -316 -326 143 -46 -128 38 82 -153 -326 -94 -271 -193 70 -316 -273 125 279 -218 -132 -192 -30
5598 -30 -117 -81 7 -457 111 510 -297 -29 -44 -85 -186 112 41 -296 236 13 -365 135 76 -215 -218 159 207 148
5622 148 -331 48 -207 -109 455 315 -492 219 259 76 52 -19 -100 271 209 91 -92 218 42 -78 -70 -8 1 328
5646 328 433 2 162 159 98 -170 -225 250 -277 78 84 -109 100 73 62 -145 308 483 8 -33 -87 -227 95
5669 95 275 115 -286 -48 270 -404 -183 -359 -160 12 92 -1 -384 26 -85 -323 -183 -168 -32 -19 -35 -54
5691 -54 -134 203 -53 -221 -236 92 216 -408 -59 -208 -53 -60 -88 -508 -97 204 -66 -352 -310 174 -422 265
5713 265 -298 -451 -213 25 -131 -264 -409 89 -228 -106 186 -431 -102 168 -541 -86 88 275 -432 258
5733 258 368 145 174 22 -278 125 392 358 -577 278 120 -158 106 -96 153 71 447 232 -594 -249 454
5754D54l24k43N3L20m44M38L2l09J17J38j54J28j23M67q01M76j40o1L26l67j08
5775a25m4M16j4r1n6J23R6Q7k63o01J12N02Lk62O9L48k44K75k2k28j82N28n05
5798g8j88M18q2n72L78K86k38K0L71k25k26J74J90m46J68K28mj02l5l95J44M21
5820B07l01j60m2O15J6m18j27j8K6Q3K30m35L08K56m19PM7L02m31J37M06j41M0
5843A88m99j53K76N12j72k77J10o3j69K68J03j33k9K38k12m89K66J68o8K30J3
5864A08q3J4K13l45P4k66K93J82k76K13Rl89O5J02J41P3m00J98k32L70oj96o1
5887a99k22K81K37K43n59L09L0j78L28m19J52J5K79P8l74mR8j30k63M13K93l65
5909D3J44j10k38L92K02k80k51J52J15k88j74L62j05K78m5m29LN81Jp83J24L38
$$ plain form
5754 454 130 -113 -60 260 -184 254 286 -23 94 232 78 206 83 550 -251 225 85 24 350 -17 -125
5775 -125 -169 247 233 142 86 209 305 392 129 -472 -360 142 145 -117 -48 300 56 331 309 81 -101 427 -78
5798 -78 -266 152 70 -502 -124 162 -76 -56 315 90 -136 38 228 -218 -50 178 174 72 37 -358 -214 207
5820 207 -94 -254 -296 319 335 -83 -210 -228 -202 -119 111 -324 -16 240 -179 -172 -125 177 -254 -117 289 148 188
5843 188 -311 -464 -188 324 152 -125 -15 -78 -247 21 124 -9 -38 200 -12 -501 -235 -67 -135 95 108
5864 108 25 39 252 -93 -19 -285 8 190 -86 127 136 -253 -188 -86 55 128 -272 -74 -306 64 58 -138 -199
5887 -199 -421 -140 97 340 -219 90 120 -58 270 -149 3 18 297 375 1 -3 95 -35 -298 115 408 43
5909 43 187 77 -161 231 433 153 -98 54 169 -119 -293 69 -36 242 197 -232 -229 352 353 -430 -306 32
5931C2M0L0M01p19O6L59k21j02Q7J95l50l05M76l69J02L61l87J15K06j08j96n
5953b92M94l62j44pJ31n15Q96J38o63KJ88M19j71K42m55m33M19J24k77m11N40
5974a37q3N2N3K07m24j9L17j44N1L10m19j01K54L22r7j12L71j73j18K27m28l60
5996d51M25J95m27M3L81k97L07J96k33m30M30k8k30R2K69l21LO6K6n19O23O7j97
6019a0j4M97n66j63O14M5j68K74p45m3L12N12n23p8O5Q8l45K35L6k15J08L53J65
6042D34n62L23j32j52L51j83K3J86j0m17j1L81j63l41K52K91j74l81Q2p2K52N42
6064E19l86p16L93k40O42m96L92l70j2M01l32jK99j67M5L29l12j30j3N28m95k5
6086a47K79j35j01k2N7j48q5K85K5j13M3nj76R3L32j21l59J60J53N1J7N7m79J18
$$ plain form
5931 32 72 102 503 -216 -150 209 -12 -114 -27 168 -182 -487 -11 -380 -278 83 -304 -189 17 -91 -287 -292
5953 -292 202 -160 -304 -311 -180 -695 201 339 -324 -322 -134 285 114 356 -99 -532 -113 11 -266 -677 -137
5974 -137 -220 -168 -115 92 -332 -351 -34 -178 -127 183 -236 -337 -83 239 142 30 401 228 110 337 -91 -451
5996 -451 -26 169 -258 -215 166 -131 176 372 139 -291 139 111 -119 -27 242 -79 -76 -10 16 -503 120 187 -10
6019 -10 -24 473 -93 -256 358 403 235 509 -236 -279 33 545 22 -56 9 97 -248 -13 23 -192 -84 269 434
6042 434 -128 195 63 -89 262 79 102 288 278 -139 -150 231 68 -273 -21 270 96 -285 -203 -275 -23 519
6064 519 133 -583 -190 -430 212 -284 108 -262 -274 127 -205 -206 93 -74 -29 300 -12 -142 -155 373 -122 -147
6086 -147 132 -3 -104 -126 -69 -217 -302 -17 8 -105 -62 -67 -243 -150 182 61 -298 -138 15 66 83 140 -339 -221
6110b21N72k62m16L17J07Qj71K11l97K12M23m90k7M52k38k46R0J40K4k44K50j74
6132h0K08Kj01l51M3N37k32m1j8j99L32k11K06m86L02J40J93m37N19l04k3L8J64
6155B01k09j14J73j27j50N02j26o4J07j39k44m5M39m25L7M44o2m64M2L88j15J56
6177B05j09l37K6K88K59n54J92K89m69Q3J01j50K81jPo05J07L34PJ17k27P4K19
6200A37L0m34K37J06j17n1j31K81J7o4Lm3j69K73j31n29L17M19J74j74j94p8k66
6223c87M15J83l88J72L92m82j8K98p2m11J87J72J14k20L35m06k15P00k51m19L24
6244B3J32k96M32k43k22q9M82K54o78R6k2k1M11j7k3k36K9J20p2p8K20k83J53
6267G2L97n03J48K68l56k01O39l41l89K62K63k88J32J8m8J08K58Mm61J49p6kJ4
$$ plain form
6110 -221 351 89 -327 -10 97 105 -66 145 -252 -40 383 -107 -134 318 80 -166 -76 64 88 -156 94 -80
6132 -80 128 130 29 -322 -279 258 26 -15 -33 -232 100 -111 95 -391 -89 51 244 -193 326 22 -1 37 201
6155 201 -8 -122 51 -76 -226 276 150 86 193 54 -190 -235 204 -221 -184 260 198 -266 -224 164 49 205
6177 205 96 -241 -215 73 332 -222 -30 259 -210 -127 -26 -176 105 104 111 -494 -387 -53 -46 71 -156 -82 137
6200 137 167 -267 -30 76 -41 -92 -223 58 75 11 14 -29 -198 75 -56 -585 -268 151 325 151 -43 -121 -387
6223 -387 28 211 -177 -5 387 -95 -113 185 113 -298 -111 61 175 -45 290 -116 -331 369 118 -301 23
6244 23 155 -141 291 48 -174 -263 219 473 -205 -109 -131 -152 259 242 219 -17 12 132 60 -18 202 -81 72
6267 72 469 -34 114 382 26 -175 464 123 -266 -4 259 -29 103 121 73 181 439 443 -18 131 55 53 67
6290F7M15n08l63L37N40m41l17N63k60J07K10o54j82L14O23l49l3L23k40m42K98
6311HQ9j04J61k74j4l5K10j35k79L56K42j11M2k09k15M38J14m44M1L9K11k59j60
6334b88J24l72L64N90l47j97J69k84J57N20k39o8j71L6N1k60J78j25o7R5M43m01
6356i2k95J75N45o13J35J32l20K52L05m80r0N93l39K35j32O8l94nK42J14K59m60
6378a65R5q7K20M14o04K63m41M86m8K19k72k37j76P60l39K11j62n25L07J19P0
6399A08l97J25L11J36j82nl11k9K45K75k99L3J17p5k51L70j1j62j23L22j01J20
6421B16k32j61n3M64j54l8po9L6L08p1m30L66j4j85k0N%LKj17j98K06K23J14j58
6447C6j32j0M9j06K42l4K41N0l71k56M28n05K05l30O97l13J6mN8m97N15j97K04
$$ plain form
6290 67 482 -26 -389 -52 488 47 -270 293 33 140 350 -304 -486 -172 451 102 69 392 152 -290 8
6311 8 97 -7 154 -120 -134 -169 41 -94 -373 -17 225 114 156 -53 -268 170 284 -160 -119 -80 131 -128 -288
6334 -288 -164 -536 -172 418 71 -126 43 -241 -84 436 197 129 -42 -6 45 -215 -37 -162 -229 -134 309 -92
6356 -92 -387 -212 333 -280 -145 -13 -333 -81 224 -256 -346 247 -92 143 11 79 -315 -320 -78 36 295 -165
6378 -165 -70 -157 63 477 -127 136 -305 181 133 352 80 -157 -333 427 88 299 137 -388 -81 38 108
6399 108 -289 -164 147 283 101 96 -215 -244 1 276 -23 10 127 52 -199 171 160 -2 -125 197 96 216
6421 216 -16 -177 -230 234 80 42 35 -34 2 310 239 -191 175 161 -24 -44 -39 -39 -36 -34 -151 -349 -143 80 194 36
6447 36 -96 -106 -57 -163 79 45 286 336 -35 -291 137 -368 -163 -493 204 -109 -93 -97 -39 -536 -21 -218 -14
6470a4m7N4j20p2L88k42k27K38l8j23j4K77k66P0J68M9o01O90p6m69M1K26j08
6493b16J41K97O3m18m3K99l20J39J91j7k55O5J60j86M8j64M70j11J57p26N00o2
6515A2l1k18J74K14l73L05K46l08K46j41j54M1P8n0J06p3J96K5k17r2m67L29M45
6538B93O3k41k25L22J84l97j26Q3J9K87K90o97o4K42j85J44l4J16J6J22l74J22
6560d0Q4m8n2r5K62m2n13M70J4l92R6L79j51j76M80j41k76J13q4j55L28J9j09
6583b9k73K06O7N4Q1j16j45J35K32m47J15p8M67k34j03l1k30mJ76M61m48J26k57
6606b75K13J73K12m62k3J34j56O9J37n10M58K15k37j24J18l9K09k93M05m93P0
6627a99O9L5J52J17J21l08k6O5R3k09M64l17p2K98K0m32q8L13LJ75l80J07J43
$$ plain form
6470 -14 -61 -7 -127 -199 189 -53 -280 -42 -80 -203 -217 60 -206 -136 32 81 -520 170 94 -375 -334 -108 -216
6493 -216 -75 222 285 -133 -176 123 -197 -58 133 116 -139 -74 86 -100 -52 -216 254 143 300 -426 74 12
6515 12 -19 -237 -63 151 -222 83 329 21 267 126 -28 13 91 41 147 74 270 295 78 -14 -481 -152 293
6538 293 356 115 -110 212 396 -1 -127 -44 -25 262 552 -145 -209 33 -152 -8 -42 74 90 212 -162 -40
6560 -40 44 -4 -56 -151 111 69 -444 26 40 -352 -256 123 -28 -204 276 135 -141 -28 -112 -267 61 80 -29
6583 -29 -302 -96 -29 25 106 -10 -155 -20 212 -235 -120 -198 269 35 -68 -99 -329 -333 -157 304 -144 -18 -275
6606 -275 -62 111 323 -139 -162 -28 -184 -115 22 -488 -30 185 -52 -176 -58 -97 112 -181 224 -269 -199
6627 -199 -130 -95 57 174 295 -13 -39 26 119 -90 374 57 -15 283 303 -129 -217 96 99 274 -106 1 144
6650A44l87N45m23N6j3L01j04p2ll9o3J24N0m6j75J93K5j9l8R9j20M7%J22M3k19
6676B8M7k78K77k63M5L57j99j27K47k28j01J24M59k14j30j57K74j00L93n86o8
6697b00K32J33j60Q9p3l72J67n4P13q55L42QM5o8M84k03l13K11j26j20J51Pk8
6720A0j6J81j46j42nn8K29P3k9k76K80k29J25on9QJ33M3r2Q1k71K22O0k42K6R6
6746dn33N28L17k60j73N2N5K88K40m63J6l53N33k15K3kn9n9J53M7l1l22L15Oj93
6771i4N3k4N6J72N0j13j51k62K56R3K12l7l46J14J71J04k48j76K78l06J70J91
6793A63l12m7J81J01k76K50j17k29R58n06l20L28N7l54K27M1o2m61L87O6P1k66
6815a20L97m20j41M94o2o0k3Rj8P8K25j24m91J12N9l0L28l13j10M05k05m5n4L51
$$ plain form
6650 144 -243 302 -121 -65 -78 223 119 47 44 5 -58 66 116 70 -105 88 113 94 56 155 35 82 82 204 247 28
6676 28 75 -203 74 -189 -144 213 14 -113 134 -94 -195 -71 388 174 44 -113 161 61 454 -132 -200
6697 -200 32 165 5 94 21 -351 -184 -238 475 -380 -38 -30 15 -53 431 228 -85 126 0 -120 31 38 10
6720 10 -6 175 29 -113 -118 -176 53 126 97 -179 101 -128 -3 -9 -68 -60 73 116 24 105 -166 56 116 -126 -100 -4
6746 -4 -537 -9 308 48 -125 -73 -18 270 510 47 63 -290 243 28 51 49 -10 -69 84 131 100 -222 93 99 -94
6771 -94 -41 -65 -9 163 213 100 -51 -313 -57 36 248 211 -135 -21 150 254 6 -170 108 -198 -28 163
6793 163 -149 -196 -15 86 -190 60 -57 -286 672 166 -154 174 231 -123 104 145 83 -378 9 75 146 -120
6815 -120 277 -143 -284 210 148 88 65 74 56 134 359 235 -256 -144 -85 -115 213 -100 -210 195 -10 -55 -109 242
6839B42k22J98j06j47k32M19l16K41J92m53L0j46N50M3l31l0K42m17K98K50p8
6860B27l87K23J95m13m2J56j74J75J71n8j77J1K55k84q9J62n2lJ00j53j14L46
6882G5RJ49k24J50j96k32K62j72J53Ln3J6j50K15j03j68P06l73Ql7l19j00K32
6905a49L71k61k8j06L03O5p8o4o4K34j40L0j10mM8J31R5r6j89l2Q1j68R0K23j51
6930C1o0JN13l19n5j4j51K53j35k8RJ62q5r2n4J27l8j14L09j52k50Q0J93J1K68
6955D10l89o4l38L31j28n9J85O8m7J40o9j80j09M92j87K54m58K25n8j00K25j48
6977dk02Q9K03m24K69J85m9j1J39o8j3k42R1l15J72N13p06R0K23J31q0K20l61
7000a50o5J87J82q8k58j35L81J28k52m2j7L04M9m00j80J99J36J46l09j3J18J92
$$ plain form
6839 242 20 218 112 -35 -267 152 -164 77 269 -184 -154 -300 250 293 -38 -68 174 -243 55 305 227
6860 227 -160 63 258 -155 -197 -41 -215 -40 131 73 -104 -93 162 -122 -211 -49 -101 -104 -4 -157 -271 75
6882 75 84 233 9 159 -37 -269 -7 -179 -26 -23 -76 -60 -210 5 -98 -266 440 67 75 38 -281 -381 -149
6905 -149 222 -39 -67 -173 130 195 117 53 -11 223 83 113 3 -1 47 178 273 177 -12 -44 37 -131 -41 182 31
6930 31 -29 -28 485 166 111 97 -54 199 64 36 45 207 122 30 -24 103 65 -49 260 108 -142 -62 131 142 410
6955 410 21 -43 -381 -50 -178 -237 -52 16 -31 109 40 -140 -249 243 56 310 -148 77 19 -81 144 -4
6977 -4 -206 -117 86 -338 -69 116 67 56 195 127 114 -128 -37 -352 -180 333 -373 -283 -60 71 -9 211 -150
7000 -150 -215 -28 154 66 -192 -327 54 182 -70 -112 -129 175 224 -176 -356 -157 -21 125 -184 -197 -79 113
7022A13k02j0O3j88M16j18J21j56M7k33J08L4O4R1k01k27K84J77J03l24n7K49
7044A54K58j77k91r2J02L03o35O99j62k74P4K93l95j49J82j2J52k36M11p2o7l3
7066C3p9j20L59o1k28N4M48m18k60L36k36J77o1J17j70j20N10m13K3J19j24K47
7088A33j23M6k70J43k1J41n0L20m26K50j36K0Qk04L17l80K54k74J86j58K2K78
7110G6k06k64J31K87K1k30L08l50K84k75M48j81Q4k89J62N1l7j98J54k06L04L8
7132A12Q7k76j47K16j43J91J24j28l94J30L35q0o9K4j27K14J09k42K3p8N73k02
7154B52j87m6LJ7J60O6m93J29J31K01k42J11k09Lr2M49k84J43J1Q7k39j86L60
7177A45k04k1J9J11k90M49m97J87K63J01l80P2M9k36K28J32K7k58J45n1j18J06
$$ plain form
7022 113 -89 -99 -36 -224 192 74 195 39 86 -147 -39 -5 59 150 -51 -278 6 183 286 -38 -95 154
7044 154 412 235 -56 -148 -46 257 -378 321 159 -115 -41 252 -143 -292 -110 -122 30 -206 205 133 66 33
7066 33 -46 -166 193 132 -96 -42 406 -12 -272 64 -172 5 -56 61 -109 -229 281 -132 -109 10 -114 133
7088 133 10 56 -214 -71 -92 49 -1 319 -107 143 7 27 35 -169 148 -232 22 -252 -66 -224 -202 76
7110 76 -130 -394 -263 24 45 -185 123 -227 57 -218 230 49 133 -156 6 57 20 -178 -24 -230 74 112
7132 112 199 -77 -224 -8 -151 40 164 36 -358 -228 107 27 -42 -18 -145 69 178 -64 -41 -119 454 252
7154 252 65 19 22 39 199 265 -228 -99 32 233 -9 102 -107 -104 -196 253 -31 112 123 210 -29 -215 145
7177 145 -59 -80 -61 50 -240 209 -288 -101 162 263 -117 -45 4 -232 -4 128 155 -103 42 -9 -127 -21
7199b1j44J29mJ29q1j08N7J2p6L0K03j81r3L36j36j78J79J35j35j24N30l99j05
7222d5J90j07k18Q6K48j56j10K94k50q3L8L78k77j3q6l7p8J97J52j40R1k68J45
7245d9oM56q12L66J19j67K20j15L6k43J51K22k60j64J71J5J80q5J52k66J54nj44
7268g4k5K14O9k50K3K86k69J5j1k29L92m9r3j57K40m6Q7k43L39k89J83Q3m31J98
7292c7m1K28j37r4J64l55K26K63k70m8N6J52k07M96k48k73r8L57J24n17L76j83
7314f6n7K85k42J1K4P1J11N6m02L49j56R0J45j86o4J20j41L8J19l3k43J84L1j3
7338C1k50L30k41M2J57M1k09J14J73l41L29m39J05N4K69n0k55Q5K07l46K70J13
7360A89j34m8j1n4R8n3k33N5M2L14k6K1l65J37J1K79k75k05K57op2j86K05j88
$$ plain form
7199 -21 -165 -36 -40 89 8 -100 -43 -31 -107 -77 126 -55 -148 188 52 -126 53 188 53 -71 459 60 -45
7222 -45 145 38 -180 -94 154 -2 -112 182 -68 -151 -113 265 -12 -25 -111 -148 -226 -29 123 -17 74 -194 -49
7245 -49 -55 401 -411 -45 74 -93 127 12 48 -195 -44 178 -82 -246 -75 -60 120 35 187 -79 75 70 -74
7268 -74 -99 115 184 -66 -43 243 -26 -11 -22 -251 141 92 -1 -158 82 36 123 -120 219 -70 113 196 -235 -37
7292 -37 -78 150 13 -81 83 -272 -46 217 -53 -101 -45 107 -100 396 148 -125 -223 134 258 -259 117 -66
7314 -66 -123 162 -80 -69 -45 26 137 193 -209 140 -16 74 219 33 -31 89 -52 -14 105 72 -171 13 44 31
7338 31 -219 111 -130 -88 69 110 -99 15 188 -153 176 -263 -158 -104 165 115 -140 -55 152 -194 76 189
7360 189 55 7 -4 -58 40 -13 -246 -191 -149 165 139 160 -205 -68 -57 222 -53 -258 -1 -7 -79 -265 -60 -248
7384b48R1N5J34j97M08k0J8k10j2j09O8L5K39r0j89J18j67j16p8K85k18J52J4
7407c7q1L63j05J08k59K86q7n35M02J7J76l59K42j89L14k82J22J02k2k49J19j0
7429C6L26l11j76Q0L54j84j39J47j84R9j03J42k14MK71j28j45K60l20k3M49k18
7451B3l0J05l4l8O2J15j52m2L8J20j61m0N4K2N5M0k37r4j35Q0L71j11n5j1k29
7476b84O22j31k61j57kQ0K00k34M4Q7ll0qJ69l24L21j50J48k51m2M8J71j44K22
7500I1q2q0m32M05j9K51r4j21J53O2O8j42l17J74N64j28j19l60K36l53K93K59
7522C09l29q2J85j36J55q9j8J28J64j05j33j09J88N0L59l96N4l04J61o3K06R3
7544B88m66O6Q7L46j14m8J40k77J87J96n22l3M78j27k52L0J57k26M73o04O5QO9
$$ plain form
7384 -248 -157 -102 32 -165 243 223 241 31 19 -90 -22 13 252 162 -27 91 -76 -192 -270 15 -203 -51 -37
7407 -37 -118 245 140 248 -11 275 188 -347 55 72 248 -111 131 -58 256 -26 96 198 176 -73 46 36
7429 36 362 51 -125 -45 309 125 -14 133 -51 48 -55 87 -127 -123 148 20 -125 135 -185 -208 241 23
7451 23 -7 98 64 26 88 203 51 9 47 167 6 -34 20 42 97 137 -100 -194 -329 -249 122 11 -44 -55 -284
7476 -284 338 207 -54 -211 -213 -133 67 -167 -123 -36 -39 -69 -77 92 -232 89 -61 87 -164 -206 -158 13 -131 91
7500 91 9 -71 -503 -98 -117 134 40 -81 72 134 202 60 -257 -83 481 353 234 -126 110 -243 50 309
7522 309 -20 -102 83 -53 102 13 -5 123 287 182 49 -60 128 178 537 141 195 -109 52 -11 195 288
7544 288 -178 -112 -25 321 207 159 299 22 209 405 -117 -150 328 201 -51 -21 136 -90 383 -221 -156 -148 -79
7567g9oK89l21K52j28q1l0j62J76K33j22j64J55K03o0j34k26k58O63k60j76m6
7589b82K08J17j6k6M7j34K06j03n9qj33J46J93j74L94l94k04N03M7k7o37O04k34
7612C4P0K52m33k18N99j86k10L29k85k69K42K58N6m33M9K61j87Q3N7p4r8L52l58
7635a09r5M53j59j28J5K07k38j05J23J85k21l6J2N3j03m6L95q7o8K4k74M36k55
7658b1l21L52K24n12K96N1J03k25R9n4n9l1j87N21j37J56q5l72K63M1l38L7M31
7681B32k57R5q9n7R4M0k15m5L59k01j71L37J83l78k19M67n2r7j52j96K35RN8R6
7705G6j18K64k50J45j31PJ90l01J15K7K13J3j71k61L24l4o3k53j11M93m61M3K91
7728D7RK19j8j71n12L80j86o7O67m86N0L83l75rJ82m7n52M42j33J05L5R6K96l18
$$ plain form
7567 -79 -85 204 -117 135 7 -74 -104 -266 -90 143 21 -143 12 215 155 21 -205 -463 200 -60 -236 -282
7589 -282 -74 43 27 1 48 -86 120 17 -42 -50 -183 -37 156 -18 376 -18 -222 281 328 301 -336 268 34
7612 34 104 356 -77 -295 304 118 -92 237 -48 -317 -75 183 239 -194 -145 116 -71 12 69 -5 -103 249 -109
7635 -109 -204 249 90 -38 -23 184 -54 -159 -36 149 -72 -108 -96 -43 -146 -192 203 116 48 72 -202 234 -21
7658 -21 -342 10 234 -278 18 69 172 -53 46 -8 -67 -98 -285 236 99 255 170 -202 61 102 -236 -199 232
7681 232 -25 70 -19 -76 18 58 -157 -202 157 -44 -215 122 305 -73 -292 175 123 26 -126 -322 -87 -78 -20 76
7705 76 -42 222 -28 117 -14 -7 183 -118 -3 24 237 250 79 -182 142 108 45 -208 -319 174 -287 -244 47
7728 47 56 275 257 86 -426 -46 -232 -299 368 -118 -68 315 -60 -69 113 66 -486 -44 -177 -72 -37 59 355 37
7752C7k77K74K74l61K0j67M02k65j98J05J8K6L48j32l08K09K02j7k48K11m05N24
7774B72j21l02J16J68j39J48k41R8L02k25J91j46k37P0R6L45l63j05J33L6j51
7795e5L9J26P5l40J1M27k85l26N42L2k93J05q6N0J58qK9j49m2l5k61M29q1p4J81
7820A69j20j34J40K32o8k34k13M23q6j18p0k40L06J18k34O7Q9J98l14M01m29J56
7842C9J76j17K50l71J20k08j46M05M2k90k25L89j47K84l53K11k83K15K04j48j70
7863a23K33l29J87Q7K14k64j44J70Q4l70K35M6k11J32J74n65K28J67j22K46j07
7884c2j23J42m1Q9K44j95o8k2q9J29J51m75R5J13J44J38J13l08K16m1J08k07k97
7907b16N01l71L15k83j02J34K13J30n03K63j57nj4K92k35j74K74j95L29Q7j27
$$ plain form
7752 37 -240 34 308 -53 -33 -200 202 -63 -261 -156 -138 -112 236 104 -204 5 207 190 -58 153 -252 272
7774 272 151 -151 -35 133 -6 142 -99 -1 301 76 267 121 -116 -46 50 395 32 -73 60 96 -55
7795 -55 -16 110 185 -155 -144 283 -2 -328 214 246 -47 58 -28 22 180 172 201 52 10 -25 -286 143 62 -12 169
7820 169 49 -85 55 287 219 -15 -228 195 109 -9 -79 -319 -13 105 -129 -62 27 225 -89 312 -117 39
7842 39 215 98 348 -23 97 -111 -257 148 190 -100 -325 64 -83 201 -152 59 -224 -9 195 47 -123
7863 -123 110 -219 -32 55 269 5 -139 31 115 -255 -20 26 -185 -53 121 -444 -216 -49 -171 75 -32
7884 -32 -155 -13 -54 35 279 84 16 -6 -95 34 185 -290 -195 -82 62 200 313 5 221 180 288 81 -216
7907 -216 285 -86 229 -54 -156 -22 191 321 -182 81 -76 -81 -95 197 -38 -212 62 -133 196 283 156
7928A56j67l62P62o2m52J70L6k78K44J10n26K16M51k91j06J46j42J11J83j40q2
7949b3K3q3j34K89L5nj80M67l56j78L51m10L56j16k19M21k33kq3k16K79q1N5K39
7973A96k96q0M40l58M3l24l1M55p57M91M50M1k89j63P2K6J23o0K33n2J3m7l00
7996a74K43J43q1j56O2M6O9k42J12j02Q2M4j36j51K70J60m91K00P9j96K53J38
8018A72k03j22j7L55j11J3nl93L36k12M1M5n8Q5j2K83m83M27m08n7L44k97K97
8041B0l0o2k13M98n05K58n8j3J7j1J04j20k4j4R7J1J68j72J99j09j00l2J89k9
8065F9j70O8J94m09J34MJ28J3P4K9l3q0j39q4K47P0k44j38L86J19l02K49n2j16
8089A7q9K32k83K94M0k86J43j2k3J11k01L6K12m50L2K74p8J2L2j05K28m4r0j33
$$ plain form
7928 156 -11 -373 389 327 -125 45 81 -197 47 157 -369 -153 298 7 -99 47 -95 16 199 59 -23
7949 -23 0 -83 -217 72 107 102 -78 389 33 -145 206 -204 152 36 -183 238 5 3 -80 -296 -17 -98 -43 196
7973 196 -100 -180 260 -98 -55 -379 -410 45 -712 -221 229 270 -19 -182 -110 -84 39 -21 212 160 173 126 -174
7996 -174 69 212 131 -25 37 83 152 -90 22 -80 2 46 -90 -241 29 189 -302 -102 -23 -219 34 172
8018 172 -31 -153 -170 185 74 87 82 -311 25 -187 -146 -101 -159 -74 -86 197 -286 141 -267 -324 20 -277 20
8041 20 -10 -72 -285 213 -292 -34 -92 -105 -88 -99 5 -115 -139 -153 -56 -45 123 -49 150 41 -59 -91 98 69
8065 69 -101 -33 161 -248 -114 -110 18 31 105 134 101 21 -118 -202 45 115 -129 -267 119 238 -64 185 133 17
8089 17 -72 160 -123 171 211 -75 68 56 33 144 -57 -21 191 -259 -227 47 -31 -19 13 -92 136 92 2 -131
8113a31L13L8Mm36m1Q1J14j06J87J43n5K80l86j24R6J46k36N12k07l65K32M1j81
8136h1K49J22m06P5r6K12J3J69k84J25J81l04j51q6K70J40l47M65l07MK09Mq2
8159I4k69J73J21j23rL7n0m8K31q9l16J05P0n0J04J45j8L1k97K11L79l95p8K03
8183A62j30M26n14rK10n5k17J11
$$ plain form
8113 -131 182 220 224 -212 -253 -172 -58 -164 23 166 111 391 5 -119 -23 123 -113 399 192 -173 59 100 -81
8136 -81 168 290 -116 -41 -137 75 88 257 -27 98 279 -25 -176 -262 8 148 -199 266 -41 -37 172 176 94
8159 94 -175 -2 119 -4 -13 24 -26 -74 157 68 -248 -143 -73 -123 -19 126 108 139 -158 53 432 37 -41 162
8183 162 32 458 -56 -65 145 90 -127 -16
8191a6
$$ Imaginary data points
##PAGE= N=2
##DATA TABLE= (X++(I..I)), XYDATA
0@%%%qJ6j6J6k4L2m0M9n7P2q8J12j37J62j96K35k76L25l80M38n08N88o72P64q69
28d62R88j118J261j421J594j782J990k221K472k746L048l379L742m143M588n080
44b669N629o243O931p715Q612r649J0868j2325J4102j6322J9193k3073K8639l7353
58b1375N3067r0310L33720L69998m83280k06111P6699K00801j8006p6398l6147
69A02658J47566Q9558j18640k21131n35J71184J30660l7596j22877q6827M8197
80A02217K7136q7826m4119J62492J23926j05758j64254j9227Q2693O3911k5612
91A15579p7279K932J03028k0167j69281o5276J43807J51266R34j11482j16559
102d2498J0237J16232J4935j26337n9541R9530Q4747l1173q1355l3152P5638Q8499
$$ plain form
0 0 0 0 0 -8 8 -8 8 -16 16 -24 25 -32 40 -48 64 -73 89 -107 128 -148 177 -203 235 -273 315 -357 407 -462
28 -462 526 -592 669 -752 842 -940 1050 -1171 1301 -1445 1603 -1776 1966 -2177 2411 -2669
44 -2669 2960 -3283 3648 -4067 4545 -5104 5764 -6561 7541 -8781 10412 -12661 15978 -21375
58 -21375 31692 -58618 275102 645100 161820 -44291 32408 233209 215203 138805 102658
69 102658 250224 339782 221142 11 -524 170660 301320 263724 140847 54020 102217
80 102217 129353 41527 -2592 159900 283826 178068 13814 -5413 77280 141191 115579
91 115579 38300 41232 144260 124093 -45188 -110464 33343 184609 185543 74061 -42498
102 -42498 -32261 83971 98906 -27431 -86972 12558 97305 66132 -15223 -48375 27263 115762
114A15762n2945j36778q836Q8655m844n0086K5637N4751M557l0953n6150m1410
126i2640O5460Q7413l9873r6741K98P0326J6801n0285o2373K3152J24040M8706
138I4284j16816r8693O9191R1698j7168n3720l0919Q885N0526K5754m9522j8964
150d5464P9622M0004n6274n3267j221J9099K8992J1933l6002J936N9342l316o5382
163a9998k411O6894K0733l5164m5572k9527L6724O3650j2155o2096J0130N1922
175D3130o946l2962k3323j3328L9496P6485j2264j07437m0325M7127L2835R94
187C482J793K483J1372J8177l7076o0086J1907M4476L757r899M669j8233j1781
200c4959K8439j024k0066L0767L4058m4770n5947J5671K9096O507p01j3690k22
$$ plain form
114 115762 62817 -73961 -82797 5858 1014 -49072 -23435 31316 35873 4920 -51230 -92640
126 -92640 -27180 60233 20360 -76381 -76083 -5757 11044 -39241 -101614 -78462 45578 94284
138 94284 -22532 -121225 -52034 39664 22496 -31224 -62143 -53258 -2732 23022 -26500 -45464
150 -45464 34158 74162 17888 -35379 -36600 -17501 11491 23424 -12578 -10642 48700 45384 -19998
163 -19998 -22409 44485 65218 30054 -15518 -45045 -8321 55329 43174 -18922 -8792 43130
175 43130 36184 3222 -20101 -33429 6067 82552 70288 -37149 -77474 -30347 2488 3482
187 3482 5275 7758 19130 37307 231 -59855 -47948 -3472 285 -9614 -4945 -23178 -34959
200 -34959 -6520 -7544 -27610 3157 37215 -7555 -63502 -47831 -18735 -12228 -12929 -26619 -26841
213b6841L9578J1720o4640k9248N7876M0592k0261l4596k4734k162M5129K2663
225A5076m9872j9175N6306L7719k8383l6190j4320J0353L7503p701o2897k087
237f3668P8349K8878m9360j8952K3036J6079J600k7965m3603J3088O8197M000
249B9679o0313j3117M0969L5317L88l5009l6581L1321N6392m1471p7300J9946
261d9779P5016R579m1707j9751J4059M4237J7514o0169n0025M9841O1178l9135
273A0858o7533j17N1883N3335o040o5665k1246Q0389M1916q7283p5455L9168P4988
286B9198J4966m5744m5647K5925Q5776N066r0066l1357O6831M0630l9295m7711
298c1428j1716L8225N5312j3262o1029J2118P7093j253p7890l1013L9060M8594
$$ plain form
213 -26841 12737 24457 -40183 -69431 -11555 29037 8776 -25820 -50554 -52716 -7587 15076
225 15076 -34796 -53971 2335 40054 11671 -24519 -38839 -28486 9017 1316 -61581 -63668
237 -63668 14681 43559 -5801 -24753 -1717 14362 15962 -12003 -55606 -42518 25679 29679
249 29679 -30634 -43751 -2782 32535 32923 -2086 -38667 -7346 49046 7575 -69725 -49779
261 -49779 25237 34816 -6891 -26642 -12583 31654 49168 -11001 -61026 -11185 49993 10858
273 10858 -56675 -56792 -4909 48426 42386 -23279 -44525 35864 77780 -9503 -84958 -45790 29198
286 29198 44164 -1580 -47227 -21302 64474 69540 -20526 -51883 14948 55578 16283 -31428
298 -31428 -43144 -4919 50393 37131 -23898 -11780 65313 64060 -13830 -44843 -5783 42811
310D2811j015n8077l9297O1157P6346m1334p8476J7512P0691J6488m8201o1538
322d2933j6852O7706N9015m7869o4234L4011P1210m927n4807l5473J8579N9356
334D2782P889p3846l9903O6608N3936l9882l8814K1732M1399J0319m0146n8207
346d6133R289P9520J4511p4714l4037N2373N2385q412m7753l6097L9657P2730
358G3319k5234r9322j8995P8286M3451l0146l9046r521L5025L7117k6574n3522
370c5162J2312M7698j0346l5953m262J1116J1550J1381j0444j5384K8063J8587
382B9156m7422l3543L7460L9172j6768l3579j6945J6894M8571P260n3538k1320
394d4602N0896K9873l2255l3856j1212J6004M2857J4103m7147l0802L9267L2091
$$ plain form
310 42811 41796 -16281 -55578 5579 81925 40591 -37885 -20373 50318 66806 18605 -42933
322 -42933 -59785 7921 66936 19067 -45167 -11156 60054 55127 320 -35153 -16574 42782
334 42782 50671 -23175 -63078 3530 57466 17584 -21230 502 41901 52220 12074 -46133
346 -46133 -36844 42676 57187 -17527 -51564 809 53194 44782 -2971 -39068 589 73319
358 73319 48085 -51237 -70232 8054 51505 21359 -17687 -27208 7817 44934 18360 -35162
370 -35162 -22850 24848 14502 -21451 -25713 -14597 -3047 8334 -2110 -17494 10569 29156
382 29156 -18266 -51809 -14349 24823 8055 -25524 -42469 -25575 22996 30256 -23282 -44602
394 -44602 6294 36167 3912 -29944 -41156 -25152 17705 31808 -15339 -46141 -6874 25217
406B5217j2048j6086q978j808J5979Q206k7644r312K8363M136j4248J1835J3691
419A7303k0372j1406J1851K236O978P780k5708k9927K6314M1368q645k5405q022
432a5655Q009K8335J5287l9279m5624L0560M9203j1079l3995r771J2447K7440
444A5878K5635k4156m1638J0820K9456l291j5168l370n723P832K2861r562k2000
457a2426J6708K1999j5018j2462J0457r781j8300M654P602Q463K1177N18l7374
470a3783r276L3235J1419j5137j3842j0151M104K7634k638n0534n221O0252L5528
483E1590k5482l8160j8011R627L2402j029l9454m83M3285R911l1018j2006R281
496i547J4471J9473q151l2478j550K4768j5601l1540K3241M1583N309k3411k2708
$$ plain form
406 25217 13169 -2917 -11895 -13703 2276 10482 -17162 -26474 1889 6025 -8223 3612 17303
419 17303 -3069 -14475 -2624 -388 6590 14370 -11338 -41265 -14951 26417 17772 -7633 -15655
432 -15655 -7646 20689 35976 -3303 -48927 -18367 30836 19757 -14238 -24009 -11562 15878
444 15878 41513 17357 -24281 -13461 15995 12704 -2464 -5834 -11557 -3725 19136 9574 -12426
457 -12426 4282 26281 11263 -1199 9258 -523 -18823 -14169 -6567 1896 23073 23591 -13783
470 -13783 -23059 10176 21595 6458 -7384 -17535 -13431 14203 11565 -38969 -44190 16062 51590
483 51590 26108 -12052 -30063 -20436 11966 10937 -28517 -29000 14285 24196 -6822 -18828 -9547
496 -9547 4924 24397 16246 -16232 -17782 6986 -8615 -40155 -16914 24669 29978 6567 -16141
509a6141l98L0797J5726m6614l5327M0177M4572k1176m2729n150K8521M2264N770
522D0292n4602l5191L9283L9460k9972m0471M479L0343K7439p888l8401n377M8379
535A7773J5622m8710k4034K5323J8050r321j5803n645K1362L6804j2957m9503
547c1039J782M8198J0289l7960k7267O334L3931K6010l3321m3904L0448O6075
559D9576o609n9109j9593K3922K8785Q03l5296k3414L9972M7010k6985m5212R724
572a6426L4730R158j7576k5426n715L4965J6766m2242k4907M2503M0136j8487
584B7479l1467l055J8546K2300j4578m3206O21N4428J8034m1289j9894K0715K3700
597C2334P084j8100k7266R797M1569n230m7118p273L5355J9828q690j4729q460
$$ plain form
509 -16141 -16539 14258 29984 -16630 -51957 -11780 32792 11616 -31113 -36263 -7742 34522 40292
522 40292 -14310 -49501 -10218 29242 -730 -41201 -36722 -6379 21060 13172 -25229 -30606 17773
535 17773 33395 -15315 -39349 -14026 4024 -5297 -21100 -26745 -5383 31421 18464 -31039
547 -31039 -29257 18941 29230 -8730 -35997 -29663 4268 30278 -3043 -46947 -16499 49576
559 49576 42967 -16142 -35735 -11813 16972 17775 -17521 -40935 -963 46047 19062 -26150 -16426
572 -16426 18304 27462 9886 -15540 -21255 13710 30476 -11766 -36673 5830 45966 27479
584 27479 -3988 -7043 11503 33803 19225 -23981 -23360 31068 49102 7813 -12081 8634 32334
597 32334 39418 21318 -5948 3849 45418 40188 -6930 -14203 21152 40980 32290 17561 9101
610I101J7413K2486k4504l7365J4028L7071l974k2694m134L603J2535J1542j7939
623A7169k1844J9688K6630j8365k5853Q26P741P906N062j2180j1322K3146J5506
636C4110k6593j6944J5590Q523j0290l457k422j551J7029K735k3970l890K5289
649A4159O186j7515n132j004Q26J2436l573k6153J05L3358O090k0536l995L844
663i04j540L728j95j6433K64J9422l769j2493L823K708q637Q687J3438j0693o655
678i249M568j0635j2138J1880J0202r966L302J2372l692l688J188j2641r927J8216
692a0208J3616j3038q039Q8m296Q579J8506o946j8550J3452J7486j0441j8569
705a8360r826j335J9379K5179j2049k3880J0200J7504p009r477K056l663M512
$$ plain form
610 9101 26514 49000 24496 -12869 1159 38230 34256 11562 7428 11031 23566 35108 17169
623 17169 -4675 15013 41643 23278 -2575 -1749 5992 13898 18960 6780 -4542 18604 34110
636 34110 7517 -9427 6163 14686 4396 939 -1483 -3034 13995 16730 -7240 -11130 14159
649 14159 20345 2830 -2302 -3306 -2480 9956 6383 -19770 -19665 13693 19783 -753 -4748 -904
663 -904 -2444 1284 1089 -15344 -15080 4342 573 -11920 -8097 -5389 -14026 -5339 8099 -2594 -9249
678 -9249 -4681 -15316 -27454 -15574 -5372 -15338 -12036 336 -3356 -7044 -5856 -18497 -28424 -10208
692 -10208 3408 -9630 -17669 -17581 -21877 -13298 5208 -1738 -20288 -6836 10650 209 -18360
705 -18360 -28186 -29521 -10142 15037 2988 -20892 -10692 6812 -197 -9674 -7618 -11281 -6769
718f769J1685j2557j7539J0734J5518p539O83J5806k322j2991q307p059L476J9222
732B041k207k7594N603L3083L206k3943j1725M356J3876J7497j4879l7688J932
745c6442L5424R280k1210r430O754J4511J4441j4953l0376L833K6557n378k1457
758b8446O012J3390J867o47m869n591J1662Q849k5165j6991K3862J7986j7327
771a5408k0043J544J7274K5364j352l9972j4809L8096K3121l1832l3522O601K8695
784a6243K3356j1466l6494k695M0290J5252l3038j9165J1511J2627K065q417j3430
797c5847P448K8024l125k8135N203K6092k710k4052n822J1620J7178L396k7391
810b8121j6922L4905L7650k0075l8591R85K3581J7137o092l0239j2249L5391L2748
$$ plain form
718 -6769 4916 -7641 -25180 -14446 1072 -6467 -5784 10022 7700 -5291 -13598 -20657 -17181 2041
732 2041 -166 -27760 -22157 10926 14132 -9811 -21536 -17180 -3304 14193 -686 -38374 -36442
745 -36442 -1018 8262 -12948 -22378 -15624 -1113 13328 -1625 -32001 -28168 -1611 -6989 -28446
758 -28446 -22434 -9044 -7177 -7824 -12693 -18284 -6622 2227 -22938 -39929 -16067 1919 -15408
771 -15408 -35451 -33907 -16633 8731 7379 -32593 -47402 -9306 13815 -18017 -51539 -44938 -16243
784 -16243 7113 -4353 -40847 -43542 -3252 12000 -21038 -40203 -28692 -16065 -14000 -22417 -35847
797 -35847 -28399 -375 -3500 -31635 -26432 -340 -3050 -27102 -32924 -21304 -4126 -730 -28121
810 -28121 -45043 -10138 27512 7437 -31154 -30169 -6588 10549 4457 -25782 -38031 -2640 30108
823C0108k5084l3659R338K7683J2435q037k1407j0728K1324J5590k1129j0554
835a4120K1429J2803r618n801J923L83P622k158j5967N604K3824l928k7493K86
849e211K0135J2853J08j6135j8701J3445L1251r721l6172j018K5610J2367o380
862B2431j4039j1437J3059K3519j0193k5287J901J5322m5m213k179q265L610J3153
876A7337n745j0513J0708P032j7111o556J1785J682n433j343m485O61J5933N52
890A4504k1816k378J8255L812r513m388o621k675J5518N241j6037l212J2879K426
904E995n282K859o413q746J0246O668j0646l965P649k965k74J2630k677j3819
918h740L713R719o795m839M545m989j909R915J128o502N192M787r999J094J0276
$$ plain form
823 30108 5024 -28635 -19297 8386 20821 12784 -8623 -19351 1973 17563 -3566 -14120
835 -14120 7309 20112 10494 4693 6616 6999 14621 12463 -3504 2100 25924 21996 -5497 -5211
849 -5211 14924 27777 27885 11750 -6951 6494 37745 28024 -8148 -9166 16444 28811 22431
862 22431 8392 -3045 10014 33533 23340 -1947 -46 15276 15231 11018 8839 574 4184 17337
876 17337 11592 1079 11787 18819 1708 -4848 6937 8619 3186 1843 -2642 -1981 13952 14504
890 14504 -7312 -9690 8565 12377 2864 -1524 -8145 -10820 4698 9939 -6098 -9310 3569 5995
904 5995 713 3572 -2841 -11587 -1341 5327 -5319 -9284 -1635 -4600 -4874 7756 5079 -8740
918 -8740 -5027 4692 -2103 -6942 -2397 -7386 -9295 620 1748 -4754 438 5225 -4774 -3680 6596
933F596p156j0232N773N534l799M902J808j0120M787J6349l988j5875L96O178
947A153k33L690k992j0383O987J7664l681j4626N517O843m306k39j699p968L857
962d16J2784o578j0021J1218Q787o804l485K138m780J983N439j2230p283J7276
976H028J0547j3949o808R033L791N18k727j2101j926J6649J806k0434l000J7429
990F856O924l164n948p867K567J6496o228k5608L501K4091K294j6345n888N128
1004c191J1330J0041j3821j9970R745K0370r413k0277M022J1963O161L54j2044
1017d730p637J5576J3508j9317j7701J3617J2392o514r125k148N816J5656P91
1030A0184k4228o020K4674Q905k1115j3412P276J0984R131o682j9293M586K6648
$$ plain form
933 6596 -560 -10792 -5019 515 -3284 1618 3426 -6694 -1907 14442 10454 -5421 -5025 1153
947 1153 920 4610 1618 -8765 -1778 15886 12205 -2421 3096 9939 5633 5394 3695 -4273 -416
962 -416 12368 5790 -4231 6987 15774 8970 5485 7623 2843 4826 10265 -1965 -9248 8028
976 8028 18575 4626 -2182 6851 10642 11160 8433 -3668 -5594 11055 12861 -7573 -10573 6856
990 6856 13780 10616 4668 -3199 -632 15864 9636 -15972 -12471 11620 13914 -2431 -8319 -3191
1004 -3191 8139 18180 4359 -15611 -5866 14504 5091 -15186 -11164 799 6960 7314 -4730
1017 -4730 -12367 3209 16717 -2600 -20301 -6684 5708 -806 -9931 -12079 -6263 9393 10184
1030 10184 -14044 -20064 4610 13515 -7600 -21012 -13736 -2752 6379 -303 -19596 -15010 11638
1043A1638K692k6520r358J2553J1253K841r793j5113N861K2787k961k1599M529
1056a1190J8275N87j1489p298k700Q400J2568r145j2990J3846J5513j2399j6824
1069a4846M440J1627R689j095k0569j0625K1460J7464j8438j6602J3504J6447
1081A2456K264j0742j7951l600K3716J3677k0075j2163J2167Q804m391m032m033
1094c903J190J4278K702j8101l552J2896P02j0888L636O998R48J629n583j0497
1108g545P796J6367q797j7900N657J1929Q34l063o296p902Q873J7601q058j7991
1122h495K030J0799J439r37n771j0748N980J6556l933j3040K304N477l444K227
1136D44J919r671m42J0111j920q537M093L474p330L748P780l381m062R60o725
$$ plain form
1043 11638 14330 -12190 -21548 -8995 2258 5099 -4694 -19807 -13946 8841 5880 -15719 -11190
1056 -11190 7085 7672 -3817 -11115 -13815 -5415 7153 -1992 -14982 -1136 14377 1978 -14846
1069 -14846 -10406 1221 10910 9815 -10754 -21379 81 17545 -893 -17495 -3991 12456
1081 12456 14720 3978 -13973 -17573 6143 19820 -255 -12418 -251 8553 4162 130 -3903
1094 -3903 -2713 11565 14267 -3834 -7386 5510 6212 -4676 -1040 5958 6906 8535 2952 -7545
1108 -7545 251 16618 7821 -10079 -4422 7507 8341 5278 -1018 -8920 -47 17554 9496 -8495
1122 -8495 -6465 4334 5773 4836 -935 -11683 -5703 10853 6920 -6120 -3816 1661 -1783 444
1136 444 2363 -7308 -7750 2361 441 -8096 -4003 -529 -7859 -4111 3669 288 -3774 -2814 -9539
1151i539l990J3773M768j3741l317J0111L378j524j056r737k819J6434N648j6084
1165g695q695Q222O474L896J384j1692n910J4763Q390j3130p716O877J643M43
1179b746L409n651m271J0334O120r139j338O210n238n171N163L135j459M256k705
1194I09j0224Q538J4976o876j4088L581Q527J089j635r682q007J5570J8997r040
1208A2635j9026L423J0297K110j531q279o328J1475J3398j2356j4188J0051J0100
1221A1781k762l191N0k035L249Q68j3009p19J7818K868j5593l577J2289M629k125
1236A0541q234j0801O929J8912m184k4118k91J9825P355p093j0455o153R671J6090
1250A7994r200k2471M408J8384o11j0222j569K805O120O228j0650j2703J0398
$$ plain form
1151 -9539 -13529 244 5012 -8729 -12046 -1935 1443 -81 -1137 -10874 -13693 2741 8389 -7695
1165 -7695 -16390 -8168 -1694 2202 3586 -8106 -14016 747 9137 -3993 -11709 -4832 -3189 -2746
1179 -2746 663 -4988 -9259 1075 7195 -1944 -3282 2928 -2310 -7481 -2318 817 -642 3614 909
1194 909 -9315 -777 14199 7323 -6765 -3184 5343 6432 4797 -4885 -12892 2678 21675 12635
1208 12635 -6391 -2968 7329 9439 7908 -371 -6699 4776 18174 5818 -8370 1681 11781
1221 11781 9019 5828 5878 3843 7092 7960 -5049 -5768 12050 14918 -675 -4252 8037 12666 10541
1236 10541 2307 -8494 -1565 17347 13163 -10955 -11246 8579 15934 8841 -1614 -7767 1904 17994
1250 17994 8794 -13677 -9269 9115 8504 -1718 -3287 -482 5638 11866 1216 -11487 -1089
1263a089J2193j0787j1364Q467Q702r71m866r430k56J8423P381k1068j3034J5384
1277b315J0772o886j0523l335P502J7678m59k3469p198J9688R615j2004r765J192
1291i507P001R801m985j7343L238K1532J500j8620l793R077L809p20p251o759
1305a3020J1243J5292j0350j9231P522J6939o58j0014o133J09J1057Q579j5634
1318d299j3433J4862J6791p520j3396j47N276Q480J524j4597o869J6268R922j4480
1332a618q519R072O966J056l337r227j845J4316L742j6265l195J3008M563n262
1346C455m783l088L354J2713j560j6344l28J3668J226r217j287J845L584P292
1360A0530l752j3035L179J3622k247j0311J295L636L14K696m032p535P290J2600
$$ plain form
1263 -1089 11104 317 -11047 -2580 6122 5151 285 -9145 -9401 9022 16403 -4665 -17699 -2315
1277 -2315 8457 1571 -8952 -12287 -4785 12893 12434 -11035 -18233 1455 11070 -934 -10699 -9507
1291 -9507 -2506 7295 2310 -15033 -11795 9737 11237 -7383 -11176 -2099 1710 990 -6261 -13020
1305 -13020 -1777 13515 3165 -16066 -8544 8395 7737 -2277 -8410 -8301 2756 11335 -4299
1318 -4299 -17732 -2870 13921 6401 -6995 -7142 -1866 6614 8138 -6459 -13328 2940 12862 -1618
1332 -1618 -10137 -1065 5901 6957 3620 -5607 -7452 6864 10606 -5659 -8854 4154 8717 3455
1346 3455 -1328 -4416 -1062 11651 10091 -6253 -6581 7087 8313 -904 -2191 -346 3238 10530
1360 10530 6778 -6257 -3078 10544 8297 -2014 -719 2917 3231 5927 1895 -5640 1650 14250
1374A4250p530j1729M374O858j469j901l306m565P933R441r774j0594P939Q203
1388H130l294k808k568m521O434O726q783q375R036P126n552j919N97k564K875
1403E40L757p391n555R820L146q758l14N259o23N01J874p154k405J1522K82j2844
1419h343j871R150L020r70j490p218J356J3100p75j4949k200J0903K516k872k345
1434b988n499K897J2016q24j2864J366J0398l107n397j60N3K513N957l354q057
1449g050P784R277q948r015O800O318j334l006o683j988J3690Q015j3735r160
1463i035J1621Q847m972p268o026K234J3968M574j6407p799J4481Q303p057m593
1477H71p9J298N823r86j2246m0J4019J431j0593L7P707l30k213l809n046P685
$$ plain form
1374 14250 6720 -5009 -635 6223 4754 2853 -453 -5018 2915 12356 2582 -8012 -73 8130
1388 8130 4836 2028 -540 -5061 1373 8099 -684 -9059 -23 7103 1551 -368 229 -2335 540
1403 540 4297 -3094 -8649 1171 4317 -4441 -4755 504 -119 382 2256 -4898 -7303 4219 4501 -8343
1419 -8343 -10214 -1064 1956 986 -504 -7722 -6366 6734 5959 -8990 -11190 -287 2229 -643 -2988
1434 -2988 -8487 -5590 6426 5602 -7262 -5896 4502 1395 -4002 -4162 -4109 -1596 4361 1007 -7050
1449 -7050 734 10011 1063 -7952 -1152 5166 3832 826 -5857 -7845 5845 13860 125 -9035
1463 -9035 2586 11433 6461 -807 -6833 -4599 9369 13943 -2464 -10263 4218 12521 5464 871
1477 871 792 2090 7913 6927 -5319 -5359 8660 10091 -502 -465 7242 6912 4699 890 -4156 3529
1493C529J1078r547j6541O895J6135n10q507n997M22J1356P208j4392j6308J2106
1507c073J6625m318j2079k867M612Q554M258j2597r723J2689J0193j1066r608
1520h400N440O022J076j325o981J264J1385J10j6748k711J5530L954r687o875
1534g946P50Q117J0410o475j8461L680J9991J076j5893p304N704Q863O408q818
1548A02j3999P633J6913l211j4801m01P604K778n22n483o196Q279R373q336r738
1563a0005Q999Q063n306n935r05J775P473K226j2814n890J5436Q614j1061q811
1577h141L793O967N451k859j4179k240J6722O510j3273o942O282O335K862k650
1591D638j0074o51J3240K535j3729j663Q516J745k406r93k083K408P428m188j0731
$$ plain form
1493 3529 14607 5060 -11481 -4586 11549 11039 2532 -3465 -3043 8313 15521 1129 -15179 -3073
1507 -3073 13552 9234 -2845 -5712 -1100 7454 11712 -885 -10608 2081 12274 1208 -8400
1520 -8400 -2960 3062 4138 2813 -4168 -2904 8481 8591 -8157 -10868 4662 8616 -1071 -7946
1534 -7946 -7196 921 11331 4856 -13605 -9925 10066 11142 -4751 -12055 -6351 2512 8920 102
1548 102 -13897 -6264 10649 7438 -7363 -7764 -160 2618 2096 -3387 -9583 -1304 8069 -267 -10005
1563 -10005 -1006 7057 1751 -4184 -5089 -3314 4159 6385 -6429 -12319 3117 11731 670 -8141
1577 -8141 -4348 2619 8070 5211 -8968 -11208 5514 12024 -1249 -8191 -1909 4426 7288 4638
1591 4638 -5436 -6087 7153 9688 -4041 -5704 2812 4557 2151 1158 -925 1483 8911 4723 -6008
1606f008M644J0551m194p862J083L446L747L478o963q627Q620J1343p052j1083
1620d877K402N881K564J382p553o139R090R860p643q749M515L911j81L3l908n234
1636d646O369P010o731n184O681K550l990o53n53k448M444K203q301k049R892
1651D594J902p706j005L101O19K855j063r602q46J1356J583j0064j218M445K859
1666A810K182k248r156Q76J1716j797j0755L73O354N69j255j144l861L602P861
1681E127m028j0680K738Q010l059l924N07L19L860M511o168p619P412P918p113
1696b189o349K517L084J925J033o331l855J1055O438j0220o135N515L824j161
1710h49j621m375m67J0072K661j1283l186J0768L615n422l519j837K516P111j841
$$ plain form
1606 -6008 -1364 9187 4993 -2869 -1786 1660 5407 8885 1922 -6705 1915 13258 6206 -4877
1620 -4877 -2475 3406 5970 7352 -201 -6340 2750 12610 4967 -3782 733 4644 4463 4496 588 -4646
1636 -4646 1723 8733 2002 -3182 3499 6049 2059 1406 853 -1595 2849 5052 -3249 -5298 4594
1651 4594 6496 -1210 -2215 886 1505 4360 3297 -6305 -7151 4205 5788 -4276 -5494 -1049 1810
1666 1810 3992 1744 -7412 -6536 5180 3383 -7372 -6999 -645 -76 -1331 -2475 -6336 -2734 5127
1681 5127 1099 -9581 -6843 1167 -1892 -5816 -5309 -4990 -1130 3381 -2787 -10406 -2994 4924 -2189
1696 -2189 -8538 -6021 -2937 -1012 21 -6310 -10165 890 7328 -2892 -9027 -3512 312 -849
1710 -849 -2470 -6845 -7312 2760 5421 -5862 -9048 1720 5335 -87 -3606 -5443 -2927 4184 2343
$$ [...]
8191C6
##END NTUPLES=NMR FID
##END=
