##TITLE=1H_TG-2288-b
 CDCl3, 8 sc, 
 8.6.2020
##JCAMPDX= 6.0         $$ Bruker NMR JCAMP-DX V2.0
##DATA TYPE= NMR FID
##DATA CLASS= NTUPLES
##ORIGIN= UXNMR, Bruker Analytische Messtechnik GmbH
##OWNER= root
$$ XWIN-NMR		Version 3.5
$$ Mon Jun  8 11:29:53 2020 Russian Standard Time (UT+4h)  she@DPX200
##.OBSERVE FREQUENCY= 200.1315
##.OBSERVE NUCLEUS= ^1H
##.DELAY= (6, 6)
##.ACQUISITION MODE= SIMULTANEOUS
##.ACQUISITION SCHEME= undefined
##.AVERAGES= 8
##.DIGITISER RES= 18
##SPECTROMETER/DATA SYSTEM= spect
##.PULSE SEQUENCE= zg30
##.SOLVENT NAME= CDCl3
##.SHIFT REFERENCE= (INTERNAL, CDCl3, 0, 15.7039)
##AUDIT TRAIL= $$ (NUMBER, WHEN, WHO, WHERE, WHAT)
$$ ##TITLE= Audit trail, XWIN-NMR		Version 3.5
$$ ##JCAMPDX= 5.01
$$ ##ORIGIN= Bruker BioSpin GmbH
$$ ##OWNER= she
$$ F:/spectra/data/she/nmr/H-F/1/audita.txt
$$ ##AUDIT TRAIL=  $$ (NUMBER, WHEN, WHO, WHERE, WHAT)
(   1,<2020-06-08 11:28:48.06 +0400>,<she>,<DPX200>,
      <created by zg, POWCHK disabled, PULCHK disabled
       configuration hash MD5:
       00 E9 B6 7A A2 85 ED C7 34 08 36 98 17 FE 4E 26
       data hash MD5: 16K
       79 2C C9 35 52 26 08 FE 03 F5 3C 6D 24 AA 34 DB>)
$$ ##END=
$$ 
$$ hash MD5
$$ 1C 7B 2F 0B 78 8C 51 71 01 29 BF CE 79 2A 76 8D
##$RELAX= 
##$RELAX= 
##$RELAX= 
##$RELAX= 
##$RELAX= 
##$RELAX= 
$$ Bruker specific parameters
$$ --------------------------
##$DU= <F:/spectra>
##$EXPNO= 1
##$NAME= <H-F>
##$PROCNO= 1
##$TYPE= <nmr>
##$USER= <she>
##$AMP= (0..31)
100 100 100 100 100 100 100 100 100 100 100 100 100 100 100 100 100 100 
100 100 100 100 100 100 100 100 100 100 100 100 100 100 
##$AQSEQ= 0
##$AQ_mod= 1
##$AUNM= <au_zg>
##$AUTOPOS= <>
##$BF1= 200.13
##$BF2= 200.13
##$BF3= 200.13
##$BF4= 200.13
##$BF5= 200.13
##$BF6= 200.13
##$BF7= 200.13
##$BF8= 200.13
##$BYTORDA= 1
##$CFDGTYP= 0
##$CFRGTYP= 5
##$CHEMSTR= <none>
##$CNST= (0..31)
1 1 145 1 1 1 1 1 1 1 1 1 1 1 1 1 1 1 1 1 1 1 1 1 1 1 1 1 1 1 1 1 
##$CPDPRG= <>
##$CPDPRG1= <>
##$CPDPRG2= <>
##$CPDPRG3= <>
##$CPDPRG4= <mlev>
##$CPDPRG5= <mlev>
##$CPDPRG6= <mlev>
##$CPDPRG7= <mlev>
##$CPDPRG8= <mlev>
##$CPDPRGB= <>
##$CPDPRGT= <>
##$D= (0..31)
0 1.2 0 0 0 0 0 0 0 0.06 0 0.03 0 0 0 0 0.0002 0 0 0 0 0 0 0 0 0 0 0 0 
0 0 0 
##$DATE= 1591601327
##$DBL= (0..7)
120 120 120 120 120 120 120 120 
##$DBP= (0..7)
150 150 150 150 150 150 150 150 
##$DBP07= 0
##$DBPNAM0= <>
##$DBPNAM1= <>
##$DBPNAM2= <>
##$DBPNAM3= <>
##$DBPNAM4= <>
##$DBPNAM5= <>
##$DBPNAM6= <>
##$DBPNAM7= <>
##$DBPOAL= (0..7)
0.5 0.5 0.5 0.5 0.5 0.5 0.5 0.5 
##$DBPOFFS= (0..7)
0 0 0 0 0 0 0 0 
##$DE= 6
##$DECBNUC= <off>
##$DECIM= 24
##$DECNUC= <off>
##$DECSTAT= 4
##$DIGMOD= 1
##$DIGTYP= 9
##$DL= (0..7)
0 120 120 120 120 120 120 120 
##$DP= (0..7)
150 150 150 150 150 150 150 150 
##$DP07= 0
##$DPNAME0= <>
##$DPNAME1= <>
##$DPNAME2= <>
##$DPNAME3= <>
##$DPNAME4= <>
##$DPNAME5= <>
##$DPNAME6= <>
##$DPNAME7= <>
##$DPOAL= (0..7)
0.5 0.5 0.5 0.5 0.5 0.5 0.5 0.5 
##$DPOFFS= (0..7)
0 0 0 0 0 0 0 0 
##$DQDMODE= 0
##$DR= 18
##$DS= 0
##$DSLIST= <SSSSSSSSSSSSSSS>
$$ [...]
##$SUBNAM2= <"">
##$SUBNAM3= <"">
##$SUBNAM4= <"">
##$SUBNAM5= <"">
##$SUBNAM6= <"">
##$SUBNAM7= <"">
##$SUBNAM8= <"">
##$SUBNAM9= <"">
##$SW= 24.9337058887773
##$SWIBOX= (0..15)
0 0 2 0 0 0 0 0 0 0 0 0 0 0 0 0 
##$SW_h= 4990.01996007984
##$TD= 16384
##$TD0= 1
##$TE= 0
##$TE2= 300
##$TE3= 300
##$TEG= 300
##$TL= (0..7)
0 120 120 120 120 120 120 120 
##$TP= (0..7)
150 150 150 150 150 150 150 150 
##$TP07= 0
##$TPNAME0= <>
##$TPNAME1= <>
##$TPNAME2= <>
##$TPNAME3= <>
##$TPNAME4= <>
##$TPNAME5= <>
##$TPNAME6= <>
##$TPNAME7= <>
##$TPOAL= (0..7)
0.5 0.5 0.5 0.5 0.5 0.5 0.5 0.5 
##$TPOFFS= (0..7)
0 0 0 0 0 0 0 0 
##$TUNHIN= 0
##$TUNHOUT= 0
##$TUNXOUT= 0
##$USERA1= <user>
##$USERA2= <user>
##$USERA3= <user>
##$USERA4= <user>
##$USERA5= <user>
##$V9= 5
##$VALIST= <valist>
##$VCLIST= <CCCCCCCCCCCCCCC>
##$VD= 0
##$VDLIST= <DDDDDDDDDDDDDDD>
##$VPLIST= <PPPPPPPPPPPPPPP>
##$VTLIST= <TTTTTTTTTTTTTTT>
##$WBST= 1024
##$WBSW= 4
##$XGAIN= (0..3)
0 0 0 0 
##$XL= 0
##$YL= 0
##$YMAX_a= 1046956
##$YMIN_a= -611024
##$ZGOPTNS= <>
##$ZL1= 120
##$ZL2= 120
##$ZL3= 120
##$ZL4= 120
##$ABSF1= 10
##$ABSF2= 0
##$ABSG= 5
##$ABSL= 3
##$ALPHA= 0
##$AQORDER= 0
##$ASSFAC= 0
##$ASSFACI= 0
##$ASSFACX= 0
##$ASSWID= 0
##$AUNMP= <proc_1d>
##$AZFE= 0.1
##$AZFW= 0.1
##$BCFW= 1
##$BC_mod= 2
##$BYTORDP= 1
##$COROFFS= 0
##$CY= 11.3945322036743
##$DATMOD= 1
##$DC= 2
##$DFILT= <>
##$DTYPP= 0
##$F1P= 16.9975609425685
##$F2P= -3.02152046262296
##$FCOR= 0.5
##$FTSIZE= 0
##$FT_mod= 4
##$GAMMA= 1
##$GB= 0.15
##$INTBC= 1
##$INTSCL= 1
##$ISEN= 128
##$LB= 0.24
##$LEV0= 0
##$LPBIN= 0
##$MAXI= 10000
##$MC2= 0
##$MEAN= 0
##$ME_mod= 0
##$MI= 1.114404
##$NCOEF= 0
##$NC_proc= 0
##$NLEV= 6
##$NOISF1= 3.799351
##$NOISF2= 2.8
##$NSP= 1
##$NTH_PI= 0
##$NZP= 0
##$OFFSET= 15.70392
##$PC= 1
##$PHC0= -9791.16
##$PHC1= 11.00088
##$PH_mod= 1
##$PKNL= yes
##$PPARMOD= 0
##$PSCAL= 0
##$PSIGN= 0
##$REVERSE= no
##$SF= 200.130013532006
##$SI= 16384
##$SIGF1= 3
##$SIGF2= 2
##$SINO= 400
##$SIOLD= 16384
##$SREGLST= <1H.CDCl3>
##$SSB= 0
##$STSI= 0
##$STSR= 0
##$SW_p= 3612.71676300578
##$SYMM= 0
##$S_DEV= 0
##$TDeff= 0
##$TDoff= 0
##$TI= <>
##$TILT= no
##$TM1= 0
##$TM2= 0
##$TOPLEV= 0
##$USERP1= <user>
##$USERP2= <user>
##$USERP3= <user>
##$USERP4= <user>
##$USERP5= <user>
##$WDW= 1
##$XDIM= 8192
##$YMAX_p= 0
##$YMIN_p= 0
$$ End of Bruker specific parameters
$$ ---------------------------------
##NTUPLES= NMR FID
##VAR_NAME=  TIME,          FID/REAL,        FID/IMAG
##SYMBOL=    X,             R,               I
##VAR_TYPE=  INDEPENDENT,   DEPENDENT,       DEPENDENT
##VAR_FORM=  AFFN,          ASDF,            ASDF
##VAR_DIM=   8192,          8192,            8192
##UNITS=     SECONDS,       ARBITRARY UNITS, ARBITRARY UNITS
##FACTOR=    0.0002004,     1,               1
##FIRST=     0,             0,               0
##LAST=      1.6414764,     0,               0
##MIN=       0,             -611024,         0
##MAX=       1.6414764,     1046956,         0
$$ Real data points
##PAGE= N=1
##DATA TABLE= (X++(R..R)), XYDATA
$$ [...]
2468e388J875Q018J123o981l616L023M827N95m021o126R16P927K736n908l405
2483d405J880L567J940j620m873j366M153J689k691n32J359r04R71J792l16j134
2499d90k19j762j225L703J867m143k780L359L751N30k409l931j57N844K301n581
2515a342m637K732M378J610j874l688j82N589K274n780l631L170K583J51j402
2530d9k417L50L808J054k888o6K324j059k455L67Q84M41N60j267r28L350K877
2547D886l769l661K439L446M5k523l849m05N176L804l829m410L034L594l07l016
2563F55k537P5M003J156m466k199M455K788k436j878q2J208J642j255m080M10
2579b541M480j66l535M06K763J256j127k486j911K019L630l076m224K242L999
$$ y = [-5388, -3513, 4505, 5628, -1353, -4969, -1946, 2881, 3476, -545, -6671, -5755, 2172, 4908, -1000, -4405, -2525, 1042, 2982, 1362, -3511, -4877, -724, 965, -1726, -2258, -899, -1803, -832, 960, 644, -490, -709, -2471, -3696, 7, 1874, -2269, -5049, -1690, 2061, 2591, 182, -3749, -3906, 1938, 4239, -1342, -5979, -3247, 1131, 2741, 867, -2821, -3003, 2586, 4860, -920, -4551, -1381, 1202, 1353, -49, -2466, -2116, 1692, 2746, -142, -208, 2116, 1057, -1398, -1031, -147, 294, 854, -413, -1341, 2009, 4886, 1117, -2544, -105, 3341, 3386, 863, -2986, -3391, 1785, 5589, 1760, -2650, 384, 3978, 3671, 655, -1882, -1807, 2196, 3352, -1114, -3313, 1142, 3930, 1494, -384, -466, 742, 2384, 1129, -2951, -2541, 1939, 1773, -1762, -1356, 1407, 2663, 1536, -950, -2861, -842, 2788, -288, -4512, -2270, 1729]
2594A729r24k299j312P52L731J308m597l909L162L427k013k544J093J532J903
2609A039m76m081r42M887J894m613k622J957K002L69j322j759J275M644p07m736
2625c191j107L470J556k175j103n90J864K635j347l482K021L707j781k610k6J644
2641e15Q13K05k717j297M453L377l461l258K249K330J09j806l021N66M854J588
2657D469m853k164M135K328j34k129j583N63K716m27l575k09M199J207k085m90
2673A968R0N83R21q39k315J860K519k563l436K454L009K43j040k322p64L216J622
2690E206m135l338L235L308o89k467j449J0M096J387m359k771K415K028j386j352
2706b61n29M45J671Q39k509p08K429n53k381n5J809p48p91k84m01J797J834k332
$$ y = [1729, 805, -1494, -2806, -2054, 1677, 2985, -1612, -5521, -2359, 1068, -945, -3489, -2396, -864, 1039, 563, -3518, -4460, 427, 2321, -2292, -4914, -2957, -955, -586, -1908, -3667, -2392, 2252, 1545, -3191, -4298, -828, 728, -1447, -2550, -3140, -1276, 1359, 12, -3470, -1449, 2258, 477, -2133, -2159, -515, 298, 503, -2214, -3511, 942, 4319, 858, -2400, -151, 2179, 2288, 482, -2539, -1973, 2881, 4469, -384, -2548, 1587, 3915, 3781, 1652, 69, 632, 3348, 2921, -654, -863, 3336, 4543, 2458, 1968, 2058, 2641, 3562, 2723, 408, 2268, 4787, 2224, -1212, 1242, 4251, 4494, 3454, 1132, 368, 3584, 5206, 1071, -2267, 968, 4276, 3587, 1120, -329, -319, 3777, 5164, 805, -1966, 449, 2477, 1091, -261, -790, -345, 1326, 2165, -344, -1052, 1377, 824, -1557, -1612, 197, -551, -1342, -1626, -2027, -230, 1604, -728]
2724g28l131J895L425r03l468j822N74L410K365l453l429K612M006q35k852j437
2740c771L75J993K258k945l194K418K703m10o07k78r12K91J374j158j013J199
2756a677M45j909J243K492m69j741L40O2J011R72k177k858K080M317p27k587q75
2773b058J353K280K185l150m221J698M500k06l075p38P62K131K297k130k819J132
2789e9L356j284j797K12l40K82J473L04r56J172M19k096l34K414K08k471o78Q48
2807F73J233J667j691l130J305M462O0m097j630J280J961J410j824l869J077M832
2823C719l31l498k93Q80R44P05j760k200R00K673q83k087J384J168j389n01L27
2840b42j98R37l7k679p31L482R89l071n76R89J649O24j476l549O61M303J65l985
$$ y = [-728, -3859, -1964, 1461, 558, -2910, -4732, -4158, -748, 1617, -1836, -5265, -2653, 1353, 518, -2334, -3771, -3396, -1403, 855, -2090, -5284, -2866, -163, -573, -1180, -1458, -2370, -2079, -705, -1863, -2876, -1677, -1232, -3141, -1898, 594, 125, -1616, -1276, -1214, -203, 769, -1408, -4266, -2186, 2131, 1404, -1183, -2058, -705, 1575, 3760, 610, -3611, -1913, 2587, 2381, -694, -1432, -670, 1461, 3758, 1628, -1191, -59, 3297, 2013, 216, 428, 88, 370, 1843, 2147, 1191, 2363, 2782, 686, 352, 2766, 2974, 503, -175, 673, 1906, 3573, 1882, -1248, 57, 4519, 4579, 482, -1148, 132, 2093, 3503, 1679, -2190, -1113, 3719, 3388, -110, -403, 477, 1421, 2126, 366, -1834, -934, 1739, 856, -1231, 153, 1321, -68, -569, -242, -440, 497, 460, -2219, -2950, 532, 1521, -1550, -2126, -1137, 512, 1136, -340, -3889, -3228, 1075, 1240, -2745]
2858b745j079J932K119N72j587k313Q72L256j004l347p0K534Pl19l67p69J255
2875a053J803j823k294J864J575j833j675J332J230Q98k53k072n71L185J168l367
2891a886j941K343J661K39j597j741O08M008O23l816p79K871P40j283j120n26
2907a596J016K101l94k467J127K563m56j996K74K94N34O57j425j870K577K480
2923C419j622k471J841J104k83j50j642q71K927R93k584j623K576J626p58r25
2939A557r67J88J788j90k708o18L010P20j593n90K39Q75J194j059k630R60K329
2956B505m65k394q4J286P26N9j095j324J412K274k273k463J467J411p11l33j94
2973a96o13J623J088k231j184J880R53k189p21K66N47P12L51k074J50K557K00
$$ y = [-2745, -3824, -1892, 227, 799, -788, -3101, -2229, 1027, 23, -3324, -3394, -860, -853, -1172, -1539, -2308, -1053, 750, -1073, -3367, -1503, 72, -1761, -3436, -2104, -874, 24, -229, -2301, -2872, 313, 1481, -1886, -3827, -1484, 177, 416, -1181, -2922, -2314, 1694, 2317, -1499, -2278, 593, 1333, 50, -1070, -1596, -580, 1521, 1127, -1340, -213, 2350, 1894, -102, 172, 466, 1000, 1657, 232, -1638, 939, 3419, 1797, -674, 1167, 2271, 1988, 1838, 196, -675, 2252, 3245, 661, -962, 1614, 3240, 2482, 1557, 590, 778, 2566, 2376, -332, -950, 2060, 2780, 1187, 597, 836, 1711, 2905, 1846, -784, 176, 2505, 2040, -354, -438, 848, 1574, 1633, 538, -786, 626, 2900, 627, -1836, -369, 1042, 331, -2, -196, -809, 814, 1902, -329, -1513, 367, 1320, -869, -1590, -1324, -777, -65, 286, -1788, -1638, 919, 1119]
2990A119k447r85J053O58K58o95j837O64K827L0k516j68J690k38l28o28j113L62
3008b294K233n09j802J148J194m89p58M40m49L81P31j089j588K365J052j148o56
3025a238R30R04M1k61j666m02K537J140k595j294K137J047L6l44j513j88K934
3042B205L13k973p21K090O00m42m79K02N2J552n0k423K98J686o29j396Q65Q37
3060A587j26Q3o65r11J716K053k598j803J238J199r1p12j476K6K578J422k531
3077I89k435J893J509n58p22j137n04K291N84k178q88K169O90j282l39j20k54
3094b92J81q4j161R82J773q31k362N01J981l05p94j107j116J952J722k524k224
3111c708J569K932j02j862j293k17K214R15k303k051J862K128j051j088k04K29
$$ y = [1119, -1328, -2313, -1260, -602, -344, -1039, -2876, -2212, 615, 645, -1871, -2039, -349, -587, -915, -1543, -2656, -2294, -61, -570, -2372, -1224, -30, -519, -1277, -837, -1286, -905, -174, -1263, -2851, -486, 566, -582, -1238, -308, 596, 637, 376, -1290, -1692, 845, 1985, -610, -1904, 233, 1280, 1316, 972, -541, -729, 2205, 2518, -455, -1176, 914, 1514, 1072, 593, 795, 847, 2399, 2349, -74, 224, 1910, 1281, -115, 750, 1587, 1461, 1544, 879, -32, 1684, 3737, 1139, -664, 574, 1773, 1682, 970, -506, -480, 2098, 3520, 989, -1446, 447, 1956, 1398, 676, -461, -965, 1326, 1910, -268, -1156, 1013, 1703, 421, 82, -38, -292, -111, -195, -1356, -374, 1399, 568, -1794, -1293, 688, 383, -411, -1518, -2634, -682, 1040, -1484, -3708, -2139, 793, 691, -1171, -2464, -2681, -467, 448, -1855, -3906, -2044, 84, -967, -2055, -2259, -2030]
3127b030J099O82j715m32J053k12j391L65J805j01p94j21k41R47J587j293k522
3144c314J148K668n48j903l74N01K240J460k068k589J726K551p11j722j80O1J311
3161B57J520j375j795J256J821p14q36J96L9L3L05j93k11J202K23j464L72K033
3179B669j48j791m56L98R65J047r83k160J074K867l2k421k94P30J346N30j827
3196A514k314J342K503j46j507K36N49l88L28m61j396J040J524j663j022J162
3212A301N55j013J69O32k97O34n01k214P3K090P89j744p65O81L59N55l71j991
3230a058L9K572j41k331q96M77R99J157k92j864o2J727n80j275m5Q85o72l5K26
3249a169n48K18J089r15q49J253J074j606j185M67O02R55o31j077m25K199N98
$$ y = [-2030, -931, -249, -1964, -2396, -1343, -1555, -2946, -2581, -776, -877, -1671, -1792, -2033, -1086, 501, -792, -3314, -2166, 502, -46, -1949, -2323, -1822, 418, 1878, -190, -2779, -1053, 1498, 787, -935, -1115, -1054, 257, 1777, 402, -1393, -137, 1684, 970, 134, 330, 369, 402, 707, 514, 303, 1505, 1728, 264, 636, 2669, 2521, 730, 274, 672, 1637, 2684, 1701, -459, 615, 3482, 3450, 1029, 735, 1465, 2811, 3341, 1514, -800, 542, 3045, 2899, 1392, 1628, 2177, 1789, 2117, 1656, 260, 1300, 2824, 1161, 139, 1301, 1856, 843, 1012, 1644, 1347, 1981, 1480, -734, -661, 1429, 2218, 474, -291, 390, 749, 1304, 933, -1058, -1019, 1553, 1412, -919, -1815, -1338, -339, 818, 526, -1338, -1400, 327, -253, -1528, -1573, -688, -1360, -1395, -1169, -1717, -1499, -410, -1325, -2174, -921, 153, -1453, -2638, -2171, -1569, -614, -1245, -2322, -2747, -548, 50]
3266E0j847o45N49O76M98k84j867j84K465L34j450l69Q83L71J18P4j045j82R43
3285i12L04o44N09P58r30p7P57P0k97P66q10r69J047J943j796j004J163J177r8
3304I57Lj033j067K121Q57j562j130J164R71M53m20p75o49J726Q07j797r41J341
3322A026M41o06J60k16r5J143j70j176P0J433Oj616J73N11M75J4o39p34P71J836
3342B807j114j921O07O00J8J13o67p04N93J886j388j233N92O38o78M7O7n52J31
3361a58L12r28l03J869l5j642J37J31L58J78l11j184N8K025j41j970J7J123K44
3380b20j48n68j252M36J650l59j728K29J573j57l61l13n51P17J095q84j409Q19
3398a431O73o39J8Q33L54J50k28j330J01J711L72j932o70J824M65k27n12o19P53
$$ y = [50, -1797, -2442, -1893, -1217, -719, -1003, -2870, -3054, -589, -255, -1705, -2074, -1191, -820, -702, -628, -1673, -1855, -912, -608, -1252, -743, 15, -915, -992, -235, -165, -462, 304, -506, -1475, -428, 1515, -281, -1285, -122, 1055, 957, 960, -73, -1140, 981, 1838, 276, -854, 310, 1281, 1734, 1314, 539, -110, 1616, 2423, 626, -315, 1026, 1467, 861, 1021, 805, 710, 1853, 1683, 507, 577, 2010, 2016, 400, 573, 1084, 1559, 1573, 934, 200, 971, 2807, 1693, -228, 379, 979, 997, 1110, 443, -261, 332, 2218, 830, -403, 189, 827, 149, 196, 263, -289, -158, 154, -774, -1077, 792, 757, -885, -748, -617, -259, -81, -392, -1576, -1518, 507, 366, -1604, -1587, -464, -220, -368, -936, -2188, -1752, -102, -461, -2189, -1960, -387, -544, -905, -1218, -1769, -1052, 43, -841, -2250, -1431, -758, -1397, -1379, -546, -192, -42, -270, -1600, -1499, 212, 584, -1348, -2018, -194, 271, 44, -468, -1087, -334]
3417c34J585J78k491j54J410L71j98m90k3N1J250k77j059M61J162o66l77M83j38
3436G44J6N36m50m17P69J123j307o00R34M95p43j91o76J14J663K86j643q46J502
3455A309P53m00n55m98l30J443J68j880j99J136N78l06R2q55n10N47P63p32L65
3474H89L74j105j051J140J030n56l44l78j86O10K79j473r58J448J492n75j054
3491d18r55M44J303P94j564j553J565O24r87K13l28j97P77M36r48n66N32L21k25
3510g32K11J40j065kJ078Ol58R4n92o67J208J103r01p39l59K70M67J156o93j592
3530a967J045J374l55j323m08j9J222J184q85k229J041R56M03J62k77l36j66P01
3548A23o77l95J000L89n82j86R73n76o15L66N16J06R29j177j459J217J233p9j123
$$ y = [-334, 1251, 1429, -1062, -1216, 194, 565, 367, -123, -146, -95, 1155, 878, -181, 280, 1442, 776, 399, 882, 744, 760, 1296, 846, 429, 1198, 2321, 1014, 414, 1348, 1843, 1100, 909, 233, 347, 2010, 2296, 653, -193, 1309, 2062, 1662, 1107, 609, 279, 1722, 1890, 10, -189, 947, 1525, 1219, 1311, 456, -54, 493, 1256, 524, 889, 1263, 158, -893, 247, 1277, 721, 377, -1, -187, 423, 702, -771, -1729, -281, 1211, 636, -418, -1373, -929, 374, 1168, -396, -1949, -384, 240, -747, -534, -862, -1059, -282, 154, -794, -1360, -828, -507, -732, -521, -381, -1446, -1448, -370, -364, -722, -628, -1220, -1887, -679, 424, -477, -1216, -1575, -1305, -838, 318, -375, -1967, -922, 452, 97, -1226, -1634, -1653, -431, 753, -132, -2361, -1320, -364, 39, 201, -76, -412, -578, 123, -554, -949, 51, 440, -142, -328, 645, 69, -546, -180, 336, 442, 1371, 194, -1265, -48, 1185, 1106, -17]
3567a7MJ87P09R47r40j841J026J508k38r10k37j28M10J124n2j706J83J369j72
3586A226l35J17j032l89J070Q42l44K8l96j046qJ455k80q91J97k8K11M03k59j356
3606h15N38J784Mj587j088O2J125P69j27j665j36J816k47j263o0M55J15L02k42
3625b60r06j63R97n3n22R03k38r27R7Q86l7m20j22j032L34J396Q8j313l67N61
3645a098N60N27l02j664K49J236P84j534o73O45N84R45O5j870k99J330N95p57
3663f77j7K98m90L56J20l70j24R83l3n68O47o1r24k68J070R13m20l39r28j36J924
3684I56M48j541n18O77R93K05o42o86j94J267R67j163p66M18L78N4M82o49l65
3703C21L09M25j45L41L04q83l93J011K41l84l24o27P0J232N83j183q38P27O72
$$ y = [-17, -13, 174, 883, 1830, 890, -951, 75, 1583, 1345, 435, 198, 70, 480, 1604, 1552, -154, 29, 1398, 1226, 891, 1008, -24, -413, 657, 1499, 1155, 1183, 787, -259, -267, 1188, 908, 17, 214, 186, 397, 800, 541, -815, -277, 1507, 1511, -76, -1164, -1102, 23, 792, 665, -1000, -1136, 680, 433, -830, -890, -435, -320, -18, -260, -1166, -1329, -332, -385, -907, -4, -242, -1169, -1072, -186, -223, -643, -765, -1797, -1463, -67, 21, -1292, -1659, -1098, -538, -11, -313, -1977, -1728, -492, 292, -1242, -1915, -1270, -686, 259, 324, -1546, -1845, -515, 80, -677, -694, -396, -886, -530, -410, -780, -904, 79, 46, -522, 125, 64, -860, -1128, -58, 855, 435, 96, -832, -968, 956, 1404, -137, -655, 22, 1015, 1220, 578, -108, -302, 965, 1932, 769, 3, 421, 799, 853, 1335, 686, 321, 630, 1055, 910, 1251, 1555, 672, 279, 1290, 1531, 1147, 823, 196, 266, 1498, 2081, 898, 60, 787, 1459]
3722A459l90J58r77j17Q50J112j090j047M63L99j8N62o80q99O96M88p12o59O83
3741B81J66r9O13l92p53K07K20m67P7L05m23o86N18P98l98j02m25l13K42J220
3761E89q35j152L37Q45l0m04j53o34N44O28n53n52M16jk59O1N02o93J65K88r1
3782i82r6N53l63p33M87P20j87q62J84q3K90R63m32j070M59R42j36k76l50o60
3802a632N57J094J00j127P1Q39J06j29m0n18K6R97K24j087N4P09k77P8Q86m82
3822D49n37N23O5l23P02L19j191k57J528J95o34J89n41J90J064P9j406j60R42
3841A196J84j23M3o95p8R32Q37j361j71K44J80k72K97j78j81J99P16o49j5Q0r66
3862B19O1J098j94p41J01j41mN32N3r60j20O40K32n45l7o08l13J028P23r96j060
$$ y = [1459, 1069, 1227, 250, 133, 983, 2095, 1005, -42, 421, 820, 802, 1364, 684, -215, 481, 969, 257, -402, 281, 447, 348, 961, 569, -184, 23, 243, -224, -147, 158, -265, -951, -433, 365, -33, -135, -560, -873, -631, 589, -246, -1398, -1061, -216, -246, -650, -803, -1437, -893, -265, -818, -1370, -954, -955, -1214, -1153, -651, -1344, -1179, -891, -982, -1078, -525, -888, -1621, -1134, -414, -601, -1463, -1279, -1362, -1072, -109, -541, -1611, -1152, -210, -346, -622, -972, -1632, -1075, 19, 119, -1008, -937, -98, 8, -121, -161, -679, -653, 344, 568, -519, -465, 244, -33, 45, 931, 449, -88, 435, 500, 177, 879, 1198, 7, -250, 1278, 1473, 839, 1028, 487, 677, 1741, 1820, 414, 254, 1196, 1380, 1257, 1300, 605, 527, 1459, 2296, 935, 764, 1008, 1188, 916, 1213, 1035, 854, 1053, 1769, 1120, 1105, 1185, 219, 280, 1378, 1184, 443, 544, 403, 399, 931, 984, 24, -96, 544, 776, 231, 194, -414, -727, 301, 1024, 28, -1032]
3883a032P22O63n43j57j67l58M94M44m44q94L58K42k16P41l07n30l15K9L09J19
3903h42L69o40o38O05J298q44p37J4J3J211L57j260j253Q73J025Kp18j59K8N75
3923g21P27n08j089L73O25j01L82L5o74q8J034N1l22p1r7k21L26J066j117o07
3943i97Q35M19J35J37o27o21R10J001l61j095L7N21N07M10j134o35J070J225j89
3962A548j257j78K4O69N05O0q27J90N67m45j34O21m0p33P73k0j21k36j25o47L74
3983E68J733q86j378M23L39L60K72n81r14K39J346l20p51Rj01K37L30j59n15n06
4003b55O28Q9j88J23m45n54J002M44p74o57J39j42Q7R40m02j125K80N66K07k31
4023b68j9n26o0J001m19r87p6N77N16M47m03j631K8J140Q57o93k88n47l86J077
$$ y = [-1032, -310, 353, -190, -347, -514, -872, -378, 66, -378, -1272, -914, -672, -888, -147, -454, -984, -1299, -1270, -961, -842, -473, -1113, -1751, -1146, 152, -692, -1429, -1415, -1402, -191, 166, -1094, -2347, -1474, -449, -447, -1165, -1324, -1296, -721, 6, -502, -1591, -1218, -593, -694, -312, -277, -951, -1039, -5, 46, -276, -347, -444, -665, -339, 727, -390, -997, -162, 257, 392, 529, -98, -719, 191, 1192, 831, -264, -227, 294, 801, 1211, 77, -558, 512, 1737, 1548, 291, 113, 137, 806, 1311, 1371, 544, 734, 1301, 856, 722, 1343, 1303, 570, 1343, 1323, 1202, 966, 841, 194, 568, 2301, 1415, 37, 460, 799, 1159, 1431, 850, -64, 175, 1521, 1201, 450, 459, 358, 595, 925, 766, 251, -255, 373, 462, 274, 397, -48, -602, 400, 844, 70, -587, -448, -590, -503, 437, 35, -1090, -810, -244, -37, -268, -287, -813, -873, 128, -291, -1278, -1354, -777, -261, 186, -217, -1848, -1820, -680, 177, -516, -804, -1351, -1737, -660]
4043f60M86r27j65O16J76k65K17k51p62L02J009k2p52o8o1N20O52L3j525L7J117
4064b93K86l28M9o99J33Q02M15q36k21Q60j56R9r5o85j99J409L10m31k84n01L
4085c62P07J034p73j118M66N55l29J54M37j84l14P69l38l27J38J29j30K22P42
4104A478r56o48M71J67N89K20n37n50J77P34j62o41MJ4K37J82k22p01K37N27o6
4125E54l05P2m11j74R49K8m20m02K99LK31K73q66o74M32J046o23j45m24j90O14
4146a33R22p13j110M98N46R7P0l59j554O09J509k47o12k50j23K57O96n1j076K2
4166a002P58K94n31J37m84r3P37N52q83l60Q7J35M96M62j93j419M84J040j15l35
4186b33n80J13P42P34n81j294L52R52N33p82P3o00K96J139j47j251K70J20O9L94
$$ y = [-660, -174, -1101, -1266, -650, -474, -739, -522, -773, -1535, -1233, -224, -246, -998, -1066, -1127, -607, 45, 78, -1447, -1410, -293, -7, -335, -286, -985, -852, -50, 365, -471, -692, 168, 12, 111, 16, -669, -868, 541, 851, 420, 136, -365, -362, 345, 1379, 606, -512, -46, 509, 180, 334, 771, 587, 273, 1042, 704, 377, 515, 644, 514, 736, 1478, 522, -126, 345, 512, 1101, 1321, 784, 234, 411, 1145, 983, 342, 346, 360, 597, 779, 557, -144, 93, 620, 554, 249, 321, -90, -264, 685, 713, 293, -109, 190, 193, 424, 697, -169, -843, -411, 635, 12, -133, -557, -747, -133, 789, 76, -1034, -536, 10, 107, 177, -182, -1736, -1127, 382, 135, -477, -727, -850, -593, 103, 52, -1024, -1002, -244, 50, -481, -344, -828, -921, -184, 368, -515, -875, -788, -653, -157, 305, 112, -1307, -823, 217, 102, -233, -813, -700, 42, 776, 195, -1099, -747, 205, 738, -44, 29, -571, -275, 864, 717, -534, -264, -144, -75, 319]
4206C19M08q02q8M29P8Q8K51l41o00P81J71N4n28n7J26L45O07k97r20j59J025
4227H90M6m86K00l25k04J058Pp43PJ43QJ06N48o69m15N84L0m30J59J37n94J46
4249B03P72l20l09M8o6l18M31k37p48J60R72L4m59n93l08M46N33M78r56n37O05
4270a69L88j59r6m59j93M62M37l71p91M17J64J98J96n16q02K52P17j42o9m6o07
4291a189K36Q26j07p14P8L15L27l83M1l07l06Q47K11n50j60Jr7L96N01n39n53
4312a126L48L87J23M0j65k19mQ33p93r8L32M05k70L42l84k98k8Q97kl99K24n52
4334d07J99N71L52n45j50L75m76J77L63k3l52M41N24o34r4L14j79N5O28n53m64
4355A22M14Qp5L67L20n91l73M82K26l67L3K78n10L38K35k23k98L24m9J25J34j07
$$ y = [319, 727, -75, -163, 266, 344, 432, 683, 342, -258, 523, 694, 748, 220, 163, 289, 634, 1241, 944, 24, -135, 890, 936, 450, 650, 325, 121, 1179, 1186, 443, 450, 593, 601, 707, 1255, 586, 171, 755, 785, 355, 514, 651, 57, 203, 975, 655, 346, 394, 328, 10, 441, 204, -544, -384, 588, 622, 163, -430, -738, -292, 241, 719, -237, -774, -169, 219, 60, -36, -495, -688, -226, 211, -160, -951, -534, -370, -172, 24, -492, -1294, -1042, -325, -467, -536, -582, -1189, -953, -127, -234, -948, -870, -555, -228, -611, -570, -877, -1183, -336, -125, -675, -835, -834, -931, -535, -34, -573, -1126, -778, -391, -268, -228, -393, -612, -616, 217, -576, -674, -342, 63, -207, 135, -249, -547, -575, 322, 320, -79, 145, -407, -208, 363, 715, 170, 20, 395, -81, 96, 459, 436, 84, 525, 1049, 415, 321, 635, 456, 511, 1139, 586, 122, 536, 544, 469, 836, 1156, 565, 192, 674, 900, 533, 566, 844, 334, 672, 907, 684, 386, 710, 661, 786, 920, 813]
4377H13j089K16P80k08K70o25k92M58O68m8r00k93P02k25j80M88q76K37N80j71
4397C05q40L3M86n4k1O5m05n83N11O2J73R2j85m49r7Q52K8q45n3K82J80J87j50
4420d26r34L84R93j94p86j59M63l63M27N20j021KM16P9k03P5L64j90j61N37l32
4441e09l03L01k94p2L46L9l55J05K56k20P06J11r67q8P11M48k93l69J37J51J45
4462a4K19l64o19R99J95o18J15K41k23K84O89o62j03nj41J62Q69j99o52J2M38
4483F23K23L2j12p6m43P49J26m39m11K27O55j74q2o09j85Q07P67r07j46k01k08
4504B16N42L25j67p68M54L43k11J02j05n98J62O12J53j243K84L79l91L98M26q73
4524D0o72P86N94o46r2n08m5N78N66n84j117N40P17J83p31k6q15N79Q57o26k88
$$ y = [813, -276, -60, 720, 512, 782, 157, -135, 323, 991, 943, 43, -250, 452, 227, 47, 535, -341, -104, 476, 305, -535, -502, -16, -70, -91, -26, -431, -1014, -503, -441, -268, -176, -361, -810, -907, -55, -27, -872, -925, -643, -463, -276, -426, -1360, -976, 17, -177, -963, -1122, -659, -1022, -595, -75, -1096, -1094, -678, -599, -802, -727, -363, -553, -714, -177, -509, -812, -511, -805, -877, -531, -492, -847, -742, -486, -706, 0, 111, -856, -944, -233, 215, -78, -447, -310, -159, -14, 205, -159, -778, 221, 416, -202, -87, 154, -69, 215, 904, 242, 139, 134, -7, 155, 1024, 825, 173, 185, 623, 846, 878, 766, 690, 247, 996, 1122, 683, 272, 499, 1154, 980, 898, 289, 104, 911, 1678, 771, 625, 424, 216, 758, 1083, 916, 148, 602, 945, 734, 836, 731, 133, 295, 907, 1060, -183, 101, 480, 89, 487, 913, 40, -632, 154, 748, 102, 10, -498, -543, 35, 601, 17, -1100, -560, 157, 340, -391, -417, -1232, -653, 204, -422, -710]
4545g10k00q6K97L53K69r77J48K69K98o82K61k90l12M42O47p01l99L83J36M59
4565c95K7o47m18M55N67j20k71k50k10N08R18k48j106N68K17j56K11q1m91M1Q45
4586c6M6m37J16L5p6O85J11p74k12Q05P5m62N81j68o01L48M25j36l6k2j59L28
4608D36O07l24q68L01Q96r0p37j69K99L2P42l3q41m6N01L07k59J49l84k68L77
4629F28O80n93j64K87l20L04M9m17m19M65O32k32k46M9n79J48O21l92k16j89j05
4650iJ06P24m11p55J98L71N0k39p2m37j6P60J93j087l87Q39O96q28M52l77l24
4671e53N37L44p08k42L97k21o9N03k23m23K58k91k1K84P6n92j27P91K49o09l44
4692i84K28K91L21l55o23o6R05K86p08O2OK94L08J02q26K9N64K59k80k1ok10L92
$$ y = [-710, -910, -996, -699, -346, -77, -1054, -906, -637, -339, -1021, -760, -1050, -1362, -920, -273, -974, -1373, -990, -854, -395, -368, -1015, -1433, -978, -411, -531, -802, -1052, -1262, -754, 164, -84, -1190, -622, -405, -561, -350, -431, -922, -881, -36, 10, -427, -311, -276, -352, 333, 444, -330, -542, 263, 338, -124, 457, 289, -312, 36, 461, 325, 289, 267, 108, 436, 1043, 719, -149, 152, 1048, 958, 221, 52, 351, 383, 1125, 1092, 251, 205, 706, 1013, 754, 903, 519, 251, 628, 1308, 715, 551, 838, 518, 822, 871, 454, 35, 500, 1132, 900, 654, 703, 124, 272, 893, 501, 285, 96, -9, 97, 821, 410, -345, -147, 224, 274, 35, -37, -474, -490, 270, 463, -624, -1011, -172, 524, -304, 148, -229, -553, -16, 328, -380, -622, -225, -446, -515, -12, -235, -658, -400, -691, -712, -428, -352, -944, -1071, -280, -31, -640, -984, -756, -465, -144, -499, -1122, -1188, -283, 3, -705, -643, -637, -343, -35, 67, -759, -730, -166, 93, -187, -208, -214, -424, -32]
4715c2K36o19K26M78k75j58J24K04l78J1M32o1K21K92m50k12K27N26o96j37M41
4736D00l3jL00l30l26Q36J07p55R7K65K35n34L77l10l08Q34j4m28j24M74l92M5
4758D15K13k34pK45n1l46L83J60l88j8L00N8l22j56L2j36O4O1j46k65J80K81k25
4781I8j58L27n86L45J95m17k11L65J31k65J44mm91M06L51o01l45N48K4l32M21
4802e5k79k58N46o7n89j60M63q3q3J28l3k42P4M38m38K38L16m06l05N27J18l92
4824e42L79j99n1j82O26o38j36N82K46l72m42J91j8M33K36o10p4O91k46J87k98
4845b37J01k8j16O80l41j78O9K22j4j94M23n54K50M37k06L1j3r8j63J86O43n36
4867C64mK5J8k31P15o07k70O14K20k51m21k76L43N50N6m23p39N85N18m3n11P3
$$ y = [-32, 204, -415, -189, 289, 14, -144, -20, 184, -194, -183, 249, 188, 409, 701, 251, 39, 266, 792, 96, -41, 400, 367, 366, 666, 336, 10, 846, 953, 198, 295, 560, 795, 261, 638, 328, 20, 854, 840, 412, 288, 762, 370, 415, 628, 394, 387, 632, 581, 235, 618, 778, 390, 372, 672, 730, 408, 252, 284, 148, 212, 273, 127, -138, 42, 323, 98, -60, 267, -319, 26, 221, -196, -407, -42, 89, -176, -32, -36, -527, -121, 230, -371, -716, -168, -144, -476, -55, -334, -592, -46, -113, -702, -862, -399, -482, -565, -437, -470, -712, -638, -200, -638, -400, -84, -490, -795, -268, -150, -542, -163, -362, -413, -595, 31, -607, -743, -161, 85, -287, -729, -538, -556, -123, 113, -497, -571, 120, -126, 61, -237, -136, -164, -280, 400, 59, -119, -50, 172, 158, -36, 387, -167, 83, 520, 314, 345, 332, 234, 71, 257, 900, 364, 360, 385, 403, 172, 887, 280, 10, 624, 844, 593, 172, -104, 239, 789, 845, 422, -317, 268, 786, 743, 232, 305]
4889C05O7J29J09l36m75P17J55m57l42L68j72j21J83L01l44P9R6n79L80M60o65
4910a42q1N9J5L46P1l01m43L46M21n69o85L51N22J25M3m69o16N90M33n16P7rQ9
4933c43j22K86m39j93K91J84j0j72K21p4o07P93K51p83l3L54m23L82O14m98o13
4954i34J81Q02L3j82n34j51L04P40n74n10N18O16j63j51n47p8M18O25k37k15p
4975d6K91l22N24K0m43R5L32k22K11p5n60J12N87J97l84n94M11j7M92K3k22p33
4997c23O03N10o4m43J67n8K52J31m01k45J97M29k42n6j58l34L06O83q9n55k24
5018H6K28L26k97K06j39m34M04k08j12J37k2l53P32J02n14k35K07n0J85K63n09
5039Co78N86J74K6j55j11k08K39K50k99l29j14O68j81k80K79n77K54L81J81o47
$$ y = [305, 372, 501, 610, 274, -201, 516, 671, 214, -128, 240, 68, -53, 130, 431, 87, 166, 262, -317, 63, 523, -142, -223, -164, -149, 197, 268, -33, -476, -130, 291, -278, -963, -612, -90, 35, 78, -391, -1007, -417, 16, -500, -423, -432, -343, -465, -179, -618, -811, -520, -336, -346, -518, -297, -371, -978, -185, 66, -717, -750, -396, -819, -437, 177, -321, -934, -753, 49, 82, -100, -634, -785, -481, 259, -315, -825, -307, 309, 146, -5, -552, -630, -212, 413, 176, -39, -46, 245, -77, 447, 467, 24, 119, 451, 229, 440, 365, -195, -83, 504, 701, 317, -277, 134, 117, 609, 632, 410, -323, 280, 790, 726, 283, 450, 392, 644, 775, 374, 129, 326, 755, 513, 457, 299, -35, 271, 954, 865, 310, 86, 314, 640, 343, 549, 410, -24, 380, 172, 60, 197, 175, -178, 554, 656, 142, -93, 114, 64, 249, 512, 3, -675, -89, 85, 111, -44, -155, -363, -124, 126, -173, -502, -616, 52, -129, -409, -130, -707, -453, -72, 109, -538]
5060e38j39R9M8K48j98j15l24O17r3k34M9O6j8j56J64j61j76M84J02l27K84J22
5082a96p74J16N21K78l07j34oL62m6L8m19q9P86M51j123j12M29J14J78L95p78
5103c16p3N78O5l44JL71r9J39J26l21K34Q5j35q7J30Pl26J97M00j46O7r2m95L24
5127B90M35J73r03K7M59L67K25m28p68R1O82K70k40l94J15M6K16L11n53k72M56
5148F05L50k67j63l1j29K87J90l65m21J59K31J12K26o4r56J41M14Nk64n4n5K28
5170A79L69L1r21r5O08J79k08m42l18J94O52J56n57p39O52K73k28J24l9n39K74
5191c95L25n44j04JK66J71K20k51o90M17L10J66j78k33k65l19J047J48p70j7M11
5212b84l23O11j04q03L34P21J38m00k71l87N55K3L87o70p9M24K60Q9k92k99M6
$$ y = [-538, -677, -578, -530, -282, -480, -595, -919, -302, -395, -629, -580, -514, -532, -688, -524, -685, -861, -377, -275, -602, -318, -196, -970, -854, -333, -55, -362, -496, -502, -140, -186, -148, -567, -656, 130, 581, -542, -654, -225, -111, 67, 462, -316, -389, 189, 254, -90, -89, 282, 183, 322, 448, 127, 361, 446, 311, 224, 354, 361, 35, 232, 632, 486, 553, 461, -34, 290, 725, 898, -5, 22, 481, 848, 1073, 645, -123, -32, 650, 920, 680, 286, 401, 447, 663, 974, 421, 149, 605, 955, 688, 525, 494, 365, 652, 842, 477, 56, 215, 446, 558, 784, 720, -236, -95, 319, 324, 60, 6, -49, 179, 548, 579, -342, -437, 171, 350, 142, -300, -618, -424, 228, 384, -173, -912, -260, 13, -215, -91, -130, -669, -395, -70, -614, -718, -717, -451, -280, -60, -311, -1001, -584, -274, -108, -286, -519, -784, -1103, -56, 92, -678, -695, -284, -607, 4, -100, -903, -569, 152, 290, -110, -381, -768, -213, -190, 197, -473, -552, -128, 132, 221, -71, -370, -324]
5233c24J70N46l36k38L19l36K55K05R5q58J25O97j7j40m6q9O1M44J40o60k08L38
5255A43J50R9M59o70k59N48J81j66k57j25K68K43K65m87l72L27J94o2k5K79q73
5276a40J50Q27j57o08N09m16K80k55O14r28L94N2J90n24n3K2p6N70L63q43l97
5297d26J50L39J01R2k70o09O12K6j6l20jQ7K85J9j16p19J00J030k49o13j53q1
5319g32K36N93l31n07L34j22p1K66k44q3n3M96L98p78JL38j82N83Qn57l44K21
5341e30K83L03j57m22lJ47O66o65k22m8M34o1K42j80n92J62J086k56l66m3j99
5362d21N89L5nm34j14J96M19l51K67k72k11N13R8j89j32K01J56j99J28L4m77K49
5384H0M62Ll10k61R7J1Q06n69l00P1L47m2j71K25l17J5M73n0n41K53R1k08J45
$$ y = [-324, -154, 392, 56, -182, 137, -199, 56, 261, 356, -502, -377, 320, 303, 163, 117, 28, 89, 533, 673, 13, -195, 143, 293, 392, 851, 181, -78, 470, 651, 485, 228, 103, 371, 614, 879, 392, 20, 347, 541, 479, 454, 733, -140, 10, 837, 680, 72, 581, 165, 445, 190, 804, -124, 270, 322, 512, -12, -65, -43, -119, 451, 814, -29, -426, -276, 63, 164, 256, -14, -623, -11, 15, -1, -321, -322, -235, 50, 69, -47, -766, -666, 364, 115, -498, -651, -732, -496, 97, -234, -741, -407, -529, -600, -334, -578, -661, -714, -218, 180, -598, -597, -259, -441, 142, 150, -407, -751, -530, -247, 56, -101, -523, -526, -379, 287, -378, -600, -648, -214, -275, -33, -213, -805, -643, 443, 187, -179, -222, -421, 168, 203, 198, -236, -350, -154, 265, -86, 181, -91, -302, 211, 309, 120, -12, 189, 345, 146, 274, 308, -169, 80, 542, 545, 235, -26, 71, 82, 888, 319, 19, 90, 437, 395, 224, 449, 132, 147, 620, 570, 29, 282, 373, 165, 310]
5407C10N04n37k53M68l7k81qr3R2K29K40j44n20P6J81p6J80j72k85K6O37n00k12
5430a75Q0J7N0M24k86l76j53O90j0l52r6J2l87P94k63n48K39k39M46J69M5o49
5452e68j12M34J32L7l23N0k55lO95l28l35q0N85k5K0l53l58L04M70J01n09p2N9
5475d34J83K32K01n60J52K63K39o50o6J23N5M12J30n03m05M36L07q8J2n56L43
5496a74M62K78l15n27L82k61N12M28n65n88N48L39k07m00K18k77L08Q14l48o34
5516gj82N26J18J84k34n07k4P80l01M7k32R4J69K4K24l47l46K74K81j16j48O0
5538C37m54J38O27k99k70mL99p2j12N4n79j77Q86j61k38j92R8J78L97l81n57K85
5560i7K81n4n9k23r4r6O99o3m97k80N55R1L5l7k73l65O2O12l36k05p5l6L38l2
$$ y = [310, 814, 277, 24, 492, 455, 174, 166, 73, 165, 394, 634, 490, -30, 46, 227, 151, 331, 159, -126, -100, 537, 37, -175, -95, -78, -28, 396, 110, -266, -419, 271, 261, -91, -187, -175, -562, 232, -31, -579, -340, -579, -133, 36, 81, -568, -680, -246, -114, -77, -400, -350, -605, -608, 87, -241, -576, -656, -71, -96, -76, -429, -787, -483, -13, 88, -421, -493, -434, -251, -19, 182, -378, -226, 37, 276, -374, -440, -317, -262, 150, 280, -223, -628, -192, 115, 27, 39, -517, -174, 288, 566, 251, -276, 106, -155, 357, 785, 220, -368, 180, 519, 312, -88, 130, -147, 161, 975, 627, -7, -189, 337, 455, 639, 405, -102, -126, 654, 353, 400, 168, 262, 431, 455, 679, 332, -14, 260, 541, 425, 277, 337, -117, 21, 648, 349, 79, 75, 474, 402, 290, 344, -235, -412, 474, 313, 75, -117, -19, 159, 556, 175, -382, -97, 184, 130, 71, -152, -246, -342, 357, 294, -203, -483, 72, 163, 198, 161, -112, -477, -415, 197, -139, -344, -419, -455, -117, -149]
5584a49k3k60k11N40r2J04k74k79J93M69m2l62k1J11L5jL08o87OM70K29m92J24
5607c04k96J94O94r1n99k38M33K72K6k45N6l81L34J25J79m37K49j69J07O96n06
5628I9o33J36O08J46k26l9Q2j87L60K13m61k20L87L43l2j29l32k75Q69j33m07
5649A69m8l95O18K65J31m09l73N15n4J69J03l22n15M12K69q5n64J53L6J12L18
5670E05m1n02j32N15p5J92l12j06m11P54K22p15j40qM85j13P3m05k95P98K09m64
5692C4n23M08P1O2O0j59o26L11L72k53m1r8j44K72M53k71m90p7N05k6j40J35m13
5715e78r3N89K7m11N7j74K45L15J76n63k71K80N9J05K62m11N8L50P6l89o32R42
5737A9j14j26K08l04k80L85K6R3j90K21k7j00L78J6m86K44J64J76l98L10j44j68
$$ y = [-149, -172, -432, -643, -103, -195, -91, -365, -644, -451, 18, -24, -386, -407, -296, -261, -262, 46, -641, -635, -165, 64, -428, -304, -600, -406, 288, 197, -402, -640, -207, 65, 91, -154, -98, -479, -145, -20, 159, -278, -29, -198, -91, 605, 99, -534, -398, 210, 356, 130, 91, 173, -14, 346, 559, 98, -122, 265, 608, 576, 447, 115, -160, 709, 576, 169, 121, -274, 344, 609, 740, 331, -42, 473, 419, 588, 691, 369, -146, 266, 535, 450, -114, 39, 75, 187, 505, 464, -38, -170, 345, 270, 462, 150, 44, -367, 387, 609, -106, -246, -254, 231, 118, 191, -214, -509, 289, 498, 34, -489, -81, -10, 52, 112, -47, -673, -362, 10, -243, -284, -382, -526, -254, 199, -72, -562, -639, -134, -160, -300, -165, -578, -671, -82, -55, -466, -409, -583, -338, -23, 153, -410, -681, -401, -342, -237, 25, -386, -328, 22, 98, -291, -923, 19, -95, -221, -13, -317, -597, -212, -186, -93, -283, -62, -89, -189, 189, 205, -281, -37, 127, 303, -95, 215, 71, -97]
5759i7M42r7l15K28j08J1J26J82n79j11M93M93n16Jl92N26j1p0M4l41K26J43K34
5782E12j41j43l41N91R9j3n91j14N23q5K05q3l61j18N25M9p5n67K68J12r5K03
5804C60m81j57M00K18l07N43m56m09L05L41k39m21R8K19QK60l14m51L72L63k45
5825Gk32O3m83M90J66Q8m32r0M6J85J85m1j77j03K33o4j04K8J14j20j5L55k93
5848a94j15k02M27j64J8J27l47K34K84k64m97J92J97p2J27J7k95L32N32j19o12
5869c94J55o5M11K23k55p82M04J78J22K06k80k5k79O59Q1m08k05K99j84K37K16
5890C14j59l75K24L81l57L25j88l53L15O30k30p51M86K26O4k98j27k2l7L81k6
5911D23j53j19K98K27l61n8l30q6N50K13j54j14l34NK74L12n58J1j66K26L67J3
$$ y = [-97, 345, 248, -67, 161, 53, 64, 190, 372, -207, -318, 175, 668, 152, 153, -239, 287, 276, 206, 250, -91, 135, 278, 512, 371, 228, -113, 478, 577, 564, -27, -141, 382, 297, 502, 419, 58, -60, 465, 514, 439, -128, 140, 252, 157, 360, -121, -278, 122, 340, 33, 576, 120, -289, 16, 357, 118, -303, -205, 14, 22, 282, -32, -483, -111, 252, 7, -225, -162, -645, -155, 11, 99, -333, -423, -377, -192, -7, -48, -225, -328, -95, -159, -263, -235, -121, -241, -256, 99, -194, -309, -511, -84, -248, -230, -103, -450, -216, 68, -196, -693, -501, -304, -376, -249, -232, -527, -195, 337, 218, -394, -239, -304, 107, 330, 75, -707, -303, -125, -3, 203, -77, -102, -381, 278, 359, -49, -254, 45, -139, 98, 314, 155, -220, 4, 385, 28, 353, 165, -188, 127, 757, 527, -224, 262, 488, 552, 254, 127, 105, 68, 449, 423, 270, 151, 449, 676, 315, 257, -73, -159, 391, 604, 450, 336, 2, 7, 281, 593, 35, 46, -120, 106, 473, 486]
5933D86j97n81J71N02R2o84r8J65L49Q9r9o13Q9N00L14p01r5j05K56L52Q9q43
5955e62KM82R9j1K57o90l8N05K5j82l26K81q7J33L68m64l78J1P91m1l40k73k86
5978g24L70O34k49n79j57N35L9L4Ll30j22O82K23m64j04j48k65P89O1m52k38J41
6000c21M02j55L21m17K1L91r5j92j45L31P5j65K39j76j49m1K72L02o89K56j1R0
6022A44L65j42o08M24l91M89J14R6l47l75N57L75p63J65N1Q8L23j96l65m69M75
6043A0N00j70K26m10k56K89K67k2o33M14m3J16j16J07j05k47N61r8k65J46j25
6064A46o9K06J4k77k26M11p6j76n3r6M2M79j11l01j78J9K08L06J20n53k16K85
6086i6K06k92K50k42j39L37M0j05m47Q6K82j64K40m2j77O1M6j2k68q7L64N1rJ02
$$ y = [486, 289, -292, -121, 381, 473, -211, -309, -144, 205, 294, 195, -418, -329, 171, 485, -216, -311, -416, -160, 192, 281, -562, -560, -78, 21, 10, 267, -423, -461, 44, 69, -113, -439, -158, -245, -112, 256, -208, -586, -575, 216, 175, -165, -438, -724, -354, 280, 31, -548, -705, -170, -131, -97, -94, -424, -546, 136, 359, -105, -209, -357, -622, 167, 228, -224, -462, -321, 81, -74, 247, -170, -149, 242, 147, -45, -190, 141, 216, 51, 290, 114, -35, -76, 196, 498, -191, 65, 54, 144, 509, 367, -241, 183, -208, 281, 395, 491, 144, -231, 326, 701, -62, 103, 154, 242, 565, 369, 4, -465, 10, 510, 340, 566, 156, -100, 189, 456, 434, -199, 215, 172, 288, 172, 279, 174, -73, 488, 390, 125, 271, 146, 77, 283, 297, 20, -206, 205, 129, -47, -100, -196, -154, 325, 214, -87, -265, -246, -38, 268, 388, -165, -381, -96, 110, -182, 68, -174, -313, 24, 64, -41, -488, -402, -120, -284, -44, -86, -263, -202, -156, -168, -436, -523, -159, -108, -117, -15]
6110a5p97J49N08O9m46R7j62J80J85K36j63j99J81O4j19r1K14l28L48J68r8m95
6132e14K26L29l08K31k4o11N98L26o7k94K84k89j76K16M55k07l22J25J08RL46
6153D41n23k95N81M9r2m80L10J50K47o7m46J91J72J36l57nL01j94K08J04l0k93
6175A08J71j25K5L19l80N8o6L64r7j11K8l52J53J72J1k11k27L95J75m12qJ03k28
6198a35L07M8n4l04J56m9K21Pn14l5K71M26m12j64N1o4J94J30k17k76j86M67M2
6221i0k12K84l92J63O54k70q04K34O79l97M3L18p84k37P65L49n63o6K50n43P55
6242A36J00m68j50L1L34J41k44l36K6M05K58m43l61J92P0j24Q74k88n48k52Q90
6263B43k83o8j95j28K20M78J8o06J58J02J85k0J22n28K86L00J38l80j85L18j24
$$ y = [-15, -812, -663, -155, -86, -532, -435, -597, -417, -232, 4, -159, -358, -177, -113, -232, -323, -109, -437, -89, 79, -19, -514, -288, 41, -267, -36, -60, -671, -73, 253, 186, -108, 176, -113, -289, -73, 382, 175, -147, -22, 86, 95, 441, -82, -377, 204, 253, 161, -319, -9, 141, 388, 321, -125, 66, 238, 374, 17, 12, 313, 119, 327, 431, 401, 108, 279, 154, 179, 498, 118, 176, 110, 474, 377, 266, 294, -58, 95, 267, 278, 67, -160, 235, 410, -2, -10, 93, -135, 172, 220, 166, -138, 18, -31, 190, 197, -317, -352, -81, 345, -67, -231, -180, -244, -50, 80, -137, -413, -599, -132, -90, -302, -18, -410, -247, 407, 137, -667, -433, 246, -151, -108, 210, -574, -811, -46, 303, -260, -326, -76, -619, 136, 236, -232, -382, -351, -17, 124, -120, -456, -430, -25, 233, -210, -571, -379, -309, -433, 441, 153, -395, -647, 243, -40, -108, -303, -431, -211, 267, 285, -321, -163, -61, 124, 104, 226, -302, -16, 284, 422, 42, -143, 175, 51]
6284E1k2N87o75l68M07O89k91r2j57l89N39K37k06k97L1J83j79M22k74l37N0M67
6306C76J71k59l65J15L07J66k45r5l47L42L35k48p6k23j00oM64r7m02R1L23J97
6328D24K11p30o26L82P73o4k65l9k63L36K61r0o27q4L86k6n8j43l79L86M39j32
6350G2k17j35k19J96K18J77n30j0J34K63J20l8k35m34J76N22J9m24r2n4M75K38
6372B22l69n50M07L28R4k37k45m79M63N21K04j027L83L16K08j47j94K2n78Q04
6392A46K90m66j75O4r3K25Q8k1l89J65M05j72j14j70l06M62L71j97l71J50j66
6413b74M42K6k52m12L32L32J29l90k05J2J98M12j48k49j43J55K93O4k08l45J9
6434b12M44K43l48k51N3K65k7K25k20k71J6N12J87l96k93l22M34J73p9k00j06
$$ y = [51, 29, 616, -59, -427, -20, 669, 378, 286, 129, -260, 279, 516, 310, 13, 44, 227, 48, 470, 196, -141, -91, 376, 547, 288, -77, 38, 345, 511, 266, 171, -176, 166, 501, 253, 177, -46, -146, -152, 312, 215, -187, -96, 227, 424, 635, -95, -721, -339, 434, 370, 105, 66, -197, 139, 400, 310, -317, -401, -15, -41, -99, -242, -621, -235, 204, 72, -145, -280, -499, -303, -85, 92, -438, -448, -314, -51, 69, 31, -204, -638, -462, 60, 79, -345, -437, -491, -16, 222, -147, -697, -290, 38, 132, -105, -350, -829, -366, 155, 359, -668, -285, 31, 239, 92, -102, -80, -658, 146, 436, -30, -205, -141, -234, -9, 79, 58, -331, -166, 239, 67, -47, -217, -523, -61, 310, 113, -258, -108, -274, 168, 194, -58, -470, -138, 194, 323, -67, -272, -260, -62, 350, 202, -47, -190, -35, 258, 322, 114, -231, -212, 232, 475, 127, -124, -71, 194, 167, 392, 172, -99, -83, 429, 616, 220, -73, -395, 39, 212, 133, -67, -173]
6455a73J61K85qm17J11l21Q73m03k10J15j3j6K29N4n22l12Q7N52l40Q2J18j92
6477b60K75L39l14m17j74N44r5O4k84j18K37L65L4m52K0M0q3M42j52n29L17J63
6499c8J42j50k91J43j63K70M11m69k6j9M18m91K34o4j86J71L13k40k10K76k04
6520a73j43L78j09l23J30M86j74O6k6l29R9M03j13k92L01p6K24j10o5k44N4O69
6542F33k38k01M4k47j49M04J12l35R4J71J24j31J19m48r2M07K77j28m08L70k3
6563C55p7J92l65k3K03L09l08m7K0k51p3L75K04n94OQ9K49K81j96m39k83Q38K18
6586F83m26o28L97R3j25J81l88m58N28M52l11k13M76l30L7J37j67o35L56L88j40
6607i3j25O0k27J59M33m03k82O43n15J97L17j92j13n74N69K64k79J7n02J14M46
$$ y = [-173, -12, 273, 265, -152, -41, -362, 511, 108, -102, 13, 0, -16, 213, 267, -255, -567, -480, 72, -268, -186, -68, -260, 15, 354, 40, -377, -551, -7, -102, -38, -322, -440, -203, 162, 196, -256, -236, -196, -279, 163, 11, -518, -201, -38, 104, -46, -337, -194, -357, -87, 324, -145, -171, -190, 228, -263, -29, -93, -279, -108, 205, -35, -245, 31, -173, -316, 62, -47, -370, -240, 246, 72, 138, 112, -217, -118, 285, 172, -120, 181, 105, 329, 219, 154, -90, -36, 633, 395, 194, 238, -9, -158, 246, 358, 23, 117, 288, 412, 281, 400, -48, -140, 267, 544, 416, 8, 378, 355, 278, 470, 105, 82, 285, 594, 286, 239, 259, 8, -65, 310, 514, -80, -74, 15, 264, 545, 349, -90, -373, 465, 683, 257, -371, 26, 119, -6, 175, -213, -671, -143, 309, -2, -215, 261, -69, -32, 105, -62, -697, -341, 47, -93, -218, -158, -385, -226, 207, -196, -478, 165, -350, -153, 164, -28, -141, -715, -146, 118, -161, -144, -646, -532, -86]
6628h6J68Kn26J57L43n5k12J55l62L27J4PRkj97M6L88k1m18J88L55m03m0L4O9
6653f0n4Q0O9l02J17k5l1K83K55m27j50K60P25m80j83l80K07M74L2l26J8j69K97
6676B30Q0j66n8l91M71L81j39m70j20K88J66J39R2m46r3K77N10l31o20K21k45
6697b24P16l07k21q4P9J44J6P2n9l95M54L59l00k16p4M8n4K40Pl22J51J64j95
6720a%l49M82m18P04m04k00J38J65p9K2j14p4j69L07K27m51M1J84k23L81O0l79
6743a50r9K25J66k09J07j47l02K34L12l2m62J62J48P4K50m48j81o2L94K95o28
6764c53J92j09l88R44k39j86n9L00q5J20j75j25k63L50M82n08J3r2N8J8M12m55
6786a48j56J48L73l01J99k3k91J87K19M4n89M43L9p2K18j29k15K19k24K59k67
$$ y = [-86, 82, 84, -442, -285, 58, 3, -209, -54, -416, -89, -75, -68, -59, -61, -258, -212, 176, 155, -263, -75, 280, -123, -163, -129, -60, -114, -34, 35, -267, -150, -175, -206, 77, 332, -95, -245, 15, 740, 260, 77, -303, -96, 378, 410, 84, 102, -67, 230, 310, 144, 86, -305, 166, 547, 408, -62, -182, 106, 272, 411, 503, 57, -36, 241, 751, 420, -200, 21, -224, 492, 185, -36, -120, -41, 103, 119, 191, 132, -263, 191, 550, 250, 34, -40, 8, -46, 194, 201, -121, 30, 194, -1, -1, -350, 132, -286, 418, 14, -186, -48, 117, 38, 60, -54, -128, -297, 10, 237, -214, -173, 11, -212, 169, 229, -150, -249, -24, 142, -67, 40, -107, -409, -175, 137, 105, -357, -195, -47, 27, 277, -171, -352, -414, -20, 275, -353, -161, -270, -658, 286, 47, -139, -198, 102, 17, 137, -38, -163, -426, -76, 406, -102, -89, -181, -123, -105, 307, -148, -304, -156, 217, -84, 115, 92, -199, -12, 207, 251, -338, 105, 144, 72, 290, 161, -54, 165, -59, 200, -67]
6807f7L25l22n6L18k7q1k45K58J25j25J58l66j04N23J77k92k72J91J16M2Qrl29
6830e4j92L61N84m81j6l28L62K1K03m17k1L01j33N1M2k91l8M85l18j69j32R2M33
6853C45K06j49m65J27L0M7n02L62j49j35N09K17k48j90j56K24L0K00k93l14j07
6874d11L70P6l88K87M3j77L09l21n5j67J79L37k06J19k9k72L09J15m82L75J11
6895A22m76J98K51j90k50O79j64k05l00l6m0J80N74l17l71L09k25M03J23k59J13
6916A19k07L33k70l4m1j40L21J09l0k38J20J04j52j14J77k41M3M47o5k56l47M28
6938F6k27N23k29p2J20j04J68k07R4p2k66L93L24j87l57J40K84k98K07k69l42
6959c11K18K52j63l34M29O1Q3k11L51k07j67L42j92jJ2j60J7M1K97l79n7k63N86
$$ y = [-67, 258, -64, -120, 198, 171, 90, -155, 103, 228, 103, 261, -105, -209, 314, 491, 199, -73, 118, 234, 276, 284, 275, -54, -246, 115, 699, 218, 202, -126, 236, 257, 460, 43, 22, 323, 190, 241, 283, -8, -46, 439, 121, -48, -180, -88, 345, 551, 402, -63, 64, 94, 141, -361, 1, -148, -283, 226, 443, 195, 5, -151, 73, 103, 303, 10, -304, -411, -41, 35, -353, -66, -23, -200, 109, -212, -267, -434, -255, 82, -124, -5, -34, -306, 3, 118, -364, 11, 122, -354, -156, 95, -95, -345, 334, 170, -35, -335, -371, -411, -231, 343, 26, -345, -36, -261, 142, 265, 6, 119, -88, 245, -25, -59, -100, -240, 81, 190, 160, -78, 42, 146, -6, -120, 57, -184, -141, 306, 241, -15, -362, 66, -161, 362, 133, 61, 181, 77, 245, 38, 132, 60, -206, 187, 511, 324, -33, 107, 391, 93, 300, 31, -311, -93, 159, -4, -338, 91, 152, 235, 24, 375, 168, 1, 343, 151, 150, 162, 2, 19, 60, 357, -22, -79, -342, 244]
6982B44j43k07L33m69K12K09j72o4m7K98k82J07J70m90L9K60p3r1J76l81O0N35
7004B24j67O3J6J50l28k07K32k01R8r6K24l59mK79j10Q2J22L7j56K41J59l11q8
7027a00J4J04r3J15m5J21m93M37j32j3L40n47K11J98n3j30k83K21k24M40K53o12
7049b71P7L08J86k8q9l01oJ99O27n94j81J16J03k54J54k38k6J99M44l43J12k48
7071e4P2J03N8Q2k81N7p2K24j21K4j46M5M60k28k36j7oK34N8l40k0j90M07j25
7095a2K07j77j56K92j45M26o0m78J83J19j75L6Q8q5l43K25l3k36J64L09j83k8
7117f2O6l96J98K26J2j27m1L9k17M26o4k29l6K03j63lL39j80k37M36k41Lk51O1
7141b38P0QQ8k79N9J43J47o5J2j17K38j43N2J76l63J09K51j38r1M53j17k31l13
$$ y = [244, 101, -106, 227, -242, -30, 179, 7, -57, -104, 194, -88, 19, 189, -301, -262, -2, -75, -166, 10, -371, -311, 224, 57, 120, 136, 286, -42, -249, -17, -218, -120, -216, 8, -351, -355, -76, -186, -104, 18, 55, -101, 140, 299, -12, -100, -86, 18, -75, 40, -5, 116, -377, 60, -72, -85, 255, -292, -81, 117, 64, -66, -349, -128, -352, 88, 341, -271, -194, 114, 300, 272, 183, -118, -124, 75, 702, 108, -73, 43, 146, -108, 46, -192, -218, -19, 425, 82, 194, -54, 18, 121, 179, 261, -20, 37, -35, 189, 68, 92, -54, -9, 451, 223, -13, -30, -36, 198, 256, -84, -104, -294, 113, -12, 195, 18, -138, 154, 9, 435, 375, -103, 80, 199, 24, 60, 148, 63, -280, -55, -88, -324, -160, 149, -34, -62, 4, -392, -194, 32, 44, -83, -124, -85, -302, 124, 60, -169, -205, -2, -165, -168, 171, -9, -246, 190, -51, -48, -299, -238, -168, -160, -72, -351, -292, -149, -2, -67, -55, -172, 66, -77, -25, 151, -212, -103, 148, 10, -81, 372, 255, 24, -289]
7164b89K29m59L05N07m11L8PQ9l21M24n0J48J02j23l60J16J30O7m24M26K34k46
7186A39L7j64k28L62K7Mk80O7J99J96P2m28J96j92L14n5q5l1J15k5j70%L8M9N4
7211B11k42J33N64l02m37l2M61l0j33k32m09N20K72m91K7L78k27K69k20o8j42
7232a30R7L42j10m43R8K00J7j21O2J43n67N21K44n22L08j40n36M60K62m42l8m
7254b99NM30j07j75j26j83N61k0j47k75N55m96N18q8n44O1L18p5J53j77J1j53
7276b53L48k0m45K16j97M82j55j56M18l07L7J28J51l77L1J1J05K54j69m75J46
7297b27J66P2J48k19j85N6M46L4k11N9l94K77L43l10j69j79L58P2l15Jj19K3M69
7320A96K9jk02J21j5OJ93k87k68L53J13j08j82J90k04J27Q6K06j48k72mJ63O5
$$ y = [-289, -60, -519, -214, 293, -118, -80, -73, 16, -305, 119, 69, 217, 319, 196, -164, -48, 82, 149, -275, 151, 385, 139, 176, 12, -216, 146, 173, 177, -103, -36, 163, 359, 431, 3, 199, 7, 321, 266, 181, 150, 265, 240, 70, 70, 108, 157, 211, -31, 102, 666, 364, -73, -105, 356, 326, 193, -39, -448, 72, 344, -147, -120, 258, 31, 300, 80, 12, -130, -33, 309, 199, -244, -146, 54, 71, -50, 12, 155, -412, 109, 353, -169, 139, -1, -537, -77, 185, -257, -295, -299, -294, 136, 29, -146, -272, -455, 106, 86, -61, -336, 219, -277, 241, 153, -391, -330, -12, -87, 66, -111, -100, -253, 95, 75, -370, -154, -351, 131, -24, -180, 238, -69, -32, 96, 247, -130, -99, -88, 17, 271, 102, -373, -227, -61, 11, 159, -60, -245, -189, 257, 291, 80, 139, -255, 22, 365, 55, -114, -293, 65, 137, -178, -177, -296, -273, 196, 225, 224, 22, 143, 128, 134, 327, 40, -228, 125, 238, 130, -52, 138, -66, 61, 147, 353, 205, -67, -71, 92, 157]
7343A57K3q0j58K40j9l30M15j65j51K67N0l26N6k0L17l52J68R1l01j8J82K95l62
7366b1o2O8L4q9P7j31J39R3J01k01j01L67l86M22m1l86M9M0K46k27J19k80l3J10
7390i3J98k22L0J58k15R8m0J53j3l02N03l21R6Q4j65m83N65l58K57K43n1k57P4
7413f1j34k2R6J94J68m28J35q2j40L67j17K21m00K10j38j03J79m7pJ69mL5j98
7436a07j57L82l65L83l51n7M68j86J5J34k6j22j14J11J72j55j06l3k22M65J40
7457B69k43lj80L82k71j92M27n0N7l06M96n41J52L13m10J96q1k7J25o1L12o31
7479b67J46J44k77J7M77l98Q5K40j18r4J20J01l48J22J19m9O4N1l18N8K35K2k52
7502a20K9Pj22L35j0k32M2K80o7m0J8Q8l40L35k61L23m06J34K12k28J04k17J13
$$ y = [157, 180, 100, -58, 182, 163, -167, 248, 83, -68, 199, 249, -77, -21, -41, 276, -76, 92, 183, -118, -136, 46, 341, -21, -83, -15, 19, -70, 7, -124, 15, 108, 209, 8, -93, 274, -112, 310, 269, -117, -68, -28, 218, -9, 110, -170, -203, -93, 105, -117, -87, 71, -144, -46, -86, 67, 54, -248, 255, -66, 30, 114, -51, -534, 31, -327, -70, 173, 122, -135, -61, -195, -217, -121, 73, 241, -187, -52, -134, -274, 93, -24, 197, -203, 7, -131, -234, -55, -102, -109, 60, 56, 91, -107, -264, 118, -247, 136, -215, -272, 196, 10, 25, 159, 133, 11, -103, 8, 180, 25, -81, -114, -336, 129, 269, 26, 23, -157, 225, -46, -238, 189, 139, 196, -110, 386, -155, -3, 310, -100, 96, 15, -12, 113, 52, 364, -267, -121, 23, -254, -237, 240, -158, -73, 167, 49, -45, 75, 176, -172, -50, 69, 20, 84, 135, -183, -125, 110, 132, -120, -91, -84, -206, 129, 119, -113, -71, 209, 142, 102, 120, 208, -132, 203, -58, 265, -141, -7, 205, -23, 81, -136, -23]
7525b3m7M23r5l31%k13K34P4j22K79l90K11k20L05j30j78R7J35k18L16j41K1K06
7548A93j62K22k30j14K30q8JM5p5j33j10L29o6k14J12J80l84J92m7J30J59l13
7570a43L91l44L83m06J77M6J34n5l78J83j98L88J46n7l06L3L8J0j21K25P2l35
7592a17Q6O4j02K85l11J73N8j95R6m1O8L37l54J41j94J23j88N7J39l95L90P1j75
7615A6q2O3k21L75K13l69j22k7K38J57K9k28l4k87O33l52J82m9r6k67qJ94j81
7638b23R1J63l20K46K39k42m18L50L81k06k04J94m66L86j8l76L43O3K70j89J4
7659G8l28L73j00L87k49m59J36k43J20L29p4k03oJ78J54j89L22m63J6M42j3m31
7681b23K8P1K83j96J62J26k60l6J43K1j36J0ON1J32j3j86J02j22L97k51Kj09Q3
$$ y = [-23, -70, 353, 258, -73, -73, -286, -52, 22, -100, 179, -211, 0, -220, 85, -45, -223, -126, 9, -209, 107, -34, -13, 193, 31, 253, 23, -91, 139, 51, 52, 97, 22, -111, -221, 108, 42, -172, -60, 120, -264, -72, -119, 11, 170, -143, 248, -96, 287, -119, 58, 104, 238, 183, -195, -12, -210, 178, 324, 267, -39, -6, 32, 42, -79, 146, 218, -117, -31, 33, -69, 216, -95, 78, 136, -59, 37, -4, 64, 401, 47, 188, -6, 117, -71, -14, 125, -270, 120, 191, 16, -66, -3, -224, 151, 364, -5, -127, -154, 84, 241, 270, 42, 8, -279, 354, 2, 184, 135, 39, -228, -236, -42, -223, -132, 31, -289, -43, 196, -46, -464, -114, 267, 61, -143, 51, -415, -29, -47, -423, -80, -17, 253, 64, 78, -250, 123, 23, 410, 161, -298, -162, -405, -285, 44, -30, -233, -239, -61, 93, -96, 226, -237, -221, 221, 208, -223, -195, -124, 159, -37, 125, 251, -9, -45, 98, 119, -17, -7, -1, 50, 182, 169, -17, 85, -37, 360, 109, 111, 2, 85]
7705H5O3Nj34k50N25r8K94l30j27k31K79K6j10Q2q3r5J63k3Lk81J69l1L12K51
7729D64n56j13O3M61%j34k1m3q2l06M74R2n28K32%j62K82j58J42j44J03j19J58
7752A05j12M8l11M96nl50N3J95n7p4L04k90l40L75j8k69J97rR9j15J86l23j29
7775c44R2J61J30q8j66n0L62k66j14Q1M46n19K73M5P4l20K68K56k36r5m8o6j92
7798c16L68J55j98l74l6M58p4Q1k12j45K21K20l1K5o5m15M43K35k69m88N30J06
7820B19j02k71j0N9j26L37p3j85K62M5j95L08J39k80l30j34K51J40J81l16R3q1
7842f9K22k31j04L85J01j05K66m63j82L55q6J31k27l7J29KJ09Pj65L0J3K64l75
7865c0Q0N5j2k83K40j60J02j57k8K00k5j10r9K60l3O6J49m08Q0q3K20J74j10l98
$$ y = [85, 148, 153, 19, -231, 294, 196, 490, 160, 33, -198, 81, 107, -3, 79, -4, -99, 64, 41, 44, -237, -68, -99, 213, 464, -92, -205, -142, 319, 319, 185, 164, 121, 39, -267, 207, 299, -229, 3, 3, -159, 123, -35, 107, -37, 66, -53, 105, -7, 41, -270, 226, 221, -129, -76, 119, 62, -12, 292, 2, -338, 37, 19, -250, -53, -62, 37, -78, 108, -215, -344, -252, -91, 39, -49, -215, -265, 97, -169, -283, -202, 244, -275, -2, 43, 117, -203, 65, 321, 85, -10, -58, -124, -316, 52, 207, 9, -365, -401, 57, -17, 64, -148, -293, -72, 148, 117, 142, 77, -338, 105, 340, 71, -417, 113, 219, 117, -154, -164, -105, -231, 106, 33, -152, 110, 155, -40, 268, 407, 127, -203, -337, -86, 54, 235, -81, 12, -69, 153, -78, -182, 203, 304, 199, 465, 2, -180, 175, 89, 220, -7, -44, 85, 87, 196, 203, 38, 68, 81, 345, -30, 50, 105, 93, -190, 50, -110, -8, -165, -193, 7, -18, -128, -227, 33, 0, 66, 215, -193, -113, -196, 24, 198, 88, -310]
7889c10L63j30J02q5l4j48q2K31M7M8k66K25k41J91K36k77K33l52J36j02J74q5
7911a26Q0R3J31k76Qk7l19P13l07j92l25J94N83J58p70L49m79O36m3j97O7j62
7933b11M15J7j85k27L4J82m2N9k14J12m7m8M37j18j23l2p2k9L33j16l41j27O17
7956B74j68r8k54J46J65L66m65n8J11Q5j46J54Q7k55j55K88K38j40k43j04M54
7977B82k19J28l81M5K44K5N58q88J20N1m5L09K5k31j48K57r5L4j58q9m6K83M66
8000E27l75m4l93J79J22J29l9m41M49l18K04O5l28L46J4Nm8k01J27k68J84N16
8022D12o07R1Q5k13L92m45O51m9l64J96J60k7l26q6M71l24K19k75j38K01j31J44
8044C7j23K79o58L36L7L09m35J1j71J71M44l21r8j03K92l13M38l90J22j54K74
$$ y = [-310, 53, -77, 25, -60, -94, -242, -324, -93, -46, 2, -264, -39, -280, -89, 147, -130, 103, -249, -113, -215, -41, -126, -46, 47, 178, -98, -90, -117, -436, 277, -30, -222, -547, -353, 230, 388, -382, -33, -512, 124, 81, -116, -49, -211, 204, 221, 36, -191, -157, 25, -17, 42, -172, -60, -107, -155, 282, 164, 41, 9, -63, -92, 241, 125, -216, -343, 274, 106, 8, -246, -100, 65, 431, -34, -92, 19, 104, -42, 112, 199, -56, -211, 77, 315, 175, -68, -172, 282, 63, 191, -190, -145, 99, 124, 682, -206, -86, -35, -80, 229, 254, 23, -125, 132, 37, 71, -87, -176, -222, 61, 527, 152, 108, -285, -106, 16, 145, 106, -335, 114, -204, 0, 65, -263, 83, 97, 102, 54, -147, -20, -288, -104, 412, -195, -104, -19, -232, 160, -285, 366, 317, -47, 149, 309, 282, -44, -130, 341, 17, 236, -39, -177, 24, -107, 37, -86, 193, -465, -129, -92, 217, -218, -207, -378, -207, 237, -84, -182, -285, 7, -306, 132, -258, -136, -290, -16]
8065a6L4j98J44m8l22L20L6r1p2K14rR7k27RM1m7R0J41k73K51M81m03j5k1m48
8090c32R7K39L27l60n2J72j89J59n8j9J42N5k20J33n2p0q7L34K0j54k67L19k18
8113h1J06J95K1k73m1M79j18m31L99m13OJ24L05k21k0k63M01L2j50Q4l05J46m3
8136f1J90%J15j17k05J41n7q1j41K91m2J44k16j58q6J44N20m8m99P6j97M01l4
8159H0r4R2j5k14L19m33J71M6j27J90j70K24k70M6J10O7K42n56N23k37J32m9p9
8182bj44MN6L80j96k98L19J54O9
$$ y = [-16, 18, -180, -36, -84, -406, -86, -50, -141, -213, 1, -8, 89, -138, -129, -88, -135, -45, 96, -177, 74, 555, 152, 137, 116, -332, -235, 4, 331, -29, -81, 91, -98, 61, 3, -16, 126, 181, -39, 94, 42, -28, -115, 219, 239, 85, -182, 137, -81, 25, 220, 241, -32, -73, 406, 288, -143, 256, -157, -151, -27, 278, 57, 37, -226, 175, 207, 57, 141, -164, -18, -61, 129, 129, 244, 127, -78, 63, 6, -75, -216, 75, 33, 177, -39, -197, -283, -139, 381, 333, -166, -90, -287, 114, 80, -14, 78, 63, -151, 168, -265, -94, -48, -175, 15, -155, 69, -201, -155, -45, 22, 264, -292, 231, -6, 126, 77, -2, -146, -142, -86, 294, 98, -200, 119, 273, 342]
8191C42
$$ Imaginary data points
##PAGE= N=2
##DATA TABLE= (X++(I..I)), XYDATA
0@%%%qJ6j6K4m0M8n6P8r4J12j44J76k08K50l03L58m20M96n77O68p75Q92j020J163
27F20j324J503j699J913k152K416k702L017l364L743m158M616n122N672o276O952
43C655p697Q523r455J0504j1690J3054j4635J6487j8707K1419k4814K9214l5178
56a9320M3761n7261Q1750j40241N29967O08300r00545m40269K68237O28414Q3121
67F85914l89159l76846J82027L67164M5907l35217j83328J31522K66551O7384
77D61919j78335k58782n5984R7791J00880O2740M3486j05225j69464J554J82340
88A82920Q3773j25981j98263l4832J92995J71354j54905k99396R39L23916K11944
99C54464j52586l26766j17754K40603K83741r7001l62327j22846K55945K67549
$$ y = [0, 0, 0, 0, -8, 8, -8, 16, -24, 24, -32, 46, -48, 64, -80, 96, -112, 138, -165, 193, -227, 269, -308, 360, -415, 477, -543, 620, -704, 799, -900, 1013, -1139, 1277, -1425, 1592, -1772, 1971, -2187, 2429, -2693, 2979, -3297, 3655, -4042, 4481, -4974, 5530, -6160, 6894, -7741, 8746, -9961, 11458, -13356, 15858, -19320, 24441, -32820, 48930, -91311, 438656, 1046956, 146411, -293858, -25621, 602793, 685914, 296755, -80091, 101936, 469100, 515007, 179790, -3538, 127984, 394535, 461919, 283584, 24802, -31182, 66609, 167489, 230229, 273715, 168490, -974, 580, 182920, 266693, 140712, -57551, -92383, 100612, 271966, 117061, -182335, -181396, 142520, 354464, 201878, -124888, -242642, -2039, 281702, 184701, -177626, -300472, -44527, 223022]
109B23022l3366k55755j56511J32047K16541j7305j93633q1769N8165M3508R981
120e5075Q891k1810l4865p379J5915N6085O5266p1124j94676n4490J82593J68582
132E7913o3963k05799q4705J76584K32075n1694k77089q6512K18387J86484q4602
143A7079k21115q8500J58649K28740N497j97175q2913J32112J24339k9825j09341
154f2453o6210M6873J09421K9809o0467k1615K3217j0364J0453Q1270L8179q0723
166C7390j08518k2348R5999J20034l3164j76866m6907J92291J70465q4122k34157
177h9903j19840J38199K52128L2761k56634j96346J18121K26694M1128j35250
187A1058j07930N2926J35379M878j54362q7487Q9752J09772P555m8195m4679r982
$$ y = [223022, 189656, -66099, -222610, -90563, 125978, 108673, -84960, -166729, -108564, -65056, -55075, -46184, -67994, -102859, -110238, -94323, -38238, 27028, -44096, -238772, -293262, -110669, 57913, -6050, -211849, -296554, -119970, 112105, 60411, -216678, -303190, -84803, 101681, 17079, -204036, -292536, -133887, 94853, 100350, -96825, -179738, -47626, 76713, 46888, -62453, -128663, -81790, 27631, 57440, -3027, -24642, -1425, -11789, -1336, 79934, 118113, 37390, -71128, -93476, 2523, 122557, 89393, -87473, -134380, 57911, 228376, 144254, -89903, -209743, -71544, 180584, 213345, -43289, -239635, -121514, 105180, 146308, 11058, -96872, -43946, 91433, 96311, -58051, -145538, -55786, 53986, 61541, 13346, -31333, -41315]
199d1315L9482L4729j536J4415J0984o5791o4158M9852P8865j8713o2792L338
211b2640P9534P1545n1181j52398l6164J64299J24064j07458j85485l0659J42036
222d507J46151l0367j76217o7509J46774J26442q3371j60656l8149R7108J00600
233E6299k7354j24053k9396J16252O7709p2628o7687K7229M2501j0673n4397m0604
245a16802M2424Q0864j4002q4340K684R0581L8813m9958o6288j2863N8038M4913
257A4064n8016p0024N7065R9532j4680p7188n255O3514M3998l8500r4867k1186
269a01543R9711O0831q3644q1638N5977J06847K0327q0453q4309K7871J07826
280D7803K566j33250n8458J03745R6151l7226r0802j7313Q7938Q4882n5531j31794
$$ y = [-41315, -1833, 32896, 31360, 45775, 56759, -9032, -73190, -23338, 55527, 36814, -25978, -22640, 56894, 128439, 77258, -75140, -111304, 52995, 177059, 69601, -115884, -146543, -4507, 141644, 111277, -64940, -132449, 14325, 140767, 57396, -103260, -141409, -44301, 56299, 28945, -95108, -124504, -8252, 59457, -13171, -80858, -53629, -11128, -21801, -76198, -116802, -74378, 6486, -7516, -91856, -89172, 1409, 40222, -9736, -76024, -88887, -30849, 14064, -43952, -113976, -56911, 42621, 27941, -49247, -54502, 9012, 53010, 14510, -80357, -101543, -1832, 58999, -24645, -106283, -50306, 56541, 76868, -3585, -87894, -60023, 47803, 50369, -82881, -141339, -37594, 58557, 21331, -69471, -86784, 1154, 86036, 30505, -101289]
292a01289j0385J10821M1550o9081n4926K4033O8366M1638l4643n1456K9544N2812
304D6984l7323o1835K6635O0572n143n3428k0691O4986J01243p932j35525o0317
316h1774J16635J09056n7263j32723m0740R5934J23562j3642j38239m6067J25354
327F0093R8637o9098j26945l2258P7424Q2727k7402j00662j0658R2338L7071n5874
339B5393l0268K5332J0140k5453l0263j9M1726J4027o6955l8586Q9627R5700m6074
352F4327j17084l0160Q7821R3991m0965j53189m8091J56408J41648p0189j62477
363g7960l4355J21735J29776j9523j52065q5894Q2767J03350j4298o7933k2553
374c6953L1788N6191K3600m8181n7539o31K1533J5906K9620j897p5449n6831N2329
$$ y = [-101289, -111674, -853, 40697, -28384, -83310, -59277, 9089, 50727, 16084, -35372, -5828, 46984, 9661, -52174, -25539, 35033, 29890, -23538, -44229, 20757, 122000, 114068, -21457, -81774, 34861, 143917, 86654, -46069, -86809, 9125, 132687, 119045, -19194, -65261, 60093, 158730, 89632, -37313, -69571, 7853, 90580, 63178, -37484, -48142, 44196, 81267, 25393, -4875, 20457, 30597, 5144, -25119, -25138, 16588, 30615, -36340, -74926, 14701, 110401, 64327, -52757, -82917, 4904, 98895, 57930, -95259, -143350, 13058, 154706, 84517, -77960, -112315, 9420, 139196, 119673, -32392, -118286, -35519, 67831, 53533, -14400, -36953, -5165, 51026, 74626, 26445, -31094, -31725, -10192, 5714, 35334, 33437, -42012, -98843, -46514]
387d6514R9519L8492o3684j09303j9198J15583P7668r9113j38842J6381J45899
398A6888R9546o2946j63652n4921J52006J55850n7229j76941o2977J01972J26596
409G4192Q9j27324p7798R6058J37758O62j01516o9764Q167O4793O1835j4154o8832
422a5834l1988K3492M5523N1348O751p5813o1364N3860R6882O718r9977j06162
434a06564J5203J50633J03074r8025j61328K146J46091R0360p1061j50417m9281
445a29169J24436J29308n3771j54002m2463J03931J17497J2224j01687r6846K9055
456f1487R4630J4965o0772m0021M754L4342N0393J5068m3235m3179m94L4123N2203
469E1290J5180q0473r2580L0948J18808N3363o4297r8293j0294J15282R9388q1520
$$ y = [-46514, 53005, 91497, 27813, -81490, -100688, 14895, 92563, -6550, -145392, -129011, 16888, 116434, 53488, -110164, -165085, -13079, 142771, 85542, -91399, -154376, -52404, 74192, 74281, -53043, -130841, -34783, 102975, 103637, 2121, -67643, -59476, 5317, 67152, 52998, -15834, -47822, -24330, 21193, 72541, 79292, 3479, -57885, -4025, 92857, 99575, -402, -106564, -91361, 59272, 162346, 64321, -97007, -94861, 51230, 141590, 70529, -79888, -129169, -4733, 124575, 70804, -83198, -125661, -21730, 95767, 107991, 6304, -90542, -61487, 33143, 48108, -12664, -52685, -47931, -13589, 36804, 51872, 8637, -34542, -35036, -913, 51290, 66470, -14003, -106583, -75635, 43173, 96536, 32239, -66054, -76348, 38934, 138322, 56802]
481E6802j72763k6972J42969J14792m5435j41283o5935J00404J37429j5725j30876
492d6593n4381O5443O8087q442p2550o2322K8156Q6414L5551l2376l4707k5710
504e3430j4605L3368N2715o993o2385m4592J7968P4840N5751n3214r7998J9774
516g8801J26704N5283q9642j24312j9871J13426J16897l6748j37583l0516J17022
527A1859R5185l6993j06316m7341P3310J01034j7501j13917m5691O5541O9612
538D8782J3179k2970l1229q859J7474L487j2631M553m138l2087L766N8572K4916
551F2815m9575n3762J2885P8500O0844n8391j31371k1747J21371Q4729o0097j00635
563e4434m728J02022Q5683n0702j26647j9855J08750O5568n6364q0950r238O0030
$$ y = [56802, -115961, -142933, 36, 114828, 69393, -71890, -137825, -37421, 100008, 84283, -46593, -100974, -35531, 32556, 24114, -48436, -110758, -82602, 3812, 39363, 6987, -27720, -53430, -68035, -34667, 18048, 11055, -51330, -95922, -77954, -3114, 52637, -577, -98575, -78801, 47903, 103186, 13544, -110768, -130639, -17213, 99684, 62936, -74647, -105163, 11859, 107044, 70051, -36265, -83606, -10296, 90738, 73237, -40680, -86371, -20830, 48782, 61961, 38991, 7762, -1097, 16377, 19864, 7233, 11786, 7648, -24439, -20673, 37899, 62815, 13240, -40522, -27637, 50863, 111707, 53316, -78055, -99802, 21569, 106298, 46201, -54434, -59162, 42860, 128543, 77841, -48806, -68661, 40089, 105657, 49293, -31657, -40895, 19135]
575A9135O0838r563n3165j422M3712Q89l5635l266J4694j0387j7583L827K9518
588D1592L4342j2090o0640j2756O9681L8068o2523p4350N894O7322M6121m1242
600C9419q6312k067J01438N5675o6985q3969j20N6331L2835l9236o3595J1798
612d4788P7064K0370o0879l5091L0804L6771L97l0059k9285R106K4699j8668k9069
625d8628L1131N2205p271m5563j8341K1387L3453k661n1343k5667M9089M0650
637B8441l8495m7057K1013N3330K0165l1937n1882l070M9953J2213n3820k8346
649f9492M0048L8060r223l1716j4838K8909M0176k0860o4919n422N6425K0315
661G463m0901l4861J2952M9620L4423k8720n2648R175N0685L154m2349k2630J4715
$$ y = [19135, 79973, 70410, 17245, 15823, 59535, 60424, 24789, 21523, 36217, 25830, 8247, 12074, 41592, 75934, 63844, 3204, -9552, 60129, 98197, 35674, -38676, -32782, 34540, 80661, 39419, -46893, -48960, 52478, 108153, 41168, -42801, -42921, 13410, 46245, 7009, -56586, -44788, 32276, 52646, -8233, -43324, -12520, 24251, 24648, -5411, -34696, -25590, -891, -19559, -48628, -17497, 34708, 27437, -18126, -36467, -15080, 18373, 15712, -35631, -61298, -12209, 28441, -10054, -57111, -36098, 17232, 37397, 5460, -46422, -49492, 461, 12674, -41146, -69492, -29444, 8616, -607, -32323, -47161, -18252, 21924, 1064, -63855, -69277, -12852, 7463, -33438, -68299, -55347, -5727, 28696, -24, -52672, -43497, 7188, 10342, -32007, -54637, -39922]
674c9922L3823K3042j8739l0477J8027M0454k403k5666j527O183n801n804j500
687a0310J1819K8510L899l3824m180M6155J9545m0759m2200N270M2416L1631l1731
700B6241o4492O908Q5232M0952n5515o5285K079N6296L8335m0951p5712Q20P5157
713C0065L3951m0974l7789P367L1115K2196j4483l9933j0454J8882J723o428J6336
726A1574R427j9745j2008J8145K4147N933l1251m9749L531O5752K4381o1542n4404
739f5809K7965P2642L6002m6666q2539q160Q1379M4663n9900p4501J582O3074
751a0268N0297k0874o9539j8268O0541M1927l2617m8879j5094J1598K3708J3994
763a3474j1955j3324P55q20Q108L1927O699n2385m2670K7597N6198J4757m6522
$$ y = [-39922, -6099, 16943, -1796, -32273, -14246, 26208, 23805, -1861, -3388, 2795, -3006, -8810, -10310, 1509, 30019, 33918, 94, -4086, 42069, 61614, 20855, -21345, -16075, 26341, 57972, 26241, -38251, -31343, 53889, 94841, 39326, -25959, -23880, 32416, 70751, 29800, -45912, -45092, 30065, 64016, 23042, -14747, -7380, 23735, 45931, 31448, -8485, -18939, -57, 1666, -4762, 11574, 21001, 1256, -10752, 7393, 31540, 37473, 6222, -43527, -39996, 25756, 50137, -11405, -65809, -37844, 34798, 70800, 24134, -58405, -66565, 14814, 59477, -423, -74924, -73342, -10268, 40029, 19155, -50384, -68652, -8111, 33816, 1199, -47680, -62774, -51176, -27468, -13474, -25429, -38753, -37998, -38818, -30710, 1217, 7916, -44469, -87139, -59542, -3344, 11413, -35109]
776c5109n8623J8673R8421M6377p9941r1793K2794R9070M7065o4016j03105o035
788a06222J11437P9168n0820q7525m598O5214N0381j8143o6527l0738M6280N0439
800C8346j0313l2942j0499P219K4272L4010K968l6612l8416j0241L1255N5486
812E4533Q248o9037n1225M9926Q4666J1468o9515o7651K1105R4826L6210r1332
824A2222r4818L6955J14285M7190o6510r4347l249R9013O7120o0355r4032n040
836d1566O5388M2976j4915m5397j9143L3614L7354n774k1439r229j4098p321K6434
849B6884K5612k0598m3608j4163L9629O5006Q870q3261p0798M6832R4883O847
861H2135q6984p0442L0096R5451L6508p8360p9434L7072R1763J7427p1337p1157
$$ y = [-35109, -93732, -75059, 23362, 69739, -10202, -101995, -79201, 19869, 66934, 2918, -100187, -106222, 5215, 84383, 33563, -53962, -58560, 6654, 57035, 38892, -27635, -58373, -12093, 38346, 28033, -4909, -15408, -8189, 16083, 50093, 53061, 16449, -21967, -32208, -953, 54533, 62781, -6256, -57481, -7555, 77111, 88579, 19064, -48587, -27482, 67344, 103554, 12222, -82596, -45641, 68644, 115834, 49324, -45023, -48272, 50741, 117861, 57506, -36526, -41566, 23822, 66798, 51883, 6486, -12657, 20957, 58311, 52537, 31098, 21869, 7771, 450, 26884, 52496, 31898, -11710, -25873, 13756, 78762, 87632, 4371, -66427, -19595, 75288, 82135, -4849, -75291, -45195, 50256, 86764, 8404, -71030, -33958, 57805, 75232, 3895, -67262]
873f7262K492O9693M7831l5701n8370K66L8110J9314Nj0146k0263j0479P944P719
887h847M330j269k0380j1772L8889M5112j9838n9919k2158L9288N6955N290p1535
900b5854o2889L8333R0130J9793o1009n2200J5509O2427K8784n3918o7390J6513
912e1771O6774J7280m1477l7807M801M3614L6838j6627m5387j4425J3273Q871
924a6043R284R838j3241k3580J309K3221K4005O239k7810l3115J7565M4313p693
937A4292n3135j9958M1408N5783R495n5535n4730K9682P9317J7260o0595n3018
949d9734O987M9533L4572k3708m4871Q464N0625J4109l3254k7137L464K1982J7880
962B8912j3344l0214j987K2824R836K246R386n592k2224q102J1499J3093M681
$$ y = [-67262, -64770, 4923, 52754, 17053, -41317, -41051, -2941, 16373, 16378, 6232, -14031, -24510, -16566, -8847, -4517, -5786, -26166, -37938, 951, 46063, 26225, -33694, -55852, -16564, 40391, 45681, -25854, -88743, -50410, 39720, 59513, -1496, -53696, -38187, 24240, 53024, -894, -68284, -51771, 15003, 32283, -9194, -47001, -42200, 1414, 38252, 21625, -23762, -38187, -24914, -16043, -6759, 3079, -10162, -33742, -32433, -9212, 14793, 21032, -6778, -39893, -22328, 21985, 14292, -38843, -58801, -17393, 38390, 47885, -7650, -62380, -32698, 46619, 63879, 3284, -49734, -42747, 6786, 41358, 17650, -27221, -18757, 31868, 45977, 12723, -14414, -10950, 11032, 28912, 15568, -14646, -16633, 6191, 16027, 18273, 27659, 22067, -157, -8259, 3240, 16333, 21014]
975B1014j7159l0334O485M5549J6500l5352k6616J7791L4212P458l8674m5797
987d4923J5681O1407J3095m8982l1774K4521M2159J3682l0057l7467Q529L7473
999B3344k380l7992p697K8907J9555o319j8225p789J8380J7094j9348k5023J1390
1012f103J7875j3290j9903O194K2101J6542q726l0735p824L2521J5633l1596k7391
1025c4702J1878K4500N624j8126k1036J3951M1135L065m4626k2539K6198K4202
1037I524q676k5983j1715K3012L1372j1569l7237M369M1582J2517k9242l1261
1049c3307j036K9460K3811j8935l0876J4320L5807j631k6731n191J7031J4422
1061A7144p313k6862j0304K6608J9338j9738j4271K2704J9215j3871k4334m689
$$ y = [21014, 3855, -26479, -19994, 25555, 42055, 6703, -19913, -2122, 32090, 39548, 874, -44923, -29242, 32165, 45260, -3722, -35496, -10975, 31184, 44866, 14809, -22658, -14129, 23344, 20964, -17028, -24725, 4182, 23737, 17418, -807, -8596, 9784, 26878, 7530, -17493, -6103, 11772, -1518, -21421, -15227, 6874, 23416, 14690, -16045, -23869, 8652, 24285, -7311, -34702, -22824, 1676, 7300, -10826, -31862, -17911, 23224, 26289, -18337, -40876, -14678, 9524, 848, -25135, -36850, -13838, 17534, 5965, -31272, -26903, 14679, 27196, -2046, -33307, -34343, -4883, 18928, -7, -30883, -16563, 19244, 17613, -9118, -14309, 2722, 17144, 9831, -17031, -27335, -727, 18611, -1127, -15398, 7306, 26521, 12650, -11684, -16373]
1073a6373K3476K5678j9968m9524r69N4803K7234l3108l7334Q216M2904K2713
1085D7748l6155n3626R894N9485J5040m4660l4421J7229M3814K3074k5548l9723
1097a7849L634L3826M118k4633r015R229Q175L622o64j265Q634O81j7194k901
1111a602K5766L440l5960k2944K3260L9655J1538l5040m1540J7074O1371J2437
1123E7455o0274m6457K2894N3599J6178m2665n0339J7349O6951J9525n0004m1447
1135c7235J2184L4620J3316k2249l2827M11L0285J2401j1401l355J130q807j66
1148a1693J4215M469j3561k0511j1393K1202M1501P70m9439k3997L9335M6470
1160C7368n072n1132m1200K4411O4047J1496n9727m0654L3868N8314J4208m0793
$$ y = [-16373, 7103, 32781, 12813, -36711, -37680, 17123, 44357, 11249, -26085, -17869, 25035, 47748, 11593, -42033, -32139, 27346, 42386, -2274, -36695, -19466, 24348, 47422, 21874, -17849, -14215, 19611, 23729, -904, -9919, -690, 7485, 11107, 10443, 9178, 17812, 18493, 1299, -1602, 24164, 27604, -8356, -31300, -8040, 31615, 43153, 8113, -33427, -16353, 45018, 57455, -2819, -49276, -26382, 27217, 43395, 730, -49609, -32260, 34691, 54216, 4212, -37235, -25051, 9569, 22885, 636, -32191, -31780, -1495, 10906, -495, -3850, -2720, -11527, -11693, 2522, 6991, -6570, -27081, -38474, -17272, 24229, 24999, -24440, -48437, -9102, 37368, 32296, -18836, -60036, -35625, 28422, 39918, -19809, -60463, -26595, 31719, 45927, 5134]
1172E134m9588L918N4058K4066l8641m0482N910L2766K4514k791k7032j5677J7109
1185f736J9026k355j0338j2371j6126N709L1354J5059j7623k4687n096K5437L6069
1198C7322m717n5558l1157L8296N1887p23m7409l6791K5215O6533K0051n8105
1210D844n3163K2019N5541J4845l7214m4460K182N2396L3788k6769l9441m55K3585
1223G698J7688k3k0905k3289L209J9219J2043L993o578k1895n457L0839K3859
1236D0401k2411m0661j2678K8637M3842P15n4610l5263M1029O0302j77n3351m1730
1249d5955J6941N6804J9761n2067n0961K2609N7818J7288l1746l7956k068L6992
1261G460K5296k2903l4694m34J8575J0559L046n290j3123k900J2635J1044N134
$$ y = [5134, -44454, -40536, 13522, 37588, -1053, -41535, -35625, -2859, 21655, 18864, -8168, -23845, -6736, 12290, 9935, -403, -12774, -28900, -23191, 8163, 23222, 5599, -19088, -24184, 1253, 37322, 32605, -22953, -54110, -15814, 36073, 35350, -12059, -48850, -23635, 42898, 62949, 4844, -48319, -26300, 29241, 44086, 6872, -37588, -35406, 16990, 50778, 24009, -15432, -15887, 7698, 25386, 25363, 4458, -18831, -15622, 3597, 15640, 19633, 13055, -8840, -14297, 16542, 40401, 17990, -22671, -35349, -6712, 37130, 37845, -16765, -52028, -10999, 49303, 49126, -4225, -45955, -29014, 27790, 47551, -4516, -55477, -32868, 24950, 42238, 10492, -27464, -29532, 7460, 32756, 9853, -24841, -25275, -6700, 3859, 6905, 1615, -11508, -14408, -1773, 9271, 14405]
1274A4405q302k8049j7662K7567L6524q485l9270j8012K6401M2477O569m9215
1286a5052m1000L1311N5218j432n2821l4214K1117N2521K1627l8210m2343J4439
1298b8839M1289O291k7120k2087J252K0247J6463r053j5765L312Q034L8Q368J0945
1312A3375j2557k4242l753J8350K0416K227k6691k0167K7317M2898o300m5950
1324a5077k2033K5935M0483O321m2198l8523K5322N4336O184l9549k3583J7632
1336d750L2760Q032l1348l1482J3534L3937L758j7453n723N663M460M059l38k351
1350A2758K457n501j4697M463K3209R4k5079p404K4146K5777k189l4056k7574
1363b3596K1012M3150k611m4957j8346K8255L4534J175l2666k4979K1422L8899
$$ y = [14405, 6103, -21946, -39608, -12041, 24483, 15998, -23272, -41284, -14883, 27594, 34163, -15052, -56052, -24741, 30477, 29045, -23776, -57990, -36873, 15648, 37275, -935, -43278, -28839, 12450, 18741, -8379, -30466, -29214, -8967, 7496, -1557, -17322, -14010, -5976, -5938, 2430, 13375, 818, -23424, -27177, -8827, 11589, 13816, -12875, -33042, -5725, 37173, 30873, -15077, -37110, -11175, 29308, 35629, -6569, -45092, -19770, 34566, 40750, 1201, -22382, -4750, 28010, 36042, 4694, -26788, -13254, 20683, 24441, 6988, 1265, 6928, 11388, 15447, 15109, 12758, 15215, 9714, -4983, -520, 22689, 22783, -2296, -9700, 14446, 40223, 38034, 3978, -23596, -2584, 40566, 37955, -7002, -25348, 2907, 37441, 38616, 5950, -19029, 2393, 41292]
1375D1292n069l9040j5784J6298J8496J643j2697r535J1979J5669q982j6634L340
1388I76O294o825m617N214L115k497p773p964J1035K5140j140l0754j4414J5519
1402h691J5583m446j8620j1276J8055K8319o199l3173p938K6156J7210r954k2632
1415a7606j2295J4210K0765o901k1632O084K4860L439j6018j1710J726J1515N362
1428A799j4734j2945J5672J8857q469j5243L061J2695P035m291j5560n306J4555
1441b874O841j6221p727J5295J4101j106q876q565K317J2501j289j6572j673J7008
1455C160M363j1337o516N194J1750R187r060j5972M770J5697n632j7888j256J5520
1469A980J4240R12j6758j3794J4747K2240p150k1685l424J2055Q432k676j2400
$$ y = [41292, 36223, -2817, -18601, -2303, 16193, 17836, 5139, -4396, 7583, 23252, 14270, -2364, 976, 7270, 445, -4172, 1042, 4157, 1660, -6113, -14077, -3042, 22098, 20958, -9796, -24210, -8691, 6892, 2446, -16174, -27450, -9395, 18924, 12725, -20448, -28386, -2230, 14980, 5026, -17606, -29901, -15691, 5074, -1827, -23459, -17375, 7485, 10924, -5094, -16804, -15078, -3563, 1799, -12935, -25880, -10208, 8649, 180, -15063, -12002, 693, 7728, 3437, -12123, -17429, -2874, 3967, -12254, -19981, -4686, 9415, 8309, -567, -9132, -6815, 5686, 4397, -12175, -13848, 3160, 7523, -3814, -10330, -5136, 6614, 15801, 6741, -9231, -4461, 11236, 5604, -12284, -13540, 1980, 16220, 17132, 374, -13420, 1327, 23567, 16417, -5268, -8692, 3363, 11795, 9119, -3281]
1482c281o688J7287J7126q741j5990J819O126k217k633j163J299N379j819j1193
1496d689L477J9764J672k0146r432J1143J3074q15j8765j7097J4292K9871j380
1509B0969k7730q095J8703J6511n222k3273j5694J5955K6574m227k5796o408J5870
1522a863J2564J043r054j0146L461P834o544q693O295N838n118n27Q714L196n744
1537A256r314o031J0925J8969p281l0886q813K5843K4043m179k4475j5880J6553
1550i270L0351l238l6487j5020K2942K3673k444k1410j5259J3502K6775J060k3641
1563h466r538J1653P462k809m462n852R94P645K206k27O025r83j4774k689J7199
1578C384R612j3646j8698k696K0198K4889p661l3466p064L2333K3259j5858l2169
$$ y = [-3281, -9969, 7318, 24444, 15703, -287, 1532, 7658, 5441, 2808, 1645, 2944, 8323, 6504, -4689, -1212, 18552, 20224, 78, -9354, 1789, 14863, 14048, -4717, -21814, -7522, 22349, 20969, -6761, -14856, 3847, 20358, 15136, -8137, -23831, -7876, 18698, 14471, -11325, -17733, -1863, 10701, 11744, 2690, -7456, -3995, 3839, -2705, -11398, -5103, 735, -4383, -4910, 3804, 7000, 1256, -8058, -14089, -3164, 15805, 8524, -22362, -31175, -5332, 18711, 14532, -9943, -25823, -9270, 21081, 17843, -18644, -33664, -10722, 12951, 10507, -10903, -26162, -12660, 14115, 15175, -8466, -18004, -6351, 1111, -1698, -6160, -12012, -11018, -3373, -1167, -1394, 4631, 3648, -11126, -13815, 3384, 12996, -650, -19348, -22044, -1846, 23043, 15382, -18084, -25148, 7185, 30444, 14586, -17583]
1591a7583j1386K2448L1178l678l5089j2843K7058K5438m366k1032j4499N688
1603h666J9704L671j6162q390P220N014K536O947lr677n603K960P160P164p315
1618F560k1113k689K7199J7453j5843k3154j130K2084K1020j1202l7119j0422
1630b8356L2082K5371j4244k7538n223K1534K4208n466l0000j1806K1232J6558
1642A8352r177j5929n817N308J4061P567o498p269q75l887p42J1543L574j5466
1656e255j2665Q276J6767P942j1369k1484K45K8566J4984k4557k9054J518K4184
1669a902J9498p960k7723q016K5858K0355j3207k2674l365J2535J3800j961j8334
1682a3096r453J3938J4895k434o328k421k498K258O552j999o648l020j459L737
$$ y = [-17583, -28969, -6521, 24657, 20979, -14110, -26953, 105, 25543, 21177, 145, -14354, -8666, 11038, 14709, -1453, -9843, -2623, 2391, 4927, 11874, 11871, 2194, -3409, -449, 6711, 13875, 6560, -14553, -17242, 9957, 27410, 11567, -11587, -12717, 9367, 30387, 19185, -17934, -28356, 3726, 29097, 14853, -12685, -17908, 3626, 27834, 22368, -7632, -19438, 1794, 18352, 9175, -6754, -12571, -7263, 6798, 14365, 7867, 598, -277, -4164, -4906, 6637, 10211, -5255, -17920, -9644, 7123, 15065, 3696, -17788, -17543, 11023, 26007, 1450, -27604, -26086, -1902, 17596, 9636, -18087, -26103, -245, 20110, 6903, -15771, -19136, -6601, 7199, 5238, -13096, -22549, -8611, 6284, 3850, -2478, -4899, -7397, -5139, 1413, -586, -7234, -10254, -11713, -7976]
1696g976J3292O246j4600j4149P915J7129O636j0871j9841m767K1500J6599j4849
1709B264k0670N911K2466J2599r864k5001r745K0530K0580p868j8618k806Q734
1722a488R354K375o724m452P749N439p778o860K719k32j450O247O552o95l986
1737F770o281l480J0950J1914j0135j7538P92J3989P593n776j2650l577J6774
1750I345J6534j1554k2583j713J5416R300n109j4747o450J4851J6028p698j6762
1763e142l74R468M220j980n490n400K813K772n255j19J0169L411r171m537M497
1778a18K100l725o682l514J0254J3738q110k1115j256J9131J2128n513j4413p870
1792a4965Q966J0907r177j5772P112J9491M086j2917j2271K99J3399R574j0390
$$ y = [-7976, 5316, 11562, -3038, -17187, -9272, 7857, 14493, 3622, -16219, -20986, 514, 17113, 2264, -18406, -12495, 9971, 22570, 12706, -12295, -22040, -1510, 19070, 11202, -7416, -10222, -1488, 7866, 10241, 3517, -935, 6814, 12253, 4475, -2385, 334, 102, -1348, 4899, 11451, 10756, 6770, 489, -2991, 7959, 19873, 9738, -7800, -7008, 6981, 14574, 8798, -3852, -7429, 9345, 25879, 14325, -8258, -9971, 5445, 14745, 9636, -5111, -11561, 3290, 19318, 11620, -5142, -5516, 3952, 8172, 6192, 702, -4698, -1885, 887, -4368, -4487, 5682, 9093, -78, -4615, -118, 1982, -1743, -8425, -11939, -1685, 12053, 3943, -17172, -18428, 703, 12831, 7318, -7095, -14965, -5999, 4908, -4269, -20041, -12929, 6562, 10648, -2269, -14540, -14241, -842, 8732, -1658]
1805a658j3339N954R304m844q141L077Q251O579j858j0899l510R738L784j1131
1819h693n537Q569P328j191m954m181N491J0609k743j3707m50J2662K401r584
1833c980o934K278J0615Q451o114j0066O235J0861o920j3962K84J2107R711l090
1847I476j4346o322J5359J4447r130j3899M126J1754J282j1101j2204L041J9643
1860A2126R586j3695j2233O630R552j570n880l487K410O955j915j0363Q8J1854
1874A0058K313p230r38N683J822m761r130l542J1199J1129r076j4309N113J5164
1888A3495K977j0668j1450O63J4999Q380j4835j6502O308J5643L157p897p385
1901c115J664J0884L126j3413j0762P340R488j702m102j246R1J403M0k558L373
$$ y = [-1658, -14997, -9043, 261, -4583, -12724, -9647, -1396, 5183, 3325, -7574, -11084, -1346, 2438, -8693, -14230, -5661, 1667, 476, -4478, -8659, -3168, 7441, 4698, -9009, -9459, 3203, 5604, -3980, -10914, -8636, 1979, 10430, 4316, -5750, 485, 11346, 4426, -9536, -9252, 2855, 12566, 9476, -4870, -11192, 4167, 18614, 9484, -4415, -289, 11465, 12747, 1646, -10558, -7517, 12126, 21712, 8017, -4216, 2414, 11966, 10396, 4516, 1029, 3439, 10394, 8479, -1884, -1796, 10058, 12371, 5141, 4203, 9886, 11708, 6947, -2183, -5725, 5474, 16603, 7527, -6782, -1669, 13495, 16472, 5804, -5646, -4983, 10016, 18396, 3561, -12941, -6633, 9010, 12167, 4270, -3115, -1451, 9433, 12559, -854, -11616, -4276, 5212, 3510, -592, -1838, -1747, -344, -304, -2862, 511]
1916E11O586n158j3407k42J0338L077o073n337K264J1289O106j3693j7238O467
1930a4510J9107L087j3628j3221J240J4056J0391q969j3065N321J1958l54r727
1943h314n328L53N378N537l062m044L165K474m217J133O589j145p645l304K582
1958i848P060M030p222j0578O904J7617J739j4307j0364L604J3192P831j1070
1971a412j6516M498K0069P014j2124j2941J209J3447J1730p556j7601k493J2881
1984B05P929k981n300l452L749P852K088o724m238P83k50M289O015l831r535p90
2000d191R260Q508J335j0646j1612N624J6675J040j6789r405Q294J5321N777j2344
2014F847j6018M424K0575M461j6242j2867L420J1796P549o888j2890J367J3551
$$ y = [511, 7097, 1939, -11468, -11710, -1372, 1705, -4368, -9705, -7441, 3848, 9954, -3739, -20977, -14510, 4597, 7684, -5944, -19165, -17925, -3869, 6522, -2447, -15512, -10191, 1767, 1413, -8314, -13642, -13289, -7911, -2374, -5436, -9480, -6315, -3841, -8058, -6925, -336, -1481, -9126, -12430, -9848, -2788, 1242, -5980, -16558, -9654, 7963, 9702, -4605, -14969, -11365, 1827, 9658, -1412, -17928, -13430, 6639, 13653, 1529, -11412, -10203, 3244, 14974, 7418, -10183, -12676, 205, 8134, 5153, -147, -3599, 150, 8002, 10090, 3366, -872, -89, -339, 3950, 9965, 6134, -3401, -4191, 5069, 13577, 14912, 4266, -7346, -1722, 14953, 15993, -796, -10201, -1907, 13414, 19191, 6847, -9171, -4747, 15828, 20289, 4047, -8820, -5400, 6396, 13945, 7057, -5833, -4466, 9085]
2027I085M449q068n891p29J512K681M81l628j171J180j857J695P687M55j0447
2042b566n944N156P196R84p667j1333L472J6709N443j4039j1519N858J1806N035
2056H591r819j4999K35J6155O319j0389q550M149Q528L763m348r315q26P614J719
2071a173n350n00L293j565j049L125L737o4k722o479m41J0140L454j1171q096
2086a4861Q467J2213K518r189j1356K508J6070O192j4616j1616N671J1828L912
2099G741o128q762J042J2811N710r635p483K328L926R77O31j176j613K126L73
2114B868r60L922L224n966n401M978O111j971p457m622M394J3220M031j2687j0905
2129g221P374J2997m14j0930r212M465J4264M184j4452j0333R466J3435N31r493
$$ y = [9085, 13534, 5466, -425, -1154, 358, 3039, 3520, -108, -1279, -99, -1956, -261, 7426, 7881, -2566, -8510, -3354, 3842, 4826, -2841, -14174, -10702, 6007, 11450, -2589, -14108, -8250, 3556, 8591, -1228, -16227, -15992, 163, 6482, -3907, -12457, -8308, 220, 3983, -365, -9680, -10506, -2892, -1173, -6523, -7023, -3730, -5295, -6344, -3219, 518, 454, -2268, -8747, -9188, 952, 4406, -6765, -14861, -6394, 5819, 8337, -852, -12208, -9700, 6370, 12562, -2054, -13670, -7999, 3829, 7741, 1613, -7149, -6107, 6704, 12414, 2779, -4704, -2376, 1550, 2527, 3158, 1982, 369, 2495, 2868, 1908, 5830, 9054, 3088, -2313, 2665, 8776, 6805, -652, -5274, -880, 12340, 16371, 3684, -7221, 153, 13150, 12736, 1806, -7406, -2941, 11323, 15507, 1055, -9278, 188, 13623, 14154, 4661]
2143D661q718O40R607K929r090n517P205O604k270l635j109k7J798M12l290J195
2159A395K710m266n222M266P274p76m404k396J356M732J1q906n479Q665R298m226
2175D032q270k242M626P199M58q892m170P218M742o416o077J583N071M755p13
2190B904o129k073O233J265o323k299M645J896q31k681k941K196O650j54o379
2205d021O52M862l13n079k658J201M262L820l184m925L463N582l061n236J021
2220c614M257K542k076o573k296P234N810l757m956L447M507j158l965m793Q25
2235d566Q273K590o812l919N360M293j492k515j649J570M633j196p045j193N783
2250B115K580j996k22R65J179J287k802m959J890N898j609m649J009L293N20r29
$$ y = [4661, -4057, -3417, 6190, 9119, 29, -5488, 1717, 8321, 6051, 2416, 1307, 1280, 3078, 3490, 200, 1395, 4105, -161, -5383, -1117, 6157, 5381, 977, -1419, -63, 4669, 4680, -4226, -9705, -1040, 8258, 4032, -4238, -6480, -1854, 5345, 5803, -3089, -7259, -41, 4701, -1715, -7792, -6209, -1138, 3617, 2904, -3225, -5298, 935, 2200, -4123, -6422, -1777, 119, -712, -3393, -6334, -4138, 2512, 2358, -4021, -3369, 1493, 1180, -3899, -6557, -5356, -1094, 2726, -458, -5383, -1920, 3662, 601, -4635, -3614, 643, 3185, 1109, -5464, -7760, -526, 5284, 1527, -3429, 18, 4525, 3367, -598, -5391, -4566, 3707, 6297, -515, -4434, 926, 5219, 3727, 1212, -437, 1133, 5766, 4570, -2475, -3668, 2115, 4695, 2699, 2477, 3442, 4621, 5908, 3106, -1853, 37, 5935, 4326, -323, 686, 3979, 4499, 3570]
2266C570k360n52N831L841p182q053J585O608K019j480l349p73N027K732o568
2281H96m683M749M504j997l942j739r4L176J388k790Q63M112j642o616q77L804
2297h88J712j868l288j113M804M719n091q187L417Q946J111p458p025K87Q285
2312a637N418p535q802M865J0357J398p455p465j14P588N594n525p869K255N958
2327b969Q97j778j260j038J704K303j668k148N71j277k342L590O249r08n166k178
2343g418K400M838K329o396p135M923R770q72q430l353M854R311L446q830r723
2358a0286M344J0109L90p664k829L264O262L196n198n778L090O610n00l379p71
2373H60n15l42K343J649P81N46j617l325K693O280j759q213j602N278N759P31
$$ y = [3570, 1210, 658, 6489, 10330, 3148, -4905, -3320, 3288, 5307, 3827, 478, -295, 4732, 7464, 896, -3787, 962, 5466, 3469, -473, -2212, -2306, 870, 2258, -532, 331, 4443, 2801, -3815, -4692, -888, 824, -1044, -4332, -5445, -641, 4078, -1013, -9200, -5783, 3163, 4274, -3184, -10209, -9922, -1637, 3781, -3754, -12556, -7691, 2666, 4064, -3391, -10856, -10970, -3382, 2212, -3313, -11182, -8927, -2969, -2072, -3850, -5110, -6148, -4444, -2141, -3809, -5957, -5386, -6663, -9005, -5415, 834, -74, -5240, -7418, -5018, -180, 2149, -4247, -11382, -6459, 3311, 2439, -5991, -9344, -4490, 4821, 8267, -563, -10286, -5942, 4167, 4557, -3107, -5936, -2672, 3590, 6786, 1588, -4190, -1100, 5510, 5010, 1631, 860, 345, 3, 2346, 3995, 4776, 5322, 3705, 380, 3073, 9353, 7594, -619, -2221, 3057, 8816, 9547]
2389I547o505o631N317J0276j59r498m016M129N532J250o719o245M470R201q3
2404I866p403j792K088K397Q05k248l191J184K639j791k158K553J749l169j95
2419A334J794O36o80l499m031K790P212p02q437k601N668N742j06o283o229K833
2435d559R111r27q714l493M791N455J418m011m908Q78N672Q3m736j536J537j19
2451d058P17J527p69p61J009j348Q4L409q92n357j715M995K530j462k997j784
2467f872K588P057n63p929l200N655M413j338m432l615K896Q239J116p360l052
2482f397M174L968m81k729l434K20N090J775l173o13K010K3J54J297n95j835j83
2499g29K53n41L257J482l688k006L964L667j110l286k718Q85N406J463o167l403
$$ y = [9547, 3042, -3589, 1728, 12004, 11845, 2347, -1669, 2460, 7992, 9242, 2523, -3722, 748, 9949, 9866, 2463, 671, 2759, 5156, 5961, 3713, 522, 1706, 4345, 2554, 396, 2949, 4698, 1529, 1334, 3128, 3764, 3084, -415, -4446, -1656, 5556, 4854, -3583, -6184, -516, 5226, 5120, -1163, -7392, -4559, 4552, 3625, -5089, -8582, -3791, 1664, 3082, -929, -5837, -4959, 713, 796, -3940, -5476, -3939, -4058, -3341, -1814, -2583, -3344, -2335, -3683, -3599, -190, -1082, -6439, -8154, -3159, -629, -2091, -5088, -6872, -4284, 2773, 2210, -5719, -8919, -3264, 1149, -189, -4621, -8236, -5340, 2899, 4015, -3345, -6397, -2223, 1745, 1264, -1465, -4899, -4679, 411, 2186, -987, -1600, 410, 433, 587, 1884, 1289, -546, -729, -476, -1017, 2240, 3722, 34, -1972, 1992, 5659, 4549, 1263, -1455, -570, 4836, 6299, 132, -3271]
2515c271M497N212p09k670k790J024M664O65n928k870M378L266j445j687j006
2530A330L64L309P08l303j361K706j130k477J060J793k64N4n72p46J966J695l594
2547A538m242L255L730j766l268j785J032M828K713n515m120L224M005k231l686
2562b288j205J189L514Q27m689j685M460K584l560k786J148J134P76j539k921
2577e041O69M222J96m207M81L659j13k162k324q17K555K768k716l693K880M144
2593E01j038l552m66K202K507j29m606k698M127L964k352k563J553K250N99j451
2609a152k931J39M453J404m937k029M018K209o67j055r12J324L464r89n039O2
2625b638M500Q79j879j028Q71J590J716j418k881K031L833k514l461J094K580
$$ y = [-3271, 1226, 6438, 5729, 3059, 269, 1293, 5957, 6622, 694, -2176, 2202, 5468, 4023, 2336, 1330, 1694, 5003, 5711, 2408, 1047, 3753, 2623, 146, 1206, 2999, 2735, 2789, 2217, 1471, 3437, 5132, 1538, -2704, 551, 4281, 2515, -753, -2538, -1506, 3322, 6035, 520, -3600, -376, 3629, 1398, -2288, -3493, -2304, 1210, 2037, -2652, -4337, 123, 2707, -853, -3639, -2491, -1357, -581, -2120, -5041, -4372, -150, 46, -4161, -3680, -21, -134, -2296, -4620, -5437, -2882, -114, -2830, -6523, -3643, 501, -537, -4089, -4555, -2353, 154, 25, -4581, -7279, -3152, 812, -1540, -4103, -2550, -300, 299, -1152, -4083, -3944, 509, 1913, -3024, -5053, -1035, 1174, 507, -548, -1460, -136, 3328, 2339, -2700, -2638, 1862, 2741, 862, -166, 705, 2295, 4011, 2593, -288, 1743, 5576, 3062, -399, 695, 3275]
2640C275L54k76j558o87L744K584m068l569K810K678j215j854j615J303M395K14
2656F515m749k105M680K612k850k198j085Q13K347l17l349L36L954P14l297j321
2672G00R77J03K40n57j933O88K317j728l193K546L468j479k490j537N2K291J019
2689A484l881k455L732L387j911l418q70J599L059O02m857k935L431K799j914
2704b148j859J77J122J373K22k305j296J977L86k564M32K134n70j196O04L57R58
2721b196J633k437k789K114L515j913l054j25K364K701J170l510l322L254M426
2736A831j731m109O7J731K188J253l083j987K906L656j255k166j9K8K41J350n86
2753C15q36J499R47j514P46K131o19k273N28R56M84K95j562k482K906M038j252
$$ y = [3275, 3629, 3353, 1795, 1108, 4852, 7436, 3368, -201, 2609, 5287, 4072, 2218, 603, 1906, 6301, 6515, 1766, -339, 4341, 6953, 4103, 1905, 820, 1633, 3980, 3663, 314, 650, 4604, 5318, 2021, 700, 1677, 1780, 2020, 1463, -470, 218, 2535, 807, -2386, 160, 3628, 2149, -341, -1878, -1826, 465, 1484, -2397, -4852, -1120, 2267, 356, -3062, -3932, -2333, 726, 1328, -3529, -6464, -3033, -234, -2148, -4007, -3830, -2708, -1335, -1113, -3418, -4714, -2737, -2351, -4915, -4483, -2349, -2919, -4115, -3511, -3154, -2196, -563, -3000, -5789, -3675, -160, -2073, -5127, -5252, -2888, -187, 983, -2527, -5849, -2595, 1831, 100, -4009, -3942, -2211, -23, 1230, -1853, -3840, -934, 2722, 1467, -699, -718, -690, -449, 901, 315, -521, 978, 1925, 411, 1157, 3288, 2669, 396, 924, 1880, 2364, 2659, 1097, -1385, 1521, 5559, 4307]
2770D307l463k05K367J446J40l144l020K244M642p59l592l07K072J243O67k194
2786B444k802J588L194j435k983Q72J030P5Q64j84j178L12M50k436J66K432ol039
2804f36j39J509J148J9j307k524R48M463j659m547j124L089K185K73k411l090
2820c803J850M097r66m149m67K386O82n16j448j602J533K990j390k412J301J010
2836i04j500o35Q47n71N58N35k240j30L248R99l414j040K420J241r09r84k517
2853d996J363L963K1m286o21L837J039n83j909j386P68L365q46l573Q72L437Q5
2870E50j168k94O6L92J280j257j795J702K149j759j693K078J605r3m98j529j11
2887c75K852L86l606j226L146K005p22j733n06J043L010M8l744r29K940J012k059
$$ y = [4307, 844, 639, 3006, 4452, 4592, 1448, -1572, 672, 5314, 4555, 963, 656, 2728, 3971, 4638, 2444, -358, 1230, 4424, 2989, 6, 878, 1908, 1983, 2847, 2663, 1485, 1797, 2247, -189, -23, 2409, 2403, -636, -775, 734, 1882, 1901, 594, -1930, -982, 3481, 1822, -2725, -3849, -760, 1425, 1698, -713, -3803, -1953, 2144, 1178, -2971, -3438, -1052, -370, -886, -2334, -3936, -2403, 587, -803, -3215, -1914, -904, -2404, -3039, -2192, -2763, -2205, -1670, -3910, -4040, -792, 207, -3207, -4247, -1827, -586, -1495, -2479, -4996, -3633, 330, 351, -3935, -4556, -719, 320, -263, -2172, -3558, -2790, 575, -271, -3844, -2972, 465, 550, -618, -912, -846, -454, 826, -431, -2226, -524, 1625, -134, -1827, 251, 1856, 1763, 1265, -264, -375, 2477, 2863, -743, -1969, 1177, 3182, 2460, 727, 221, 1264, 4274, 4322, 578, -351, 2589, 3601, 1542]
2904A542p72P34Q58J972r48k454O97K860q39k617L45J103N2L11p65j155J876J916
2922D716j851k723K153J340p37j276q99oK160J043k999j356K834J230j590j591
2938D48l20N95R17J95k780m10L153M23k183q37J200L96N6j002k103O16K438o03
2956A99k995N74K332j96o81o89j137R16J870k163k548J606K386n91j548K80J58
2973b227P74P01k164j602K288J537k347r85J311P02O93j66j420k87K395N24l078
2990c351o87J955J233r43N3r94L92K291J32k564r3K107p4r99o1l59N49K061k68
3009C80j820N99J615k62j571Q51K88j74M62k02r77J638J885k063j052J560J300
3026B457p25j160n71r2K352J029k386j261K596J187j181n04j130M92J909o8k375
$$ y = [1542, 770, 1504, 2362, 4334, 3386, 932, 1629, 4489, 3650, 1033, 1378, 2481, 2533, 2844, 2079, 924, 2800, 4716, 2865, 142, 2295, 3635, 2898, 1622, 723, 717, 2877, 3920, 921, -435, 2399, 3629, 2039, 448, 128, 723, 1640, 1835, -945, -1355, 1798, 2221, 38, -799, 401, 797, 853, -149, -2252, -1636, 802, 199, -2796, -2222, 110, -86, -767, -1456, -2593, -1677, 193, -1970, -4518, -2912, -526, -1117, -2665, -2385, -2227, -1453, -752, -2916, -4518, -2230, -693, -3040, -4025, -2714, -2012, -1319, -1485, -2905, -3192, -797, -273, -3351, -4038, -2083, -850, -1793, -1740, -2734, -2342, -51, 81, -2483, -2576, -469, -543, -1542, -1603, -1962, -1413, 648, 380, -1440, -841, 774, 512, -1059, -208, 80, -94, 368, 166, -811, 827, 2712, 649, -403, 1157, 2457, 1732, 572, 1, -91, 2261, 3290, 904, -357, 2239, 3426, 2245, 1741, 611, 1103, 3012, 2944, 569]
3043E69n73K623P86j173l14j41k32J481m32k163L54J811p82j452J188J006l77
3060B179m37o09r04J533R33k180k222K137J620p83j294k29J00J930N46k789k233
3077b702K219J940j416j339o7R2J404M09k121p92K289J77j481q40N15l03M36M39
3095a141r71L84J468q93k205J033J969m16j655o05K38J587J111j748k207K188
3111a863K765j204k655m06P26J721J120k045k230K361K036j067j267O81L18O04
3127d05M21j334j042J666J037j806M20J875j26j319L2M87J40J189j045j823J515
3144a18K618r31k305J82J591J488O58j805k811K020K862r16k211l5J244J223O89
3161C443j780j524J735J804q38j743N93M38m38N08k4l74P80L09j468P7J640m96
$$ y = [569, -4, 2619, 3405, 2232, 1918, 1777, 1545, 3026, 2594, 431, 785, 2596, 1814, 362, 1550, 2556, 2179, 1742, 1133, 229, 1762, 2695, 515, -1707, 430, 2050, 1267, -27, -256, -156, 1774, 2320, -469, -2702, -483, 1457, 41, -1298, -1365, -1273, 131, 540, -1581, -2373, -84, 93, -1388, -2228, -1713, -2016, -1580, -1141, -2112, -1728, -260, -1153, -3358, -2325, -356, -772, -2427, -3032, -2794, -1207, -96, -1844, -4051, -1863, 902, -302, -2957, -3363, -2637, -916, 204, -1841, -4071, -1710, 326, -741, -2008, -1327, -1009, -405, 16, -1318, -2360, -694, 343, -1463, -1043, 832, 706, -613, -581, -94, 46, 1235, 190, -1633, -118, 2500, 1569, -736, -554, 1037, 2525, 3183, 1378, -1433, 587, 3449, 2533, 322, 287, 1531, 2754, 3443, 1663, 139, 1874, 3678, 2840, 1097, 1690, 2128, 1690, 2198, 2174, 1800, 2580, 2889, 1421, 1498, 3138, 2642]
3179B642k099l26J487L00P66q15j888O86K867q29k808k58J192P97n0j732j404
3196a472J296K669p70k331M99Q00p17l5m60q02Q40Q97q99j151J088Q75j408M7
3214a034M01l05j56k38j295N1K083L82j960q43J274L57M90q39j246o3K477j62
3232f26k707l60J662R36J61j99j673L7J675j40j672N41J473n02l20K93k39j1J024
3251f47o24r76J617O62j468j011J452Q49J17l30q47O3J909P21k393q53J463J081
3269G85j13l21j010m4K244M91j754n21J332M12j86j49r62k78J346P82j146O52
3287A560O14p77p03J047K57p24L97n42m92Q35J603j293j161J139J020o64m56q82
3305G78m65J471R93j449j413J355J062l78p63m54n02J213P88j996p77J570O56
$$ y = [2642, 543, 217, 1704, 2004, 2770, 1955, 67, 753, 3620, 2791, -17, -275, 917, 1714, 1664, -68, -1472, -176, 2493, 1723, -608, -109, 691, -26, -61, -521, -1323, -483, 414, -485, -1636, -548, 327, -1081, -1034, -633, -938, -1094, -1332, -2627, -2576, -493, -111, -2071, -2914, -1640, -1283, -793, -1632, -2878, -2941, -464, -626, -3333, -3693, -2031, -1095, -934, -1133, -2806, -2769, -1094, -1234, -2906, -2365, -892, -1394, -1714, -1421, -1660, -1671, -647, -1271, -2247, -630, 32, -1436, -2447, -995, -146, -29, -359, -1206, -1143, 766, 1487, -906, -1759, -296, 785, 672, 351, -659, -703, 1541, 2032, 278, -243, 1089, 1501, 1315, 1166, 204, -74, 1272, 2054, 908, 1560, 2174, 1397, 694, 1741, 1998, 1274, 1671, 1129, 637, 1472, 3075, 1782, 621, 1760, 2780, 2116, 1660, 778, 313, 1784, 2777, 1328, -85, 1270, 2332, 1954, 1191, 737, 235, 1448, 2236, 240, -537, 1033, 1689]
3322A689j233j47j82M54O35n07j364J98J315n92j273J83J118j60l91m15o95J152
3340b15J413j628j540J34J462l44m11l19m15P81J416j571j212J313M41o45n40
3357a880K01l51M55M80n81j2J010J68j535j52J221k25L86o79q20N03J720k48j543
3376a882j64J696K23l55q88n50P51J796m21j635N32J665k62q27k76K59L79J170
3394A211q30j172O73J087j12o89J338O3o31o5k93K01J480K18k270N6J637K34l58
3413A778j025J74O58J313n39j905n47K090P34j131m0j08L9J048k91j313J06J125
3431B166n73q60M91K34m46M34N2p08O62N31j256j032J564J39j261j84L99K17J013
3450A582jj817j199J674J005j204l96n09l1J073J82j581l57J704L06q07o37k70
$$ y = [1689, 456, 309, 127, 581, 1216, 709, -655, -457, 858, 266, -1007, -824, 294, 134, -257, -672, -1367, -215, 1198, -430, -1970, -1836, -374, -718, -1129, -1448, -1863, -1082, 334, -1237, -2449, -1136, -695, -1340, -1880, -1679, -2030, -1575, -1095, -1676, -1688, -678, -510, -2045, -2197, -976, -1201, -815, -1494, -2314, -1811, -91, -339, -1882, -2046, -350, -127, -482, -1370, -1920, -1169, 627, 206, -1429, -897, 768, 506, -321, -597, -338, 41, 1211, 381, -791, -118, 969, 857, 168, 1506, 1569, 938, 873, 580, 781, 2261, 2479, 209, 265, 1902, 2136, 1778, 753, 927, 1585, 2898, 2359, 454, -93, 1997, 2731, 1600, 1560, 1452, 1491, 2539, 2248, 935, 1041, 2166, 1593, 733, 1224, 1458, 1012, 1446, 1498, 790, 1452, 1983, 727, -305, 1259, 1398, 137, -47, 352, 569, 1582, 1581, -236, -1435, 239, 1244, 40, -356, -865, -896, 177, 359, -1222, -1579, 125, 431, -376, -1013, -1283]
3468a283j60L56M41m14k28M50q19p22J081J394q11j211k85K98M37N87j330p76
3486b995J826J126r40j489J41O52O92O70j613j279J328J234o15n54M2K74M20N83
3504d97j181p62J234P09p14j54M23o19N4J244l56j1J0m65l11R08J530j464r00
3523a322K69J062M95M51n89j707J341J526r20j512N62O25R82N83j199j606R05
3540e4J931j28k36n47l14m76J133L2n43R10L53r64j03P05l34q28P09R81n36j46
3560A545o12q92J297J517p79j643J39R30N75m32n72j703J433J779m08j666j48
3577C60M42L04L08l84j227J29J285j57p46k91k64m2J100L93n80r87L53q47K71
3596e80J013j61j142j02N73mL65o93r25O18J646l98j956q39J454O70K94l20j607
$$ y = [-1283, -1443, -1087, -646, -1060, -1288, -838, -1657, -2379, -1298, 96, -715, -1926, -2211, -1913, -1476, -889, -2219, -2995, -1169, -43, -983, -2472, -2331, -1679, -987, -317, -1930, -3209, -1881, -647, -1262, -1816, -1774, -1500, -1080, -497, -1678, -2440, -1206, -497, -1211, -1365, -942, -1561, -1507, -263, -619, -630, -620, -1085, -1396, -488, 1042, -422, -1322, -1053, 9, 504, 955, 366, -1341, 0, 1526, 606, -906, -344, 281, 1263, 1846, 647, -959, -54, 1877, 1749, 1513, 966, 652, 176, 1309, 1341, 798, 1708, 2061, 1097, 994, 1699, 1365, 537, 1246, 2227, 1691, 1545, 933, 41, 1338, 2855, 2076, 433, 572, 1502, 2077, 1645, 1073, -630, 803, 2582, 2174, 508, 360, 802, 1106, 1414, 1030, -197, -68, 1217, 1060, 314, 23, -241, -283, 817, 1210, 630, -357, -4, -851, -580, 433, 272, -870, -972, -399, -403, -38, -731, -1656, -1038, 608, 210, -1746, -2585, -1131, -461, -167, -487, -2094]
3615b094J80J530J27j509J9P50l31M66k60j024K01J248J15q03O14k63p98N7J486
3634b89m69m94j04l14N66J130L18j832l71J039Q14o6n91p77m2J824O78j689m09
3653a078J078N34KO2j304o3J200P81q43j78M28l91J74M28k86LN91j57r53P06M61
3674A195o80j66J175Q06r17m27o97K3J598M30j617q05J364P52j55p89o34J35J617
3693B208K57j885o87R89M15m7R4p62j53N69K94l31n93O74m29m69M53O66p28m74
3713F1J90l08J051L18j096j144Q34O92m70n56l39n6O90P08r63q88R44N32m88K3
3733b65l78p44N09P24o49n29J20R49n92k62L06m51l9O02j41n20N96j87r54O66
3753a239P88l19l00k11k25N80P16o39j374P59J490o31l80P5m85L93J128n30j030
$$ y = [-2094, -1914, -384, -257, -1766, -1747, -997, -1328, -862, -1122, -2146, -1945, -697, -582, -1385, -771, -1034, -1832, -1775, -289, -758, -1252, -1356, -1670, -1104, 26, 344, -1488, -1859, -820, -6, -72, -663, -1440, -1482, 342, 1020, -669, -1078, 0, 534, 536, 598, -706, -769, 431, 1212, 369, 191, 619, 228, 402, 830, 544, 547, 1138, 981, 28, 734, 1195, 515, 349, 1524, 2330, 1413, 986, 289, 312, 1910, 2340, 723, -82, 1282, 2034, 1879, 1090, 456, 591, 2208, 2465, 580, -107, 882, 1297, 1250, 1344, 582, 429, 998, 1292, 961, 368, 1042, 613, 144, 597, 1263, 535, 61, 251, -57, 994, 1312, 216, -928, -94, 598, 128, -428, -767, -823, -133, 575, -388, -1276, -332, 200, -288, -265, -643, -1387, -878, -154, -803, -1332, -1212, -263, -855, -1117, -811, -1262, -1301, -699, -840, -1360, -764, -951, -1905, -1239, -451, -770, -1070, -1281, -1506, -926, -210, -849, -2223, -1464, 26, -605, -985, -910, -1395, -1002, 126, -404, -1434]
3772a434M03Q46k68k00L18Mm27N30K14j5j32J67m90M70O53m63l94N0L51K03N62
3793I48j32j035J75J272J36o66l47k44K60J430l17j322l2J018K79l28l03o27M81
3812F46J072J08j221k68J126k40n6L2r4o36L31N5J9J63J39p85j92J244m9j184
3832B10K60k42N20K14m7j008m95J234M98o27n75k8j07P65j5j009l76P14M8m54
3852e20J71K44l95J77N94p55l07J15l84q7Q81O4q34l22N74k67M81J5n89o14O68
3873a090R18r45n41J5K34Q39P55j408o64O56P87k71m4k98k19L91Q28r12n83N93
3893i59M35J5K93o0n72l91P62J08L85K32o54n71J173O03p18r04O96M49M94j32
3913F84r37m55P74J662q90q60J84l8P97L99r62o20O64J056k38j39J76p10L74O37
$$ y = [-1434, -1031, -185, -453, -653, -335, -331, -758, -228, -14, -29, -161, 6, -484, -14, 639, 176, -218, -168, 183, 386, 948, 816, -219, -44, 1228, 1364, 698, 351, 107, 367, 1797, 1480, 158, 126, 1144, 1423, 1095, 792, 165, 646, 1718, 1826, 605, 337, 1463, 1223, 1167, 1199, 1105, 469, 800, 855, 874, 1037, 1176, 391, 199, 1443, 1394, 210, 470, 228, 748, 962, 915, -93, -588, 646, 1144, 517, -58, -86, -193, 572, 557, -452, -828, -114, -66, -520, -349, -105, -500, -323, 271, -484, -791, -676, -1060, -1147, -266, -202, -1036, -1358, -784, -1051, -570, -555, -1144, -1758, -1090, -172, -1117, -1658, -1643, -1409, -570, 185, -1223, -1887, -1231, -444, -715, -759, -1057, -1276, -885, -57, -969, -1552, -959, -524, -509, -216, -276, -848, -1239, -477, -369, 16, 248, -406, -977, 196, 799, 81, -823, -127, 322, 816, 684, -253, -708, 66, 1728, 838, -22, 162, 124, 921, 1320, 358, -262, 402, 1458, 1220, 1081, 1257, 547, 921, 1558]
3933A558q1r11K44J02k63P54J20p99l99R69J67J22k53n69q06R00P66m08j163j1
3953C9N98N36j00n39p23O86J147o20r83n26O59K10L96k50r85L07M83k39j01K19
3973B14l9p08K94K90k45j67k55J15%J130r63j200l9J000K68k57l36q26N29J168
3993b7l83p16k45K66J31M00p6p54k46P31L13o75L55j21o16P84N14o31p00M93L12
4014h91N2M13n10r07L72R97O6k58l56K3j08J057N3j270N4R94M85j95j98j338K07
4035a258J770N09j276l72J54J93P07L04o80l24P44M09k76l28j06j95M26Q88m13
4054H76m90PK76M79K11J94j371L37R62L02p98k19j88K56Q45K06j114j62N81M07
4074A597j39m86l41k90J102O32p54j062L72n9N13M78p77p99L59O30l89k4J40l64
$$ y = [1558, 1477, 566, 810, 912, 649, 1403, 1523, 724, 325, 1294, 1461, 1583, 1330, 761, -45, 855, 1621, 1213, 50, 39, 637, 1173, 1073, 534, -189, 497, 1644, 1024, 41, -485, 174, 384, 780, 530, -455, -148, 335, 96, -5, 214, 175, -533, -239, 51, -194, -361, -616, -501, -501, 629, -334, -1534, -1573, -573, -305, -562, -898, -1724, -1195, -27, -410, -1126, -1371, -1105, -974, -574, -650, -1404, -1650, -919, -606, -1281, -926, -1047, -1663, -879, -365, -996, -1696, -1203, -891, -839, -426, -936, -1843, -1471, -474, -408, -666, -1022, -999, -1107, -50, 3, -1267, -1213, -219, 266, 71, -127, -1465, -1258, 512, 1021, -255, -627, -473, -280, 427, 731, 51, -273, 471, 880, 604, 276, 170, -25, 401, 1289, 876, 386, 393, 669, 1148, 1359, 1553, 182, 519, 1481, 1783, 985, 766, 578, 834, 1679, 1885, 771, 609, 1190, 1597, 1458, 972, 631, 341, 1443, 2075, 1321, 259, 631, 572, 1085, 1563, 786, -13, 346, 976, 587, 563, 703, 339]
4094C39k12M16j09l02j01M54m01M78L2j098q30R39R89k87m8p57m35M45P63l89
4114a14p80K4M84j69L56n21n84M91Q20m46n81P5K6l6L30M44r04q5J37L77L93O
4136b57q93p42R67N36l29l41j96J02O56N39o39r31M71R83N1j76p76o42J292Q90
4156E65k83j237j31P12L98L36o26o29J98J119P7q46J45R1J21M39L59l16r77M92
4176GL52M62M08q00p61N79J018k47p63L22r2O51M30p37j116K85J416j06m48l98
4196D62K2L06N53r4q87R8L61k9K1L36n97k84O99j61j7o7k9l69K06O51k98o72P6
4219B87M81n6J77m6r48K01O52j00o82J56m7l32R72r0q25k47P46Nk56j8k57m19
4241f46L61N94n24n16L52l58P9O65l06p94J62J61L34Q1k22m57l33J274q0o66m79
$$ y = [339, 127, 543, 434, 132, 31, 485, 84, 562, 594, -504, -1334, -395, 594, 307, 259, -498, -933, -488, 275, -114, -894, -870, -386, -555, -199, -720, -1304, -813, 7, -439, -1020, -945, -919, -955, -625, -181, -1085, -1170, -1033, -656, -263, -257, -1150, -1892, -925, -389, -718, -1059, -1255, -1153, -497, 42, -597, -1528, -1057, -74, -23, -199, -975, -1617, -325, 565, 282, -955, -1086, -374, 24, 360, -266, -895, -697, 422, 499, -347, -202, -111, 10, 449, 808, 492, -485, 7, 359, 821, 1229, 429, -332, 247, 1265, 1018, 255, 577, 485, 1136, 1566, 829, -287, -2, 1414, 1308, 860, 462, 484, 790, 1343, 1249, 362, 460, 821, 792, 813, 1149, 552, 268, 967, 806, 789, 722, 693, 324, 530, 1181, 883, 211, 287, 768, 712, 889, 843, -105, 96, 748, 648, -34, 122, 75, -257, 715, 625, -200, -447, 299, 304, 48, 30, -227, -646, -285, 309, -215, -731, -379, -737, -658, 7, -299, -1093, -931, -770, -436, -355, -577, -1034, -1367, -93, -173, -839, -1318]
4262a318M66j57O33J06r52j00O23%Q2j2j69k38K92J60l54m30Q38K53j68J80n44
4283h09o62J89J301Qp95J47k8j98P85l8o69j11R24q0k84P4Q7k63N77M76n79n61
4305e09O24k35M74M89n86n49P75L97l37l0j94l38P11N25o54k59M00K89m82R8J75
4326G84k43K41m1K84n41K45J91m64M04L59m64n54K75J91j70L32j96l10M32M23
$$ y = [-1318, -852, -1009, -376, -270, -1222, -1322, -699, -699, -617, -629, -798, -1036, -744, -584, -938, -1368, -530, -277, -445, -265, -809, -1471, -1282, 19, 27, -768, -621, -649, -847, -62, -100, -769, -880, 44, -36, -320, -246, -159, -422, 155, 631, 52, -509, 115, -120, 354, 843, 257, -292, 483, 880, 543, 513, 319, -19, 692, 1217, 563, 304, 704, 993, 511, 609, 784, 541, 782, 741, 1025, 484, 729, 920, 456, 860, 1219, 755, 201, 476, 667, 497, 829, 633, 323, 755, 1178]
$$ [...]
8191C13
##END NTUPLES=NMR FID
##END=
