##TITLE=1H_TG-2288-A1
 CDCl3, 8 sc, 
 9.6.2020
##JCAMPDX= 6.0         $$ Bruker NMR JCAMP-DX V2.0
##DATA TYPE= NMR FID
##DATA CLASS= NTUPLES
##ORIGIN= UXNMR, Bruker Analytische Messtechnik GmbH
##OWNER= root
$$ XWIN-NMR		Version 3.5
$$ Tue Jun  9 11:11:33 2020 Russian Standard Time (UT+4h)  she@DPX200
##.OBSERVE FREQUENCY= 200.1315
##.OBSERVE NUCLEUS= ^1H
##.DELAY= (6, 6)
##.ACQUISITION MODE= SIMULTANEOUS
##.ACQUISITION SCHEME= undefined
##.AVERAGES= 8
##.DIGITISER RES= 18
##SPECTROMETER/DATA SYSTEM= spect
##.PULSE SEQUENCE= zg30
##.SOLVENT NAME= CDCl3
##.SHIFT REFERENCE= (INTERNAL, CDCl3, 0, 15.7039)
##AUDIT TRAIL= $$ (NUMBER, WHEN, WHO, WHERE, WHAT)
$$ ##TITLE= Audit trail, XWIN-NMR		Version 3.5
$$ ##JCAMPDX= 5.01
$$ ##ORIGIN= Bruker BioSpin GmbH
$$ ##OWNER= she
$$ F:/spectra/data/she/nmr/H-F/1/audita.txt
$$ ##AUDIT TRAIL=  $$ (NUMBER, WHEN, WHO, WHERE, WHAT)
(   1,<2020-06-09 11:10:15.57 +0400>,<she>,<DPX200>,
      <created by zg, POWCHK disabled, PULCHK disabled
       configuration hash MD5:
       00 E9 B6 7A A2 85 ED C7 34 08 36 98 17 FE 4E 26
       data hash MD5: 16K
       42 CF D3 9D 20 F9 52 6B D0 F0 93 EC 1A 5C 22 DA>)
$$ ##END=
$$ 
$$ hash MD5
$$ 2F 62 19 E3 30 61 2B 97 9A 54 4F 08 7D 19 A3 42
##$RELAX= 
##$RELAX= 
##$RELAX= 
##$RELAX= 
##$RELAX= 
##$RELAX= 
$$ Bruker specific parameters
$$ --------------------------
##$DU= <F:/spectra>
##$EXPNO= 1
##$NAME= <H-F>
##$PROCNO= 1
##$TYPE= <nmr>
##$USER= <she>
##$AMP= (0..31)
100 100 100 100 100 100 100 100 100 100 100 100 100 100 100 100 100 100 
100 100 100 100 100 100 100 100 100 100 100 100 100 100 
##$AQSEQ= 0
##$AQ_mod= 1
##$AUNM= <au_zg>
##$AUTOPOS= <>
##$BF1= 200.13
##$BF2= 200.13
##$BF3= 200.13
##$BF4= 200.13
##$BF5= 200.13
##$BF6= 200.13
##$BF7= 200.13
##$BF8= 200.13
##$BYTORDA= 1
##$CFDGTYP= 0
##$CFRGTYP= 5
##$CHEMSTR= <none>
##$CNST= (0..31)
1 1 145 1 1 1 1 1 1 1 1 1 1 1 1 1 1 1 1 1 1 1 1 1 1 1 1 1 1 1 1 1 
##$CPDPRG= <>
##$CPDPRG1= <>
##$CPDPRG2= <>
##$CPDPRG3= <>
##$CPDPRG4= <mlev>
##$CPDPRG5= <mlev>
##$CPDPRG6= <mlev>
##$CPDPRG7= <mlev>
##$CPDPRG8= <mlev>
##$CPDPRGB= <>
##$CPDPRGT= <>
##$D= (0..31)
0 1.2 0 0 0 0 0 0 0 0.06 0 0.03 0 0 0 0 0.0002 0 0 0 0 0 0 0 0 0 0 0 0 
0 0 0 
##$DATE= 1591686614
##$DBL= (0..7)
120 120 120 120 120 120 120 120 
##$DBP= (0..7)
150 150 150 150 150 150 150 150 
##$DBP07= 0
##$DBPNAM0= <>
##$DBPNAM1= <>
##$DBPNAM2= <>
##$DBPNAM3= <>
##$DBPNAM4= <>
##$DBPNAM5= <>
##$DBPNAM6= <>
##$DBPNAM7= <>
##$DBPOAL= (0..7)
0.5 0.5 0.5 0.5 0.5 0.5 0.5 0.5 
##$DBPOFFS= (0..7)
0 0 0 0 0 0 0 0 
##$DE= 6
##$DECBNUC= <off>
##$DECIM= 24
##$DECNUC= <off>
##$DECSTAT= 4
##$DIGMOD= 1
##$DIGTYP= 9
##$DL= (0..7)
0 120 120 120 120 120 120 120 
##$DP= (0..7)
150 150 150 150 150 150 150 150 
##$DP07= 0
##$DPNAME0= <>
##$DPNAME1= <>
##$DPNAME2= <>
##$DPNAME3= <>
##$DPNAME4= <>
##$DPNAME5= <>
##$DPNAME6= <>
##$DPNAME7= <>
##$DPOAL= (0..7)
0.5 0.5 0.5 0.5 0.5 0.5 0.5 0.5 
##$DPOFFS= (0..7)
0 0 0 0 0 0 0 0 
##$DQDMODE= 0
##$DR= 18
##$DS= 0
##$DSLIST= <SSSSSSSSSSSSSSS>
$$ [...]
##$SUBNAM2= <"">
##$SUBNAM3= <"">
##$SUBNAM4= <"">
##$SUBNAM5= <"">
##$SUBNAM6= <"">
##$SUBNAM7= <"">
##$SUBNAM8= <"">
##$SUBNAM9= <"">
##$SW= 24.9337058887773
##$SWIBOX= (0..15)
0 0 2 0 0 0 0 0 0 0 0 0 0 0 0 0 
##$SW_h= 4990.01996007984
##$TD= 16384
##$TD0= 1
##$TE= 0
##$TE2= 300
##$TE3= 300
##$TEG= 300
##$TL= (0..7)
0 120 120 120 120 120 120 120 
##$TP= (0..7)
150 150 150 150 150 150 150 150 
##$TP07= 0
##$TPNAME0= <>
##$TPNAME1= <>
##$TPNAME2= <>
##$TPNAME3= <>
##$TPNAME4= <>
##$TPNAME5= <>
##$TPNAME6= <>
##$TPNAME7= <>
##$TPOAL= (0..7)
0.5 0.5 0.5 0.5 0.5 0.5 0.5 0.5 
##$TPOFFS= (0..7)
0 0 0 0 0 0 0 0 
##$TUNHIN= 0
##$TUNHOUT= 0
##$TUNXOUT= 0
##$USERA1= <user>
##$USERA2= <user>
##$USERA3= <user>
##$USERA4= <user>
##$USERA5= <user>
##$V9= 5
##$VALIST= <valist>
##$VCLIST= <CCCCCCCCCCCCCCC>
##$VD= 0
##$VDLIST= <DDDDDDDDDDDDDDD>
##$VPLIST= <PPPPPPPPPPPPPPP>
##$VTLIST= <TTTTTTTTTTTTTTT>
##$WBST= 1024
##$WBSW= 4
##$XGAIN= (0..3)
0 0 0 0 
##$XL= 0
##$YL= 0
##$YMAX_a= 902724
##$YMIN_a= -429600
##$ZGOPTNS= <>
##$ZL1= 120
##$ZL2= 120
##$ZL3= 120
##$ZL4= 120
##$ABSF1= 10
##$ABSF2= 0
##$ABSG= 5
##$ABSL= 3
##$ALPHA= 0
##$AQORDER= 0
##$ASSFAC= 0
##$ASSFACI= 0
##$ASSFACX= 0
##$ASSWID= 0
##$AUNMP= <proc_1d>
##$AZFE= 0.1
##$AZFW= 0.1
##$BCFW= 1
##$BC_mod= 2
##$BYTORDP= 1
##$COROFFS= 0
##$CY= 11.3945322036743
##$DATMOD= 1
##$DC= 2
##$DFILT= <>
##$DTYPP= 0
##$F1P= 16.9975609425685
##$F2P= -3.02152046262296
##$FCOR= 0.5
##$FTSIZE= 0
##$FT_mod= 4
##$GAMMA= 1
##$GB= 0.15
##$INTBC= 1
##$INTSCL= 1
##$ISEN= 128
##$LB= 0.24
##$LEV0= 0
##$LPBIN= 0
##$MAXI= 10000
##$MC2= 0
##$MEAN= 0
##$ME_mod= 0
##$MI= 1.114404
##$NCOEF= 0
##$NC_proc= 0
##$NLEV= 6
##$NOISF1= 3.799351
##$NOISF2= 2.8
##$NSP= 1
##$NTH_PI= 0
##$NZP= 0
##$OFFSET= 15.70392
##$PC= 1
##$PHC0= -9794.641
##$PHC1= 13.00088
##$PH_mod= 1
##$PKNL= yes
##$PPARMOD= 0
##$PSCAL= 0
##$PSIGN= 0
##$REVERSE= no
##$SF= 200.130013532006
##$SI= 16384
##$SIGF1= 3
##$SIGF2= 2
##$SINO= 400
##$SIOLD= 16384
##$SREGLST= <1H.CDCl3>
##$SSB= 0
##$STSI= 0
##$STSR= 0
##$SW_p= 3612.71676300578
##$SYMM= 0
##$S_DEV= 0
##$TDeff= 0
##$TDoff= 0
##$TI= <>
##$TILT= no
##$TM1= 0
##$TM2= 0
##$TOPLEV= 0
##$USERP1= <user>
##$USERP2= <user>
##$USERP3= <user>
##$USERP4= <user>
##$USERP5= <user>
##$WDW= 1
##$XDIM= 8192
##$YMAX_p= 0
##$YMIN_p= 0
$$ End of Bruker specific parameters
$$ ---------------------------------
##NTUPLES= NMR FID
##VAR_NAME=  TIME,          FID/REAL,        FID/IMAG
##SYMBOL=    X,             R,               I
##VAR_TYPE=  INDEPENDENT,   DEPENDENT,       DEPENDENT
##VAR_FORM=  AFFN,          ASDF,            ASDF
##VAR_DIM=   8192,          8192,            8192
##UNITS=     SECONDS,       ARBITRARY UNITS, ARBITRARY UNITS
##FACTOR=    0.0002004,     1,               1
##FIRST=     0,             0,               0
##LAST=      1.6414764,     0,               0
##MIN=       0,             -429600,         0
##MAX=       1.6414764,     902724,          0
$$ Real data points
##PAGE= N=1
##DATA TABLE= (X++(R..R)), XYDATA
$$ [...]
2469d693l016L637P972J218r133m240R126P307n436r011j749O010O111l061q946
2484g904n4J0664M614p701m927K983M564N62m842n061K695P545m68q149n1P517
2500A987M341l319o517j927N802O072n818r359L058R994Q66n877l146L171N793
2515E121R05p358n622N383O923l290o796J60N935M675r08p132k432P683M507p421
2531C33p628L156P517J687m622m680K288P872P37q498k807O722L549n306n776
2546e456p18N612O733j635q113j649R035K733p064n616J764O148K211n704o517
2561h236L887R741n23p883j233M631K296k628n623j945N683O253m655p184K253
2576e166P224J827m141m811k99N520K744p526n712O414P618k571o000k86M411
$$ y = [-4693, -7709, -4072, 3900, 5118, -4015, -8255, 871, 8178, 2742, -6269, -8018, -2008, 4103, 1042, -7904, -7958, 2706, 7320, -381, -5308, -2325, 2239, 2801, -2041, -7102, -4407, 3138, 2670, -5479, -5530, 1987, 6328, 3009, -3508, -5435, 367, 6439, 621, -8738, -5680, 4314, 5180, -697, -3843, -672, 5121, 6026, -1332, -6954, -1571, 5352, 2062, -4734, -4574, 1361, 6036, 5128, -2004, -4436, 3247, 7754, 333, -7295, -4139, 3378, 5065, 443, -4237, -1949, 5923, 6660, -1838, -4645, 2077, 5626, 320, -5456, -6174, -562, 6171, 4536, -3577, -5226, 3809, 6542, -522, -6138, -4374, 1774, 3985, -1719, -8236, -4349, 5392, 4869, -3014, -4247, 384, 2680, 52, -5571, -7516, -1833, 4420, -235, -7419, -5166, 2058, 3885, -256, -5067, -5366, 154, 2898, -4628, -10340, -3926, 3692, 1121, -4879, -5165, -754]
2591g54M133j862p710k211P132M241n842m785L270N354K186l100n917P12Q253
2606C100J749q979m788N434N086m85l986j459M155O190l155r083N57P832K298
2621D466n365l787O27M308L847l038m793L200P425j590q323k189L971N205q5n184
2637a305l478O168N927m203o715L071N846K75m595m995J50O283M239n641m423
2652c396M682N188j576m477k500K287N090j042p522k022P834M875m981m656J738
2667d78M338K015l030o769R62O848P47p016k263N153M727k78m395m269L190N866
2683E348k080p596m13O696J939l950l548R01N722M018n331o973K216O039q84n052
2699b948j275K742M151Q20n292l144N333N850l736o311k72L811K001j392m264
$$ y = [-754, 3379, 1517, -6193, -8404, -1272, 2969, -2873, -7658, -4388, 966, 3152, 52, -5865, -5153, 3100, 4849, -4130, -8918, -3484, 1602, 1117, -2869, -4328, -173, 6017, 2862, -6221, -5664, 2168, 4466, -899, -4686, -4059, 249, 4096, 1058, -3735, -535, 6890, 5300, -3023, -5212, -1241, 3964, 3879, -1305, -4783, 1385, 7312, 3109, -3606, -535, 5311, 5586, 991, -4004, -3854, 2429, 6668, 1027, -3396, 1286, 6474, 4898, 421, -2079, 208, 5298, 4256, -3266, -5288, 2546, 7421, 2440, -2216, -478, 3860, 5875, 2845, -3924, -2962, 3886, 4633, -2383, -4646, 507, 5234, 4956, 561, -3708, -518, 5348, 3268, -4328, -4741, 1955, 3894, -56, -3604, -2703, 3019, 7037, 1706, -5267, -3051, 2988, 2104, -2948, -4223, -1481, 2670, 3490, -1802, -4946, 387, 6237, 2501, -3810, -4082, -271, 1730, 338, -3926]
2714c926L96O654K947o735m084M438M268j699m330k542K223N358N52o019j347
2729c846O438L155m220m461L16M123L232l072p059J057Q132J864n454k771L189
2744F23L173N44m319m026K653O460j801o412j41M978K806j161l140k126L985L297
2760E393m748n558K639O335J6m416j933J374N058J414n915l759M884M058l836
2775A006m892O74M109L350r00n392j531O267K673n470l870K415L280K09k921l500
2791d493K700O283K87o675j536M842K040k803l492q55L088M346k429n345J170
2806b872O507R02m838k651J173L259J203l950m033L693O324j612n765J81L779
2821A300K544j205m348k509M303M159l393m948K871M825R5k094k811l17M642J668
$$ y = [-3926, -3530, 3124, 6071, -664, -4748, -310, 3958, 2259, -2071, -4613, -2390, 2968, 3520, -2499, -3846, 2592, 5747, 1527, -2934, -2618, 1505, 4737, 1665, -5394, -4337, 3795, 5659, 205, -2566, 623, 3796, 4340, 21, -4005, -1352, 5108, 3307, -3105, -3246, 1732, 4538, 3377, 237, -1889, 2096, 5393, 645, -4913, -2274, 4061, 4077, -339, -2272, -898, 4160, 5574, -341, -4100, 784, 4842, 1006, -3886, -3212, 897, 4247, 3347, -2045, -3576, 2691, 5364, -106, -3976, -1561, 1719, 1928, -993, -4493, -1793, 4490, 4777, -1898, -3434, 1408, 3448, 645, -2847, -3702, -614, 3732, 1303, -4042, -2872, 3635, 4537, -301, -2952, -1779, 1480, 2683, -1267, -5300, -1607, 4717, 3105, -2660, -2479, 1300, 3844, 2639, -1709, -4218, 85, 4244, 851, -4097, -1226, 3599, 3694, 1600, -1211, -1528, 3114, 4782]
2837D782n424l579M389M118j893l127j23K628L360j060n487j097N702J414m525
2852G8l018K412L325J756k298m414J606N771J24o666j879M040K509j236k715j933
2868b538L121N049k102n838Q99M219K34l203k307K79L088K533l113m026L103N423
2884D821k291m614n89K269J988l73m342j860N298L776m177l862J929L482P93k338
2900i0m029j19M920K010n483k627M088L639p88l126j504J094M077o58n307j377
2916e280N500J757k837j845R72K740J889k117m430R20M958o48m303q55L061K470
2932A952J17k643k152K844M524k988n027Q25M360M65k031k293K21L995K760l416
2948A513m029K436L748j096l471j102J547L218J028m002k699M734L420l217l468
$$ y = [4782, -642, -4221, 168, 4286, 2393, -734, -857, 1771, 5131, 4071, -1416, -2513, 3189, 4603, 78, -2940, -528, 2797, 4553, 2255, -2159, -553, 5218, 5342, -1324, -3203, 837, 3346, 2110, -605, -2538, 583, 5632, 3530, -2308, -1409, 2810, 3044, -159, -2466, -2187, 901, 3434, 321, -3705, -602, 4821, 2530, -2084, -2673, -404, 1584, 1211, -3131, -4991, 307, 4083, -94, -3956, -2027, 1455, 2248, -90, -4119, -4238, 682, 2692, -2791, -5418, -1330, 2309, 1521, -1605, -3109, -2015, 2062, 1404, -3903, -5280, 220, 1977, -860, -2705, -1733, 1007, 2896, 779, -3651, -2731, 2227, 1579, -2724, -3579, -518, 1952, 2069, -574, -2726, 118, 4642, 1654, -3373, -2548, 1812, 2277, 246, -2047, -1826, 2169, 4929, 1513, -2516, -80, 3668, 2572, -899, -2001, -454, 2764, 3792, -210, -2909, 1825, 5245, 2028, -1440]
2963a440N67K314J107j425l626J80M564J963m182k083K662K134p47k381k206J182
2979a417L915l19n039o32M392J960k647k163o52K417K756k983m790J226N118R2
2995A234l477n98J251J967P44l068k972K171M098k237m003M75K907J493k80k766
3011c061p25L434J968l880l714K627L476p68k122q72P70L442R05m347j926M034
3027g59K596k955k577J21K148J977J8l634J95M609J180m428j718K133K111R2j474
3044c65k688J769M410o23m318M1L856J012j468k273j549K303L348j403l982J148
3060g82M555l2l102j153M62K541J284l105k753K062L716j322k432O15J665Q94
3076C113J97l055j815L187K459k946k851K032K477J56j634k139L29L466R96m567
$$ y = [-1440, -873, 1441, 2548, 1123, -2503, -2323, 2241, 4204, 22, -2061, 601, 2735, 1988, -393, -2599, -1417, 2498, 2179, -2860, -3492, 900, 2860, 213, -1950, -2602, -185, 2571, -412, -5202, -3976, 1142, 1234, -2243, -2841, -1590, 377, 1121, -1947, -4919, -2748, 1350, -887, -4890, -4415, -1508, -15, -295, -3061, -3786, -352, 1616, -2264, -5978, -3351, 125, -643, -2765, -3637, -2867, 575, 1480, -2867, -4793, -759, 1837, -1118, -3695, -3574, -1426, 551, 569, -3065, -2870, 1739, 2919, -1509, -3227, -1094, 1017, 1109, -365, -3053, -1284, 3126, 2503, -1815, -1774, 2082, 3094, 1626, -647, -2196, 107, 3455, 2052, -1930, -782, 3773, 3741, 639, -514, -52, 2489, 3773, 668, -2085, -23, 3693, 2371, -61, 554, 2219, 3113, 3310, 255, -1560, 1627, 4086, 1140, -1711, 321, 2798, 2954, 1320, -819, -490, 2976, 3972, -595]
3092e95j973L230J615j679j210k20J445K604p16l991r06L921Q96k745j595O30
3108a289J694R97j545k674J721L954p90m014r57K293J235n01k113j038K404K824
3124B201j749l542J227L014M69j871j841o37K258J857k088k681K455L252j108
3139A216k514n35J383J691k20k996j339L827J956k385j777J588J134N73p89k326
3155a513K01L193Q31m073j222K785K785q79j298j427M13K982o99l831M7L944P64
3172C003k526j666L33J969K259p32l228N38K591p28k602j16J530J375R20k001
3188I19k371J709K728j427k411J157J500m39j372j372L96K824J542k669k217J900
3204C97J743j180j698m26N84K009L45l358j551L660K232j719k599M00J172J287
$$ y = [-595, -2568, 662, 2277, 598, -612, -832, 613, 3217, 2501, -1490, -2396, 1525, 2421, -324, -1919, -1289, 405, 1402, -143, -2817, -1096, 2858, 2068, -1946, -2903, -610, 625, 124, -1989, -3027, -623, 2201, 452, -3090, -1863, 1151, 1620, -251, -2092, -2729, -471, 1386, -702, -3383, -928, 2324, 1216, -1298, -1833, -450, 1241, 1021, -1975, -3314, 513, 2469, 84, -1693, -105, 1029, 1602, 813, -1513, -1312, 1881, 2712, -1361, -2583, 202, 2987, 2108, 810, -617, -204, 2778, 2079, -1752, -1705, 2239, 3003, 477, -1189, -856, 1113, 3372, 2640, -588, -50, 2541, 1813, -789, -905, 625, 2000, 2920, 919, -1452, 257, 2985, 1558, -853, 304, 1804, 1365, -7, -1379, -983, 1841, 3383, 714, -1503, 397, 2140, 960, -738, -1164, -580, 1429, 1774, -1584, -3135, 525, 2757, 1038, -1561, -1161, 11, 1298]
3220A298o88l018J65K829Q26k663p74J864J011m28j206j855Q44K884l07l120p4
3237b412K025Q22q25r25l07J351J735j847l334J137L295k27j890l47P57J058Q05
3254H71j774j433J777K456k178j871j33J263R64N35j306j007K065J546k367j855
3270b447J802J368p71q71r09P01K853N9k817j172L034P09j383j228l35R90J272
3287H55o8k888O0L550R77k718j194M94J338J150j158k486O07L302m12k783N0J819
3305D95R47n02p99j815P28K070j138k032J586J594m89j520j65J15J702R61k459
3322g21j777K056J770j568k004P35K276N14k43k590m65K408J660k376j406R20
3338h11Q71P70n37j548j46L062R86l124j405J648J151q05l17o87K75K137j37k121
$$ y = [1298, 610, -2408, -2243, 586, 1412, -1251, -2025, -161, 850, 422, -784, -2639, -1795, 1089, 782, -2338, -2412, -387, 435, -390, -1315, -1622, -271, 1464, -383, -3717, -2580, 715, 488, -1402, -1749, -992, 66, 871, -903, -2336, -559, 1897, -281, -2152, -2285, -1022, -58, 477, -829, -1836, 229, 1775, -592, -2447, -645, 723, -48, -919, -1828, -1127, 1726, 1785, -1032, -2204, 830, 1539, 156, -1072, -1407, -417, 855, 787, -2101, -2041, 1509, 2486, -232, -1426, -932, 406, 1556, 398, -2088, -1481, 1821, 1409, -1374, -1324, 495, 1442, 940, 141, -1674, -946, 1124, -14, -2046, -460, 1134, 645, -875, -1040, -925, 777, 1738, -721, -2498, -442, 1328, -240, -2244, -1509, 767, 1281, 1038, -1552, -2017, 391, 2051, -325, -1731, -811, 60, 830, 293, -1255, -1401, 1661, 2647, -477, -1882, -234, 917, 112, -205, -892, -617, 1520, 1383, -738]
3356g38J39J883l3j622j07M61R1Q96p86j230J364K238j082k598L21J860J038p68
3374A327j725j182J789K378j442k348J251J675m66k13j293n12J395J611k043j299
3390a097J841J121q53q56l9K89J350k53k048r69K462R34j985q23Q99N37N37m34
3408F13j516L30K471n25k840l54J717J387lj266j557P19K368K21k787o92J769
3425E5K60l57p91m51J175R82m83j758P00R82n44p70O74P74m47R0j351p34K756
3444G62J680j652k052M62J108J69j11j023k96K130L88k279j175K144J604j53j336
3461C70j129l0J806O14j760q36J971J151r50p53p11O45J544M52k003p35J524K62
3479A432j175O02Q33n88j24n78l82J399J483j325k635O02J717K87k69l42n03R01
$$ y = [-738, -599, 1284, 1251, -371, -478, -17, 74, 970, 184, -1046, 318, 2556, 1474, -1124, -803, 1057, 2095, 1327, -398, -1580, 209, 2587, 1145, -1203, 48, 1723, 1257, 1044, -249, -761, 634, 2245, 202, -1097, 744, 1865, 1012, 156, 117, 406, 1756, 1503, -545, -1514, 948, 1882, -103, -926, -27, 510, 1047, 613, -903, -573, 1898, 1373, -1467, -1821, -104, 1283, 1280, 14, -1543, -824, 1544, 1765, -1022, -1714, 55, 315, -42, -833, -1284, -109, 873, 390, -1368, -668, 314, -230, -1000, -326, 448, 1, 91, -1260, -1994, 762, 2442, 790, -1262, -800, 308, 477, 366, -657, -953, 1177, 1565, -714, -1889, 255, 1859, 1706, 370, -759, -789, 1017, 1631, -129, -965, 1006, 2157, 1207, 454, -257, 388, 1932, 2384, 381, -354, 1170, 1432, 257, 859, 1692, 1104, 980, 402, 20, 1419, 2902, 1577, -1058, -456, 1261, 1548, 1279, 937, 434, 1335]
3497A335P59j605j586J519K193j193j154r75J5J572R49j234q36R94J146j938j293
3514a332M46J099J212J17k201j590J664J349q83k7O44n59o48j22n35N27J791l25
3532F27k470l0J552N62o88m75l48J61J433r44j658L01K033J96r45o59j49O99O93
3551a09q0j646N93J321r78r56P56J506J49o58j188j353J971K057o01j692N41j55
3569e22j63PM69J69J328J41j769j580J699J571m33p12l04L70M55N05j922N6K093
3588A458J511j864j410j33M52J026Q72j183n92R81q5j500O39J609m28l74j170
3605a91l80P85J937n11j756J07J110J28r95K41k93O8Q76j030j502J263J575k01
3623A231j711L19qL34L04j023q52J431J013j112j966N45J272R42L21j611j062
$$ y = [1335, 2094, 489, -1097, 422, 2615, 1422, 268, -707, -692, 880, 1829, 595, -241, 753, 1899, -39, -1332, -886, 213, 1425, 1542, -659, -2249, -585, 764, -119, -146, 498, -61, -709, -831, -1366, -839, 952, 627, -1843, -1873, -321, 241, -447, -922, -1270, -1109, 324, -620, -2278, -1977, 56, 252, -693, -1352, -1501, -802, -109, -189, -1835, -1242, 79, -899, -1855, -1099, 407, 556, -102, -1290, -2643, -672, 1385, 784, -908, -367, -522, -685, -678, -209, -40, 1288, 1429, -340, -1920, -221, 1350, 917, 205, -99, 271, 726, 1231, -691, -635, 1458, 2969, 1105, -305, -438, 14, 1040, 1912, 729, 137, 1118, 1033, -467, 172, 1781, 1353, 979, -191, -571, 214, 2151, 1640, -116, -9, 1101, 1229, 234, 475, 182, 250, 1126, 96, -1406, -143, 1432, 1231, -480, -161, -169, 165, 469, -554, -1406, 25, 1038, -74, -2040, -1495, -223, 719, 1040, -571, -1633]
3640a633K54J058q63J22Q29J75r25o79L8K69J366K88j501p14J363M07j073l88
3658a607O76K08O52l13j228l82J687K36j207L15Q66l82m54k16n37J129J633j285
3676b09j549l3J719N49m89p89q82J023J414k12j524M84N37j40j62k9J84N5P15
3695F62r27q44J096Q24r68k73R07KL40l67q17m73J390Q39j428n41J111o2k24M92
3715G39k90k4P67n18j671J4J779P55q04q65k14M74J241j98j850J57J311L77j285
3734a05k04r9N3J041J66j281K56Q89m57j093O41N85l79k33j44n95J174J012j142
3753H5j005Q37O19n10l47M1k77M53M14q01q00J623O58j409n19J57J37J101o6j462
3773a071l16J273R42j249l85K76K39N48K51j419k33J107L50p67j39Q53n51J26
$$ y = [-1633, -1379, -321, -1184, -1062, -233, -58, -983, -1662, -1624, -1355, 11, 299, -1202, -1916, -553, -146, -1219, -1607, -931, -723, -71, -384, -1612, -1994, -307, -71, -1278, -963, -97, -479, -933, -1149, -1686, -557, 1076, -209, -1758, -1791, -72, 477, -12, -801, -1683, -660, 754, 542, -982, -498, 39, -101, -263, -292, -108, -53, 662, -265, -1109, -13, 811, -157, -430, 477, 479, 819, 452, -365, -838, 552, 1391, -37, -578, 533, 471, 247, 739, 449, 425, 1192, 674, -997, -983, 796, 1551, 747, -118, -332, 142, 1383, 1185, -665, -508, 803, 1180, -105, -309, -408, -355, 686, 852, -429, -173, 716, 259, -834, -193, 392, 13, -220, -364, -959, 215, 1227, 85, -920, -83, 536, 26, -321, -280, -557, -104, 310, -491, -1291, 332, 990, -419, -938, -781, -644, 457, 391, -1071, -1387, -114, 828, -421, -806, -530, -291, 257, 508, -911, -1144, -37, 313, -454, -593, 260, -291, -165]
3791a65J36p15N87P35m90j316O23Q38Mn93r4L35K76K70l16j107Q30R50o72q09
3811f93K49L21K32L22m77q40J252N93q62q52M56L28L9J39n20k00Q61L95r11l71
3831e39R30J99p45jK8o3N27L89j421K65J171J88r15m94K02M47P74k37j531J92
3851f34J572K42o69o86J57N95M90n28j165k15J670k7n38N4j9j78M49N56r85r0
3871E1P52k92o64Q46Q4j163j42R60N10o1j58r90j33J151M13j373n65P96P70Q7
3891H79m80j117mJ861O28j396j392O72P78K57l5j374r8J216M73q55q61N28J72
3910a48N45L29r76m50M74N13o94K42j9Q4j85L60k5n54Nk7l69P75R10j177j085
3931a472Q22N97l38L14p17k43O47O60r63q68P29J146j6k55o45p33P49O69p41m84
$$ y = [-165, -29, -744, -157, 578, 88, -1228, -605, 233, 237, -356, -450, -115, 161, 431, 115, -992, -162, 788, 116, -693, -444, -123, 109, 431, -46, -886, 366, 959, 97, -755, -299, 29, 68, 207, -313, -513, 348, 743, -168, -539, 391, 590, -155, -156, -128, -191, 336, 725, -696, -431, 740, 928, 13, -481, -279, 168, 942, 705, -826, -634, 938, 1180, 511, -175, -18, 577, 1067, 539, -626, -841, 829, 802, 264, 318, 299, 121, 570, 1126, 141, 51, 803, 511, -153, 693, 777, -386, -528, 432, 942, 881, 723, -267, -400, 751, 1164, -209, -774, 22, 792, 879, 399, -718, -722, 1139, 1767, 371, -1021, -349, 429, 686, 651, -723, -821, 395, 868, 13, -848, -320, -148, 397, 726, -250, -700, -226, 287, -407, -165, -184, -100, -285, 75, 50, -504, -499, -526, -895, -120, 790, -387, -1472, -650, -53, -391, -77, -794, -1037, -390, 270, -693, -1561, -832, 314, 298, 43, -602, -1335, -586, 83, -658, -1142]
3951a142J138J63k64o69j45L70O76L89p45o88N10M16n68K07N67L8m5n3n92j51
3971e88R38L65o62o93O42K96K66j79p27k83J161O29r63J64p9k03k49M16J4k19
3991D6N74L6k59r9M10q42k02Q07P29l92k53r57k38J189Q73r40k87N09N36p27p25
4012b12q03J042J454P8j707j096N97J364L98m56o13p64J255K79j291o63L22J253
4030D37N65n05j084o34P64J012k70n72L0l41k12O06N24j052P6K03L9K54L80q76
4050f56o02N98L01m19l40N4P24J86K67j355r87J444J053n1j273j13L3L10P91n71
4070f06r24J235J133q94j161l53J98R92J133l48j584J82N20J24J11O44j69l78
4088a45M8o09k7P76N73l90m52N68k41n10M58M42K48j86J20q38J65P26m1m67L86
$$ y = [-1142, -4, 159, -105, -774, -919, -549, 127, 516, -229, -917, -407, 9, -559, -352, 215, 253, 208, 155, -437, -588, 350, 715, 53, -640, 2, 298, 564, 385, -342, -625, 536, 1165, 202, 366, 287, 84, -165, 251, 265, 46, 620, 656, 397, 298, 708, -134, -336, 471, 1200, 808, 555, -402, -640, 549, 1422, 482, 195, 704, 1240, 513, -212, -1015, 27, 1481, 1559, -148, -1244, -647, 717, 1115, 659, 46, -718, 537, 816, -475, -1138, -816, 437, 1002, 497, -587, -1221, -457, 555, 285, -287, -257, -598, -810, -204, 320, -732, -656, -453, -414, -160, 220, -656, -1258, -660, -359, -778, -1118, -1064, -340, -154, 113, -1242, -2229, -785, 268, 217, -1056, -1169, -1136, -826, -35, -606, -1530, -295, 838, -56, -1217, -1570, -1372, -380, 753, 405, -1179, -997, -477, -353, -242, 402, 233, -145, -97, -706, -733, 43, 616, 226, -226, 342, 101, -409, 49, 491, 739, 553, 673, -165, 0, 726, 685, 218, 604]
4109F04J37l5J44j97n76N04J040p28j070M39Q17J61n6m51n28K53Q70k91q00N20
4129G57K65l37l99k55L91P80P03j192j506O00R57j0m92L35l82K94J47r08o11J345
4149D82N81k45n43o37p44O96R48k37m92J51k10k36K60j42K16j12q3Q7k45J0o8
4170e63n22P70P82q27p51L8L02O50J69o91q00N68J241q30q47L81M35P20l74n07
4190f56r23Q49J433p21j272J96O11N81P2k16o25nJ058m71k60n8L63K21J99m75
4210i9o26N70Q33l54l17N84q3n86J7P16k92K61o3l14M7L80k31n54M96O41l74l55
4232B97K34o07O17O04k51p58K89Q16K2p25l36L89R8P42o92j059N01J073J81o40
4252G95m32j37J99M49m33r06O04P72j34n36m10P5L57O96m46p50mL22j79k6J40
$$ y = [604, 741, 706, 850, 653, 77, 581, 1621, 893, -177, 262, 1079, 1240, 1184, 733, 205, 458, 1328, 1037, 237, 757, 1022, 685, 286, 31, 422, 1202, 1905, 713, -793, -193, 764, 754, 262, 597, 215, 509, 656, -252, -863, 482, 1063, 818, 275, -362, -1106, -410, 538, 301, -191, -40, -250, -486, -226, -368, -152, -264, -347, -260, -505, -495, -563, -1085, -315, 467, -360, -1111, -1073, -771, -121, 48, -643, -1443, -875, 366, -464, -1311, -930, -495, 225, -149, -656, -1579, -730, 703, -18, -1290, -1094, -483, 98, 170, -46, -671, -676, 382, -89, -349, -407, -44, 177, 376, -99, -725, -155, 678, 324, 7, 591, 508, -78, -61, 655, 363, 624, 561, 247, 294, 674, 443, -111, 385, 1026, 652, 297, 531, -76, 541, 1145, 894, 136, 425, 1241, 1263, 538, 202, 591, 689, 1431, 739, -320, 181, 1254, 1435, 795, 363, 226, 425, 874, 441, -465, 139, 911, 777, 241, -169, -94, 263, 959, 513, -237, -241, 81, -98, -124, 16]
4273A6K89k93K11l9o14O2J24nJ54M23p83k89K16J52O49J19k65j140J64J308m71
4294a2o04m02R65J34n4m62n85N18R57k21j086J4J97L70N40j99j034L55Q67j18
4314A40q74J65N16J62o8m55m29J43J015k47l45l2K32n30L25O29k47J07k90n09
4334e92l6M25L83M3q2K80p80k9M54m07K77P37m5j106q8N06R5K96L84m49k2Mn06
4357b58m36R19Q10m92p61l56P2P98M38k49o51J61M40k76j63J81J59M32K36q91
4377A13o89L31J269n60l33K0k32o5M23K34l08L54R8n08n97Q26k99N07k65N1o79
4398c09k85L23L87O20K87o12q65k77P59Q32j15k58p90j50P56j74l75J34N84L69
4418H41n32l23j326O27J738l3r44o93n3M64p3L09k51M76L61l74j040M1P36K61
$$ y = [16, 305, 12, 223, 184, -430, -368, -244, -249, -95, 328, -455, -744, -528, -376, 273, 392, 127, -1013, -849, 459, -12, -616, -1018, -53, 81, 27, -435, -1020, -502, 455, 234, -852, -838, -641, -271, 269, 70, -964, -609, 258, 140, -734, -569, -53, 109, 41, -414, -843, -700, 315, 68, -277, -309, -77, -607, -282, 347, 100, 207, -83, -592, -628, -203, 180, 223, 141, 421, -359, -388, 66, -341, -64, 673, 628, -478, -566, -60, 35, 331, 715, 266, 244, 248, -258, -694, 225, 1035, 543, -218, -574, -502, 296, 734, 485, -166, -5, 435, 159, -4, 177, 336, 768, 1004, 113, -576, -245, 1024, 464, 131, 151, -81, -146, 277, 511, 203, 557, 655, 147, -450, 376, 77, 584, 319, 370, -309, -594, -271, 116, 736, 1023, 411, -454, -731, 28, 860, 745, 487, -303, -453, 303, 129, -246, -112, 472, 841, 309, -14, -1340, -713, 1025, 992, 48, -645, -698, -234, -307, 2, -249, 227, 588, 214, -826, -785, -49, 212]
4438B12J96k23o87k46P76K15k79P8j39q26L68N65l0k96Q0R5k9j84M70k03n13O78
4460G8L48p80l27n20M45J369M33j256q98N02M69K83jM8l36K63j78o75L31J069
4480F67j20l01n61K95l79O61R6j94K07M77q00p97O87O63K24K0l94r41M27R43m92
4501C88l57M51M44j78m46k35J01N36N25m55q56L13J38Q7J93K77l25J3p6o7k91
4522A80M35r0n04J48J21l6K24R2N9m25O71n12r31M88R00J87p86l05k98M80O21
4543G19R7j190m3Q36j23o60Q4j05K91O75l81p78r4N58M79k78p1l28j02K12l73
4564e75N1L69L18l09l09Q3K89k92K82j51l06K13K44m30k39O10K55l44l30K71k86
4585e86L33M51r23j17N50M01o43N4K29o7K94ll28n72P02K17r9j9kj10K90M2k29
$$ y = [212, 408, 185, -502, -748, 28, 243, -36, 42, -97, -923, -555, 10, -20, -316, -236, -141, -170, -354, 116, -87, -600, 78, 426, -354, -681, -1201, -756, 613, 1046, -210, -1108, -606, -137, 146, 145, 193, -143, 120, -58, -733, -402, 667, 547, 246, -315, -20, -399, 262, 358, 164, 371, 848, 48, -749, -62, 601, 825, 845, 451, -490, -63, 880, 388, 31, 482, 926, 748, 302, 67, 168, 704, 1229, 774, -82, 231, 369, 456, 649, 926, 601, 614, 538, 471, 180, 615, 525, 21, 169, 290, 254, 478, 570, 629, 204, 875, 363, -568, -80, 820, 1007, 221, -84, -382, 98, 719, 816, -374, -417, 419, 296, -364, -280, -385, -94, 581, 200, -578, -672, -114, 365, 87, 16, -312, -414, -202, -575, -524, -155, 163, -146, -455, -372, -83, -375, -93, -244, -550, -337, -93, -523, -762, -152, 103, -241, -571, -300, -586, -253, 198, -725, -842, -292, 109, -534, -480, -251, -318, -24, -27, -355, -927, -225, -8, -107, -126, -128, -238, 52, 94, -135]
4608a35k8K21K46l73P1L87j49k68K37j91J7M52l57n90J118K81l54n78j87K37L57
4629D14O07o08p16K95P08q6n66J68KK32M27r19l55O47O04o38m6L80j0j28m68J71
4651A15j20M92K27n28l42N04K34j82l9k72NL96j79n43K82J43K3o63K76K89o1K65
4673C22k90n28J32O77j79j064M76J57K48J4l26m56N03O94m67o87J60M98l51k05
4693f72L4j26O93k64j93l44M83J74j40k74K91k67L16J37l92l31N76N31n31j28
4713d27M9j71L28j86n24M78O26k66m45m13O42P33o53k03j0J94N48o8n79K03L10
4734A66Q4l97L37j87P5J82j27l49J92L78O0l27R4M00j37J8k86j45J33K44j92k69
4756e3K26O24l23k77j32j52N37L33p11J4K53L63m73j83O8J57M92k28m44n21M50
$$ y = [-135, -163, 58, 304, -69, 2, 389, 240, -28, 209, 18, 35, 487, 130, -460, 658, 939, 585, 7, -180, 57, 414, 1021, 413, -303, -8, 700, 614, 48, 216, 218, 450, 877, -42, -397, 250, 854, 216, 170, 550, 540, 412, -56, 115, -5, 487, 714, 186, -156, 348, 582, 400, 361, 89, 94, 490, 311, -232, 50, 193, 216, -447, -171, 118, 57, 322, 32, -496, -364, 313, 134, -930, -454, -297, -49, -35, -361, -817, -314, 380, -87, -774, -614, -116, -467, -672, -638, -764, -71, -335, -528, -872, -389, -215, -355, -629, -338, -605, -289, -152, -544, -875, -299, 232, -299, -427, -378, -549, -221, -407, -931, -453, 173, -93, -538, -951, -309, 424, -229, -432, -442, -248, 300, 232, -347, -144, 166, 250, -147, 190, 3, 78, 260, 133, -216, -24, 354, 414, 87, 181, 581, 444, 462, 176, 31, 164, 408, 216, -53, 173, 797, 474, 197, 65, -87, 450, 783, 72, 86, 339, 702, 229, 46, 114, 271, 763, 535, 91, -430, 20]
4777B0Q18o41m68J76J92P2L86n00m43O71J1l27j00J06P4n3L1l01o0M23k68m43
4799f24L01M56Mp57j56m0L14N35k99n08N03K15J25o81j49N21J3L97p49o39L75
4820h43P47k03j11l71M01o8L28l86K75J64N7j80k52m5L05p6J01L25k40O2l11m21
4842g42M69P79k31n67m08L76L29L27j8o84k4P99O5o15j22J47K75M26o17n3k99
4863c88Q62K06l57j52m06L00K60J53l67q7L21k37j65M8N59j87j2j27k86J22j16
4884e6K34j25P01m8o50l38Q6P36o2J32p56l72N24P47o21n12N26K67O6k40j018
4905g79m1R63O66o45k19L8j40L04M42n78j59q3L92j10j62L85l17k59J70K83j51
4926@l82K8J08N32R5n61n30L50P54J23m04n45m38N31J031o09o40L46L16J3K0r09
$$ y = [20, 838, 197, -271, -95, 97, 169, 555, 55, -388, 283, 294, -33, -133, -27, 47, -6, 25, -276, -336, 87, -181, -624, -323, 133, 137, -620, -776, -816, -502, 33, -266, -774, -271, -56, 69, -612, -761, -240, -227, 170, -579, -1218, -843, -96, -299, -410, -781, -380, -448, -120, -506, -231, -67, -10, -190, -442, -487, -182, -258, -157, 168, -72, -10, -321, -742, -273, 506, 275, -292, -700, -324, 5, 332, 314, -370, -394, 405, 470, -145, -267, -120, 155, 581, -36, -89, -388, 474, 680, 323, 171, -235, 65, 325, 478, 111, 24, 345, 108, -57, -9, 550, 363, 351, 224, -62, 60, -56, 178, 53, 754, 706, 56, -282, -196, 540, 478, 610, -146, -518, 6, 753, 132, -380, 146, 413, 479, 239, -779, -820, 143, 809, 164, -55, -17, -157, 147, 589, 11, -148, -231, 161, 51, -111, 274, -43, -302, -132, 151, 0, -382, -354, -246, 286, 381, -180, -710, -360, 394, 517, 113, -432, -870, -339, 692, 83, -557, -211, 105, 118, 138, -771]
4948g71k38J148O40k05j044l62O22J35N56l53l80j87n0M7J79N27Rl63l8L31n40
4969c37r4K00k44M86Q39r27q59K52Q84M54n54m64J94r0M67J96p99J73O7L34k2
4990A56k94j90L64O83k71p97k43N49N94m15R0k89nkQ1L51K96p5j046q9N60J58
5012A66O9rl4l65P22N4j119l75J149N18k9n93o36J67N06O18o13m46M17K10n08
5033a31j5J6J92L17J29k57n47M2K75l6J90q0l72j29L34J33m8J39n8o32N17P19
5055F98p51l55j86N01P94l00p52p02P30Q32O1q46n37L46O47M97m96j103K5R48
5075E1J39m75K15p46P03K61j04n64n8M82Mr6j84n7p1J61J29L66k64Q9o93M00O41
5098C29j04p26J6J78L28M74p28p80P69O21k4m89p14K28P29N25l59j126J48J022
$$ y = [-771, -1009, 139, 779, 574, -470, -832, -210, -75, 481, 128, -252, -439, -489, -442, -263, 264, 273, -90, -128, 203, -337, -431, -231, -475, 11, 850, -77, -936, -684, 200, 654, 100, -364, -170, -260, 207, 403, -396, -223, -156, 178, 156, -138, -328, 36, 719, 448, -349, -592, -43, 551, 136, 226, -63, -68, -70, 11, 362, 658, 583, -463, -552, 8, 166, 235, 226, 192, -173, 549, 603, -516, -891, 258, 776, 747, 154, -482, -315, 191, 809, 196, -250, 167, 377, -131, -146, -130, 62, 379, 508, 251, -296, -254, 21, -15, 175, 95, -277, -406, -72, 61, 13, 152, 94, -538, -21, 698, -53, -408, -594, -93, 701, 401, -351, -1053, -323, 509, 570, -276, -813, -467, 180, 677, 181, -922, -897, 51, 190, -285, -70, -816, -113, 148, 44, -520, -578, -96, -92, -188, -372, -429, -500, -339, -210, 156, -108, -19, -712, -312, 329, 225, -501, -485, -307, 21, 495, -233, -1013, -244, 377, 353, -136, -850, -622, 107, 632, 273, -853, -705, 317]
5118C17l03L10l59k79J33N72K4o31K05R2k35J75N05nm81m66M38R4L36J41n43l09
5140b69Q95j42J44p11R0M22J80j57q64M6Q94L52k07o05j48K51K03J47l98o2L78
5161D39J09l00l29J50NR5L91j73m93mJ56P3N28k14j40m89R5L26K32k88l71l40
5183e42N97L73k06q74K16L49N97M0q14m95N62O18N7m34p97K89Q62k70j24l95J32
5204b59O28l40m20J08L87r9L98l77n98L3M18j44O38j6l41o90K14N19p4Pj68k40
5226d16M93K1Oo73K51O95M52l31r77j97Q47L63J45j003J88K91j4K63j69J4q0K04
5248C73j42m92J34Q39l41k54m12O90k44J15J13k55Q3J90k03l95J63O51m84M34
5268E63m10o64R46J47j83m31K36k29K10k60J22K69M26M8o72k19J71l0K30L50j63
$$ y = [317, 14, 324, -35, -314, -181, 391, 415, -216, -11, 81, -154, 21, 526, 521, 40, -426, 12, 106, 442, 583, 40, -269, 626, 484, 628, -83, 7, 429, 609, 452, -412, -366, 528, 880, 673, 68, -80, 171, 374, 521, 123, 61, 439, 548, 248, -81, 69, 74, 169, 560, 387, -106, -110, 46, 119, 647, 433, 293, -196, -101, 225, 457, 169, -202, -542, 55, 428, 222, -652, -436, -87, 510, 550, -264, -759, -197, 421, 478, 44, -753, -464, 398, 128, 4, -391, -259, 369, 29, -391, -283, 104, 5, 403, 26, -572, -539, -121, -265, 373, 357, 16, -674, -460, 59, -15, -8, -176, -416, 77, 98, 104, -569, -318, 377, 829, 498, -479, -676, 171, 534, 679, -324, -136, 155, 141, 404, 235, 249, 169, 373, 231, -261, -127, 712, 371, 117, -295, 395, 151, 266, 379, 124, 207, 397, 194, -201, -38, 613, 129, 563, 153, -511, 435, 582, 399, -32, 204, -25, 185, -75, 47, 316, 742, 790, 118, -101, 70, 40, 270, 620, 457]
5289D57j20k50k02k03J79O28n2k68Rl06K40j9k35K8N35m4k84p10M1P79J61m4m84
5312a64n75M79L15j46m53J52O78n0J14o75j20M68K31j55m03J83J94P8k40k42j14
5333d45K00J31K78p9Rj8l39j41M75l3p4j1K60j76K65m46m86M78O99J86q23l94
5355d84m49R00N88k8p05M8K01J5m47l34N59L80Q05q25q41r7Q83Q6k22P9J51j20
5377A43Mr6n37K29O55J6l06j85l6K78L15j19j92j93L05k02K21K70m43Kjj55K09
5400A82K70J43n93j3J40K13l08l5L75q4k26j38k73M69M92m7n69k04L09J17j57
5421F3j74j01L85J64m56l18M1L75N08k70j81j05J96l12K87q22N47K34L7k07k0
5442a29jk37Q03o20j06N43j31K2m48l62Q63l38K80m45J71J49J22o21N9O67r8k22
$$ y = [457, 337, 87, -115, -318, -139, 489, 437, 169, 178, -128, 112, 93, -142, -114, 421, 377, 93, -617, -576, 203, 364, 320, -164, -739, -260, 55, -91, -544, -392, 286, 236, 350, -325, -445, 23, 254, 99, -304, -121, 73, 151, -89, -331, -445, -245, -114, 164, 85, 94, 76, -263, -404, 71, 38, -36, -47, 213, 37, 302, -144, -630, -152, 547, 733, -90, -484, -933, -33, 555, 527, -178, -130, 71, 86, -361, -695, -136, 244, 1049, 224, -617, -714, 169, 255, 33, 112, 263, 143, 147, 51, -486, -257, 398, 414, 108, -77, -113, 165, 480, 361, 169, -24, 281, 79, 300, 570, 127, 129, 128, -27, 182, 452, 595, 2, -11, 129, 342, 34, -1, 374, 290, 64, -74, -347, 122, 614, 567, -2, -206, 103, 220, 63, -111, -212, 173, 337, -119, -437, -396, -21, 487, 217, 36, -69, 127, -185, 102, -720, -173, 61, 98, -109, -129, -130, -367, 436, -184, -290, 253, 122, 144, -304, -666, 197, -141, 139, -306, -135, 14, 136, -485, -426, 241, 143, -79]
5464g9j22k4K23Qj10k43J39K91N4m61j51K81k02Q98o18k11J8O71l47l12m6M47
5486A04k59L04j57j96j48M31p0J31K17m90J06J16l85oK42M36m01n76M36J16M6
5507cl0m8LJ13m2j47r2O16l23j66Qj47K75Ql7p2r4P68m16k06o1K22r1J97k17k23
5533b05J43N76o6r34M92L68k27j87j30l6L53K45l73m63L48M22J0k14M1m52M49
5554A60j48K46m99N4L73m0m19Q8r6J54R0j05k49K39J09j60M7K82n8k52k1j4l7
5577b56l9O23o88L9L20L06p44P0K24N9L08j67n04NM94J77n95q0Q9L9L35J48p89
5600f26j76P74J77m11l81J90K87R1j4j98r4L76Qn80L94L69l68O5rKJ8l5k31n4
5624d26M72Jl39k22L34J06N6q5j13L26m9J45j00n18J96K89P2j43K24m57M23Q8
$$ y = [-79, -201, -225, -2, 6, -104, -347, -208, 83, 137, -324, -475, -194, -396, 502, -116, -327, -309, 362, 15, -297, -343, 104, -155, 149, -8, -204, -352, 79, 9, 140, 357, -133, -27, 89, -296, -302, -60, 376, -25, -601, -165, -49, -3, -33, -81, -78, 35, -7, -154, -246, 370, 47, -119, -111, -258, 17, 25, -12, -84, -178, 590, 174, -32, -93, 129, 38, 235, 18, -205, -62, 514, 448, -486, 6, 374, 147, -40, -170, -206, 147, 392, 19, -444, -96, 326, 336, 122, 163, -289, 160, 12, 258, -241, -187, 186, 146, -273, -185, -281, -127, -37, -142, -391, -152, -43, -203, -156, 126, 68, -184, -205, -219, -256, -295, 328, -360, -321, -1, 305, -439, -369, -145, -86, 222, 55, -449, -444, 50, 227, -368, -448, -359, -320, 15, 163, -626, -802, -28, 149, -262, -643, -453, -166, -75, -89, -287, -381, -5, 3, -577, -183, 186, -182, -117, -126, -124, -106, -141, -372, -426, 46, 47, -292, -514, -180, -74, -18, -103, -216, 110, 61, 206, 106, -412, -216, 73, 145, 2, 226, -231, 192, 280]
5646B80p37R9N20J97l24Oj25J16N79o10qP4K3M45m96l07kK13M67Q8o78L60j40
5669D0k3j47J91K30R5l60l5k6j17M35R7m24p4M22p20M75k23l2J2N08l75q7K1K90
5693A73j76j98K30J07j89K25m23k40O73K4l00j65p1J50L31k94m59O6P91j29k16
5714i0Q6K69p93J54K66j92J99M26m69l38J23M44q1j42N52p03K11K19j90l81P8
5735c52N31L17j35k51l49k56M76L56j27k27N35n81k65J92N57j13l3l50J05L6M51
5756E17l11l59K77l3l5J43L53p17K69J23j92k48Q54k62n74J06J16o3L97j71j78
5777A2k77M21N7jk25j52M5M06K68l28j7r6k11k64M46M60k42j73j24j78N24r8j80
5800G3j51K88N7o79J86k6j0M59N8K37o59J43J55l21J22L53j16j20Q0n42j75P54
$$ y = [280, -457, -358, 162, 359, 35, 41, -84, 32, 611, 1, -7, 67, 90, 535, 39, -268, -270, -57, 410, 498, -180, 180, 40, 17, -130, 61, 291, 386, 26, -9, -35, -152, 283, 380, -44, -118, 304, -416, 59, -164, -196, -184, 324, -51, -138, -117, 173, -3, -201, 29, 136, -53, 172, -251, -491, 182, 206, -94, -259, -330, -180, 151, -143, -602, -536, 255, 126, -90, -4, 265, -528, -374, -108, -300, -101, 325, -144, -482, -359, 85, 4, -138, 414, -289, -78, 141, -49, -430, -352, 179, 496, 361, 110, -239, -495, -19, 337, 210, -17, 518, -63, -328, -136, 421, 308, 275, -75, 30, 66, 517, 206, -153, 124, 91, 56, 199, 552, -165, 104, 227, 35, -213, 641, 379, -195, -89, 27, -36, 361, 190, 12, -265, 156, 213, 212, -13, -165, -120, 286, 554, 226, 209, 113, -98, -362, 84, 544, 302, 129, 5, -173, 351, 253, 73, -78, 210, 267, -412, -226, -252, -262, 197, 255, 492, -167, -24, 131, -190, -68, 285, 169, 49, 129, -413, -588, 166]
5822A66K86j60o43m5R8K00L78j08l40J85J53J34k4j28k24m93M75L69j32o7j36
5843e6n73N47L51j28k13O6J83l32J91l21M3r6L68k7p7mJ81j91j71K36j58J62M49
5866D30l78o12J55K37O81l45j81l30K58L35r6k57K12j63j34r1L87m00j28L58j09
5887a71K40K94J43q75J22J86L37L6m86Q5j72O26M9l32l09O6R8K04lJ9O9k5J46
5910C47p82M31L06j11l45l2J26j00L22p0n37O10Q6k84j0J37O9k53M04j54P9Pj94
5933E2l48m2L75L21l78j7k61j65Q46J79m13n33J14L23j52M37j17l38M5L51n6k74
5955e1J88l53k8k7M38K3k42K0k13L9L40J33o12J99N10m09q4K4n2L53j51p7o11
5978f43O16K57k39k19k39K85L00L82o83m98J64P90oj14q71L37P1O09j5p14j58
$$ y = [166, 452, 292, -351, -396, -298, -98, 280, 172, -168, 17, 170, 304, 280, 152, -72, -565, -90, 279, 147, 80, -56, -629, -82, 269, 141, -72, -6, 177, -155, 36, -285, -242, -338, 30, 3, -74, -78, 103, -88, -259, -23, -181, -19, 430, 52, -560, -405, -168, 513, 168, -13, -343, -85, 250, 154, -103, 109, -54, -188, -279, 108, -292, -420, -62, -171, 69, 363, 506, -369, -247, -61, 276, 312, -174, -89, -261, 365, 414, 82, -227, -161, -63, 141, 138, 157, 226, 201, 347, -435, -4, 302, 191, -154, -186, -60, -160, 162, 92, -445, 165, 251, -33, -43, 94, 163, -90, 314, 160, 239, 246, 52, -296, -338, 37, 358, -20, -37, -298, -463, 383, 562, 149, -384, -270, 53, -99, 338, 221, -117, -72, 279, 223, -51, 137, -216, -244, -271, 167, 190, -52, -32, -245, -206, 134, 267, -345, -146, 364, -45, -129, -105, -157, 196, 45, -32, -643, -27, 230, -9, -228, -467, -182, 118, 500, -183, -681, -517, 273, 267, 153, -718, -381, -310, 299, 284, -430, -588]
5999e88N08J45J03pj40j12K29J72k81M06k30l39l93P25o2m19J16o2J41L06Ll05
6021h4P4M21k17p8k12J06L37K37n35l89J99N30K05q50K15J4N38k55j1l21k73N62
6043B13n0K74k12k95R7O4p7P2j5J86l20j43J43J32K62j04m21N99l63M34j90n74
6065b88L23L91l30j99J89k29L3L03m66K78J16N5j05l39J57NK26P8j74l14J86K2
6087h2N2Q6j8l33J24n0L03J46j4l02k59K53M79m70k12K17j56N35m7j98m50L9N38
6110A81K12l77j11k93K04K31mp4k60L36J35j76J20j52r8L58j65l91K24M39j03
6131B36N1l3l92Q4k5L17J68l15O5%%M30k03n49M42J33K7j20j20p87P22L60J8n49
6155d0J93pJ06O07m75o31O3L67N77m69k5m0k94K99o4O7k72J20p6l6M20j37k32
$$ y = [-588, -80, 65, 168, 161, 21, -91, 138, 310, 29, 435, 205, -134, -527, 198, 136, -283, -167, -229, -88, 218, 221, -84, -10, 411, 194, 116, -96, 10, 347, 584, 49, -340, -141, 389, 594, -256, -41, -27, 511, 256, 245, -76, -349, 213, 163, 437, 225, -70, 27, 91, 14, 86, 71, 257, -63, -206, -63, 69, 331, 227, -194, 405, 42, 476, 286, -288, 35, 426, 96, -103, 86, -143, -110, 193, -273, 5, 121, 176, 71, -268, -111, -106, 120, 198, 24, -290, -104, -82, -30, 56, 38, -295, -171, -221, 82, 228, 214, -88, -347, -94, 385, -85, -297, -80, -236, 299, 252, 54, -396, -357, 181, 393, 16, -95, -388, -184, 47, 43, -31, -291, 45, 180, 4, 124, -28, -126, 232, 67, -324, -100, 339, 236, 287, 254, -138, -54, -79, 238, 406, 91, 156, 156, 156, 586, 383, -166, 276, 409, 436, 316, 196, -591, 131, 491, 509, -40, 153, 146, 252, 859, 384, -247, -184, 183, 760, 291, 266, 226, -68, 231, 167, 234, -38, 82, 6, -30, 390, 253, 21]
6178B1k18M68J77k00j45k92O2N80j85j48k04R4L57l68L43m13ML39L11q29k13P05
6200B46l15M23k29o6o74O31L24m07l3N4n4N3j25J45j79j54N78j17l28M38j33l06
6222b28L05R9o2r8r0l95M52M5j11j7k60N35L1k27k6j10J35M85m02k14j13N24j94
6245F4k70J14J8P8J43RM5m1k92j18N7L11N4Q9K7l11k05N02l18j54M53J77k93l96
6269b57J0J07L6N04l61Q6m32K21K82j00J36l91l64P80K06p77J02j22K01m4M3j36
6291b70K71Q7L35n24k51P1q6J14L54q1k84J31J09l65L92L7l04r8N52j89k8j43
6313a70P0j30K29Q6l20k53L12J95J37k70l22J39J10K11k67j38M83k1l05K64l12
6334b72J20l41P33j06m86J03K4K3p6J13Kj37J20q3K11j06j10l67O21J28m1l02
$$ y = [21, -197, 271, 448, 248, 103, -189, -127, 453, 268, 120, -84, 10, 367, -1, 342, -71, -67, 272, 583, -246, -459, 246, -69, 354, 125, 59, -615, 16, 340, -67, -100, -46, -100, -47, -172, -27, -206, -360, 218, 101, -227, 211, 78, -228, 77, 176, 114, 16, -74, -469, -17, 28, -83, -100, -360, 175, 206, -21, -47, -157, -22, 463, 61, -153, -266, 258, 64, -206, -92, -74, 4, 147, 156, 201, 160, -132, -250, -193, 118, 172, 261, 288, -23, -228, 274, -44, -198, 255, 432, 139, -257, -247, -140, -104, 400, 39, 125, -307, -86, 196, 96, 232, -159, -523, 257, 463, -314, -212, -334, -133, -177, -134, -270, 1, 88, 423, -101, -352, -281, -367, -253, 101, 20, -264, -133, -24, -389, 3, 40, -264, -362, 190, 1, -27, -170, -100, -230, -1, 85, -235, -488, -176, 19, 156, -114, -436, -297, -187, 24, -243, -381, 102, 81, -224, 40, -272, -152, -493, 240, 134, -352, -249, -225, -202, -278, -165, -163, -300, -180, -263, -52, -158, -268, -635, -14, 114, 73, -229]
6356b29J01J95j48K51k76j04L9L84L3n00O3l7n7L78L3j81L7K68k68l13L68j60
6378a23J74j2J06k02J65j04L7j7jQ9k81K27r9j21K45J69l58O0L39K49p32M13j76
6401D7p9J39K93k13n69R09k19n50N3L18k04M54K4m15k55M40J19j40o3j02K15k43
6423d1K62k20n8N2L7k59J82N45o43q6k4J60K52J27m22K65J19n8k18k16l0M1K11
6446b2J60j82k57M60K45o12K86K61n44K08K82k67l40M89j74o0K31M1L3l89L13
6467A62j36j88M47J47n88J62L53j38k60K07j80K39k79k77L29j43J96n3J36p9k07
6488a50N4J93p8n9%L49m4m69K02J76k03J2p2k95L24L99m15m69M84m9lj43J34r3
6512b15J63M31p14L90j20J64p5q4j0J84q4j11J14j86J0N74o23L50j48m4j78J04
$$ y = [-229, -128, 67, -81, 170, -106, -210, -171, 213, 246, -254, -191, -228, -285, 93, 126, -55, -18, 250, -18, -331, 37, -123, 51, 39, 145, -57, 108, 4, 41, 24, 23, 112, -169, 58, -41, -162, 83, 252, -106, -46, 293, 542, -190, 223, 47, -32, 107, 400, 187, -382, 527, 308, -242, -189, 129, -75, 379, 403, -12, -267, 173, 292, 152, 89, -13, 202, -41, 221, 1, -57, -5, 32, -227, -45, 500, -143, -229, -253, -93, 159, 286, -136, 129, 248, 190, -28, -244, -274, -233, -22, 138, -44, -301, 159, 404, -208, 78, 339, -205, 3, 285, 18, -322, 167, -7, -67, 164, 205, 238, -151, 162, 26, -162, 285, 432, -156, 6, 359, 221, -39, 168, -12, 227, -52, -329, 0, -143, 53, 0, 136, 57, -150, -96, 97, 19, -40, -40, 309, 265, -204, -2, 174, -29, -17, -89, -384, -60, 339, -76, -545, -61, -110, -113, -256, -122, -215, -52, 379, -335, 55, -65, 99, 24, -60, -70, 114, 30, -81, 33, -153, -143, 431, -192, 158, 10, -34, -212, -108]
6534a08M9m61Q95j20n95L56J34k10P0L18l0l21j50J57n9j22O10n43o4K08N1j70
6556a05J26j95J54j68K92m71K83r5K15j65J04J50j31j43L11k11k09O73l41O2l14
6577a78K39l43J41J10j72j6M94k66p6J58j64n7K44J2k28K34l08rL3p0R2K44j35
6600b1J00k40K60k09j58oK46J40k70j64K89k79K60J95k7o04N00L05l27O1m36M58
6622G3l09J50J46k88J57j39R8j69K44l17J79k73O84m09J53j36K03j75Q1j30j1
6643a88K55q5j21J64n9l56K23J66j53m5L90k15J30J45k82l38O5N62j43k09Q6K57
6665B49k28L31k16l91L57K27k18m2J11j35l64L53Q8j52K47Nk05n4O5P5Q7k17K3
6688dO1o4K51k85K78k05j7r2K24q4j97M15n7Ll9l6k9l29M13j54J20j43L5J12j22
$$ y = [-108, -59, -520, 375, 255, -340, 16, 150, -60, 10, 328, 298, -23, -173, -16, -75, -197, 413, -130, -194, 14, 65, -105, 21, -174, -20, -188, 104, -367, -84, -179, 36, -129, -25, 125, -6, -149, 162, -49, -258, 415, 74, 136, -178, 61, -282, -141, -31, -203, -219, 275, 9, -67, 91, -73, -130, 114, 126, -102, 132, -176, -185, -152, -222, -130, 114, -21, 79, -161, 99, -110, -268, -274, -28, 112, -158, -322, -33, -312, -52, 143, 116, -488, 12, 317, -10, 51, -385, 73, -236, -86, 60, -228, -71, -210, -112, -281, -37, -354, -175, -448, 236, -173, -20, -156, 47, -128, -47, -177, -188, 67, -18, -139, 25, -34, -390, -167, -1, -154, -199, 191, -24, 106, 251, -31, -369, -304, 258, 115, -94, -8, 249, 21, 352, 136, -255, 102, 329, 111, 69, 180, 45, -319, 34, 122, -30, 217, 222, 17, -37, 28, 103, 190, -27, -4, 57, -7, 244, -41, 237, 32, 15, -77, 147, 63, -134, 281, 224, 227, 188, 152, 123, -206, 207, 53, 173, 30, 65, 177, 55]
6713E5J50J02o28P4K46m2j2K26j73Q2J21m73O1J50K0j68J44J02l16J35P6j53M5
6736a76p1L95l62Q3J15k14j63O38j89n91M56J69n23L05n4J31k49L36k99M5K41
6757B3j01k13Q5K76m06Q0K72o1l99N58l15J8N5l5Q5m82K48l5K94J73K26o69L35
6780A2k6j25L07m5j72NL54j69m1k07L03p4r4j1mJ69j22K5k71L49M38m63k60J88
6804F6J91k63J03J20omj55L5o6J73J83j01j20L24l72J12J37m6J40o26N01q8k49
6827a1N9J03q9k15K07o0J75J98k95j90L38jk37n15M00jK77J75l64k25J38r7K88
6850E8K80j01k87r2K7pR8J67l04N9k21O39k71j55j32j5J33P9P7l21L71j62k18
6873b98O24m98m4K45J03j83k83M20J99l88J53J79k72J12J52l69J46J26l24L77
$$ y = [55, 205, 307, -321, -247, -1, -43, -55, 171, -2, 80, 201, -272, -211, -61, -41, -209, -65, 37, -279, -144, -68, -221, -176, -247, 148, -214, -131, -16, -230, -393, 245, 56, -535, -79, 90, -433, -128, -182, -51, -300, 36, -263, -218, 23, -78, -291, -206, 70, -336, -256, 16, -45, -444, 114, -201, -183, -128, -163, -78, -560, -312, -347, -53, 120, 346, -323, 12, -14, -139, 168, 123, -49, -44, 310, 141, 100, -107, 196, 122, 28, 17, 13, 182, 60, 85, -186, 163, 601, 138, -122, 66, 257, -6, 97, 217, 211, 207, 52, 87, 21, 194, 377, 276, 156, 480, 108, 220, 357, 311, 451, -175, 326, 238, -11, 48, 151, 62, -153, 54, -6, 169, 367, 72, -118, 220, 219, -18, -533, -133, -134, 143, 318, -46, -271, -133, -230, 58, 338, 237, -50, -142, -115, -122, -24, 143, -161, -102, -323, 316, 45, -110, -242, -257, -124, -45, 32, -289, 82, -80, -298, 326, -172, -216, 29, 132, -51, -334, 86, 285, -103, 50, 229, -43, 69, 221, -148, -2, 124, -200, 177]
6893A77m9N8l74R2R2J65K8J7J69k87l2k4J97J72j09M1n7O3N3n3M1J85n24L18K39
6918E98m96OK04J01j97P7j03k49L72j68J78j94J79Jk76L98N8l48j11M36j74j7
6940B75k59M84n92K39L37k33k64j50M01k90J04n6p8J22J90k75L0j57J22k71N75
6961B54J3k56n3K05k77J15R4O1k06J36p3l51J81K01n4J20j47J09j60j89P9j32
6983c30Q7J96j73p5K61J22k79j8O2Q0m5k08JP3J63K26l09L13j31j59o6J09j54
7006b54%J15j45j6L58k25ko4L09k88J73N8J13l27J12j61m8L76J34r1k64k7M3O1
7030f0J45j25l13J30J41K95j2k21j07k75P39r9k27N3qm3j15r1L77j40J13J11k95
7053b7k7J52k07q4O33l58j22m4N70k72m76N31k14l9R3j98K36k82N4J22L2K20k09
$$ y = [177, 128, 186, -188, -96, -4, 161, 189, 206, 375, 88, 56, 32, 229, 401, 292, 333, 276, 339, 392, 339, 380, 565, 41, 359, 598, 102, 108, 312, 413, 216, 293, 190, -59, 313, 145, 323, 129, 308, 309, 33, 431, 489, 141, 30, 466, 292, 275, 16, 500, -92, 147, 484, 251, -13, -163, 238, -52, 52, -4, -82, 40, 230, -45, -15, -172, -50, -321, 254, 267, 11, -42, 163, -114, 1, 95, 156, -50, 86, 13, -338, -157, 44, -10, 110, -37, 72, -88, -277, -198, -330, -243, -47, -220, -295, -34, 88, -191, -209, -147, -67, -112, -320, -319, -246, -83, 143, -166, 147, 16, -143, -209, -100, -254, -254, -139, -284, -300, 58, -167, -169, -233, 76, -212, -39, 19, 132, -195, -83, -244, -292, 84, 218, 127, -137, -164, -121, -60, 85, -40, -353, -223, -82, 213, 201, -20, -127, -402, 337, 238, 11, 64, 56, 13, -102, -193, 184, 44, 157, 268, -27, -54, 98, -109, -193, 440, 82, -40, -84, 486, 214, -262, 269, 55, 16, 109, -89, 147, -135, -81, 41, 73, 293, 84]
7076H4m29L85k10K65r4n6k60M46J71k90j77K80j65J42J43l85j87J10K41ko9L41
7098B84q9m23K73N4k71nr3K62j23J00J24k00L6K25j90N3j61K7j0l1K80m59K18
7121a19L93j43l6L5l25N0J47N6n23N15K6j32m82K74M02m87M02N8k72J9J79k54
7143b17K54j45N51n14J52k40j48M32q3j12j46K94m2j51J13k68K95J08j37n5MK93
7165B38J84m08K3K35l39L98J13n60k7K60n1J52J21j89J99M6K3j22j8K4k42J33
7187A93K72M8o54K68m2R1j66K46l85J44J15M0l1J63k7j13J16J67k87k82L60mk74
7210d2M26m53j4K1M83k77l63K60J31k25J22J16l5k49J40J23l45L89k37j67J21
7231g5J33k10j2o4M64j26n9k32K4J14K68k28l18L03Mp0J75j46k84J10M17l61o2
$$ y = [84, -345, 40, -170, 95, 1, -55, -315, 131, 302, 12, -165, 115, -50, 92, 235, -150, -337, -227, 14, 12, -57, 284, 195, -228, 45, 99, -172, -177, -270, -8, -131, -31, 93, -107, -71, 154, -36, 17, -144, -117, -127, -158, 122, -337, -119, 274, 131, 95, 130, -195, -145, 2, 58, -465, 50, 76, -56, -538, -264, 138, -349, 53, 111, -161, -142, 37, -217, 37, -108, 443, -71, 81, -159, -307, 125, 42, -70, -216, 78, 36, -115, -2, -270, 25, 133, -4, -59, -55, 238, 422, 14, 37, 272, -67, 331, 444, -116, -143, 117, 66, 218, 339, 150, 349, 395, 418, 296, 278, 302, 60, 193, 465, 513, -141, 127, 85, 176, 10, 256, -129, 15, 130, 170, 139, 302, 275, 162, 278, 445, 158, -124, 236, 232, -42, 384, -69, -83, -62, 421, 144, -219, 41, 172, -53, 69, 185, 150, -99, 41, 164, -181, 208, -29, -196, -75, 58, -152, -164, -228, 236, 110, 51, -181, -157, -43, 225, -3, -321, -18, -14, -84, 91, -55, -339, -229, 188, -173, -235]
7254b35J77j39K4M37j88j00r6L9j11J32K28n71K14J89J10k18J09j72k11q5M44
7275b3J32m01p6R0M26l23K23k23k9K74q4m11K73J00N3j83L20J7m46K91J33k66
7297a33J16J43k12K01j08J28k97L18k6k23J80M0J2j36J3J56m80L46J64J9r8p7
7319D6mj46N20j05j50k52j2K48J25Q1j29k69J44K38l01K38k64j29K05K05k91J88
7341A86M46k87n51M16p0j98J92M9P7m63N11n10L92j00k23Ql88L42M4k1J52J22
7363A26l72L8J93L7p5J7j48N6K22m9m28L95m87L32j84P4K48j06o1j7j00Nj1K05
7387i0J20j55j1lj05J59k33L03k49o3M0K87k23R8j75J32m35N15L0j20l55L41R3
7410i9J43j89O3j70M52J06m51O8R5K52l33K56m19O2L64k59j09K61qJ95m60L77
$$ y = [-235, -58, -197, -173, 264, 76, -24, -120, -81, -192, -60, 168, -403, -189, 0, 110, -108, 1, -171, -382, -467, -23, 109, -292, -368, -278, 148, -175, 48, -175, -204, 70, -14, -425, -152, -52, 1, -182, 138, 155, -291, 0, 133, -133, -17, 126, -86, 115, 7, 135, -162, 156, 130, -93, 87, 127, 139, 3, 16, 172, -308, 38, 202, 221, 123, 46, 42, -104, 416, 311, 161, -91, -103, 145, 270, 351, 222, -47, 97, 335, 34, 272, 8, -121, 84, 289, -2, 186, 632, 345, -206, 210, 140, -58, 134, 183, 260, -203, 308, -202, 190, 90, -133, -125, -513, -171, -127, -148, 4, 126, -246, -208, -15, 22, -53, -36, -184, -128, 94, 45, -383, 12, -475, -143, -327, -253, -5, -111, -172, -189, -289, -284, -295, -90, 30, -125, -136, -139, -244, -85, -318, -15, -264, -327, -287, 0, -223, -125, -300, -168, -603, -88, -58, -178, -533, -192, -99, 44, -145, -82, -252, 200, 306, -145, -77, 18, 270, -63, 193, -226, -164, 200, -59, -168, 93, 85, 280, -180, 197]
7432A97J1l18L20R8n64L36j88j24J04K04L7k10J50j07K30J15j90l5J41l69M59
7453B97J67n12P2j96K80K02k40j10K00P0j92k1L3J03j55J60j80Lp1K12J19j01
7475A40j92j39J4L47j90r4Rk50K77K82J19l78j94K11q4o2K40k52k01RN71m50R9
7498a68K4j07l42M88o1m87M43k18L63l34L59J64m95K57k80j26N74L4n79R8M98
7519A05l45j19K61q3j03J01J75k15L15j12l3r5M8K9j33p1K71q3j9L22l51K6J28
7542A9m7J91P1n4p6l41K83k3M1j8O0j86R7J86k83j01K54K8k20K96J07q3k17l2
7566d8J17K61q4j82l1J58O6J7k71j27K94k39M61Q9l24J58j38k23J04K11j35L2
7588A66J64k06q3R5J57m47pL02o0j42K82k60k4J41j98K00j61K29l7l31N7L71k24
$$ y = [197, 208, -110, 210, 308, -256, 80, -108, -232, -128, 76, 113, -97, 53, -54, 176, 291, 101, 66, 207, -162, 297, 464, -48, 24, -172, 108, 310, 70, -40, 160, 230, 38, 17, 50, 153, -2, 158, -22, -19, -90, 122, 241, 140, -52, -191, -177, 170, -20, -114, -105, -355, -78, 204, 323, -55, -249, -38, -122, -184, 56, -196, -397, -388, 183, -267, -168, -144, -251, -593, -105, -166, -653, -210, -428, -65, -399, -40, 124, -371, -114, -394, -520, 54, 88, -491, -393, 105, -240, -359, -98, -181, -284, -183, -8, -223, 92, -20, -53, -148, -100, -71, -204, -275, -4, -87, -106, 216, -135, -109, 19, -28, 163, 234, 180, 104, -237, 46, 23, 64, 46, 106, -80, 17, 203, -80, -181, 73, 101, -119, 177, 284, 201, -16, -48, 69, 330, 246, 64, 33, 191, 257, 274, 3, -124, 170, -69, 392, 481, 157, 315, 177, -46, 58, 269, 134, 166, 330, 124, 41, 136, 293, -154, -161, 141, 81, -61, 221, -39, -63, 78, -120, 80, -81, 148, 111, -220, -163, 208, -16]
7611a6j99L84m06J5O19l88l36L54r9kJ56k03l50J85L50pk29J14L9j11L7J17k43
7634b19K45q3j37j95M13J25k55k6M6k29J92L18l07J4n%Q8L3j3m1j50L42m41M21
7658A36pk1k13K26m5j24J79J19j61j21K42k21j2j82M35j88j60O7J72k88L12j79
7680c4j99K73L63l00l96M14k58M07R7l24J5r7M51m02j22K75J3m46M50M0J15j05
7702B30Q7o74L38Q8O7j24J50k13q4J92K76l23P1K06J21k59k77K52k92M38j30n9
7724H1l4J47k99j10J47J87k26K07j33j48J10J92j80Jq4J10N7o3j15k49L64K77
7746B39k66k68K57K68n00J27J84k14J05k58L54l73J63K48q9k05J23j15j99N42
7766A23o07rM08j9n6l73J40M31K63Kl33R9J27J38n31K60K07l2k97J60J18k70L67
$$ y = [-16, -215, 169, -237, -222, 397, 9, -327, 27, -72, -74, 82, -121, -471, -286, 64, 57, -172, -58, -19, -130, -93, 24, -219, 26, -57, -194, -389, 24, 149, -106, -132, -86, -315, -123, 195, -112, -98, -103, -103, -15, 18, 5, -36, -186, 156, -285, 136, 129, 108, -105, 121, 76, -48, 131, 250, 89, -32, 210, -11, -23, -205, 230, 42, -118, -51, 121, -167, 145, -34, -233, 40, 403, 103, -293, 121, -137, 270, 367, 43, 58, -39, 412, 10, -112, 163, 176, -270, 180, 220, 335, 230, 317, -357, -19, 69, 136, 12, 162, -51, -135, 57, 333, 10, 81, 287, 408, 149, -128, 124, -168, 270, 140, 81, 47, 194, -105, -215, -68, 119, -107, 100, -33, -181, -71, 121, -59, -58, -142, -32, 25, -38, -153, -402, -38, 239, -27, -295, -38, 230, -270, -143, 41, -173, -68, -326, 28, -345, -182, 66, -23, -228, -105, -220, -419, 123, -484, -493, -85, -104, -160, -533, -393, 38, 301, 303, -30, 69, 196, 334, -197, 63, 270, 238, -59, 101, 219, -51, 316]
7789C16q4k59j15M19l13N9P3l3n9N9l5k6k26O80k77k67qK10J02m2m0k39J91K37
7813C23j42k58K59k40J96k77J88j95N5N85l49j20J78J98j27Mn02M64N2o4j29k83
7835a84M32Qm15L24P4j28K9Lk73J00L46k21j28k40N79j6m41K29L5j70K22J39m11
7858a07r6J66k8J9J93j14j32Q0J2k53K54J42j55q5K92n3l17K27K24k89L30k3m01
7881a14M0K13k01rJ35J48l73J86K06l48j13K42qj29pK61m88L07L52n24O1M08k17
7904B8k73L49m11L59l70M96l89J94J2N9l76K13p4k9J99j2J19l86L24J60r1n55
7926d54M95j94k29L96n3p0K9m3j71J29R8k82M27j87O4N2j44K59m4qL34p63K35
7949a24J69l43L85K90l58k33L07J79m70l5L7J30M9j88L05k09J35K23l38j57M29
$$ y = [316, 232, -27, -142, 277, -36, 23, 96, 63, 4, 63, 28, 2, -224, 456, 179, -88, -96, 114, 216, 174, 134, -105, 86, 323, 181, -77, 182, -58, 138, -139, 49, -146, -91, 494, 145, 25, 203, 401, 274, 278, -224, 240, 292, 228, 99, -184, 248, 256, -159, 165, 239, 111, 140, 143, -130, -30, 316, 95, -33, -273, 306, 290, -151, 78, 113, -57, 165, 304, -107, -203, -37, -65, -46, 147, 33, -99, -19, -7, -260, -6, 136, -19, -104, 188, 135, -182, 45, 269, -20, 310, 287, -114, -74, 139, -62, -71, 64, 212, -161, 25, 231, -117, -230, 12, 4, -125, -132, 129, -359, -52, 300, -224, -163, 245, 28, -245, 104, -307, 52, -318, 178, -211, -17, -5, 54, -322, -109, -183, -212, -13, -25, 94, -292, 32, 192, 101, -454, 41, -153, -382, 14, -39, -109, -80, -123, -294, -165, -67, -349, 78, -109, -45, 7, -137, 122, 78, 70, 404, -359, -124, 45, -298, 87, 377, 19, -214, 93, 272, -198, -233, -196, -66, -17, -205, 100, -109, 26, 249, -89, -246, 183]
7970A83k48j57N2N3j7M52k15N2n2R9j1r7N6k03J79j57Q8k9L76k73j09k53O9K69
7994A07r3J08L67o99J91K99k36J6JK05j40J46m05P8J46K36m89K0L53r4j59j84
8016b26J04p3j11P34m44M6K1J04l50k09K34J02j70L45k74j23K48J42k75l6L05
8037I4j86J65n8k94k6M58j19l47N6L08p0K6l19L25L6k10M68k09k23M01k03R9j08
8060F4K1k40L41j86R1k95N17m49j18L18%K28l21K35J17o7m2j62J27J47J43m22
8082D7J88R2l84L36p2j75l4M28q8j59rn6J95j83L65k06l55O22l34k84K07Q0m9
8105A72J4J69k61Q9R0m10J32O2L84l93J95j38l7K7K48j41l04N3K90k31k39J93
8127c6j22q3J75K04L2j05p2J18k74K90k52k9P7k48J12K46J87k48p4J49L5L1l00
$$ y = [183, -65, -222, -170, -117, -134, 318, 103, 155, 103, 202, 191, 94, 150, -53, 126, -31, 57, 28, 404, 131, 22, -231, -162, 107, 14, 122, 489, -210, -19, 280, 44, 60, 61, 266, 126, 272, -133, -55, 91, 327, -162, -142, 211, 117, -42, -226, -122, -195, -306, 428, -16, 30, 51, 155, -195, -404, -170, -68, -238, 107, -167, -290, -42, 100, -175, -211, 94, -92, 73, 15, -279, -305, 153, 34, -313, -257, 51, -19, 7, -312, 13, 49, -161, 307, 98, -125, 276, 73, 172, 64, 85, -155, 186, 0, 91, -204, 313, -136, -254, 64, 64, 292, -29, 206, 323, 256, 214, 52, 179, 326, 469, 47, 235, 327, -57, 279, 207, 32, -2, 426, 338, 179, 170, 114, 309, 126, 491, 285, -70, 552, 218, -66, 141, 221, 172, 186, 355, 94, 183, 273, -137, -5, 57, 441, 48, 243, 105, 68, 95, 343, 202, -102, -49, 241, 10, -229, -36, -158, -241, -66, 138, 170, 65, -7, 111, -163, 127, -125, -154, -77, -325, -213, 33, 220, -28, -102, 47, 82, 113, -187]
8150a87J49k63O79l05m04J37K40j63j24pJ38j65K83M1m78M29J34j80q8j62Q2L17
8172A03J38k53j98j95M31O9m41O7O4J17J3L0j9jL58l65k09K89J77
$$ y = [-187, -38, -301, 378, 73, -331, -194, 46, -117, -241, -248, -110, -275, 8, 49, -429, 0, 134, -46, -134, -296, -214, 103, 241, -12, -210, -405, 26, 95, -346, -279, -215, -98, -85, -55, -74, -75, 283, -82, -291, -2, 175]
8191A75
$$ Imaginary data points
##PAGE= N=2
##DATA TABLE= (X++(I..I)), XYDATA
0@%%%qJ6j6K4l7M5n6P3r0J13j44J77k10K51l01L57m21M95n77O70p77Q94j025J170
27F23j332J513j709J927k169K432k721L041l392L774m192M654n161N716o330P010
43C684p760Q595r533J0588j1782J3151j4740J6599j8818K1527k4911K9281l5184
56a9303M3641n6857Q0629j36705N02998M88321p82962k93843K03834M28775J434
67D59962k30912j97349J49656J90075j9987k24079n0494J51844J84844l2936k05153
78A75471j65262Q1462J00152q4260r9638J43666J61322p6971j93580l3085J16246
89A25523Q5337q2793j51584j2854J19958k722j40361k0168J57771R8821q3280
100I3648j53628m4704J42757J53679j24828l20869r0563K75508K76702n0261k69751
$$ y = [0, 0, 0, 0, -8, 8, -8, 16, -21, 24, -32, 41, -49, 64, -80, 97, -113, 138, -163, 194, -227, 268, -309, 361, -416, 478, -547, 623, -709, 804, -905, 1022, -1147, 1285, -1436, 1605, -1787, 1987, -2205, 2449, -2712, 3004, -3326, 3684, -4076, 4519, -5014, 5574, -6208, 6943, -7797, 8802, -10016, 11511, -13400, 15881, -19303, 24338, -32519, 48110, -88595, 414403, 902724, 119762, -174081, 29753, 458528, 459962, 229050, 31701, 181357, 371432, 351445, 127366, 76872, 228716, 413560, 380624, 175471, 10209, 91671, 191823, 107563, 7925, 151591, 312913, 235942, 42362, 9277, 125523, 210860, 128067, -23517, -36371, 83587, 80865, -59496, -79664, 78107, 176928, 93648, -59980, -104684, 38073, 191752, 66924, -253945, -344508, -69000, 207702, 157441, -112310]
111a12310j22284J85852K07524j06793k51764J0645K21381M8062j79764j38150
121b37601N4294J68214J10265n6804j08114L7105J02499o5015j86806m5283J79532
132d7714J98079k6330k31515j14300J86854K13151n0729j53012J5051J04246j5384
143G8397j29845q7329Q1667J90061O6377j36165r9380J05477J30452l7416j35694
154B6602n7082R0117J28296k9285j74726m5090J75692J33556p3013j09536L1821
165I7352J04723O169j40743j15625R6081J70749m0657j88781j3637K00547J40891
176C17069q9583k17830r8471J59373K16403n2977k70547j14252J61892J79179
186A90256k1579j42818l4129J39516R2762j45306j98749K6016J62061L8345r7545
$$ y = [-112310, -234594, -48742, 158782, 51989, -199775, -189130, 32251, 80313, -99451, -237601, -183307, -15093, 95172, 38368, -69746, -32641, 69858, 4843, -181963, -227246, -47714, 150365, 124035, -107480, -221780, -34926, 178225, 127496, -25516, -10465, 93781, 78397, -51448, -138777, -57110, 132951, 199328, 63163, -36217, 69260, 199712, 162296, 26602, -30480, 59637, 187933, 158648, -16078, -61168, 114524, 248080, 175067, 65531, 97352, 202075, 208244, 67501, -48124, 47957, 218706, 178049, -10732, -24369, 176178, 317069, 227486, 9656, -88815, 70558, 286961, 233984, -36563, -150815, 11077, 190256, 168677, 25859, -8270, 131246, 224008, 78702, -120047, -94031, 68030, 106375, 8830]
197H830p0345K6386P4112K1452p3542m3430Q5716P3419r0476j44727k3067P9917
209g5755N9858k3397n1733M0149J03177k9821j70988m1534J72464J13859j31239
220c4960k10779l0265J87872J72965p8567k15461j3633K17887J26510j34411k05187
231b18029l6163J52959J35911q1912j85192J2075K06952Q7459j32348j15837O1369
242a12756J27727O160j41381j02396R1092J45593k5702j27158m441J22046Q5753
253F4537l3916j01359m7225P0840O5903p0021q8659N9535J16224o031r3913k2248
265h6333J01327J09696m2165j68670n7291J40228J06647r2570j33240K2029J44228
276D3886R7363n5694j32626j4053J29042N4972j14316j00671M7565R5421O216
$$ y = [8830, -61515, -35129, 38983, 60435, -13107, -56537, 29179, 102598, 12122, -132605, -155672, -75755, -15897, -39294, -91027, -50878, 52299, 22478, -148510, -190044, -17580, 96279, -34960, -245739, -276004, -88132, 84833, 6266, -209195, -222828, -4941, 121569, -12842, -218029, -254192, -101233, 34678, -47234, -232426, -220351, -13399, 74060, -58288, -174125, -112756, 14971, 21131, -120250, -222646, -131554, 14039, -11663, -138821, -143262, -21216, 64537, 30621, -70738, -117963, -47123, 18780, -51241, -139900, -80365, 35859, 29828, -64085, -86333, 14994, 124690, 82525, -86145, -143436, -3208, 103439, 10869, -122371, -100342, 43886, 141249, 85555, -47071, -61124, 67918, 122890, 8574, -92097, -44532, 50889, 57105]
287E7105p9826m0212R7663J31956m2001j70521m0101J33905Q0990r1112j30164
298i2318n763J31450J02282p2831j31237L1999J52528L4381j24106j08638K1031
309f1222R8165L2773r1711p6332R0650J35857l0043j35308l2000R7624Q1160m3449
321F6164j27597n5809R0269Q6311n0621p1271N1861R4762l46q3644o1198L1008
333c0111P8210j1608j13361l4846J15065Q2470p3547j00707K6678J33321P7245
344A48809j00811j76483j2346J61970P5318j18743j14554N6150J47162N5294j01879
355A9887j22774M1044J43468R463j47537q3542P9894J06346l705r4081m8574R1968
367h143J21043l1414j31718l0889P8210K8311o2759n6113L2078R1644L4445q1731
$$ y = [57105, -22721, -62933, 34730, 166686, 124685, -45836, -85937, 47968, 128958, 37846, -92318, -98081, 33369, 135651, 62820, -68417, -36418, 116110, 150491, 26385, -82253, -61222, 36943, 69716, -21995, -98327, -7677, 128180, 98137, -37171, -69171, 28453, 109613, 66164, -61433, -117242, -26973, 59338, 8717, -62554, -10693, 84069, 83723, 79, -61119, -30111, 48099, 36491, -76870, -111716, 3349, 85819, 12272, -88435, -61757, 71564, 148809, 47998, -128485, -140831, 21139, 96457, -22286, -136840, -80690, 66472, 121766, 19887, -102887, -61843, 81625, 91088, -56449, -139991, -60097, 46249, 42544, -51537, -100111, -8143, 112900, 81486, -50232, -81121, -2911, 25400, -37359, -93472, -61394, 30250, 64695, -17036]
379a7036o7733P1861R7246l7320j04428j7429O9775M1221o1319j02900J5645J59202
391D6785R4704r9746j31278J9188J04808K8321q5969r0556L5691J25127J9805
402F6880j29450o8696J09156J29138j3592j10896o3486N2166P7257m1597j19898
413a13018j34J39718P6776p3869r2575J2080R0104M8097p0848r7697K9798J04865
425E3297n979j14198l8667R4031J05180J331q9734n0788O7948O9895p2135j16655
437i6474K0314J21429M9729o7029q0524J6130J03690N0664q2224p8045N5547Q1750
449I4957m1579j12622l4405Q5905J11999N637j00192l8642R0642N9456q3877r8415
461f1136K7800R8851L4252p9797r6440K9904J30965M3782r1658n9023O0201O5411
$$ y = [-17036, -84769, -12908, 84338, 47018, -57410, -74839, -5064, 36157, -25162, -128062, -112417, 46785, 141489, 41743, -89535, -70347, 34461, 62782, -23187, -113743, -78052, 47075, 66880, -62570, -131266, -22110, 107028, 93436, -17460, -80946, -28780, 48477, 6880, -113018, -113152, 26566, 103342, 29473, -63102, -51022, 39082, 87179, 16331, -81366, -51568, 53297, 47318, -66880, -105547, -11516, 93664, 94995, 5261, -45527, 22421, 92316, 20181, -96474, -76160, 45269, 94998, 27969, -52555, -36425, 67265, 117929, 35705, -42340, 13207, 94957, 53378, -59244, -93649, -7744, 104255, 109892, 9700, -28942, 61700, 121156, 37279, -61136, -33336, 65515, 99767, 19970, -76470, -46566, 84399, 128181, 36523, -22500, 37701, 103112]
473A03112l8434j06130n2666P5477J14954j0531j11662k2738R9236N8105o0881
484D7842q4478q2P8000M2033q0040j01446K9933J10848K2291o6426k5789N1587
496B4273N1260k9039j01309n2388P5828Q8259m0534r3963N359Q6221M1803n1437
508D333p0272J6562R8790K5714j19330j02988N2139J08282J2138o7360l3378N7420
520a7950Q2067j9297j15934m4876R1685P5133n3485r3375q128P7864O5258l3011
532E951p8819J9712J10040K4114j08149q3806L8590P9959J2145o0681l7302O8043
544a0203R1997k7944j04989j5195Q8874N3514m6901q0757j9345O7669N6199m6558
556F361o4225N4948J11996N276j01141p1575L2681Q1605J2705q1724m5633P8810
$$ y = [103112, 64678, -41452, -94118, -18641, 96313, 85782, -25880, -48618, 50618, 108723, 47842, -36636, -36718, 41282, 83315, 3275, -98171, -68238, 42610, 64901, -1525, -27314, 24273, 75533, 46494, -54815, -107203, -31375, 56884, 16350, -77613, -72254, 13967, 55770, 4333, -65939, -49377, 49413, 75127, -44203, -147191, -95052, 13230, 25368, -41992, -75370, -17950, 64117, 44820, -71114, -115990, -24305, 50828, -2657, -96032, -104160, -26296, 38962, 5951, -72868, -53156, 56884, 80998, -27151, -110957, -72367, 7592, 19737, -40944, -78246, -10203, 81794, 53850, -51139, -66334, 22540, 76054, 29153, -51604, -70949, -3280, 52919, 6361, -57864, -2916, 109080, 114356, 13215, -58360, -25679, 55926, 68631, -13093, -58726, 20084]
568B0084Q2359m3269q6677Q879R0854N6165m9142j04017l0565P9404N2513o0314
580A6274n7322N2274Q8615O930p7082o4349L4517Q8725j387j05303n0074P2057
592C875O3277l6287o3858P073P8535N2463n7109j01297j84Q5674J5421q2320n3974
605h8711M3902P9286J7440o9256o0836N1400Q7189k7828j11218l2282P3219N4509
617A6814m1089q3830r387R6379P3094n6207r0487J3697O9497j234p2520n0603
629a35876L3499Q2636J9928q0518n7420O5504Q8826j6096p9237k9729M2610M1542
641b4331l4852p9735K769J04873N8045o3388o9016K7076O7524J4302n5929n6242
653a08904K5028P2137l901q0158j8051Q4307P0963k1554o9508k5916N4984N8096
$$ y = [20084, 102443, 59174, -27503, -18624, 72230, 128395, 79253, -24764, -55329, 24075, 76588, 16274, -41048, 11226, 99841, 106771, 29689, -34660, -143, 88582, 87195, -18108, -68182, 3875, 67152, 30865, -32993, -25920, 52615, 105078, 47969, -53328, -53512, 32162, 47583, -34737, -88711, -44809, 34477, 51917, -17339, -78175, -26775, 60414, 32586, -78632, -110914, -37695, 16814, -24275, -108105, -117492, -21113, 51981, -4226, -94713, -81016, -11519, -12753, -85273, -135876, -102377, -19741, 187, -80331, -137751, -72247, 16579, 483, -78754, -108483, -65873, -24331, -59183, -138918, -136149, -31276, 26769, -36619, -105635, -78559, -11035, 3267, -52662, -108904, -83876, -11739, -15640, -95798, -113849, -29542, 41421, 19867, -49641, -75557, -20573, 37523]
665C7523m2485r2100O539R7226L7938o0176n0059L8395Q2990K2969p5058o9401
677f5699M1963P9503j5750q0707k0290O2556O5600l376o1946k4206O7773N8878
689A04299n6782r1318N805P6732L0656m8093n3960K2803Q3414K7301p0623n0589
701b0355M6696N3076k9601o9237k2358M5242N7267r804o4599n374P5758L7104
713I3815o2377o5894J4171N7138J5950o1449o4472L4239R4791J2508q0525l5403
725d7508N7997N4917k7266p9377l8523N2657O6460k8410p8119J748P7923M0742
737E3241l8949n6987m158N4637K8964o5112p5076L2475Q7914J0831o0430k7836
749f0486M2384N4185q201o6620k8139N4348M0918m8261o0657J7436O4790L5000
$$ y = [37523, -4962, -97062, -90523, 6703, 44641, -15535, -65594, -27199, 55791, 78760, 3702, -65699, -23736, 55767, 40017, -40690, -60980, 1576, 67176, 63800, 1854, -22352, 45421, 104299, 47517, -43801, -37996, 38736, 69392, 21299, -32661, -9858, 73556, 100857, 30234, -20355, 26341, 79417, 49816, -19421, -41779, 3463, 60730, 50926, -13673, -19047, 56711, 93815, 31438, -34456, -20285, 36853, 52803, -8646, -73118, -38879, 55912, 68420, -12105, -47508, 10489, 65406, 38140, -41237, -79760, -27103, 39357, 10947, -67172, -65424, 12499, 53241, 14292, -42695, -46853, 7784, 36748, -28364, -103440, -70965, 16949, 27780, -32650, -60486, -18102, 36083, 27882, -38738, -66877, -12529, 28389, -19872, -80529, -63093, 1697, 36697]
761C6697k4361m5702O711O1095J3685p3673m9705N0343O6253j3222o5829k5291
773f2999N9961P8788j0240p8749j7892O5424K9115n7007n5994J7531O7112L6870
785G1920m2490n9472K5452Q4341J6852o9007m8556K6584N1237L29n9432l6140
797c8382N9000Q0382k1133q0501o023P1101L7539m2749o6939j3116N2618L6468
809F8265l8111m2169L4201O1326N15n1856l5806K0687N4170N775p0856m9239M6131
822C033N7963j9066m2510J5373N1988J4634n2032o2220J2360P0420J3892o6647
834b812m2056L7837N0785r47l9628j9536M2922N4195l2954r7651k6872P5400O0171
847E8854l0772o7331j1402O3858N4420l6075p0924J0437O8300M387o9943m6561
$$ y = [36697, 12336, -33366, -26655, 34440, 48125, -25548, -75253, -24910, 41343, 28121, -37708, -62999, -3038, 75750, 65510, -13239, -31131, 34293, 63408, 6401, -49593, -32062, 35050, 71920, 29430, -30042, -4590, 79751, 96603, 27596, -20960, 5624, 56861, 57190, -2242, -38382, 20618, 101000, 79867, -634, -6657, 64444, 101983, 59234, -7705, -20821, 31797, 68265, 30154, -12015, 22186, 83512, 84027, 32171, -3635, 17052, 71222, 76997, 6141, -43098, 3033, 60996, 41930, -580, 14793, 66781, 81415, 29383, -32837, -20477, 49943, 63835, -2812, -44868, -7031, 43754, 42807, 3179, -16357, 26565, 80760, 47806, -49845, -76717, -1317, 58854, 28082, -39249, -50651, 13207, 67627, 31552, -39372, -28935, 39365, 43752, -26191, -72752]
859g2752K7221O1524K4147l9672m1317K7875N2732r866n1719j3561L1887J9864
871A6363k5222m7237O55O7990M3923m6777n4670K7307N4951o644n4049k7993L1382
884b0021M7322j2781o7254j4867P6217O4528k6676o8820k5196L8274M6547j9401
896A7872o7126p749P1094L5394n3215n0288L0246P0626K4038n1779o7018M198
908d3707N4756P396m2690q126M2020K5332k0747l5198k341M6559L7660l7594o8918
921d5598j255N2626J5488l4862k0667L3107N3084N5o9495l9759N7629O7128l0120
934C7361q0956k3955M7837N2083j069m3936j2456M9299L2595m5055n6963J1404
946c3811N3649K0958m0526n4842O433O7912L2624m2386k9857L2892K6703l1715
$$ y = [-72752, -45531, 15993, 40140, 468, -40849, -12974, 39758, 29892, -21827, -35388, -3501, 16363, -8859, -56096, -55441, 12549, 56472, 9695, -44975, -17668, 37283, 30639, -23410, -51403, -20021, 27301, 14520, -52734, -67601, 8616, 73144, 46468, -22352, -47548, -9274, 37273, 17872, -49254, -57003, 14091, 49485, -3730, -54018, -23772, 46854, 70892, 19113, -47905, -43707, 11049, 18445, -24245, -32371, 9649, 34981, 14234, -20964, -23305, 23254, 60914, 23320, -45598, -46853, 5773, 21261, -13601, -34268, -1161, 51923, 51978, -17517, -57276, 353, 67481, 37361, -43595, -67550, -19713, 32370, 31301, -12635, -25091, 24208, 56803, 11748, -45215, -33811, 19838, 40796, 270, -54572, -48139, 19773, 52397, 10011, -19846, 13046, 39749, 8034]
958H034m7227k263M5574L6855k8235n9362L368O6362L3032l5321l8204P232L2286
971B2131M971m8281m5025L7168P7891L098o9853l2630M6035N5704j958n3971l4905
984c9625K9416L7321k7083m7440J7008N6354J9872l0364l6112J582M0402K0759
996D2090m0637m1202K1903L7782j4642l9738K074N0188M2692k3214o7278j5692
1008d5674O0292L5804m8836n3950J4311N1035J9990l2614l9251K1029O5794J3806
1020F1736o5893n2421K3533M9886P991l7857l3001K4531N2876m10m8603p905M5516
1033A9979J8722l7363m0657J39L4464K1764k3307k8075K5039M4592j0075m4488
1045a9266q479L3995K7257k1531n6849k1012N5881N7372k6003n8949N291N7051
$$ y = [8034, -39193, -41456, 4118, 40973, 12738, -46624, -43256, 23106, 56138, 20817, -17387, -10155, 22131, 27102, -21179, -66204, -29036, 48855, 51953, -17900, -50530, -4495, 51209, 49251, -4720, -39625, -10209, 27112, 29, -47411, -30403, 25951, 45823, 15459, -20653, -19071, 21331, 42090, 1453, -39749, -17846, 19936, 5294, -34444, -32370, 17818, 60510, 37296, -29982, -45674, 14618, 50422, 1586, -52364, -38053, 12982, 32972, 358, -38893, -17864, 47930, 61736, -4157, -56578, -33045, 16841, 24832, -13025, -46026, -21495, 31381, 30971, -17632, -25537, 19979, 38701, 1338, -39319, -39180, -4716, 17048, -6259, -34334, -9295, 35297, 25222, -19266, -27745, 6250, 33507, 11976, -44873, -65885, -10004, 47368, 21365, -37584, -32293, 24758]
1057B4758K4537l7757n3808R20N7142K4990n3852n0880L0351O2248J5667l2448
1069A1868l1460P569L4048L415m3622k2343L6468K9937k3504l2343R633M0193
1081A9859K4677k3591m0605P589M1809o464n3873j5398M5388L9827j2171m4070
1093a7023j5745M4503N1819k2583o7046j3751M8075K9087k8768m4807M02N5061
1105A9224M1526l4038n6182J1985N4883P999m5259l4928J1231L7256J2233l0986
1117e056k1145L3976L7955j7950l9486k201K6572J3022k3000l6426J210M7147
1129A4618K1119l8632k8097L3597M3008r713m8248l0272K5646M5992o545n7029
1141c4556j6845N1637M1853j8760m0468q494L2336K9925k3549n4423n404M7805
$$ y = [24758, 49295, 11538, -42270, -41350, 15792, 40782, -13070, -63950, -33599, 28649, 44316, 11868, -19592, -12023, 22025, 25440, -18182, -40525, -4057, 25880, 2376, -29967, -20334, 19859, 44536, 20945, -19660, -12071, 29738, 23274, -30599, -45997, -609, 39218, 27047, -17023, -32768, 11735, 63554, 40971, -26075, -39826, 8249, 37336, 8568, -36239, -35837, 19224, 60750, 26712, -29470, -17485, 37398, 45397, 138, -34790, -23559, 13697, 25930, -5056, -26201, 7775, 45730, 27780, -11706, -13907, 12665, 25687, 2687, -33739, -32529, 14618, 35737, -2895, -30992, 2605, 45613, 35900, -12348, -42620, -16974, 29018, 22473, -34556, -51401, 236, 42089, 23329, -17139, -25633, 6703, 36628, 13079, -41344, -46748, 1057]
1153A057K1012k9291k2725J7728L2064P333k9148k6274K0885L1893k0627m5265
1165d1358J842M2214K0218k0042k8256O172M4529K0469m5444m8914K1151N1957
1177B4538K375m5562l0001K5498N5868J5750m8019l6231L4410M5488j6065n0737
1189b2688j8181K9345L9101j153l9494j2595M0837L1321k2858l0693M338K0072
1201A7352K347k1826k1485J4960L8120K635l4445n195L7207J8015k7220l3406
1213a2941r1L4271K0522l3401m5414J8643O1590J5832m1893l3679J6559M1888
1225D1886R766m7709m5185K6083N6051j69m6574j7016L2295L7693j396m0121k6811
1238b1207K6023L1976k0366l8335K135L0455J4309j1851j6130P027K7093J338
$$ y = [1057, 22069, -7222, -29947, -12219, 19845, 27178, -1970, -28244, -7359, 24534, 3907, -41358, -39516, 2698, 22916, 2874, -25382, -19210, 25319, 45788, 344, -48570, -27419, 24538, 26913, -18649, -48650, -23152, 32716, 48466, 447, -35784, -1374, 44114, 28049, -22688, -40869, -11524, 27577, 26424, -13070, -25665, 15172, 46493, 23635, -7058, -2720, 17352, 19699, -2127, -23612, -8652, 29468, 32103, -2342, -7537, 29670, 47685, 20465, -12941, -13032, 21239, 41761, 8360, -37054, -18411, 43179, 59011, 17118, -16561, -2, 41886, 51652, 3943, -41242, -15159, 40892, 40723, -5851, -22867, 9428, 47121, 45725, 5604, -21207, 4816, 36792, 16426, -21909, -19774, 10681, 24990, 13139, -2991, 4036, 31129, 32467]
1250C2467l8645k1090K7541K3409j9750k7930L554L1128K2926j9091l8290N054
1262a8717M8622J2534m7776m1355J3381M0910J7069k6706l2202J7698M9162K844
1274C5464m7745k5001K6194L1734o318l5489k2136K3909L8002p038l2751M901
1286a6274L5348P375l0276k6908L047K7941J3025k7284k5329K6413L9993p488
1298A9583l6831r723K7706K8436j1796m6048j9467L7720L4400k1731l3497J1067
1310b0181L7373J7139k1984l6012n423L3561J6322l0310k4247J9421K7148k346
1322A0461k0303p831K0751K7475j0245m0110j0037K9706J1223k4824j5864J8158
1334a1440L1410R114k9652l0466J8061M1810m570m4104j8073K5989K7438n405
$$ y = [32467, -6178, -27268, 273, 23682, 3932, -23998, -20444, 10684, 33610, 14519, -23771, -18717, 29905, 42439, -5337, -46692, -33311, 7599, 24668, -2038, -34240, -16542, 32620, 35464, -12281, -37282, -11088, 20646, 14328, -21161, -43297, -19388, 18614, 11576, -21175, -16274, 19074, 26449, -3827, -30735, -27688, 253, 13278, -14006, -39335, -12922, 27071, 19583, -17248, -26971, 735, 29171, 17375, -28673, -48140, -10420, 23980, 2249, -31248, -20181, 17192, 34331, 12347, -23665, -29088, 4473, 20795, -9515, -33762, -14341, 12807, 10461, -9842, -17673, 3078, 30553, 20308, -19802, -29839, -133, 11090, -13734, -29598, -11440, 19970, 29084, -568, -31034, -12973, 28837, 24267, -19837, -37910, -11921, 15517, 10112]
1346A0112l2320j3808L6944M2725j5949n0252j1287L1237J9304j7479l0508k451
1358c3732L6360K5877k4726l3209J3210L2707J972k3012j5673M596J5412j436
1370a654k5435o846L5530K7948j8181k9387J072K0232P473k0140k5328J1438L8039
1383A4761K597m2036j8262L3880L7251k781l2466k3073J6089K9920j1147m2593
1395c7860n067M2201K8468j6687l1550o316K6928K6131j7970l8004J596L3300
1407E170M938k7655j5001J7127K8527P734k2725j9060J9037K1713j9745l3344
1419c3284K340K7954J6457r520k2957k718K8628J8003k4910k6089J6681K7381
1431A7966p072l2857j9089J9447L7985P668l1182j4648K7452J9028k1869k8509
$$ y = [10112, -22208, -36016, 928, 43653, 27704, -22548, -33835, -2598, 16706, -773, -31281, -33732, 2628, 28505, 3779, -29430, -16220, 16487, 18459, -4553, -20226, -15630, -218, -1654, -27089, -33935, 1595, 29543, 11362, -18025, -16953, 3279, 10752, -9388, -34716, -23278, 14761, 17358, -24678, -42940, -9060, 28191, 25410, -7056, -30129, -14040, 15880, 4733, -37860, -42927, -726, 27742, 11055, -20495, -26811, 117, 26248, 8278, -29726, -28130, 5170, 10108, -17547, -32548, -15421, 13106, 20840, -1885, -20945, -1908, 19805, 60, -33284, -30944, -2990, 13467, 3947, -19010, -21728, 6900, 24903, -7, -26096, -9415, 17966, 10894, -21963, -41052, -21605, 16380, 24048, -7134, -21782, 5670, 24698, 2829, -25680]
1443b5680j08K4602K0137j3339l3532j848L6040J8476k0853j6771J2634J7541
1455A7299n354k8975k0905K1669L7931k875l5710n742L1527J8668j5548k6948
1467a4963m708K6443K0051k3664l6804P256L7364J3156j7993j5593P487K2777
1479B0809N119k9685k5720J9993L0674q520k8452j407K5029J9543q957k7074m454
1492a3102K8649J5208k6751k6518Q539K1231M702j0899r103J2302K5989k505l5675
1505g933j5682K6465K2906j4199k6834n143K3414K3147j3108l0334O437L8345
1517B7481R589l2385k8689L774K3943J2820j4050k0227J0970K9216j531k7968
1529g057p810J9985J6800r593k8828j3800K3356K6497j2991k6398R699K8327L614
$$ y = [-25680, -25788, -1186, 18951, 5612, -27920, -29768, 6272, 24748, 3895, -12876, -242, 17299, 11945, -17030, -37935, -16266, 21665, 18790, -16920, -22662, 8865, 27533, 11985, -14963, -19671, 6772, 26823, 3159, -33645, -26389, 10975, 24131, 6138, -9455, -1968, 20809, 25928, -3757, -29477, -9484, 21190, 12670, -15782, -17189, 7840, 27383, 18426, -8648, -13102, 15547, 30755, 4004, -22514, -13975, 7256, 11958, 1059, -8044, 4258, 30247, 27742, -7933, -23615, 2850, 25756, 11557, -15277, -20420, 2994, 26141, 13033, -17301, -10864, 27481, 37070, 4685, -24004, -20230, 3713, 16533, 2483, -17744, -6774, 22442, 20911, -7057, -14867, 5118, 21918, 12325, -16503, -30303, -6947, 19550, 6559, -19839, -10140, 18187, 21801]
1542B1801k1459j7825M649J9953L677k5085j4708K1563K4206q294k0994k051J8553
1555C986J7288j0487l2866r001L0700J8384k3923k4976J2665L0347J1480j8805
1567D792k4350M221K6656K352k8915j2436J9250J7274n486j5878n080J9505K3792
1580B5697r713l3316n330K6145J0712j8555j8508N320K4752J4213j7638k1449
1592a7670J3812K7308o163k7116p413J4550J2196m895j7862l963K6461K2115j6819
1605A4541k7982L584K3504Q219j7308k3610J407K8018J3560k3691j7675K1011
1617C578K5804p103k3687j0969J2056J7131o097k4945k861K8658J5503j8042j9295
1630a0269N079K1186J2374j5226k8834j427K6006P257k1416r090J9373J8406m291
$$ y = [21801, 342, -17483, -12834, 7119, 10796, -14289, -28997, -7434, 16772, 8478, -12516, -14567, 3986, 21274, 10787, -22079, -31080, -380, 18004, -5919, -30895, -18230, 12117, 23597, 4792, -19558, -15337, 11319, 13671, -15244, -27680, -8430, 8844, 3358, -12520, -17600, 1905, 25697, 15984, -17332, -22662, 3483, 14195, -4360, -22868, -17548, 7204, 21417, 3779, -17670, -3858, 23450, 17287, -9829, -17242, -2692, 9504, 4609, -13253, -17216, 9245, 31360, 14541, -13441, -9857, 13647, 21866, 4558, -19052, -17645, 10373, 23933, 242, -17433, 3578, 29382, 22279, -1408, -12377, -321, 16810, 10713, -14232, -17093, 11565, 27068, 9026, -10269, -5190, 15996, 28370, 13144, -15690, -17117, 8889, 16146, -5270, -14360, 5013, 23419, 19128]
1643A9128k0554j0547J6279J8849j4916k7628L439K4808O478j5950j3079P538
1655f155K3802J2257k2853k9015P317K6493J325k1874j0976J2701K0955J927k2222
1668f318j0326K3289J8243j9459k5784L791J9553P184j2303j8776L821K8042J3785
1681B4742k0517j9718Q622J5779k525j7009j2128J1594K4534j38k6485p465K5123
1694D409J5101j3702j5981J296J2605L863j7572j8588J3493L1636N655k1629j3573
1707a2987O932J3175L297j3805j1591J2508J7685j3343k6260M740L0335J5700
1719B6386j3036k1575l082J8703Q660k2241j9036J6810K5901j296j9730j1441
1731a4977R580K2435O509k1730j7454J3447J6764r991j9564k29J8580J6536n812
$$ y = [19128, -1426, -11973, 4306, 23155, 8239, -19389, -15950, 8858, 15336, -614, -13693, -6155, 17647, 29904, 7051, -21964, -14647, 11846, 13171, -8703, -19679, -6978, 13977, 15904, -6318, -16644, 6645, 24888, 5429, -20355, -16564, 2989, 10173, -2130, -20906, -17085, 10957, 24742, 4225, -15493, -6871, 8908, 6383, -10626, -22754, -11160, 13374, 13236, -13249, -20714, 4409, 19510, 5808, -10173, -8877, 3728, 7591, -9981, -28569, -15076, 16560, 22215, 586, -12987, -6055, 7120, 10417, -3388, -14979, -2471, 15214, 1871, -24389, -19649, 10686, 26386, 13350, -8225, -11307, 7396, 16056, -6185, -25221, -8411, 17490, 16194, -3536, -14977, -5397, 17038, 23547, 1817, -15637, -2190, 14574, 4583, -14981, -15210, 3370, 19906, 14094]
1744A4094k1012j469K2864P475k3188j7312J0061J7100L648j1001j1831N413J8327
1757A3169J957j6571k925J5376M964j4175j7430k935J7026J8334p408j8424O929
1770b113K1068l720k4681q674J6651J9811j582k6351j8500J6686K6307r54j6851
1783b903j200J2505O375j1700k2739n021K4952K1270j5075k5417L096K1155P619
1796A2917j0578j1748L751J6063l02k3775j2848J6899J7592l099j0117k353Q025
1809D27R569n453j7763k869J7304N862j5975j0047J0017J5453J889j4091j2172
1822a7849J3170K3352o083k7353q198J5737J0541o870r968K754J8846J2361j7622
1835B818k5747M466K5822R432j4886j8589j103J6372J0018j4306j1602J9097K4365
$$ y = [14094, -6918, -8387, 14477, 21952, -1236, -18548, -8487, 8613, 12261, 1260, -10571, -5158, 13169, 15126, -1445, -4370, 11006, 15970, 1795, -15635, -18570, -1544, 16790, 9382, -9042, -2113, 18955, 15235, -9446, -18120, -1469, 18342, 16760, -9591, -28091, -11405, 14902, 13948, -2903, -4103, 8402, 14777, 3077, -19662, -24683, 269, 21539, 6464, -18953, -15857, 5298, 12917, 2339, -9409, -5658, 10405, 10103, -13672, -26520, -9621, 7971, 4872, -5245, -7598, 427, 9996, 4543, -13220, -16089, 1215, 7077, -8898, -18945, -8928, 6525, 8414, -5677, -17849, -4679, 18673, 12590, -14763, -22961, -7224, 3317, -3553, -13521, -10767, 8079, 20440, 2818, -22929, -18463, 7359, 16791, 1905, -16684, -17787, -1415, 8603, -5703, -17305, 1792, 26157]
1848B6157q613k8116j2579J2037J8041L585j4041q546J2877J1224j0275j1415
1860i664P810J5109L983j0789j7669l282J6088Q367j1242n104J4557J0892q548
1873A0508j3451k326J1434J0513q523j9020K167K0277M070j4323p483J0127J4276
1886A8246L119j4622j5278P153J7903m340k0949l381J9204J7338l795j9974j0747
1899a0123J6394J7995j0278k1823J416J6894M366j2028j2362L541K0867J2547
1911B7406j4335j9238L114J2567j885j1114l588Q600J2512r36j7580p279J7898
1924F142J4307r921j4868r5P251K021q211j0012O852J9508L217j7600q808J0663
1938D46R467m629j2076o613R734J3833o828j9835J392K1331J0192j1924j4881
$$ y = [26157, 17544, -10572, -23151, -11114, 6927, 10512, -3529, -12075, 802, 12026, 1751, -9664, -1854, 13255, 17238, 6449, -11220, -14502, 1586, 9953, -1289, -6393, 8164, 19056, 10508, -2943, -5269, 6165, 16678, 8155, -10865, -8698, 11579, 15649, 1326, -6157, 3970, 18246, 21365, 6743, -8535, -1382, 16521, 12181, -8768, -12149, 7055, 24393, 20598, 624, -10123, 6271, 24266, 13988, -7835, -6419, 10475, 14841, 2813, -9549, -6008, 14859, 27406, 13071, -6167, -3053, 9514, 7629, -3485, -7073, 1527, 14039, 13103, -4477, -11756, 6142, 20449, 10528, -4340, -4435, 2816, 4837, -3374, -13386, -6534, 12974, 16191, -1409, -10217, 446, 9913, 5284, -6792, -13405, -3671, 10162, 3334, -16501, -15109, 6222, 16414, 4490, -10391]
1951a0391R2J3172P235j4561j7426P721K2110K287j5150o616P720J1958J100j5015
1965e764j0813J1828J5755p879j9132j314J6356J2141k457j2544m691J1870P502
1978A0858j3190j3174Q081J2706L41q450m257N237J0725P74j2229k504J3146L895
1992A1959j4299j1419N764J4307P420q744j3204O303J9024L28k0330q488J2707
2005A328J3120m225j6705q448J5721K0899n120k2060k750J8037J0359j0935j8263
2018i042m770J6549J5865r291k0202K522J9940O983j0612j2081r79J0164N518
2031A0564j1174j1274P605J2792j971q733m9O560L931l705j0425k844J0490L887
2045E654j2162p609R906J1169j581q990m355O137R264m528j6889l100J4945Q248
$$ y = [-10391, -10299, 2873, 10108, -4453, -21879, -14158, 7952, 10239, -4911, -11527, -3807, 8151, 9251, -5764, -16577, -4749, 11006, 3127, -16005, -17319, -963, 11178, 8721, -3823, -8514, 3356, 10858, -2332, -15506, -7425, 5281, 5622, -2828, -7085, -1848, 8877, 9651, -2578, -5082, 8064, 11959, -2340, -13759, -7995, 6312, 13732, 4988, -8216, -1913, 17111, 17439, -2891, -11379, 1328, 14448, 10223, -6482, -14930, 791, 21690, 16570, -5490, -8240, 9797, 20156, 9221, -9042, -13812, 2737, 18602, 9311, -10891, -8369, 11571, 18554, 7942, -4139, -5118, 5046, 10564, -610, -11884, -4279, 8513, 6542, -2191, -2240, 4320, 8251, 4546, -5879, -8723, 1767, 5654, -6508, -14117, -4211, 6958, 5377, -3613, -7968, -1831, 7433, 2905, -13984, -17084, -2139, 6109]
2059F109r901j0905K014J3439R854r425j7038K092J7259K349j6527r980P393J3636
2073C69M861r976j0604Q254J5069l703j7026l608J1011Q344n219j1539l428J4313
2087b882J2805q689j3796M653J3542N16j1883j0125K803J4012O804j1658r061
2100a2959J0266J1914m487j0327p61P228O411m765j3094k650J4122R604q185p258
2114d941O103Q485J54j0307r579N502J4736n35j5941l768J3501Q850n294r303
2128b337n81J0574Q891j0008j8679j02J7298P921r186r533J717J2763P239j1484
2142D493j4597M805J5442M1j3331n925M800P884K483n806m386Q122O795q036j0701
2157g917J667O294N23m199k467L130Q344j73j2163l715J2764Q575r577j3000j372
$$ y = [6109, -3792, -14697, -12683, 756, 10610, 1185, -15853, -13761, 3498, 5847, -10680, -20660, -13267, 369, 5230, -4746, -15350, -7096, 7973, 4270, -12756, -16364, -5353, 2991, -2228, -13767, -17195, -2882, 9923, 1234, -12562, -7909, 5633, 6149, -5734, -15859, -13056, 956, 7760, -3898, -12959, -2693, 9221, 4734, -5593, -6354, 874, 7285, 2520, -10574, -13224, 898, 10502, 2317, -4941, 1162, 9647, 9801, -506, -10085, -4583, 10153, 9618, -6323, -10091, 3410, 12260, 6966, -2337, -2918, 7656, 16547, 6539, -12140, -12242, 5056, 12977, 3791, -5742, -4025, 8738, 15977, 4493, -10104, -5299, 10143, 10184, -3147, -9072, -4272, 3612, 6095, 289, -4097, 4025, 10820, 2784, -7917, -6250, 44, 567, -3632, -6099, -2969, 5375, 5202, -6961, -10676, 2088, 10663, 1086, -11914, -13286]
2172a3286J0125P792o901j3311M370J9897N505j6934j3935M199J3246N810r471
2185b894j4026L289J7064L747j4636p979J0018J2886N14j2288j1987M644J2654
2198A006j272j1155Q80J1805M314n643p057j321O824N587n758q766M195P767l060
2213a654p819J039Q718Q392j057j2201o516R270P526q399r075N883J1119K142
2227G368p759r369K822J4022M250j2117p988N865O067l552o762j834Q997J1365
2241A1375j921j4840l735J1561O389q664q656J757R204N316q765j0782O300J5259
2255I798J041j2493n522N674N664j593r332n893R011J3919k597j3345k322R297
2269A307N721m457q453k383Q690N958r213r295O270J0717M02n565j245J479L098
$$ y = [-13286, -3161, 4631, -2270, -15581, -11211, 8686, 14191, -2743, -16678, -12479, 767, 6577, -2894, -16920, -13631, 3433, 7180, -7456, -15435, -5417, 7469, 7983, -4305, -16292, -11648, 1006, -266, -11421, -10541, 1264, 5578, -65, -7122, -8443, -1619, 3968, -1790, -10556, -6361, 1406, -1654, -9473, -8434, 284, 8676, 7619, -4582, -11098, -1828, 5698, -2701, -11776, -5893, 5226, 7368, -391, -9760, -6938, 7084, 11334, -783, -8771, -2906, 3161, -391, -7153, -8987, 10, 11375, 9454, -5386, -9121, 2440, 8829, 165, -8491, -6734, 2470, 7786, -979, -11761, -5461, 9798, 10839, -1654, -7176, -1502, 4162, 2569, -6763, -12656, -3645, 10274, 7677, -5668, -7990, 1307, 7028, 2571, -5882, -8265, 425, 6383, -2830, -12125, -5855, 4862, 5264, -301, -1546, -67, 3031]
2284C031k833r614j051J2074P144q334r158K623Q979N541n219j0466J335J3096
2298G148J696j5158q717R743J3204J834r153p402M936J1217j246j3270m111J0102
2312H23P285l800p936l903P268J1002j842j0953j86Q883J408q472m910K544O299
2327C510K963m888l566O692O328o952q592L754Q287J239o147q032m35J0437O988
2342A1586q511p370O638J0190k060j0786p621L862J1894K140j1946n762J0013
2355B267Q321n375p685L26P120N199n223j2009j929J0851N730n501n002K947N402
2370E439J628o259o998L521J0192k007j1529k222R056N657l411o562n41Q561O362
2385A0887q182j2276K653J0743K133o884n318K274Q155M993o931q212M760Q482
$$ y = [3031, 198, -9416, -10467, 1607, 8751, 417, -8741, -6118, 2861, 8402, 3183, -7283, -5948, 7148, 8844, -6314, -15031, -5288, 7916, 9750, 597, -6805, -1869, 9348, 8102, -5168, -9279, 823, 8108, 4308, -3628, -7531, -263, 10739, 8897, -2056, -2242, 6641, 8049, -423, -5333, -2789, 3510, 6473, 1585, -1981, 4711, 11039, 4087, -4505, -751, 7536, 8775, 2628, -5404, -5839, 4598, 11586, 3075, -4295, 2343, 12533, 10473, -313, -7934, -4072, 7822, 9962, -1984, -7746, 2267, 10588, 5213, -2472, -2146, 4974, 10173, 4950, -7059, -8988, 1863, 7593, 2092, -2910, 37, 5439, 7067, 808, -6190, -2669, 7523, 5516, -6013, -8235, 821, 6478, 3067, -3495, -4036, 4525, 10887, 2705, -9571, -6918, 3825, 5958, -926, -6244, -3970, 4185, 9178, 2247, -5965, -1205, 7277]
2399G277k658q803j317N525M891j499p185r36J0756N289q687q109M090N962m33
2414D163m859m163L057R017P13r068l697Q596O825m182q066l093N256P186l717
2429C968j0469J549J3102L993q830p370K361O667L135n681q354K504Q566M32o656
2444a083j568N324M292q62o356n038N422O277n269q538L104Q903Q90n869m272
2459d643K180P439J692r470o146O089P072m085o607j74N191O290r71r100l405
2474h648R105N484p623r285J810Q180L939m380p470J490J0644J690r448n204N394
2489d322M386j832m206k880L646P158j296p491L54P686K399o235n691N75O174
2504a575M477o015p222M814J0533o80q140j954M412M335j273o844l408O811P142
$$ y = [7277, 4619, -4184, -5501, 24, 4915, 3416, -3769, -4705, 6051, 11340, 2653, -5456, -1366, 4596, 4163, -696, -4859, -1802, 7215, 7928, -1140, -4837, 3759, 10584, 6402, -1664, -4757, 499, 7685, 3968, -6501, -4952, 8150, 12143, 3313, -4057, -1696, 4971, 8106, 2425, -5929, -3425, 5141, 5573, -1083, -2651, 2673, 6965, 6103, -253, -5291, 131, 6408, 1139, -7399, -4295, 4608, 5498, -371, -4643, -2463, 4976, 6668, -2802, -8948, -2859, 4213, 128, -6479, -6653, -1462, 4828, 3857, -5243, -8648, 457, 5941, -1682, -10967, -9157, -977, 2962, -1418, -8888, -7398, 3246, 4936, -4512, -9716, -4322, 64, -1768, -5974, -8854, -5208, 1950, 654, -6837, -6483, 1203, 3602, -2633, -8324, -7749, -1575, 2902, -3113, -10335, -5521, 5012, 4332, -3808, -5762, -1350, 2985, 1712, -5132, -8540, -1729, 5413]
2519E413m625o375K296O914K662l442o475j067P418L633p701o295O015Q720j086
2534F005n559l152L319O701r18q378k184P607L347o247m643K639O828L850l226
2549E989q066k91Q554J677q239m283M448O134K03n951m373N009Q911k085r712
2564b075j271O338J460m385l437L79N691M772n609o985L273P582j31o430m044
2579d872J840M815J498o642l925P382P193m919p012J273N048J454l527o590o5
2594g049P963L445o447m473M615N373m31m676m416J767P589L8q714l341P546N536
2610D325k642m072m27L904L306l813p810J897Q814J180o801k803L249M739J967
2625E013l288m533K870O341k976q185j89O805L844j505m821j394N937M770n472
$$ y = [5413, 788, -5587, -3291, 3623, 6285, 2843, -3632, -4699, 2719, 6352, -1349, -7644, -1629, 7091, 6005, 446, -2706, 613, 7314, 6396, -1982, -4166, 3441, 6788, 541, -4102, -1463, 5365, 9215, 5989, -2077, -2368, 6186, 7863, -376, -4659, -211, 5923, 6126, 175, -4198, 811, 9722, 7637, -2075, -3346, 2992, 4452, 67, -3370, -2991, 2700, 7472, 1863, -5122, -1849, 5733, 5602, -828, -4872, -3032, 1783, 3281, -3361, -7286, 96, 7289, 2370, -4642, -3369, 1679, 3133, -394, -6984, -7049, 914, 4359, -2088, -6561, -1946, 3427, 2996, -1680, -6096, -4329, 3260, 3298, -5416, -8757, -1211, 4325, 1683, -2389, -2816, 1088, 4394, 581, -7229, -5332, 3482, 4662, -2139, -4942, -1693, 3046, 5013, 1725, -2808, 62, 6403, 3427, -4758, -4947, 1858, 5702, 4197, -624, -2018, 3919, 8689, 3217]
2640C217o469L861O205j436n783k167J979O757K344n684m575N155N037l295n505
2655c59o78L747L618j310o509p83Q623L594o548m998L075M256j6m102m678J794
2671a274O830k8o303j851O417L065k736m769k462L342M939k114p706M56P306J408
2687D520n144l001K678M554J410o315o407L531O958j429n622j61M044K659p91
2702A484m565k631N192M729n337o432J451N518J575k383l239Q44O072J312o948
2717c358m055N144M663l136m196n61L260M682m43n677q65O510K150n397m162K237
2733c204L828K122k902n445K237Q312O12o815k212M144L080j346m213j949L673
2748g8N790k231o394J080O215J489k760l217r96L673K167m080m380M246O473j636
$$ y = [3217, -3252, 609, 6814, 5378, -405, -2572, -593, 6164, 8508, 2824, -1751, 3404, 8441, 5146, -359, -1037, 2710, 6328, 5018, -1491, -2274, 6349, 9943, 3395, -1603, 1472, 5728, 5712, 1610, -3068, -1274, 5556, 5528, -775, -2626, 3791, 6856, 4120, -649, -3111, 231, 5170, 3056, -4650, -4194, 3112, 4520, -624, -3625, -947, 3607, 5017, -1298, -7705, -4174, 2784, 1355, -4267, -4428, -384, 2275, 1484, -3081, -5712, -520, 4209, -1128, -7560, -6109, -591, 984, -1399, -4638, -3794, 2278, 3590, -3358, -7413, -2269, 2394, -742, -4938, -5499, -2239, 2443, 2000, -3677, -4542, 1968, 4118, -1279, -5441, -3204, 624, 2746, -156, -5601, -3364, 4948, 5560, -1255, -3467, 677, 3757, 2411, -1802, -3751, -78, 5712, 3481, -2913, -1833, 4382, 5871, 3111, -106, -1102, 2571, 4738, 658, -3722, 524, 6997, 5361]
2764E361n178j110L133L298k8n918k651N362L763m706m224K850M602J255k261
2779C548m746m98N478J889o067l740M260L442q36l609j383K576N000j329p044
2794c059j077M970K171m061k911J179L232K657k625m936J649O226o07o500j934
2809e626L025L173r2l562k863M202N527k879o134P87M753R15k938l229j227N097
2825a071L534l990m254L168N116j356l606j793J186L891N69n224k534N331M704
2840C671l590l340J089K882J722k084m648J47N860J317m825k342L848L620j15
2855C212k945k885J641M834o85o309q94N734K137k143k698j81K977L556k641n378
2871b668Q75N210q9m462q53J849L156J254l060l714L779M275l029n239Q70L522
$$ y = [5361, 183, -927, 2206, 5504, 5476, -442, -3093, 2269, 6032, 1326, -2898, -48, 4554, 5809, 3548, -1198, -1696, 3782, 5671, -396, -4136, 124, 3566, 2730, -879, -2262, 314, 5314, 3985, -3059, -4136, 834, 3005, -1056, -3967, -2788, 444, 3101, 476, -4460, -2811, 3415, 2808, -3692, -5626, -2601, 572, 480, -3082, -5945, -1743, 3784, 905, -5229, -4442, 311, 1226, -1712, -4941, -6168, -1071, 2463, -1527, -5781, -2613, 2503, 1147, -2459, -4252, -3066, 825, 1394, -3830, -6364, -1033, 3671, 81, -3259, -2170, 712, 2434, 350, -4298, -4151, 1709, 3026, -1799, -4141, -293, 3327, 3212, 267, -2618, -977, 3857, 3172, -3137, -4031, 1703, 3840, 1697, -1001, -1182, 1795, 5351, 2710, -2668, -1793, 3417, 3328, -1134, -1987, -138, 3018, 4272, 1212, -2502, 1277, 5552, 2523, -2716, -1846, 1676]
2887A676J225j464l137m91M784L099m774m711L255L788j399k807k635R32M764
2902B105J413n271k678M642L601k799l862n05J630L195j151m641p02N819J874
2917B670m177j911J700J894N37k719l235J595M599p88m812j86M276J822j626k608
2933b969j419K731L157k805n142K091M921L9l198j385J587L169J360l730l905
2948e498L405L768k317l260K10K528K725n4l998j440M460K786m047l697K370L284
2964A225r6j685k292J044M634J021m638j984L403J961k030j949l55J880L107o55
2980B591m453m6N203J459m096k056R14K217J644k922l494K274N136m01m508m17
2996i55K618J299l23k748k046K511L528k060m093J266L734P33k030k003m06L072
$$ y = [1676, 2901, 1437, -1700, -2191, 2593, 5692, 918, -3793, -538, 3250, 1851, -956, -3591, -2659, 2105, 3518, -1753, -4431, 211, 3812, 1013, -2849, -3354, -1724, 1471, 320, -4321, -5023, 796, 2670, -1507, -3418, -1718, 176, 713, -2006, -5241, -3646, 953, 165, -4647, -4833, -557, 1265, -361, -2969, -4388, -1657, 1500, -1305, -6447, -4356, 565, 604, -2594, -3979, -2392, 777, 2137, -1593, -5498, -2093, 1675, -642, -3902, -3692, -1164, 1561, 1507, -2491, -3931, 529, 3315, -732, -4429, -2059, 1225, 1129, -556, -2848, -1804, 2830, 3851, -787, -2771, 632, 2593, 563, -1386, -1741, 139, 3246, 2591, -1862, -1908, 3295, 4754, 658, -1398, -484, 1733, 3377, 455, -3039, -765, 4371, 3970, -538, -955, 1663, 2962, 2639, -109, -2155, 356, 3884, 1824, -2269, -1003, 2731, 3464, 1434, -569, -975, 2097]
3012B097J397l916l297L621L670j947k537r3J574K318m15l541j917L665K421l288
3028a88k675J407K115J375q37l206J00M376L57m912j691L256K321r75k016j084
3044b277J740L478j093m331K83M054K67k869k003J98K487K743j572m012J599M063
3060B755l37l956p29J632K150J60k455k728L393L632k302k943J424K351K8j493
3076E82j995o18K950K522l449j998K115K862r86k058p73J048K840Q6m530j150
3092b552L880J876k175j721J154J408J476j501l525M6M133O52l380r87J672J437
3108A893M15j491j993J701L556j437m953O8L435R54j391j472l23K090K171k282
3124I41l791J813L186q23k389n62J79K077J380k056k818K808K676j674l040M1
$$ y = [2097, 3494, -422, -3719, -98, 3572, 1625, -912, -1005, 569, 2887, 2472, -1069, -2986, 679, 3100, -188, -2863, -1456, 659, 2034, 1197, -2009, -1909, 2467, 2824, -2088, -3779, -523, 1798, 823, -1193, -2277, -537, 2941, 1848, -2483, -2200, 1854, 2121, -748, -2751, -2553, -66, 2677, 1105, -2907, -1308, 2755, 2418, -1538, -2267, -635, 1515, 1675, -780, -3508, -115, 3517, 1215, -1728, -304, 2047, 2075, 582, -1413, -2031, 919, 3441, -8, -2006, 109, 2971, 1985, -73, -846, 202, 3042, 3128, -1402, -2552, 1328, 3204, 1029, -692, 462, 1870, 3346, 1845, -1680, -1634, 2499, 3151, -229, -1216, 456, 1893, 2308, 817, -1176, 525, 4081, 2644, -2309, -2241, 1194, 2148, 757, -715, -1038, 1052, 3223, 941, -2850, -1037, 2149, 1326, -1063, -1625, -1446, 631, 2011, -45, -2863, -55, 2621, 947, -2093, -2052]
3140b052J486J286p04k425m68L376J857k915k211K095J649o57j213j416M34K830
3156I52j06l242j049L608J981j742j571j086J257K244j081l584Q33M268L26l688
3172a680p02J463J797J247j206l124Q52K547o46k762R59J869Q16j29j723j724
3188b146J908K891j597l054J122K072o09j581m83J194K384L92k885k057K607K181
3204B339k205j642M83J128J397l14k484r07L455J913l138k251J115K026or00k131
3221b122L64L150M70l490n09K700O74j362j492m91Q41K540m59k820l29K866K94
3238H25j577o32L14J239O23k029k088J271L533p38k350k31J434Q84j14j237j804
3255b677K198J819j888k298J673J657K60J26j434o62J574J170k293j905K685J785
$$ y = [-2052, -566, 720, 16, -2409, -2877, 499, 2356, -559, -2770, -675, 974, 317, -896, -2312, -1878, 952, 846, -2396, -3445, 163, 2144, 402, -1169, -2255, -998, 1246, 165, -3419, -2586, 1682, 2008, -1680, -2382, -919, 878, 2125, 919, -2205, -1353, 1194, 548, -2214, -1255, 614, 1430, 1301, -422, -2146, -238, 2653, 1056, -1998, -876, 1196, 587, -994, -1477, -283, 2101, 2493, -392, -2449, 158, 2339, 134, -1508, -1025, 103, 1500, 1186, -1298, -2205, 1250, 3163, 25, -2226, -1111, 915, 909, 9, -2122, -1758, 1392, 1862, -1628, -2137, 563, 1237, -125, -1617, -2108, -1267, 1273, 814, -2006, -2335, 531, 825, -752, -1384, -1070, 169, 792, -1237, -3325, -2054, 1479, 741, -1609, -1840, -406, 478, 364, -873, -2677, -479, 1340, -548, -2846, -1173, 484, 744, 870, -564, -1226, 348, 1518, -775, -2680, 5, 1790]
3271A790j285j571K07J041J703k96k588o06K778J084k440j262Q53J471Q71l82
3287A368k466K57L712J78l274r17J407J428L49j265j782Q88L030p69k869M47J964
3304A686L64q34j161p07Q51J711p34j564J236J515j032j380l6O75R43J95k154
3321d26j233K592J824k334j769J572J538Q8j148k496M1K883J328k912j578J475
3337e55J890n09m15j625L94K201L78l134j094K315J408j189q20J2L96J272j81
3354G44k225J3K459n70j611K89O65J29M98m87q63J113J836j272k754R50J997J68
3372A079j009j168n53J539K513j725k026J162K062q33j068n33Q3J100J041j571
3388I3j248J780J902j545j159K14R02L89m1j893l79K797O65j954j040J393R19
$$ y = [1790, 505, -1066, -859, 182, 1885, 1589, -999, -1605, 1173, 2257, -183, -1445, -592, 879, 1750, 1368, -1098, -841, 2871, 3049, -225, -1142, 265, 1693, 2042, 777, -1005, -117, 2913, 2144, -725, -278, 1686, 2050, 1216, 55, -652, 199, 1910, 1176, -388, 848, 2363, 1331, -49, -85, 590, 1533, 1728, -426, -1659, 933, 2757, 423, -1346, 226, 1764, 1852, 704, -1792, -1751, 1132, 2460, -452, -2030, -555, 1335, 826, 411, -1214, -820, 1381, 1759, -1375, -2469, -154, 1254, 65, -755, -743, -347, 925, 744, -1481, -1468, 991, 421, -1190, -901, -236, -107, 391, -96, -959, 154, 1990, 718, -2036, -1086, 911, 1079, 70, -1098, -1651, -112, 2401, 676, -1350, -188, 1874, 1041, -27, -560, -477, 623, 1664, 93, -1155, 625, 2527, 982, -177, 37, 939, 1328, 1287, -606, -985, 1812, 2477, 523, -517, 876, 1795]
3405A795j76p68j160J84K236l27k706j59K588J210j528j255q96J095K324m91k944
3422i78l75K231m3n55k65k00O97J089o74k014M18J618p90r52O86O83r06k80m49
3441a059J9J766J329j884k618P51J642M5o20n60J73J389K48k300p04K608J298
3458A523j636j762j86L82J774M40k151n79K082J274j589j209K54M28J342lk002
3475a618p25J986P96j477L65R45r06k30J84j2P85J169j277k400Q54K602J23j115
3493D9m17j04M74J160j440j318J493J885j254j498l44J149J353O57j387j302J161
3510C17R47j646j180J282J389O02o52j741r66J983J363r45q15M90k43p23o0L14
3528b84P23J280m81k369l66K600L41j529k06l90N37R71o63j466N16J746Q2j643
$$ y = [1795, 1619, 851, -309, -125, 2111, 1784, -922, -1081, 1507, 2717, 1189, -66, -962, 133, 2457, 1966, -978, -1353, 878, 835, 280, 15, -185, 512, 1601, 927, -1087, -669, 949, 159, -793, -107, 576, -330, -610, -1059, -1040, 726, 2055, 171, -2447, -1696, -54, -9, -629, -1189, -1016, 373, 621, -1679, -2383, 225, 1523, -113, -1875, -2061, -1679, 95, 535, -1616, -2195, -113, 1161, -428, -1637, -1383, -955, 387, 384, -1618, -2343, -357, 439, -1038, -673, 272, -634, -864, -680, -692, 93, 1262, -15, -2415, -1561, 1041, 1164, 49, -368, -472, 2, 1162, -278, -1596, -103, 1782, 528, -970, -1314, -165, 1188, 1845, 458, -844, 317, 1264, -382, -1562, -280, 1109, 1711, 1059, -682, -1648, 335, 1698, 753, -62, 428, 185, -538, -598, -284, 439, 1719, 1238, -1131, -1497, 1103, 1444, -85, -291, -681, -144, 827, 164, -1302, -786, 960, 1042, -601]
3546f01l76O57L62K0k87j383N93J547q82j137J206J064o16q54j144nJ359J735
3564A258j067k205M48P43K33j4K99M30k63J12k245n30K151J741j089j227J22M68
3582f35K79L06j367J02J797N61j885j531N94J319J002J15j271m66Q31J18j201
3599a332N39J928o05j259k51j50R14J691n59j980L10J612J73j116k8k15J91P89
3617F52o74j190J608J462p69j776N61K52K46L58q90m32J420R33j872j538J128
3634e21J809M98l76j485j297Q56J699p79m34R22J54j458k33M35M85R97P9j849
3652d98p43J267O08j099J4R08K07k96k77j374J24J708k2r40j62M37k21k50J28
3671d81M7N37P55j118j583M37J873j02r49p57JR29J348n32j601K49R68j65l85
$$ y = [-601, -977, -320, 42, 62, -225, -1608, -1015, 532, -350, -1487, -281, 783, 167, -687, -1831, -1836, -477, 1258, 191, -2014, -1566, -823, -590, -604, -305, 125, -138, -26, -2271, -2801, -650, 1091, 2, -1225, -1103, -635, -356, -50, -1417, -1315, 482, 1043, -842, -2373, -1779, -460, 542, 657, -614, -1080, -249, -131, -1332, -793, 1135, 530, -729, -980, -1130, -216, 1475, 916, -1064, -754, 858, 1031, -85, -113, -328, -137, 652, -22, -1212, 396, 1858, 1089, -687, -126, 126, 372, 730, -160, -592, 828, 1761, -111, -1649, -521, 1288, 1786, 1410, -75, -1372, -516, 1183, 404, -30, 892, 1046, -412, -645, -210, 275, 1272, 1351, -498, -1241, 26, 634, -465, -451, 457, 664, 368, 91, -1283, -1159, 549, 527, -413, -575, -138, -359, -609, -481, -434, 103, 858, -260, -1843, -1406, 467, 365, -584, -1341, -1340, -411, 937, 405, -1196, -947, 21, -144, -529]
3690e29P5L5J30M81j013m74J283R11q29q10P91L59p06K24q30J74J351M20j209
3709a66p18P91O22n69O1K57k57Q9R6j031K27J855J60r67j045K49M38J184l92j865
3729i81NK106K21j232l59K13N17O45l4j143k1Q67j99j006R14M77o16k35K4Q5M07
3750F55N10j067p51R09P88r90k62K40K33L73J61o92q35J411N97j235o98N69N31
3769D47j40l1j083k67J932M72j268p52O31L44M0J24j010m03J114O82j064k63R87
3788D92n1m95J30M3k9L01k06j276M46J378m38q12L03L59J61M21o70j158Q65J370
3808A134p70r81M66O05m11L02j64p06O81O58q04o83N78N32p1M9k69l41P64K88
3828H57o62p75J164K70j101N3L47K96J93n61o25K70J238p4j020n56O48M63K46
$$ y = [-529, -454, -419, -289, 192, -821, -1295, -12, 899, 70, -740, 51, 410, -296, -72, -902, -728, 623, 1043, -166, -884, -93, 529, -40, 21, 278, 21, 110, 206, -825, -598, 1257, 1417, 450, -595, -346, 92, 1276, 884, -981, -976, 1130, 1351, 119, -240, -27, 490, 1135, 1101, -42, -63, 804, 605, -401, 513, 990, 374, 139, 163, 248, 655, 1165, 98, -653, 256, 1044, 54, -208, 32, 265, 638, 799, 107, -728, 683, 1280, 45, -653, -84, 447, 307, 276, -807, -1074, 858, 1330, 62, -690, -59, 285, 325, 449, -561, -964, 150, 832, -232, -495, 492, 441, -54, 76, 119, 90, 391, 185, -1091, -645, 733, 295, -517, -214, 145, 306, 727, 57, -1101, -236, 1134, 364, -617, -151, 454, 43, 345, 181, -525, 156, 814, 10, -673, -95, 437, 366, 415, 146, -195, 569, 857, 195, -580, 584, 854, -247, -194, 153, 449, 642, 81, -544, -274, 964, 890, -130, -686, -38, 425, 671]
3847F71k56j121j01J467M75j657k04M15O26j04J3j203K37J222L77j253m6N27m92
3866d07L93J55n85m54Q07j69k84J67K81o44m1J162Pq23k64k81j86J301O32j346
3886e79p09Q79J054p62l52o33K17J743M17j886j045R23J216j19m40n01j30J404
3904F97K35j243r91R32O11K33j76m20j60N46L01m26k13K88J65m29N76Q5n20k31
3924a40O18j0J21L94o40j084N41J141l57m52j30P5K98M91q40r58J348P86l68r66
3944a32l61MM79R36r78l60M65R21q66o80K1R87K54j25o63r56O02L74j72k41P33
3965B42p8j97l75l59k05J197K47j256jK78L49j23m09J23k20O20O97j195l63M19
3985f09k59O0O08m97j85R48J81p13j98Q0m42N3J455r4m12o98m06J71J265P65j023
$$ y = [671, 415, -706, -807, 660, 1135, -522, -726, -311, 315, 211, 224, -979, -742, 480, 857, -396, -442, 85, -407, -14, 141, -444, -898, -91, -260, -544, -377, -96, -740, -781, 381, 388, -435, -699, -980, -1166, 135, 767, -579, -1288, -409, 645, -117, -469, -1102, -885, 858, 1275, -611, -1656, -733, 483, 364, -76, -577, -707, 697, 932, -311, -1302, -370, 241, 474, 298, -122, -282, 264, 565, 139, -74, 214, 379, -50, 526, 611, 91, -140, 478, 468, 589, 983, 343, -741, -200, 941, 584, 132, 2, 77, 375, 866, 26, -932, 416, 1202, 834, -132, -493, -489, -10, 926, -52, -412, 53, 974, 108, -572, -551, 436, 690, 565, -98, -1054, -452, -78, -250, -491, 242, 164, -33, -408, -767, -972, 225, 472, -784, -785, -507, -158, -281, -690, -567, -787, -167, 530, -665, -1028, -609, -868, -808, -200, -697, -882, 66, 247, -466, -664, -584, -1026, -973, 482, 388, -24, -722, -1128, -957, 308, 1073, 50]
4006E0q83N73P52p59n41M17O27J131j49k042n76J408J204K8q05r03j53J006N33
4025I18j038p57J256Q47K36r08p52n10J338J091p21r01j03L49j83Q18q6m14n41
4044f1M51K53M7J25m60o57O50M31n42p1l0Q08j35j98q85o71J628J034j131j315
4064g29N8M51N98K88n65n31O96P05q65j081J81O59J017L01q20j716Q7J523K0M9
4084C26J86m72m13j24P1k25N13O85p50l37L19L1m6j07M54l11j14Qn23Q9J016J76
4106D52r35M37o2r0JL8m65N73P91p62r73M13J527m4p50l70l68N86P56m84q37O08
4128D2N73q58k84K74O51Q90K2j190r95M56J290o1q12J01K00M07lp15p19J418Q37
$$ y = [50, -833, -260, 492, -267, -808, -391, 236, 1367, 1218, -824, -1400, 8, 1212, 1240, 435, -468, -621, 385, 918, -120, -877, 379, 1226, 1462, 554, -198, -708, 630, 1721, 1000, 99, -4, 345, 162, 980, 894, 480, -61, 390, 643, 690, 815, 355, -302, 348, 779, 237, 166, 136, 944, 809, 611, -274, -945, 683, 1717, 586, -729, -671, -220, 378, 666, 101, -430, 266, 971, 106, -975, -794, -135, 882, 1183, 363, -1353, -1266, 257, 277, 326, 512, 40, -373, -497, -426, -651, -138, 547, -203, -540, -221, -190, -236, -343, 111, -200, -314, -306, -829, -740, 276, 452, -483, -46, -108, -198, -197, -159, -624, -51, 740, -22, -995, -582, 945, 901, 151, -219, -587, -1, 755, 271, -566, 42, 615, -243, -527, -253, 398, 1288, 1310, 120, -875, -419, 871, 810, -2, 99, 299, 706, 703, -12, -731, 687, 1524]
$$ [...]
8191d61
##END NTUPLES=NMR FID
##END=
