##TITLE=1H_TG-2288-3
 CDCl3, 8 sc, 
 5.6.2020
##JCAMPDX= 6.0         $$ Bruker NMR JCAMP-DX V2.0
##DATA TYPE= NMR FID
##DATA CLASS= NTUPLES
##ORIGIN= UXNMR, Bruker Analytische Messtechnik GmbH
##OWNER= root
$$ XWIN-NMR		Version 3.5
$$ Fri Jun  5 12:07:44 2020 Russian Standard Time (UT+4h)  she@DPX200
##.OBSERVE FREQUENCY= 200.1315
##.OBSERVE NUCLEUS= ^1H
##.DELAY= (6, 6)
##.ACQUISITION MODE= SIMULTANEOUS
##.ACQUISITION SCHEME= undefined
##.AVERAGES= 8
##.DIGITISER RES= 18
##SPECTROMETER/DATA SYSTEM= spect
##.PULSE SEQUENCE= zg30
##.SOLVENT NAME= D2O
##.SHIFT REFERENCE= (INTERNAL, D2O, 0, 15.7039)
##AUDIT TRAIL= $$ (NUMBER, WHEN, WHO, WHERE, WHAT)
$$ ##TITLE= Audit trail, XWIN-NMR		Version 3.5
$$ ##JCAMPDX= 5.01
$$ ##ORIGIN= Bruker BioSpin GmbH
$$ ##OWNER= she
$$ F:/spectra/data/she/nmr/H-F/1/audita.txt
$$ ##AUDIT TRAIL=  $$ (NUMBER, WHEN, WHO, WHERE, WHAT)
(   1,<2020-06-05 12:06:44.53 +0400>,<she>,<DPX200>,
      <created by zg, POWCHK disabled, PULCHK disabled
       configuration hash MD5:
       00 E9 B6 7A A2 85 ED C7 34 08 36 98 17 FE 4E 26
       data hash MD5: 16K
       95 EA EA CE C5 F0 C5 DF 2A 82 9C 9C ED 34 45 47>)
$$ ##END=
$$ 
$$ hash MD5
$$ A3 E7 19 44 5D 58 32 99 95 14 29 FD E1 E6 DE DA
##$RELAX= 
##$RELAX= 
##$RELAX= 
##$RELAX= 
##$RELAX= 
##$RELAX= 
$$ Bruker specific parameters
$$ --------------------------
##$DU= <F:/spectra>
##$EXPNO= 1
##$NAME= <H-F>
##$PROCNO= 1
##$TYPE= <nmr>
##$USER= <she>
##$AMP= (0..31)
100 100 100 100 100 100 100 100 100 100 100 100 100 100 100 100 100 100 
100 100 100 100 100 100 100 100 100 100 100 100 100 100 
##$AQSEQ= 0
##$AQ_mod= 1
##$AUNM= <au_zg>
##$AUTOPOS= <>
##$BF1= 200.13
##$BF2= 200.13
##$BF3= 200.13
##$BF4= 200.13
##$BF5= 200.13
##$BF6= 200.13
##$BF7= 200.13
##$BF8= 200.13
##$BYTORDA= 1
##$CFDGTYP= 0
##$CFRGTYP= 5
##$CHEMSTR= <none>
##$CNST= (0..31)
1 1 145 1 1 1 1 1 1 1 1 1 1 1 1 1 1 1 1 1 1 1 1 1 1 1 1 1 1 1 1 1 
##$CPDPRG= <>
##$CPDPRG1= <>
##$CPDPRG2= <>
##$CPDPRG3= <>
##$CPDPRG4= <mlev>
##$CPDPRG5= <mlev>
##$CPDPRG6= <mlev>
##$CPDPRG7= <mlev>
##$CPDPRG8= <mlev>
##$CPDPRGB= <>
##$CPDPRGT= <>
##$D= (0..31)
0 1.2 0 0 0 0 0 0 0 0.06 0 0.03 0 0 0 0 0.0002 0 0 0 0 0 0 0 0 0 0 0 0 
0 0 0 
##$DATE= 1591344403
##$DBL= (0..7)
120 120 120 120 120 120 120 120 
##$DBP= (0..7)
150 150 150 150 150 150 150 150 
##$DBP07= 0
##$DBPNAM0= <>
##$DBPNAM1= <>
##$DBPNAM2= <>
##$DBPNAM3= <>
##$DBPNAM4= <>
##$DBPNAM5= <>
##$DBPNAM6= <>
##$DBPNAM7= <>
##$DBPOAL= (0..7)
0.5 0.5 0.5 0.5 0.5 0.5 0.5 0.5 
##$DBPOFFS= (0..7)
0 0 0 0 0 0 0 0 
##$DE= 6
##$DECBNUC= <off>
##$DECIM= 24
##$DECNUC= <off>
##$DECSTAT= 4
##$DIGMOD= 1
##$DIGTYP= 9
##$DL= (0..7)
0 120 120 120 120 120 120 120 
##$DP= (0..7)
150 150 150 150 150 150 150 150 
##$DP07= 0
##$DPNAME0= <>
##$DPNAME1= <>
##$DPNAME2= <>
##$DPNAME3= <>
##$DPNAME4= <>
##$DPNAME5= <>
##$DPNAME6= <>
##$DPNAME7= <>
##$DPOAL= (0..7)
0.5 0.5 0.5 0.5 0.5 0.5 0.5 0.5 
##$DPOFFS= (0..7)
0 0 0 0 0 0 0 0 
##$DQDMODE= 0
##$DR= 18
##$DS= 0
##$DSLIST= <SSSSSSSSSSSSSSS>
##$DSPFIRM= 0
$$ [...]
##$SUBNAM2= <"">
##$SUBNAM3= <"">
##$SUBNAM4= <"">
##$SUBNAM5= <"">
##$SUBNAM6= <"">
##$SUBNAM7= <"">
##$SUBNAM8= <"">
##$SUBNAM9= <"">
##$SW= 24.9337058887773
##$SWIBOX= (0..15)
0 0 2 0 0 0 0 0 0 0 0 0 0 0 0 0 
##$SW_h= 4990.01996007984
##$TD= 16384
##$TD0= 1
##$TE= 0
##$TE2= 300
##$TE3= 300
##$TEG= 300
##$TL= (0..7)
0 120 120 120 120 120 120 120 
##$TP= (0..7)
150 150 150 150 150 150 150 150 
##$TP07= 0
##$TPNAME0= <>
##$TPNAME1= <>
##$TPNAME2= <>
##$TPNAME3= <>
##$TPNAME4= <>
##$TPNAME5= <>
##$TPNAME6= <>
##$TPNAME7= <>
##$TPOAL= (0..7)
0.5 0.5 0.5 0.5 0.5 0.5 0.5 0.5 
##$TPOFFS= (0..7)
0 0 0 0 0 0 0 0 
##$TUNHIN= 0
##$TUNHOUT= 0
##$TUNXOUT= 0
##$USERA1= <user>
##$USERA2= <user>
##$USERA3= <user>
##$USERA4= <user>
##$USERA5= <user>
##$V9= 5
##$VALIST= <valist>
##$VCLIST= <CCCCCCCCCCCCCCC>
##$VD= 0
##$VDLIST= <DDDDDDDDDDDDDDD>
##$VPLIST= <PPPPPPPPPPPPPPP>
##$VTLIST= <TTTTTTTTTTTTTTT>
##$WBST= 1024
##$WBSW= 4
##$XGAIN= (0..3)
0 0 0 0 
##$XL= 0
##$YL= 0
##$YMAX_a= 159207
##$YMIN_a= -108108
##$ZGOPTNS= <>
##$ZL1= 120
##$ZL2= 120
##$ZL3= 120
##$ZL4= 120
##$ABSF1= 10
##$ABSF2= 0
##$ABSG= 5
##$ABSL= 3
##$ALPHA= 0
##$AQORDER= 0
##$ASSFAC= 0
##$ASSFACI= 0
##$ASSFACX= 0
##$ASSWID= 0
##$AUNMP= <proc_1d>
##$AZFE= 0.1
##$AZFW= 0.1
##$BCFW= 1
##$BC_mod= 2
##$BYTORDP= 1
##$COROFFS= 0
##$CY= 11.3945322036743
##$DATMOD= 1
##$DC= 2
##$DFILT= <>
##$DTYPP= 0
##$F1P= 16.9975609425685
##$F2P= -3.02152046262296
##$FCOR= 0.5
##$FTSIZE= 0
##$FT_mod= 4
##$GAMMA= 1
##$GB= 0.15
##$INTBC= 1
##$INTSCL= 1
##$ISEN= 128
##$LB= 0.24
##$LEV0= 0
##$LPBIN= 0
##$MAXI= 10000
##$MC2= 0
##$MEAN= 0
##$ME_mod= 0
##$MI= 1.114404
##$NCOEF= 0
##$NC_proc= 0
##$NLEV= 6
##$NOISF1= 3.799351
##$NOISF2= 2.8
##$NSP= 1
##$NTH_PI= 0
##$NZP= 0
##$OFFSET= 15.70392
##$PC= 1
##$PHC0= -9804.78
##$PHC1= 34.20082
##$PH_mod= 1
##$PKNL= yes
##$PPARMOD= 0
##$PSCAL= 0
##$PSIGN= 0
##$REVERSE= no
##$SF= 200.130013532006
##$SI= 16384
##$SIGF1= 3
##$SIGF2= 2
##$SINO= 400
##$SIOLD= 16384
##$SREGLST= <1H.CDCl3>
##$SSB= 0
##$STSI= 0
##$STSR= 0
##$SW_p= 3612.71676300578
##$SYMM= 0
##$S_DEV= 0
##$TDeff= 0
##$TDoff= 0
##$TI= <>
##$TILT= no
##$TM1= 0
##$TM2= 0
##$TOPLEV= 0
##$USERP1= <user>
##$USERP2= <user>
##$USERP3= <user>
##$USERP4= <user>
##$USERP5= <user>
##$WDW= 1
##$XDIM= 8192
##$YMAX_p= 0
##$YMIN_p= 0
$$ End of Bruker specific parameters
$$ ---------------------------------
##NTUPLES= NMR FID
##VAR_NAME=  TIME,          FID/REAL,        FID/IMAG
##SYMBOL=    X,             R,               I
##VAR_TYPE=  INDEPENDENT,   DEPENDENT,       DEPENDENT
##VAR_FORM=  AFFN,          ASDF,            ASDF
##VAR_DIM=   8192,          8192,            8192
##UNITS=     SECONDS,       ARBITRARY UNITS, ARBITRARY UNITS
##FACTOR=    0.0002004,     1,               1
##FIRST=     0,             0,               0
##LAST=      1.6414764,     0,               0
##MIN=       0,             -108108,         0
##MAX=       1.6414764,     159207,          0
$$ Real data points
##PAGE= N=1
##DATA TABLE= (X++(R..R)), XYDATA
$$ [...]
2460H03J021k765L89J878q81j998K395l74k057K279R48k677k6K158q08j351J773
$$ 803 1824 -941 -552 1326 445 -1553 842 468 -1589 690 1638 -1039 -1065 1093 285 -1066 707
2477G07P1k092J131J384k149k87L264j476k735K021J352j839O64J158k766N06
$$ 707 778 -1314 -183 1201 -948 -1235 2029 553 -2182 -161 1191 -648 16 1174 -1592 -1086
2493a086K892j502k300K114J545l084J319N92j870O92J964j157k395K558J264
$$ -1086 1806 304 -1996 118 1663 -1421 -102 490 -1380 -688 1276 119 -2276 282 1546
2508A546l076Q47J912j718n87J540j069j574K453N87k579P1K525j557J98J075
$$ 1546 -1530 -683 1229 -489 -1076 464 -605 -2179 274 861 -1718 -1647 878 -679 -481 594
2524E94p2k670K364J184k568N17J723j279n49J804j04k589K143K87j904N99K550
$$ 594 522 -2148 216 1400 -1168 -651 1072 -207 -756 1048 944 -1645 498 785 -1119 -520 2030
2541B030j770j025K082l76j840J852J053k051o36K381q29k084K685k01j705J257
$$ 2030 260 -765 1317 941 -899 953 2006 -45 -681 1700 871 -1213 1472 1271 -434 823
2557H23J295k284m86K548j188j348J140L08j240J587o3k026J45K972j857j847
$$ 823 2118 -166 -652 1896 708 -640 500 808 -432 1155 1092 -934 -789 2183 326 -1521
2573a521K387L33j927J479R3j166J87J756j483k080L254K80k208M50J552j479
$$ -1521 866 1199 -728 751 844 -322 -135 1621 138 -1942 1312 1592 -616 -166 1386 -93
2589i3r1J201R4j586J568M7k292J762O27j883l44J757m54j901J470J460k815J000
$$ -93 -184 1017 1111 -475 1093 1140 -1152 610 1237 -646 -990 767 313 -1588 -118 1342 -1473 -473
2607d73J568j429p50K426r31k097K039O32k324M52J607j679N22J922j188j375
$$ -473 1095 -334 -1084 1342 411 -1686 353 985 -1339 -887 720 -959 -437 1485 297 -1078
2623a078Q49M99j757K99K167j483o17J340O24k507J031J325j909N35J892j485
$$ -1078 -229 270 -1487 -1188 979 -504 -1121 219 843 -1664 -633 692 -1217 -682 1210 -275
2639b75j785K825j7k500K094J51j826J287J231j578j184K318N02l017J235J604
$$ -275 -2060 765 748 -1752 342 493 -1333 -46 1185 -393 -1577 741 1243 -1774 -539 1065
2655A065k075M82J792j366q52K244p09j923J180J676k147kJ661n26j557K391p43
$$ 1065 -1010 -528 1264 -102 -954 1290 581 -1342 -162 1514 -633 -635 1026 500 -1057 1334 591
2672E91j419K024K48j728q61K666j362j208J714l3j169P01J461j170j044K470
$$ 591 -828 1196 1444 -284 -1145 1521 159 -1049 665 632 -537 164 1625 455 -589 1881
2688A881j373j555J565L11j850N39K375k133qJ195k81r87R81O95j663J23J685
$$ 1881 508 -1047 518 829 -1021 -482 1893 -240 -248 947 666 -321 660 1355 -308 -185 1500
2705A500j907K94J340n44j412J368O47j979K41K022j396l17R21l41j196J352L24
$$ 1500 -407 -113 1227 683 -729 639 1286 -693 -452 1570 174 -143 778 437 -759 593 917
2722I17k011J135J497j558j714J963O48j696J121O88j684J85J396r61j037K126
$$ 917 -1094 41 1538 -20 -1734 229 877 -819 302 990 -694 -509 887 -74 -1111 1015
2738A015o73j839J104J071j507J01J699j381o55J915n35j351J334L87k500J404
$$ 1015 342 -1497 -393 678 -829 -728 971 -410 -1065 850 315 -1036 298 685 -1815 -411
2754d11Q37q48j399J886N06j036J58J236j947j76K149j928j331K461J119k418
$$ -411 426 -422 -1821 65 571 -465 -307 929 -1018 -1194 955 -973 -2304 157 1276 -1142
2770a142N35J255j233M3O70m46j035K269J68k145k20K119j481q25J850n78j020
$$ -1142 -607 648 -585 -542 128 -318 -1353 916 1084 -1061 -1281 838 -643 -1468 382 -196 -1216
2787a216K074L36j963l96J910j470J50J512j151m92J990j42k177Q90J853j220
$$ -1216 858 1194 -769 -1165 745 -725 -575 937 -214 -706 1284 1142 -1035 -145 1708 488
2803D88j661K415j020j045J532L71k239J135K212k615n83J504N08j820J189R19
$$ 488 -1173 1242 222 -823 709 1080 -1159 -24 2188 -427 -1010 494 1002 -818 371 1290
2819A290j380j2J884j574q94J409M59j963J025Q99j960Q56J333q78j537K267p19
$$ 1290 -90 -102 1782 208 -686 723 1182 -781 244 1143 -817 39 1372 494 -1043 1224 505
2836E05j000Q00J110j640o5J949j473j507K102L28j930L39J268j444O7J428j164
$$ 505 -495 305 1415 -225 -290 1659 186 -1321 781 1109 -821 -482 786 -658 -591 837 -327
2853c27l52J889m14j850M37J600j585j69J922j433j241J731N58k074J330Q91j405
$$ -327 -679 1210 796 -1054 -617 983 -602 -771 1151 -282 -1523 208 766 -1308 22 913 -492
2870d92n75J249j70j529J800K22k157J460K009k310m14J581k53j833J208P98k014
$$ -492 -1067 182 12 -1517 283 505 -1652 -192 1817 -493 -907 674 421 -1412 -204 594 -1420
2887a420L20J894j091r35J981p92j302R78O13j363P06J498j878m70J615R9k021
$$ -1420 -1100 794 -297 -1232 749 -43 -1345 -367 246 -1117 -411 1087 -791 -1261 354 453 -1568
2904a568J898J43k073J245J516j131j058J960l73j379J212L6r77j1K112j844j110
$$ -1568 330 473 -1600 -355 1161 30 -1028 932 559 -820 392 428 -549 -560 1552 -292 -1402
2921a402K076J79j725P40J135j522P26R04j540j074K680r7k002P71J314q78n68
$$ -1402 674 853 -872 -132 1003 -519 207 1111 -429 -1503 1177 1080 -922 -151 1163 285 -283
2938b83J093j434n79K393p07j520O87J810j518o29Q31l23l71J471J91j997P13
$$ -283 810 -624 -1203 1190 483 -1037 -350 1460 -58 -687 144 -179 -550 921 1112 -885 -172
2955a72J536j480n05J470q39n85J543j98j651J075J172j676l06J623n12j414J278
$$ -172 1364 -116 -621 849 10 -575 968 770 -881 194 1366 -310 -616 1007 495 -919 359
2972C59P14j738N50J045j360l56J917l69j462J081N73k145J034J964k280o69K540
$$ 359 1073 -665 -115 930 -430 -786 1131 762 -700 381 954 -1191 -157 1807 -473 -1142 1398
2989A398q69j815J605O78j876J281Q73j314j191J696K40k194J394R47j505J32
$$ 1398 529 -1286 319 997 -879 402 1275 -39 -1230 466 706 -1488 -94 853 -652 -520
3005e20K036k095m07K163m56k117P69J356p47o36J138j540L18J450j52k178J186
$$ -520 1516 -579 -986 1177 721 -1396 -627 729 -18 -654 484 -1056 -738 712 560 -1618 -432
3022d32J664j909j07J112o25l44J392q63j264Q16J972j988j78J578r53p71J216
$$ -432 1232 -677 -784 328 -297 -641 751 -112 -1376 -560 1412 -576 -754 824 -129 -900 316
3039C16k03j313J175J371j922k05K139n24j740J377J10j649J068R44j838j24K353
$$ 316 113 -1200 -25 1346 -576 -781 1358 834 -906 471 581 -1068 0 944 -894 -1018 1335
3056A335j338n81J363j63j405Q00Q32j286OJ600n67j122O73K02j054J102J546
$$ 1335 -3 -584 779 616 -789 11 843 -443 -437 1163 596 -526 147 349 -705 397 1943
3073A943j995j146K178p2j717J096O58j531R29Q52j584l57K403o59j459R98M09
$$ 1943 -52 -1198 980 908 -809 287 945 -586 343 1195 -389 -746 1657 998 -461 537 946
3090I46j027J77P94j242J3J621p48j451J087R60j191k44J318q13o82J585o57j706
$$ 946 -81 96 890 -352 -339 1282 534 -917 170 1130 -61 -305 1013 200 -482 1103 446 -1260
3108a260K018O08j635k27J374j137m53J822q24j444J380J318k266j35K068j066
$$ -1260 758 1366 -269 -496 878 -259 -712 1110 286 -1158 222 1540 -726 -861 1207 141
3124A41q89J570n81j777J538R39k057J49J909p89j007J045L63j408P97J078j645
$$ 141 -748 822 241 -1536 2 941 -1116 -967 942 153 -854 191 554 -854 -57 1021 -624
3141f24j59J295m20j209J429J38j846R30P66j110j64K280j207j465J071O89j421
$$ -624 -783 512 92 -1117 312 450 -1396 -466 300 -810 -974 1306 99 -1366 -295 394 -1027
3158a027J097J035k165J02J795q95p96J238m68r71N30P91r38j4K400j916j430
$$ -1027 70 1105 -1060 -958 837 -58 -854 384 -84 -1055 -525 266 -672 -686 1714 -202 -1632
3175a632J724Q10j499J49J170q96l68J476m83j786J355J127j451J2J257j002k36
$$ -1632 92 902 -597 -448 722 -174 -542 934 451 -1335 20 1147 -304 -292 965 -37 -273
3192b73J539q28j604J628O87j780O77J168q24q08J185m36j232J389M69j211j79
$$ -273 1266 438 -1166 462 1149 -631 46 1214 390 -418 767 331 -901 488 957 -254 -433
3209d33J520r85q40J402j43j267J422L81j504j24J755k17j408J380o75r00O04
$$ -433 1087 102 -738 664 521 -746 676 1057 -447 -571 1184 967 -441 939 264 -636 -32
3226c2J335k078M17J510q21j355J361J3p69P24Q43j611j26J708l91j267P17P35
$$ -32 1303 -775 -358 1152 331 -1024 337 350 -419 305 1148 -463 -589 1119 728 -539 178 913
3244I13j066K23J057j867mJ222n35j226J792M64j542P84N72j685M99Q47p02j364
$$ 913 -153 70 1127 -740 -744 478 -57 -1283 509 973 -569 215 787 -898 -399 448 -254 -1618
3262a618J786O90j941N52J022r68j39J018p67r34J336O77j570m3J140n46l72J225
$$ -1618 168 858 -1083 -531 491 -477 -616 402 -365 -1299 37 714 -856 -899 241 -305 -677 548
3280E48p27r86J071R32j621j13J277l37p32Q77j77j046J039O77j451J50J014m67
$$ 548 -179 -1165 -94 838 -783 -896 381 44 -688 189 12 -1034 5 682 -769 -619 395 -72
3298g2p14Q52j7q91J194J90j248L6J386o68n99M72K41j003J161L16j441M67J469
$$ -72 -786 66 49 -842 352 542 -706 -670 716 48 -551 -79 162 -841 320 636 -805 -338 1131
3317A131j022j150J076O50j164M55J321j763r0J540n27j406J118L93r21N66O84
$$ 1131 109 -1041 35 685 -479 -24 1297 -466 -556 984 457 -949 169 562 -359 207 891
3334H91j573M02J601q56j252J219O07j234m74J745j069l26R35m64o62J101J96
$$ 891 -682 -280 1321 465 -787 432 1039 -195 -669 1076 7 -319 616 152 -510 591 787
3351G87j387r0J427q59m97J451p20q71J540K98j842Q67Q43j223l47J295l45q08
$$ 787 -600 -690 737 -122 -619 832 112 -759 781 1079 -763 104 947 -276 -623 672 327 -481
3369d81Q80P10j681M31Q50o28p47O20K90j485J145Q19j212l62J619q34o08P05
$$ -481 399 1109 -572 -141 709 81 -666 -46 244 -1241 -96 723 -489 -851 768 -66 -674 31
3387C1p7r24R10Q40j399j95J197k23j142R06R6m15Q09J33j726M60J667j118q52
$$ 31 -46 -970 -60 780 -619 -814 383 160 -982 -76 20 -395 414 547 -1179 -719 948 -170 -1022
3406a022O02R32r76L70O37j511P22R62o85m75Q77k40p24N2J026j074Q3J200r29
$$ -1022 -420 512 -464 -94 543 -968 -246 716 31 -444 433 193 -531 -479 547 -527 -444 756 -173
3425a73r00R44J001j492K17Q16r72j10J409j125m74J022O81j769N38J204j165
$$ -173 -1073 -129 872 -620 -403 413 -559 -669 740 -385 -859 163 844 -925 -387 817 -348
3442c48n0J246r42r38J352L96j538J2R39K3k33O94k63j676J772O11j670n8R54
$$ -348 -398 848 -94 -1032 320 716 -822 -810 129 152 -81 613 350 -1326 446 1057 -613 -671 283
3461B83M6o71O14J29p23P65P7j560R92R38l16p76O38k26n17Q24K75j233M17R87
$$ 283 329 -342 272 401 -322 443 520 -1040 -48 890 574 -202 436 210 -307 517 792 -441 -24 963
3481I63l77j290J299J84q42M13N84j391K03J419j101o24M50P46j011J80P28k47
$$ 963 586 -704 595 779 -63 350 934 -457 -254 1165 64 -560 -110 636 -375 -195 533 286
3499B86l30P81q45k96Q03R5j075K86P12q90J21O99n31m32J190K06j363J98J072
$$ 286 -44 737 -108 -404 399 494 -581 -295 417 -473 -352 347 -184 -616 574 780 -583 -385 687
3518F87q12n31J165k85j028J169K49j258J6J124o04m67Q36l03l97R63l84j013
$$ 687 -125 -656 509 224 -804 365 614 -644 -628 496 -108 -575 261 -42 -439 524 140 -873
3536h73J99J149o98j08O18n13k78P09M47j500K62J392o49j042J110R5r60O68l67
$$ -873 -674 475 -223 -331 287 -226 -504 205 652 -848 -586 806 157 -885 225 320 -640 28 -339
3555c39p46J036J448j471r24R46j44j24O66M98j389N76O51j229k79J323j74q09
$$ -339 -1085 -49 1399 -72 -996 -50 -194 -318 348 846 -543 33 684 -545 -824 499 325 -484
3573d84J164J26j166P5J226r39l24Q24K85j153K88O39n64l26Q50j094n4J295Q7
$$ -484 680 806 -360 -285 941 2 -322 502 787 -366 -78 561 -3 -329 521 -573 -627 668 755
3592G55j311N88M38o66K79L54n32o40J531jq83o0P55j22p69Q82k79o19O17K42
$$ 755 -556 32 470 -196 83 437 -95 -735 796 795 -88 -148 607 485 -284 598 319 -300 317 559
3612E59r82J45P46k9n85K98M26p08O10m5q34J72R22j368q0R96J47n84J175q58
$$ 559 -423 -278 468 439 -146 152 578 -130 480 435 -399 -227 695 -673 -753 243 390 -194 981 123
3632A23l75J58J040r77j173J689l54n80O94r7p15O79P03j151k25J091L50r88k31
$$ 123 -252 -94 946 -31 -1204 485 131 -449 245 148 -567 112 815 -336 -561 530 880 -108 -339
3651c39M75q00L76J087j355k27J210J53r91j12R43o12p7M38p65q5J028q4j132
$$ -339 136 -664 -288 799 -556 -783 427 580 -411 -523 420 -192 -269 169 -596 -681 347 263 -869
3670h69P31P59r84k04R76j322J81J254l76j083J73J003p21N34j38J75r15J005
$$ -869 -138 621 -363 -567 409 -913 -732 522 146 -937 -764 239 -482 52 -86 89 -826 179
3688A79K96j182P92N83o62rj24m52L89N63o66l87K62J250p90j50O12p85K7P40
$$ 179 475 -707 85 668 6 -3 -127 -579 -190 373 -293 -680 -418 832 42 -108 504 -281 -254 486
3708D86m68m98K54J343k166N16J213k10k74l8K56j161R32J223j940j39J527k54
$$ 486 18 -480 -226 1117 -1049 -533 680 470 196 158 414 -747 185 1408 -532 -671 856 602
3726F02j499Q37O17p58K83N29o60o22J222m00m74P01L21o66k23M79m91K32M21
$$ 602 -897 -60 557 -201 82 611 -49 -671 551 151 -323 378 699 33 -190 289 -202 30 451
3745D51k22l30M58L74q99J97L37p47k49J114m36l14M21O53j124j39P18o38j87
$$ 451 229 -101 357 731 -168 29 366 -381 -630 484 48 -266 155 808 -316 -455 263 -375 -562
3764e62Q35k99j089R95N69k58l52O16p83n59J228J08j012P0J303j061l25P77n7
$$ -562 273 -26 -1115 -120 449 191 -161 455 -328 -887 341 449 -563 -493 810 -251 -576 201 144
3783A44m40N64n06p26Q61O80j288j8J331n00j034J268R5j000Q85O9p52J17J031
$$ 144 -296 268 -238 -964 -103 577 -711 -729 602 102 -932 336 431 -569 316 385 -367 -250 781
3802G81n07j437J236J77q70L47M25m42k08J280o63p93M14O78p40J95P63o36j83
$$ 781 274 -1163 73 250 -620 -273 152 -290 -498 782 119 -674 -260 418 -322 -127 636 0 -183
3821a83R34k55l09k03L31o73q3R98m50o84P03L5o56M15Q42j165K23M82l77j016
$$ -183 751 496 187 -16 315 -358 -441 557 107 -577 126 161 -495 -80 762 -403 -180 302 -75 -1091
3841a091J278Q0o15Q17j65n43M12L46k54o71N80O23j578J087K90n64p31J111n40
$$ -1091 187 267 -348 469 304 -239 173 519 265 -406 174 797 -781 306 596 32 -699 412 -128
3860a28J68K33K03j053J045J159k020M04M05j93l50L59K78j110R64M22j532N45
$$ -128 40 273 476 -577 468 1627 -393 11 416 223 -127 232 510 -600 364 786 -746 -201
3878b01J054m30j215Q42M00j125N38L76q43oR13k62l14O58n9k87k93J024j629
$$ -201 853 423 -792 50 450 -675 -137 239 -604 -610 303 41 -273 385 326 39 -254 770 -859
3897h59O53N83P2r68Q56k18p77J0J119q69k75Q37k62k7j31N76j115N48R98j417
$$ -859 -206 377 449 -519 337 119 -658 -648 471 -398 -673 164 -98 -125 -256 320 -795 -247 751 -666
3917f66k06J083M13o66q3M06q46J56J060m25n04N94l49p82J306o7o34j66Q33p96
$$ -666 -872 211 624 -42 -125 281 -565 -409 651 226 -278 316 -33 -815 491 424 -210 -376 457 -339
3937c39Q4M07l32j66L19L37l74j28Q59j180L48N74j46p64N58J42q73L47O82k51
$$ -339 -255 152 -180 -346 -27 310 -64 -192 667 -513 -165 409 263 -501 57 199 -674 -327 355 104
3957A04j086J370k53n24M32J83P6q90J433j005J49M09o75k6K95P85j096n44J706
$$ 104 -982 388 135 -389 43 226 302 -588 845 -160 -11 398 -277 -303 -8 777 -319 -863 843
3976H43o15n73N59J61j190Q22O44o91j28N03J23m88M33K4p36L97J016j656L55
$$ 843 228 -345 214 375 -815 7 651 -40 -168 335 458 -30 403 427 -309 88 1104 -552 -197
3995a97Q07m26k76M89K27l60l72R0j25j17P90m82p35J000J46q88J1O64J1n56K14
$$ -197 610 184 -92 397 624 264 -108 -18 -143 -260 530 48 -687 313 459 -429 -418 246 257 -299 -85
4016h5J30n56P02R29j099o74J179m83o13Q60k36q24N05N72j223N59Q02q56m36
$$ -85 45 -511 191 1120 21 -653 526 43 -570 290 54 -770 -265 307 -916 -357 445 -411 -847
4035h47P54L07j79q3N10q90m5J501j158l45Q32o10n34Q34J33q17O22M39n32o38
$$ -847 -93 214 35 -48 462 -428 -473 1028 -130 -475 357 -253 -787 47 180 -637 -15 424 -108 -746
4055g46P88o8l83K20O50p63k47Q86l85o16O18J71o22M66K41q05K13P73q9j084
$$ -746 42 -26 -409 -189 461 -302 -549 337 -48 -664 -46 125 -497 -31 210 -595 -382 391 302 -782
4075g82R04N34j238M63Q99j247N17P24q75o28Q43P51j216L15J6J65m64J099q87
$$ -782 122 656 -582 -119 780 -467 50 774 -101 -729 114 865 -351 -36 -20 145 -319 780 -107
4094a07l87P75j95m95qJ291j167o4P68n59j26K71L53m19K64L62l08n67Q51l10
$$ -107 -494 281 86 -409 -417 874 -293 -357 411 -148 -274 -3 350 -69 195 557 249 -318 533 223
4114B23k76N14k2o48m0M08j9l77Q48j38m21L4K85o27O93J62p91m5P65o90k13M60
$$ 223 -53 461 439 -209 -249 159 140 -237 611 473 52 86 371 -256 437 599 -192 -237 528 -162 -375 85
4136H5J76l04K6M74m21m83O84o3k88L46q7r11N16O50n27J3R2K41j004O02N68o73
$$ 85 261 -43 -17 457 36 -447 237 174 -114 232 145 -766 -250 400 -127 -114 -22 219 -785 -183 385 -288
4158b88K79M10n70l78N39N67r92R2L19j17q1K71o6q07Q16M09q90K81L54k49k43
$$ -288 -9 401 -169 -547 -8 559 -433 -341 -22 -139 -220 51 -15 -822 -6 403 -487 -206 148 -101 -344
4179c44O39m53k28Q95n5r12J70K86L99o89L29p0o79Q36j33o21M31R48r95k34P30
$$ -344 295 -158 -386 509 454 -458 -288 -2 397 -292 37 -33 -712 124 -9 -630 -199 749 -246 -480 250
4200B50l75k76N38M08p74M45K69q59J67N95K15j070L15M4l32K30J38Mp78R98J47
$$ 250 -125 -401 137 545 -229 216 485 -374 -207 388 603 -467 -152 -108 -440 -210 -72 -68 -846 152 299
4221B99r86J254m43k24j65R68o15m51P44j85k65j91P77r31J89J210n12r24R80
$$ 299 -687 567 124 -100 -265 703 88 -363 381 196 -69 -260 517 -414 -225 985 473 -451 529
4240E29j11q05M72l61M44J09K58q58o2J361n61p79K83J009j063J60M16q18J165
$$ 529 418 -387 85 -276 168 277 535 -323 -385 976 415 -364 -81 928 -135 25 441 -377 788
4259G88r83M53m81K53M96n12l33J107q93k78O93r7k8j90N55p87m39J298p53l71
$$ 788 -195 258 -223 30 526 14 -319 788 -105 -383 310 213 185 -5 550 -237 -676 622 -131 -502
4279e02Q63k23m18j05P75l21Mj78J02k77K57K35p84j2Q07m73l77J069Q9j252M34
$$ -502 361 138 -280 -385 390 69 73 -105 -3 -280 -23 212 -572 -584 223 -250 -627 442 531 -721 -287
4300b87N68n84L43K26l76m37J005Q9j020N71O7j236R66M73m31l84R35j27p37J72
$$ -287 281 -303 40 266 -110 -547 458 547 -473 98 165 -1071 -105 368 -63 -447 488 361 -376 -204
4320b04L21k21n9L61J63j235J044J15j174M09P77m29k72K19k5l99O35O3o39N39
$$ -204 117 -104 -163 198 361 -874 170 285 -889 -480 297 -132 -404 -185 -210 -609 26 89 -550 -11
4340a1M27m82k9K86J25p60O07k89m9J46O62n61p72N54J08K4K11m02K00K82K48
$$ -11 416 -66 -95 191 316 -444 163 -126 -175 -29 633 72 -700 -146 -38 -14 197 -205 -5 277 525
4361E25o22N8O13n19m60M61N60j025N17M82o48k72P64m2p20R39r3m26j84M08m11
$$ 525 -97 -39 574 55 -405 56 616 -409 108 590 -58 -330 434 392 -328 611 518 92 -92 316 -95
4382i5q4O55n36J2L19N06r60J50K86l41m67J088j13j190P39L70p24L32N89m04
$$ -95 -179 476 -60 -48 271 777 -183 -33 253 -88 -555 533 420 -770 -31 339 -385 -53 536 132
4402A32m88M29J63p70M56J65k34m2O92m07l43O55K81o06J9l76K4m2N09k1j59R0
$$ 132 -356 73 236 -534 -78 87 -147 -189 503 96 -247 408 689 83 102 -274 -250 -292 217 196 37 127
4424A27K4j032J316l07ro40O48j66m65J266j123r7J67Q51q28O1P58p06l76K83
$$ 127 151 -881 435 128 119 -521 127 -39 -504 762 -361 -458 -291 560 -268 -207 551 -155 -531 -248
4444b48L89o45M74O53j055MP46n97O1J87J37j36J77M5n74j91R22K03n19K39L61
$$ -248 141 -504 -30 623 -432 -428 318 -279 -218 -31 106 -30 147 192 -382 -573 349 552 33 272 633
4465F33r13L90L73o03nN84o85k9K66q4M00n82N90k54m5P08n14j61m76Q92p77K20
$$ 633 -280 110 483 -120 -125 459 -226 -255 11 -73 327 -255 335 81 36 744 230 69 -407 485 -292 -72
4487g2J26M88o36L81R5r60J044j91n87k78J050p0m11N0R44j013L36K8p68J81R38
$$ -72 54 542 -94 287 382 -578 466 275 -312 -590 460 390 -21 29 973 -40 296 324 -444 -263 675
4508F75l24r66J025m92n78P29J32j05j6O00p47k40P48n19j3k24N18m03j24N79
$$ 675 351 -615 410 -82 -660 69 201 96 80 680 -67 -307 441 -78 -91 -315 203 -200 -324 255
4528B55k24m60N27R0p20J157j90m59k39N48n9k90N34K49j255O10R67j175k46J77
$$ 255 31 -429 98 188 -532 625 435 -24 -263 285 226 -64 470 719 -536 74 1041 -134 -380 -203
4548b03k29M28p1L61p04k3J004r58k33O27m88k15N74N08j433J019L81l04l05M62
$$ -203 -432 -4 -75 286 -418 -441 563 -395 -628 -1 -489 -704 -130 378 -1055 -36 345 41 -264 198
4568A98L59q25J51K34p47K39L19j09m27R50m17k43M37Qn90N56K49m20J11j94L70
$$ 198 557 -268 -117 117 -630 -391 -72 -181 -608 342 -75 -318 119 127 -463 93 342 -78 33 -161 209
4589B09m39j00P99n36J23R1o7J78m6j1l30M2O29p11J04M01j01n59N93ql66N05
$$ 209 -230 -330 469 -67 56 147 80 258 212 201 -129 -87 542 -169 -65 336 235 -324 269 261 -105 400
4611D00o24K56J55L47m34k27N89k44k92n0K47L0q1J63j33n29R23j33o19k23J256
$$ 400 -224 32 187 534 100 -127 462 218 -74 -124 123 153 72 235 102 -427 496 363 -256 -479 777
4632G77r06J9O45l02m61P05L48r93K72J51q3o63N88K4k48J10L37q48M43j7j08
$$ 777 -129 -110 535 233 -228 477 825 -168 104 255 172 -491 97 121 -127 -17 320 -528 -85 -102 -210
4653b10q0M57L60n70O28m4p74l14N17K01n11P98j73l72K57m9m70K21Q20q17K0
$$ -210 -290 167 527 -43 585 541 -233 -547 -30 171 -340 458 285 -87 170 121 -349 -128 692 -125 -105
4674a05O89Q0p88m5J188j366N95M01r83k59P94k97m26P40J87l15j84J22J22m0
$$ -105 584 664 -124 -169 1019 -347 248 649 -334 -593 201 -96 -522 218 405 90 -94 28 150 110
4694A10J70j39n65M39N03r73K31Q10l77j120J370j50n21J62p9K43K27k84j90L98
$$ 110 280 141 -424 15 518 -455 -224 586 209 -911 459 309 -212 -50 -129 114 341 57 -133 265
4714B65m07M70n56J67l65m5l91J185l27n49L79O94p01Q5N77j137J044k88m37K3
$$ 265 -142 328 -228 -61 -426 -471 -862 323 -4 -553 -174 520 -181 -96 481 -656 388 100 -337 -314
4734c14M28K4p57K99P59n76p76J369J30p02K83O4k9j42L41p94J075M00r43n89
$$ -314 114 138 -619 -320 439 -137 -913 456 586 -116 167 231 202 60 401 -393 682 1082 139 -450
4754d50Q61j49n53K64j12o21L98R44m36j3k87N36o99O22k15J39M1N9j29o69R76
$$ -450 411 262 -291 -27 -139 -760 -362 582 146 133 -154 382 -317 305 90 229 270 329 200 -469 507
4775E07R2n69L75J69n83J65L47l86m83P82L35r53L77l68l2n2Q71R14k118O35P36
$$ 507 599 30 405 574 -9 156 503 117 -366 416 751 -202 175 -193 -225 -277 594 1508 -610 25 761
4796G61q01k0N49p62Q80q67P31j598M26J183j070M89N35n45M81q74K81O9M79q5
$$ 761 -40 -60 489 -273 607 -260 471 -1127 -701 482 -588 -99 436 -109 372 -502 -221 -152 327 242
4816B42q93L14R39p50n37J473r86k84L63L03l42l60J086Jq06O12p6n21R5J78l90
$$ 242 -651 -337 602 -148 -685 788 -198 -482 -119 184 -158 -518 568 569 -237 375 299 -222 -127 51 -339
4837c39M00P96o96k14K57M80j24q56J88k54P71J94n57j4o6r0P9p39J309j62n83
$$ -339 61 857 161 -53 204 684 560 -296 -108 -362 409 603 46 32 -34 -124 -45 -784 525 363 -220
4858b20N07J0k19m42M88n48M44K85q07P76J56m92J00k19j82O3M64j14K7r88J139
$$ -220 287 297 78 -364 124 -424 20 305 -502 274 430 -62 38 -181 -363 -300 164 50 77 -911 228
4879B28j66j49k93J392r62l32P80m65n48L68o5J10N20j06o89l7N45j78j4j74L42
$$ 228 62 -87 -380 1012 50 -282 498 33 -515 -147 -212 -102 418 312 -377 -414 131 -47 -61 -235 107
4900A07l63M05J08J67q36P60l02M03k21J42n30j73K28j57m7J56K50n74K95L10
$$ 107 -256 149 257 424 -412 348 46 449 228 370 -160 -333 -105 -262 -309 -153 97 -477 -182 128
4920A28o71M37R56j168N19J76n2l12J79Q7q69O39j61L94o14O30k44j324J669m32
$$ 128 -543 -106 850 -318 201 377 325 13 192 279 -590 49 -112 282 -332 298 54 -1270 399 -33
4940c3K68n4J21m31L14n88Q81j573O73Q28p07J32O85p44n42J436l28o01O02m20
$$ -33 235 181 302 -129 185 -403 478 -1095 -422 406 -301 -169 516 -228 -770 666 338 -263 339 -81
4960h1ko0M70m13N0K26n57o46J079L97j190M25M57o5n38O00j10m1k4M52o56L17
$$ -81 -83 -143 327 -86 -36 190 -367 -1013 66 463 -727 -302 155 90 -448 152 42 1 -23 429 -227 90
4982I0Q2J09o88M74j34l9P8k2NJ94k00J50r06J079j57N07j98L73n10o27R37k34
$$ 90 172 281 -407 67 -67 -106 -28 -50 -45 149 -51 99 -807 272 115 622 424 797 287 -340 597 363
5004C63p37L07K92k68p5K31M59n33k78N09o5o42O17p22K40M92k07J25K90k59M03
$$ 363 -374 -67 225 -43 -118 113 572 39 -239 270 205 -437 180 -542 -302 190 -17 108 398 139 542
5025E42Q3q35N30k30Oj73M22j1o3J19n7J07n7J32j079P17q56J052p03O79o84N75
$$ 542 625 -210 320 90 96 -77 345 334 271 390 333 440 383 515 -564 153 -703 349 -354 325 -359 216
5047B16n72J4J09J30k46L20j59l24j81L22M89j26N97o41k40Q22j85j056J047Q57
$$ 216 -356 -342 -233 -103 -349 -29 -188 -512 -693 -371 118 -8 589 -52 -292 530 345 -711 336 1193
5067A193j598Q30k08n41L71K4M05p52N48O73o31p24l49P61o32O10M59q55J032
$$ 1193 -405 425 217 -324 47 71 476 -276 272 945 314 -410 -759 2 -630 -20 439 -416 616
5086F16l12q54j11J769j775Q6R05m48NN38k50n20q1M41m13O73K9n13L42j22L98
$$ 616 304 -550 -661 1108 -667 -581 324 -124 -119 419 169 -351 -432 9 -404 269 298 -215 127 5 403
5107D03j088N75O88l39o11Q5N76p4L04o1o71L95M04o14k78N22j36OJ06j45j8Q6
$$ 403 -685 -110 578 239 -372 -287 289 215 519 458 -213 182 586 -28 -306 216 80 86 192 47 29 115
5129A15J117r10m9j15M26m42m75O54l25M87l01j70L70n63M53r00O56K23l53J20
$$ 115 1232 322 273 158 584 142 -333 321 -4 483 182 12 382 -181 272 -628 28 251 -102 18
5149A8O07n40j63j40N77m99J98J08k89L93N3K56j147P64L71m04n70L29N00q6k4
$$ 18 625 85 -78 -218 359 -140 58 166 -123 270 323 579 -568 196 567 163 -407 -78 422 336 312
5170C12K65j002N7M86p69J46J048j80r76R63m20L33l70n8n4o24R77K20p58O19
$$ 312 577 -425 -368 118 -651 -505 543 363 -613 350 -70 263 -107 -165 -219 -843 134 354 -404 215
5190B15k58j216R51M59K57q92n2Q97o81m5N87m08N06k16N22j310J265l16n65Q62
$$ 215 -43 -1259 -308 151 408 -484 -536 361 -320 -365 222 -186 320 104 626 -684 581 265 -300 562
5210E62l31K21l97N59j201Q70j04l77K29L05q18J84P45l39j87p4J17l49P68j028
$$ 562 231 452 55 614 -587 283 179 -198 31 336 -482 -298 447 108 -79 -153 -36 -385 383 -645
5230f45Q95K66j129M66P12j120J136m47p06R47m77O12j85k21L59j25L20j78n09
$$ -645 250 516 -613 -147 565 -555 581 134 -572 375 -102 510 325 104 463 338 658 480 -29
5249b9O92m02r54M59P32n23k02L35J84K45j133R83n14j49Q76j33k71n52L17k10
$$ -29 663 261 -693 -234 498 -25 -227 108 292 537 -596 387 -127 -276 600 467 196 -356 -39 -249
5269b49l1P14j228Q91l88k40k6Q02j48p46K6J136p16j0JM66n62J15K52o54N51
$$ -249 -280 434 -794 97 -291 -531 -557 245 97 -649 -623 513 -203 -213 -212 254 -308 -193 59 -595 -44
5290d4N34n54M0N96o3r03O02r2j086J433m16N14j25p89J17N71k67J62r4J93l06
$$ -44 490 -64 -24 572 509 -394 208 116 -970 463 47 561 436 -353 -236 335 68 230 136 329 23
5311B3k14L46k25q24M31j66J349m67L3M40l15n60M51j014L46K60K2O19n91P25
$$ 23 -191 155 -70 -894 -463 -629 720 253 286 726 411 -149 302 -712 -366 -106 -84 535 -56 669
5331F69o21o18J150r99O46j14K66j061N64k21J67l58j5O31q19J068o40o51R95
$$ 669 48 -570 580 -419 227 113 379 -682 -118 -339 -172 -530 -545 86 -733 335 -305 -956 39
5350C9o0K31J20l75J02q7o95N45j07L07M7J8L75j38m53m94O22k97O77q85O00Q8
$$ 39 -21 210 330 -45 57 -30 -725 -180 -287 20 67 85 460 322 -131 -625 -3 -300 377 -508 92 180
5372A80p71J7K46M69K45m63r37K60N90L74m63l80P56l44J41N22l49J71m54Q29
$$ 180 -591 -574 -328 141 386 -77 -1014 -754 -164 210 -253 -633 123 -221 -80 442 93 264 -190 639
5392F39q51j51O77j009P37K80j88p49R6R97j155K97O86m53k43M10M3O49j105P37
$$ 639 -212 -363 314 -695 42 322 134 -615 -519 478 -677 -380 306 -147 -390 20 63 712 -393 344
5412C44j085R57Q9j154O81J098j790K31N83p2J26R8L78l84L70m1o01N98j7j9N04
$$ 344 -741 216 305 -849 -168 930 -860 -629 -46 -118 8 106 484 100 470 429 -172 426 409 390 894
5433H94j518Q40k37r03Q28j58No88M96L56j054K056j101k01P63k28o08Q3M09n81
$$ 894 -624 216 -21 -924 -96 -254 -249 -937 -441 -85 -1139 917 -184 -385 378 150 -458 -375 34 -547
5453e47J63O54p31J014j140Q61n7O81p50M22l8k93J3k43l75K07M30j139K121j023
$$ -547 -384 270 -461 553 -587 274 217 898 148 570 532 239 252 9 -366 -159 271 -868 1253 230
5473B30m88L16l20J37l0r6M23L55l47k96N87k72J22m56o91L30Q72n98m5n88N51
$$ 230 -258 58 -262 -125 -155 -251 172 527 180 -116 471 199 321 -135 -826 -496 376 -222 -267 -855 -304
5494c04K10l51J114j90k27M77M86j662n69L03K81k69L57J421j117M87q21K82J339
$$ -304 -94 -445 669 479 252 729 1215 -447 -1016 -713 -432 -701 -344 1077 -40 447 -374 -92 1247
5513A247k595K445k53j967J209l66j90k05M14n55J2J329p13l46J340l47o41K56
$$ 1247 -1348 1097 844 -1123 86 -280 -470 -675 -261 -816 -804 525 -188 -534 806 459 -182 74
5531G4J5L4q34R83j065R29J02r08P07K37j57L0j234O10J132j128mK17M63j11Q08
$$ 74 89 123 -711 272 -793 136 238 -670 37 274 117 147 -1087 -477 655 -473 -477 -260 203 92 900
5552I00j505l57J185k61M18J17j140M91M52p87k49J41J207p65m8J141o45j148
$$ 900 -605 -962 223 -38 380 497 -643 -152 300 -487 -736 -595 612 -153 -201 940 295 -853
5570h53M03J296j110R70o27N51j724P25Q20q67q37J768j78p45Q15j25o21J65L
$$ -853 -450 846 -264 706 79 630 -1094 -369 451 -416 -1253 515 337 -408 407 282 -339 -174 -171
5589a71J41K89m76o89N29J030q12N31N03j335k17J198l8p28J7k30k58J454l96
$$ -171 -30 259 -217 -906 -377 653 -159 372 875 -460 -677 521 483 -245 -228 -458 -716 738 342
5608C42j77K03N69r35r68O91nK34k15K84n59J257j541J099J99o36m1P96p10J279
$$ 342 165 368 937 2 -966 -275 -280 -46 -261 23 -536 721 -820 279 478 -158 -199 597 -113 1166
5628A166j237m5q8k09L12KJ222m21j046M47K12m9K7j499P11N53L62o16K21O3o07
$$ 1166 -71 -116 -204 -413 -101 -99 1123 702 -344 103 315 266 293 -1206 -495 58 420 -196 25 88 -519
5649e19L15l66O87O32r26j6n92Q04N65K74l13o82J31M48l53j06j29J14l77K32
$$ -519 -204 -570 117 749 -177 -193 -785 19 584 858 545 -137 -6 442 89 -17 -146 -32 -409 -177
5669a77k48Q84q98j31Q62O7m24j033J679j323J945k145R09K18p63M17o16J323
$$ -177 -425 459 -439 -570 292 359 -65 -1098 581 -742 1203 -942 -33 185 -578 -161 -777 546
5687E46o74K10N10j6l18l47m53m92K09Q42l42J84n6j02J392j164O73j088P48R40
$$ 546 -128 82 592 576 258 -89 -542 -1034 -825 17 -325 -141 -197 -299 1093 -71 602 -486 262 1202
5707A202j870R09l6o36L24k01J363q02J7l13N07J75q67q2K38P9L30m53M80k06
$$ 1202 -668 241 205 -431 -107 -308 1055 253 270 -43 464 639 -228 -310 -72 7 337 -116 364 158
5727A58J37o65L85j09o85L86J109j38o24jl45m66Q47q77J842j657J135q9p85o04
$$ 158 295 -370 15 -94 -779 -393 716 578 -46 -47 -392 -858 -11 -888 954 -703 432 343 -442 -1046
5747a046J185P9m07j58o27J047N3oO9J58j252O48J361j031p34J014o08J64L85
$$ -1046 139 218 -189 -347 -974 73 126 120 189 347 -905 -257 1104 73 -661 353 -255 -91 294
5766B94Kj53j182K72R93J87p78J027j097J40K37m19J039r56J90k74L01k79J71
$$ 294 296 143 -1039 -767 226 413 -365 662 -435 -295 -58 -477 562 -394 -204 -478 -177 -456 -285
5785b85Q57q99L59O73m34k82K87J25n50J11j78N14L17O28j597P42n32M03L80m30
$$ -285 572 -327 32 705 271 -11 276 401 -149 -38 -216 298 615 1243 -354 388 -144 259 639 209
5805B09m51J051q46j5N66j485J632n6p11N67p50m36J14L63l3O90l90K34o98N78
$$ 209 -242 809 -37 -52 514 -971 661 605 -106 461 -289 -725 -611 -248 -281 409 19 253 -445 133
5825A33N48q92K89J9p00R65l98k81L08J40m16N17O4j95j81O59n94L57j56l65J99
$$ 133 681 -211 78 97 -603 362 -36 -317 -9 131 -285 232 296 101 -80 579 -15 342 186 -179 20
5846B0M89n70L0j15o35J111K00n41l17O57q34K5J63R44j153K49L80k57j6J65n35
$$ 20 509 -61 -31 -146 -781 330 530 -11 -328 329 -505 -480 -317 627 -526 -277 103 -154 -170 -5 -540
5867e40M22J139k44q03k97J92M76r18P64m69J115R8j671Q43rJ63r06P02j97pn4
$$ -540 -118 1021 777 -26 -323 -131 345 -573 191 -278 837 935 -736 107 98 261 -645 57 -140 -147 -201
5888b01J74R3n50N02L54k90l79J64l00Q7j3J497l98q44l44K28k42m19Q78o2k54
$$ -201 -27 66 -484 18 372 82 -297 -133 -433 -346 -359 1138 740 -104 -448 -220 -462 -881 -3 -65 -319
5909c19N51m70M27m69L05J52N3p58O62n56N44n0j88K42J41J99K5o67l42K15j41
$$ -319 232 -238 189 -280 25 177 230 -528 134 -422 122 72 -116 126 267 466 491 -176 -518 -303 -444
5930d44M16l02Q75k1k24q96O90m97J97Q20m37L21p17N05q77j2P3Q96k86L32k62
$$ -444 -28 -330 545 524 300 -596 94 -403 -206 614 177 498 -219 286 -591 -603 -530 366 80 412 150
5951A50p15Q59j77j372L33J607j18j381O98J33J45L39k09l39j6L8r9l50P3j02
$$ 150 -565 294 117 -1255 -922 685 567 -814 -116 17 162 501 292 -47 -63 -25 -124 -474 -401 -503
5971e03Q58j10J32q96R55m87J19M72j036J368j472J006n66M08n65N87m31K26N55
$$ -503 355 245 377 -519 436 -51 68 540 -496 872 -600 406 -160 248 -317 270 -161 65 620
5990F20o65j320J487L33n52k69O35p12N16J53j63j06k10K06j8Q2l82O28p48l43
$$ 620 -45 -1365 122 455 -97 -366 269 -443 73 226 63 -43 -253 -47 -65 17 -365 263 -485 -828
6010h28M73N79j01l30O3j15K51l33M04n7j24L9k85o15J118rl05M8M58o53K50M20
$$ -828 -355 224 123 -207 -144 -259 -8 -341 63 6 -118 -79 -364 -979 139 130 -175 -127 331 -322 -72 348
6032C48K9n43R9L26l17N62l97j88J46J26J3o1j31n70N64J57N0j64p50R20k2Rp66
$$ 348 377 -166 -67 259 -58 504 107 -81 65 191 204 143 12 -558 6 163 213 49 -701 219 197 206 -560
6055e60O30l85N90m34l12R75p79R83p52N37l89p1K75k47M93q08M64L38r1q43k47
$$ -560 70 -315 275 -159 -471 504 -275 708 -44 493 104 33 308 61 554 -254 210 548 457 -386 -633
6076f33Q65p60P25M12o09Q82q86RJ96J89o84M12l05R46n69j16L99k91o0r3j209
$$ -633 232 -528 197 609 0 882 -4 5 201 390 -294 118 -187 759 190 74 473 182 122 29 -1180
6097a180Q89L52m8O43m28l67K70m76P83P3n05ML06l80m33J652m56o82O87j82j010
$$ -1180 -291 61 13 656 228 -139 131 -345 438 511 6 10 316 -64 -497 1155 699 17 704 522 -488
6118d88K67j6o65Q01Q07p85j00L72l96q0N75o61J02M20l34R47J65j211K01M05
$$ -488 -221 -237 -902 -101 706 -79 -179 193 -203 -283 292 -369 -267 153 -181 766 931 -280 -79 326
6138C26q44L00J225q00N5J32j81k6P9L04o83m93J089p4j22J19L8q07P65p38J49
$$ 326 -518 -218 1007 207 262 394 213 187 266 570 -113 -606 483 409 287 406 444 -363 402 -336 -187
6159a87M89M80o01L42j275Q15n37P64r36J28J250o37l14J30M56p86N58L36P1k67
$$ -187 302 782 181 523 -752 63 -474 290 -646 -518 732 95 -219 -89 367 -419 139 475 546 279
6179B79p8m58k00O07L41o44J88M06n31K65n72K22j62M96j62J49l52M47l57N57
$$ 279 201 -257 -457 150 491 -153 35 441 -90 175 -397 -175 -337 159 -3 146 -206 241 -116 441
6199D41m15J79o63Q99m8n71R1j98Q4K57Q3J7k49M44l26K0Q67q86p93K01P5O19
$$ 441 26 205 -458 441 393 -178 -87 -285 -201 56 139 156 -93 351 25 45 912 26 -767 -566 -491 128
6221A28m56P70o12L49p46j88O81K25k27P85j090R58P9o02j12k50k63L53J056l07
$$ 128 -328 442 -170 179 -567 -755 -74 151 -76 709 -381 577 656 54 -58 -308 -571 -218 838 531
6241E31l31o03J176p26M79k41j85J85OK41q35M20m7Q2p43J387n98j54k41l39L46
$$ 531 200 -403 773 47 526 285 100 285 291 532 -303 117 70 152 -591 796 198 44 -197 -536 -190
6262a90M37k95J43K91r40O30j12J13m25k1J10j33Q95o83K06l4n44K66l2L90o37
$$ -190 247 -48 95 386 -554 76 -36 77 -348 -369 -259 -392 503 -180 26 -8 -552 -286 -318 72 -565
6283e65K01k66J070k22J19m02J186j031J14M55o88k94O55K50k75m34K85j91q4
$$ -565 -364 -630 440 218 337 -65 1121 90 204 659 -29 -323 332 582 307 -127 158 -33 -117
6302a17L0o8N53o25Q06n92l0R45r62l52L16M55k23J76o49J47L05q25N53O63o22
$$ -117 -87 -155 398 -227 579 -13 -43 902 -60 -412 -96 359 136 312 -337 -190 115 -710 -157 506 -116
6323a16J03k97J81L75n36N14o72L76O60j246L83L48K03N6k43J16l40j31J142m4
$$ -116 -13 -310 -129 246 -290 224 -448 -72 588 -658 -275 73 276 332 89 205 -135 -266 876 832
6343H32j369Q08m91q16P45n96P77k28P02l23J22J22l91N14j58K85l17J4p74O00
$$ 832 -537 271 -220 -1036 -291 -887 -110 -338 364 41 163 285 -106 408 250 535 218 232 -542 58
6363E8l66K26k1O5K52p54K51N14m78L77K25J51j062O27k45N57o87P51j6o10m95
$$ 58 -308 -82 -103 -38 214 -540 -289 225 -253 124 349 500 -562 65 -180 377 -310 441 425 -185 -680
6384f80M92L3K30m24l42P66m02J00p3J13R6M06k24J76l90L62j04L38k71n56K79
$$ -680 -188 -155 75 -349 -691 75 -327 -227 -300 -187 -91 315 91 267 -123 239 135 473 202 -354 -75
6405g5m6l00N42m60Q0L5Q18j14m86m5R3J20m35K39K3M98l06j86N44n37Q2p54K36
$$ -75 -121 -421 121 -339 -259 -224 594 480 -6 -51 42 162 -273 -34 -11 487 181 -5 539 2 84 -670 -434
6428d34O85j72m8k97L38O5J66l27j8N07L33r22j37J90j53L77n93M97l14K82K65
$$ -434 251 79 31 -266 72 137 303 -24 -42 465 798 -124 -261 -71 -224 153 -440 57 -257 25 290
6449B90r11L38J91J1rJ66L11j123O08j7K96k00j8j52j14O18k33l12K80K6k32L78
$$ 290 -621 -283 -92 -81 -90 76 387 -736 -128 -145 151 -49 -67 -219 -333 285 52 -260 20 46 -186 192
6471A92j06R6k34j20L16p29N76K72n76L67J17j86J56J56r1m59K3K51k96K62n6
$$ 192 86 182 -52 -172 144 -585 -9 263 -313 54 171 -15 141 297 206 -253 -230 21 -275 -13 -69
6492f9L33Mk08J34l52M20k07j46k7j17N37o28O02j54n79M79j42l7L05j12o57M91
$$ -69 264 268 60 194 -158 262 55 -91 -118 -235 302 -326 276 122 -457 22 -120 -157 148 36 -621 -130
6514a30K27j73L61l24L32k26O4j62J65J33k17r6qJ44m52N38j29j10k4L67l97j62
$$ -130 97 -76 285 -39 293 67 131 -31 134 267 50 -46 -54 90 -362 176 47 -63 -87 280 -117 -279
6536b79J21j29M53j05R6m27K38R3K15p1n86K34k5j55M69N3l2J46o24M84j22MJ05
$$ -279 -158 -287 166 61 157 -270 -32 61 276 205 -381 -147 -172 -327 142 195 163 309 -315 169 47 51 156
6559A56m1L1l72M7RK89k16m8j13q6M38j58j45K12J35k37r3M6L16k50M4K2j71j49
$$ 156 115 146 -226 -179 -170 119 -97 -145 -258 -344 94 -64 -209 3 138 -99 -192 -146 170 -80 -36 -14 -185 -334
6583c34M16l20J43M68o31P5K92J45j42K1k59M19n63J59J26Klm74O63J13n71K40
$$ -334 82 -238 -95 373 -258 -183 109 254 112 133 -126 293 -270 -111 15 17 14 -460 203 316 -255 -15
6605a5K55n62j6N61l33L09j4k25p4K40p2r4R0j4O1j29Q3m1l15L48k52J1k08M77
$$ -15 240 -322 -338 223 -110 199 185 -40 -114 126 54 -40 50 36 97 -32 51 10 -305 43 -209 -198 -406 71
6629G1k73J93qj50j09M58J21o24J76J67O4Q7k10q7J65k7l32M91N2J73o88M48j27
$$ 71 -202 -9 -17 -167 -276 182 303 -321 -145 22 86 173 -37 -124 41 14 -318 173 225 398 -290 158 31
6652C1p4J62k5J00m73N56l81rO7L91J9l08j4l38J39J74ol32N78l36K77n23N59
$$ 31 -43 119 94 194 -279 277 -104 -113 -46 345 364 56 42 -296 -157 17 11 -321 257 -79 198 -325 234
6675B34r8k32L80l79P1jJ76n19L49j65J5K94l52N9L65l34N72j52l03M79p11L87
$$ 234 136 -96 284 -95 -24 -25 151 -368 -19 -184 -169 125 -227 -168 197 -137 435 283 -20 459 -252 135
6697A35L9k41K17M7J3m13L60k94Q5J89J57l75j00J17M7j1N7J6R7j29KL1o2k92
$$ 135 174 -67 150 197 210 -203 157 -137 -52 137 294 -81 -181 -64 -17 -28 29 45 142 13 15 46 -16 -308
6721c08N65k97K04j41p8J65J55L0n17K37J31j23j87K48J91m25Q4M39m19j96K86
$$ -308 257 -40 164 23 -55 110 265 295 -222 15 146 23 -164 84 275 -150 -66 373 -46 -242 44
6742D4J55j62Q3k75K38n1k42JJ35j13L29j28j76M33k42K25j06o16K23M57j61J1
$$ 44 199 37 120 -155 83 32 -210 -209 -74 -187 142 14 -162 271 29 254 148 -468 -245 212 51 62
6764F2o18N84K3j16M16m92L82k3j45l99O52l05P7j65j60J52N0j60K86N9J2m3n09
$$ 62 -556 28 51 -65 351 -141 241 218 73 -326 326 21 98 -67 -227 -75 -25 -185 101 160 172 129 -380
6787c80M11L92m92k46M13k5r6j90J39j72m3J40N22m97M04k28K9m16K63M6Q1K39
$$ -380 31 423 -69 -315 98 73 -23 -213 -74 -246 -289 -149 373 -124 280 52 81 -335 -72 -26 55 294
6809B94m05j68K31J96k67K40l73K42K1k24K70J4k9J77k43K8Q2k11J8J13n1K03
$$ 294 -111 -279 -48 148 -119 121 -252 -10 11 -213 57 71 42 219 -24 4 86 -125 -107 6 -45 158
6831A58j50n3j30%J42k9K70k25j9K92k68j05K09j37J49j81N9j95K77l5Q2j70j27
$$ 158 8 -45 -175 -175 -33 -62 208 -17 -36 256 -12 -117 92 -45 104 -77 -18 -213 64 29 111 -59 -186
6854a86K89k75K12L86l74n7K14J25m95kN8K56j79L21N5k96J08k09J69J41k62j01
$$ -186 103 -172 40 426 52 -5 209 334 -161 -163 -105 151 -28 293 348 52 160 -49 120 261 -1 -102
6876a02J55o50J53N75J08n41O2j16L03l8L00Q9k15K8m7l50K89O9j77K55J69j94
$$ -102 53 -597 -444 131 239 -302 -240 -356 -53 -91 209 298 83 111 64 -286 3 72 -105 150 319 125
6898A25r5l37o4L40L18j63k50K27l01M23l92L27k85k11M20k9j24K47j06j89K79
$$ 125 30 -307 -371 -31 287 124 -126 101 -200 223 -169 158 -127 -338 82 53 -71 176 70 -119 160
6919A60J00m63J12K85j27J65Pn04J54K24j50l15L60o7j38N61m25J53K94m17k75
$$ 160 260 -203 -91 194 67 232 239 -265 -111 113 -37 -352 8 -59 -197 364 -61 92 386 -31 -306
6940c06K24K90m83M53j84j17R8j71L14J41m54o2O3L15q6K39m6M3l33J56m6j06
$$ -306 -82 208 -275 178 -6 -123 -25 -196 118 259 -195 -257 -194 121 35 274 228 271 -62 94 48 -58
6962e8K97m15K65l70L10J17l29J05K51N4j23K9J92k06m61L04j42J87J55k48n4
$$ -58 239 -176 89 -281 29 146 -183 -78 173 227 104 133 325 119 -342 -38 -180 7 162 -86 -140
6983a40N08m12J98LM6n1m1l65M3J5Q8k5j77N12n67N61k6k61L47k16j85Q8Q6j69
$$ -140 368 -44 154 157 203 152 111 -254 -211 -196 -108 -133 -310 202 -365 196 170 -91 256 40 -145 -57 29 -140
7007a40M30k58m8n1J7J03p1m47l3O55kn03N64j76l00M80o47N93l02J85l77RL31
$$ -140 290 32 -16 -67 -50 53 -18 -465 -498 157 155 -348 216 40 -260 220 -427 166 -136 49 -328 -319 12
7030A2K50l27l4J32k4l5M6M06n42J38j52k11L53k74j85P43j62k37J50j65J85K58
$$ 12 262 -65 -99 33 9 -26 20 426 -116 22 -130 -341 12 -262 -447 296 134 -103 47 -118 67 325
7052C25l17L53l41O8p0l16N88m84K67J19k04n0K87k35PJ51o2Q3J50l61j12k9j81
$$ 325 8 361 20 88 18 -298 290 -194 73 192 -12 -62 225 -10 -3 148 86 169 319 -42 -154 -183 -364
7075c64K52q0J83J68j02k85N83m16P6nL28p25M77j80L10k46Kk7J84P0r9no7O7
$$ -364 -112 -192 -9 159 57 -228 355 -61 15 10 338 -387 90 -90 220 -26 -24 -51 133 203 104 99 32 99
7099I9P4l58K61J42l88J61j01J30j87J08j44K74J73j46j73l3L35l97j80L57k20
$$ 99 173 -185 76 218 -170 -9 -110 20 -167 -59 -203 71 244 98 -75 -108 227 -170 -350 7 -213
7120b13OK33Q4O7l03L36k75m9J42M17n22J28k95J33J91j02p8j59j50J74J26J61
$$ -213 -207 26 110 177 -126 210 -65 -114 28 445 -77 51 -244 -111 80 -22 -100 -259 -409 -235 -109 52
7142E2r0J00j80JP4q8M97j23k60p2j08K24m28O18j21l06P8q7K04j32R7m09M58
$$ 52 -38 62 -118 -117 -43 -131 366 243 -17 -89 -197 27 -401 217 96 -210 -132 -219 -15 -147 -50 -459 -1
7165am9Q0K4K26q7Q8m32J61m9lK25l17K58l4J28j80r1L0L57m63K87l19L71j8l78
$$ -1 -50 30 54 280 193 281 -151 10 -39 -42 183 -134 124 90 218 38 -53 -23 334 -129 158 -161 210 192 -186
7190a86K9j48M97j01L8j38j5l47K03M54R6l56j11K68J08n41P0J1K05o3J99l5q2
$$ -186 -157 -305 192 91 129 -9 -24 -371 -168 286 382 26 -85 183 291 -250 -180 -169 36 -27 172 137 55
7213E5L21n61L0OK07O2l55N7O5K15k14N9l9M14k44j06K70n00K85r6P6k47K28J36
$$ 55 376 -185 -155 -149 58 120 -235 -178 -113 102 -112 -53 -92 322 78 -28 242 -258 27 -69 7 -240 -12 124
7237A24j71N4j13N0L06k18l93K57j12L48nK5kK33l23j05M87o03L46q2k35L0K74
$$ 124 -47 7 -106 -56 250 32 -361 -104 -216 132 127 152 150 383 60 -45 442 -161 185 103 -132 -102 172
7260A72q7j20m03P05j05j01K4k95R2M48q6k67R8Q0q6K00m58n1K36j39L75n55N09
$$ 172 85 -35 -438 267 162 61 85 -210 -118 330 244 -23 75 155 69 269 -189 -240 -4 -143 232 -323 186
7283A86k06k81K47Q0P8J4j63K38l37oo0L3K59o6K03j46k7j32L53O9l01K10o25
$$ 186 -20 -301 -54 26 104 118 -45 193 -144 -150 -210 -177 82 16 219 73 46 -86 267 336 35 245 -380
7306c80N74j72J33J85j61k90J61k1r9k3K58j11Nk3p6N5J48k43k6j32M65l65K02
$$ -380 194 22 155 340 179 -111 50 29 -70 -93 165 54 59 36 -40 15 163 -80 -106 -238 227 -138 64
7329F4j29j53j45N32k11j90L44L01n15l9J64j08q2J68N7r7n4L5J20J38P4l88K60
$$ 64 -65 -218 -363 169 -42 -232 112 413 -102 -141 23 -85 -167 1 58 -39 -93 -58 62 200 274 -114 146
7352A46k25K49J33J4k74k00q5M97j44L2l48L97p4j88J52K23l42K91L6k37J81j65
$$ 146 -79 170 303 317 43 -157 -242 255 111 143 -205 192 118 -70 82 305 -37 254 290 53 234 69
7374F9o3L9Ll3MK68l32j14J83l78J97j17J64J14J08k52L94n83J58K54N6o9n6R7
$$ 69 6 45 48 15 19 287 -45 -159 24 -354 -157 -274 -110 4 112 -140 254 -329 -171 83 139 70 14 111
7398A11j88J54J67m0j19P2l98l2L87M40m01J57o09J9J67K86j80o9J6J22J75n12
$$ 111 -77 77 244 204 85 157 -241 -273 114 554 153 310 -299 -280 -113 173 -7 -76 -60 62 237 -275
7420b75L46r5O4q3J8K27j94N0j00j03J92lj14J17q1p5K44k74j5K38N3M1o7k2k58
$$ -275 71 -24 40 -43 -25 202 8 58 -42 -145 47 44 -70 47 -34 -109 135 -139 -154 84 137 178 111 89 -169
7445a69m4L5K62m5J12j12m4Q2r0M8j62Q3q9K5k28K25m6J95Q8k86J96l7j69N5q4
$$ -169 -213 -178 84 39 151 39 -5 77 -13 35 -127 -44 -133 -108 -336 -111 -157 38 126 -160 36 -1 -170 -115 -199
7470a99K84m11N18j39k06l9K86j17K22k03n1R3k80L86M4k01R1n5O5l32K07J59
$$ -199 85 -326 192 53 -153 -192 94 -23 199 -4 -55 38 -242 144 188 -13 78 23 88 -244 -37 122
7492A22j02j5J41k08K81l88L47m32L93j93q7KJ65j93J38k32J8K40q9J92q2L4k86
$$ 122 20 5 146 -62 219 -169 178 -254 139 -54 -141 -139 26 -167 -29 -261 -243 -3 -92 100 18 52 -234
7515b34L82l7r0L40j91j13O9m04L13r8j48K45k97L79k1M6l14L62n6J00k56j32
$$ -234 148 111 21 361 170 57 126 -278 35 -63 -211 34 -263 116 95 141 -173 189 133 233 -23 -155
7537a55J24q2J25r0K03j9j98O9j10O2Q4J01q7N3j62p0J09J25l47K75r1J84q5L09
$$ -155 -31 -113 12 -78 125 106 -92 -23 -133 -71 13 114 27 80 -82 -152 -43 82 -265 10 -81 103 18 327
7561C27j70r0l3K34l07M54l04J12l45J9P3J9N8L8o7k2J58l09q5J47L55m06L52
$$ 327 157 67 34 268 -39 415 111 223 -122 -103 -30 -11 47 85 18 -4 154 -155 -240 -93 262 -144 208
7584B08j34n4k09M48l08K44k32m7o8K11K8L05l35r7L28j25k45j32P7N06l53m69
$$ 208 74 20 -189 259 -49 195 -37 -84 -152 59 87 392 57 -40 288 163 -82 -214 -137 369 16 -453
7606d53N57j0L3j94j5rRJ22K63j93j87J19J22M8l16J70k67L44n7n8j79K54k42
$$ -453 104 94 127 -67 -82 -91 -82 40 303 110 -77 42 164 212 -104 66 -201 143 86 28 -151 103 -139
7629a39J39L7N6QM6o3k57K59J80k21M7J37j62R6q4J49M7k58J02J0l10K72j98j30
$$ -139 0 37 93 101 147 84 -173 86 266 45 92 229 67 163 79 228 275 17 119 129 -181 91 -107 -237
7653b37J41K89j28mR9M5j35k44J76K5o3Q5J3k16O23m92Q5k4K60n12Q2R4O2j42
$$ -237 -96 193 65 61 160 205 70 -174 2 27 -36 49 62 -154 469 -23 62 38 298 -214 -132 -38 24 -118
7677a18K18Qk01J12O5L1N1k79j58J74K94k44K42j50l06LJ87O7O1l31L23J99m0
$$ -118 100 108 -93 19 84 115 166 -113 -271 -97 197 -47 195 45 -261 -258 -71 -4 57 -274 49 248 208
7700B08J03Q3k30k90m6K56k80M36j76m29M21j99JR6K33J05r5k66K39l63N3J38
$$ 208 311 394 164 -126 -172 84 -196 240 64 -365 56 -143 -142 -46 187 292 197 -69 170 -193 -140 -2
7722bm30P58j79k04l2%K86k69O33l02n17K58L21l13k19R4L08j30r5l9J28j6m0
$$ -2 -432 326 147 -57 -89 -89 197 -72 561 259 -258 0 321 8 -211 -117 191 61 -34 -73 55 39 -1
7745aj31L36k53K6j39N22j43k41J10L44m54k23N1N7j6j18N31j94l2P6j44k7P4
$$ -1 -132 204 -49 -23 -162 360 217 -24 86 430 -24 -247 -196 -139 -155 -273 258 64 32 108 -36 -63 11
7768A1O6j95N2M24m06M0P0j42j65M35l60M1J04l58K47R6r6L74k02L00j11l15L7
$$ 11 77 -118 -66 358 -48 -8 62 -80 -245 190 -170 -129 -25 -383 -136 -40 -136 238 36 336 225 -90 -53
7791e3N8P1K48l14q9K71Ql94Q3J22L09j71p7ok91L95J35l79K83j57Ok74K59r3
$$ -53 5 76 324 10 -79 192 200 -194 -111 11 320 149 72 66 -225 170 305 -74 209 52 58 -216 43 -50
7815e0J83l11J01J57l99L95l7p5j5P1K1Q7m1M0l7J9l33K80j85L8n2M9l18N89m97
$$ -50 133 -178 -77 80 -319 76 39 -36 -51 20 41 128 87 127 90 109 -224 56 -129 -91 -143 -94 -412 177 -320
7840c20L29K86l6l93J95P2k62J78nJ37l28j0J16K22j77O7m18M52j38l70M94j0
$$ -320 9 295 259 -134 61 133 -129 49 44 181 -147 -157 -41 181 4 71 -347 105 -33 -403 91 81
7862H1N2k73l4K48LJ19j84j65J00j14J47N5j52l4n4K28J95q0k31J53k96M92j01
$$ 81 133 -140 -174 74 77 196 12 -153 -53 -167 -20 35 -117 -151 -205 23 218 138 -93 60 -236 256 155
7885A55o4J42m14K38n2J33j9k96RJ47P8o7L7k50L10j48j64K04k32M74l49J47J78
$$ 155 91 233 -181 57 5 138 119 -177 -168 -21 57 -10 27 -223 87 -61 -225 -21 -253 221 -128 19 197
7908A97j87j80k84N47j50K80l15M53l69k90M6J73k54N91k73m05M71j42J62m3J03
$$ 197 10 -170 -454 93 -57 223 -92 361 -8 -298 -252 -79 -333 258 -15 -420 51 -91 71 28 131
7929A31o7j37jJ7K05k19j35L09k05K57k94k6L82k03o5j21J61k32R0J31L49l86
$$ 131 64 -73 -74 -57 148 -71 -206 103 -102 155 -139 -165 217 14 -51 -172 -11 -243 -153 -22 327 -59
7951e9q0K44N6j28L24q3j25j65N0Q1k96L95l71K19J30nm05q8M14K57l24k41J79
$$ -59 -139 105 161 33 357 274 149 -16 34 115 -181 214 -157 62 192 187 -218 -306 108 365 41 -200 -21
7974b1J92l31N17l63Kp9m9K90n1o4k33N61o09J45O0P5q2R4J7l05N48k74J74j76
$$ -21 171 -160 357 -6 -4 -83 -132 158 107 43 -190 371 -238 -93 -33 42 -40 54 71 -234 314 40 214 38
7998C8Q6J79k21l39O24n5k23j4mk24K63j68M4j71K31l3J41k79O4L34L4j53n87
$$ 38 124 303 82 -257 367 312 89 75 71 -153 110 -58 -14 -185 46 13 154 -125 -61 273 307 154 -433
8021d33M20O8j45r2L21j78m4m9L92k76J96j10R1l49L5J07K6J36k29J27k04J99
$$ -433 -13 55 -90 -182 139 -39 -83 -132 260 -16 180 70 161 -188 -153 -46 -20 116 -113 14 -190 9
8043IO0J50m33k1K48J0k62L91j37j90L69m03K54O3k40m8J85jk33K44m6K62p7j70
$$ 9 69 219 -214 -235 13 23 -239 152 15 -175 194 -209 45 108 -132 -180 5 4 -229 15 -31 231 154 -16
8067a6K0k67N49L9k71j82R4R4Q4j90k9J86J85k85j12K54k54k2Q3K01k80J53J4
$$ -16 4 -263 286 325 54 -128 -34 60 144 -46 -75 111 296 11 -101 153 -101 -123 -40 161 -119 34 48
8090D8l90Q2M57K3l42J99q7J2J47j11j00J81q8j45Q9J46q5k46J61P0K68m77K08
$$ 48 -342 -260 197 220 -122 77 -10 2 149 38 -62 119 31 -114 -25 121 36 -210 -49 21 289 -188 20
8113B0J72k20K20k80p4L3o3L96l74L25J72l91L27k18j67Q0k8j9L1J44M9j68j40
$$ 20 192 -28 192 -88 -162 -129 -192 204 -170 155 327 -64 263 45 -122 -42 -70 -89 -58 86 135 -33 -173
8136a73J56O5k54M4K00K5j78L78n71L48K62k33j09J39q0n6K8J13k64%J23R4k21
$$ -173 -17 48 -206 -162 38 63 -115 263 -308 40 302 69 -40 99 19 -37 -9 104 -160 -160 -37 57 -164
8159a64L54k26Q8Nl12R1L84n07J24J46J0mRN6K11n14L61k96j68M79k26J54j81
$$ -164 190 -36 52 57 -255 -164 220 -287 -163 -17 -7 -11 -2 54 265 -249 112 -184 -352 127 -99 55 -126
8182a26J5o1m5K50J60j54o5j39Q8
$$ -126 -111 -172 -217 33 193 39 -26 -165 -77
8191g7
$$ Imaginary data points
##PAGE= N=2
##DATA TABLE= (X++(I..I)), XYDATA
0@%%%%%%%qJ6j6J6k4L2l2M0n1N9p2Q8j04J21j40J61j86K15k46K82l21L63m11M64
$$ 0 0 0 0 0 0 0 0 -8 8 -8 8 -16 16 -16 24 -27 32 -40 48 -56 65 -75 86 -100 115 -131 151 -170 193 -218 246
31B46n20N84o55P31q15R07j009J120j243J377j522J686j869K071k295K546k834
$$ 246 -274 310 -345 386 -429 478 -531 589 -654 723 -799 887 -982 1089 -1206 1340 -1494
48a494L164l546L995m532N186o004P063q493J0543j3743J9479l2878J18869O1598
$$ -1494 1670 -1876 2119 -2413 2773 -3231 3832 -4661 5882 -7861 11618 -21260 97609 159207
62A59207k42774L0038J54131o456j33698K2626Q4494n152o5930R015M0429p970
$$ 159207 -83567 -53529 100602 94146 -39552 -16926 67568 62416 -3514 5501 45930 37960
74C7960m8744J7803N3561k1252o8705L0224O0324m2404n9680M9023M3366m1668
$$ 37960 -10784 7019 60580 39328 -29377 847 61171 18767 -40913 8110 51476 9808
86I808k2409L1629k93j6103Q321p375j6346K4931J0179l2244O87L3306j2826k5109
$$ 9808 -12601 19028 18735 2632 10953 3578 -12768 12163 22342 -9902 -9215 24091 11265 -13844
100a3844K1810R892k7083M131K8310r487l0165L18K3655J4975j8491l1878K3102
$$ -13844 7966 17858 -9225 -5094 23216 13729 -16436 -16118 7537 22512 4021 -27857 -4755
113d755M9018k8923n8527L5886N0832m9907l7483N9134J8195o1545K245O0421
$$ -4755 44263 15340 -43187 -7301 43531 -6376 -43859 15275 33470 -28075 -25830 34591
125C4591j6631n4413J9686M7038j3304m2411k383L9528J9961m2126l3059M4441
$$ 34591 17960 -36453 -16767 30271 16967 -25444 -27827 11701 31662 -10464 -43523 918
137I18L8228m3752k7712M5216J4585l8964k343K1885j3016l190K5555o894k3102
$$ 918 39146 -4606 -32318 12898 27483 -11481 -13824 8061 -4955 -8145 17410 10516 -12586
150a2586J6091J4691j7403k446J2013q317L706J8944j7272k4008K3086J9689k2397
$$ -12586 3505 18196 793 -1653 10360 2043 5749 24693 7421 -16587 6499 26188 3791
163C791r445J9207O522n444m557j2321K797K0796p485k0842J6124J2267k5041
$$ 3791 -5654 13553 20075 14631 10074 -2247 550 21346 13861 -6981 9143 21410 -3631
176c631N163L0957k4635l6316L7076L5173m0314k7557L4021J5212k7267j1442
$$ -3631 1532 32489 7854 -28462 8614 43787 3473 -24084 9937 25149 -2118 -13560
188a3560J4908J1637o0j3666m685J8767J74k9263N594L1590j6673k7243L0459
$$ -13560 1348 12985 12925 -741 -5426 13341 13515 -15748 -10154 21436 4763 -22480 7979
201G979J9137l8706j1160L6936N562k7453o30J3304J424Q57r223j6526J6724K4483
$$ 7979 27116 -11590 -22750 14186 19748 -7705 -8335 4969 6393 7250 -1973 -18499 -1775 22708
215B2708k0040k1795K2009J4391j6840k482N391j2999L570J9263r990j6253J2746
$$ 22708 2668 -19127 2882 17273 433 -2049 3342 -9657 -6087 13176 3186 -13067 -321
228c21Q007r348L085k0j2046J2054J6019k4297j5455L0801O148l4110L215L0058
$$ -321 7686 -1662 1423 1403 -10643 1411 17430 -6867 -22322 8479 14627 -19483 -16268 13790
242A3790r192j7236J5338M955j5726q18Q837j778j493k688l837J4026P972k6208
$$ 13790 4598 -12638 2700 7655 -8071 -8889 -52 -1830 -3323 -6011 -9848 4178 12150 -14058
256a4058p121L6491J825l8870N096L4569j0973k5647J1263J1054q437K899O303
$$ -14058 -21179 15312 17137 -21733 -16637 17932 6959 -18688 -7425 3629 -4808 -1909 4394
269D394p657K842O227j1118l13J2716j1414j2622K2968R115k6882j603K5889m022
$$ 4394 -3263 -421 5806 -5312 -5625 7091 -4323 -16945 6023 15138 -11744 -13347 12542 8520
283H520j8589N488P314j613L879n473j4965J2245J7202j7205j0831K0208L422
$$ 8520 -10069 -4581 2733 1120 4999 -474 -15439 -3194 14008 -3197 -14028 6180 9602
296I602j5923Q672N920j9707J509K3419r987k0228J5533J5294j2660p414N217
$$ 9602 -6321 2351 8271 -11436 -9927 13492 3505 -16723 -1190 14104 1444 -5970 -753
309g53J638M822P07j5881K772K1458j0194k1932J7359J7264k2434n931K5655l052
$$ -753 885 5707 6414 -9467 -6695 14763 4569 -17363 -4 17260 -5174 -11105 14550 11498
323A1498k1876Q954J2994j1482o738O520J377N517L000j5916k041K3414l244k4895
$$ 11498 -10378 -1424 11570 88 -6650 -130 1247 6764 9764 -6152 -8193 15221 11977 -12918
337a2918Q833K0053j4148j0465J5484n30j5610P571J1137p659r91M177o755K017
$$ -12918 -4085 15968 1820 -8645 6839 6309 -9301 -1730 9407 1748 757 4934 -1821 196
351A96R198j3177r220K1064M338k2936L643K0083j0113j3024J2742L203j0988
$$ 196 9394 -3783 -13003 8061 12399 -10537 -6894 13189 3076 -9948 2794 5997 -4991
364d991N695N006j1930J413J1429q021o064R844j412n171J0718l579j7711J1729
$$ -4991 704 5710 -6220 -4807 6622 -1399 -7463 2381 969 -4202 6516 2937 -14774 -3045
378c045J9266k0544j6205K3640J0802k0445m025J2609j398k324K652p237K053
$$ -3045 16221 -4323 -20528 3112 13914 -6531 -10556 2053 655 -1669 983 -6254 -4201
391d201J1194r075j1482J6290O054k0723J594K1978q970j7932J4745J0337j3623
$$ -4201 6993 -2082 -13564 2726 8780 -11943 -10349 11629 2659 -15273 -528 9809 -3814
404c814l954Q226k757J20M410p969k64J4852n573j6045J2299J1565j6982m128
$$ -3814 -7768 458 -2299 -2179 2231 -5738 -6002 8850 3277 -12768 -469 11096 -5886 -10014
418a0014J8951m663j5329J0504Q352j2812o92J1361l913j839M775o929m202J3133
$$ -10014 8937 4274 -11055 -551 7801 -5011 -5703 5658 1745 -94 4681 -2248 -6450 6683
432F683j836j5189Q767J3750j3245n399J3261l482j0961J2152O445j6546q04J5365
$$ 6683 4847 -10342 -1575 12175 -1070 -6469 6792 3310 -7651 4501 10946 -5600 -6404 8961
446H961l782j0259L872K266J598P244p769j3055J5143J3313k1294j0927K2263
$$ 8961 5179 -5080 -1208 1058 2656 9900 2131 -10924 4219 17532 -3762 -14689 7574
459G574N370j8629J996J2291o732l619O990l379k683O986m484n623J0609j137
$$ 7574 12944 -5685 -3689 8602 1870 -1749 5241 1862 -821 6165 1681 -3942 6667 5530
473E530j4924Q508J5992j4312j2065J8197N792j7490l00J0384m755k004O019o876
$$ 5530 -9394 -886 15106 794 -11271 6926 12718 -4772 -5072 5312 557 -1447 4572 -2304
487b304k881J1261r78j1076O521N605j1349K499J0538j1968q724J8095L667j7510
$$ -2304 -5185 6076 5098 -5978 543 6148 -5201 -2702 7836 -4132 -12856 5239 8906 -8604
501h604J503J2999n155n797O400l709l887R334j170j1478N901P553q708P25J0795
$$ -8604 -7101 5898 743 -5054 1346 -2363 -6250 3084 1914 -9564 -3663 3890 -4818 -4093 6702
516F702r041q968J6535L423k0129O65J9386k985j2238K496M165R12L974p418p907
$$ 6702 -2339 -11307 5228 8651 -11478 -10813 8573 5588 -6650 -4154 11 923 4897 -2521 -10428
531a0428J4740P919j8883n059J8257j692j3667Q798Q521j2182m70J1473n371q519
$$ -10428 4312 12231 -6652 -11711 6546 4854 -8813 -15 8506 -3676 -4146 7327 1956 -6563
545f563O379K177l294N025k717r079J0100J0206j5465o663J6132K532j3852M650
$$ -6563 -184 1993 -1301 3724 1007 -8072 2028 12234 -3231 -9894 6238 8770 -5082 -432
559d32O692r464K203R467q742o305J1741L768j0288J589L369n309M676O421j3494
$$ -432 6260 -3204 -1001 8466 -276 -6581 5160 8928 -1360 229 3598 -1711 2965 9386 -4108
574d108l121J9583n34j9174M577J4007p170n849O993k908l516P930m61r245M233
$$ -4108 -7229 12354 11820 -7354 -2777 11230 4060 -1789 5204 2296 -1220 6710 6249 -2996 1237
589A237O019o110R41N690j0946j634J8019l713k1366O440K0066r076j3727O958
$$ 1237 7256 1146 2087 7777 -3169 -4803 13216 9503 -11863 -5423 14643 5567 -8160 -1202
603a202O662k798J93n613m524J1109M866j3664j862J4451n189r388P976L285j1365
$$ -1202 5460 2662 2855 -2758 -7282 3827 8693 -4971 -6833 7618 2429 -6959 1017 4302 -7063
618g063N229J0204j0428o918J1051J527q276L576K467n683N765N423j1829j885
$$ -7063 -1834 8370 -2058 -8976 2075 3602 -4674 -1098 1369 -4314 1451 6874 -4955 -6840
632f840J2686l249j0210Q184M756r914K554R933r330p265J1667L152r494J468
$$ -6840 5846 2597 -7613 571 5327 -4587 -2033 7900 -1430 -8695 2972 6124 -3370 -1902
646a902L843k880K857K440j1387J699J5373n639j4551R339J0499j2238m001J0809
$$ -1902 1941 -939 1918 4358 -7029 -5330 10043 4404 -10147 -808 9691 -2547 -6548 4261
660D261k894o432Q572J755r888J579N642k838J164J179p958K857J3958q716j6081
$$ 4261 1367 -5065 3507 5262 -4626 -3047 2595 -243 921 2100 -5858 -3001 10957 2241 -13840
675a3840J2480J4405j3469q922J0100L776m792J830j879o147Q690N438j0817l325
$$ -13840 -1360 13045 -424 -9346 754 4530 -262 1568 -311 -6458 2232 7670 -3147 -6472
689f472J0634o51n300L795j878o720R552O620j3207l413J3766q69j0081K588L392
$$ -6472 4162 3511 -1789 2006 128 -6592 2960 9580 -3627 -7040 6726 5857 -4224 -1636 1756
704A756m777M929M852r466o21J0016m505q047Q067J907r781N677Q899j1567o608
$$ 1756 -3021 1908 6760 -2706 -3327 6689 2184 -5863 2204 4111 -5670 7 8906 -2661 -9269
719i269J3784K963j1323K44O397j393J120j320p585K359J1241o597r327J1152
$$ -9269 4515 7478 -3845 -3601 2796 1403 2523 1203 -6382 -4023 7218 621 -8706 2446
733B446M875j1937K217R765j0117n903J3207K124j3562J193R600k163k958Q35
$$ 2446 7321 -4616 -2399 7366 -2751 -8654 4553 6677 -6885 -5692 3908 1745 -1213 -378
747c78m031M122Q840p525j1348J0233Q522j1410m098Q403p67j752O468l968q612
$$ -378 -4409 -287 8553 1028 -10320 -87 8435 -2975 -7073 1330 563 -1189 5279 1311 -7301
762g301Q744O725j2172k940R962k7n434L653j777n118Q423M901j2718j187J3812
$$ -7301 1443 8168 -4004 -6944 3018 2991 -2443 1210 -567 -5685 2738 7639 -5079 -6266 7546
777G546l450j0778M541M364m467J572L222m836Q05O573n622m233P575k141q280
$$ 7546 4096 -6682 -2141 2223 -2244 -672 2550 -2286 -1481 5092 -530 -4763 2812 671 -7609
792g609Q461O507j3190k354J5617k708j3507N538R443o143l172L770l533j41M836
$$ -7609 852 7359 -5831 -8185 7432 4724 -8783 -3245 6198 55 -3117 653 -2880 -3021 1815
807A815l779m060P985K199q146L994M068r551j430J2836l199j1241O686O946o833
$$ 1815 -1964 -6024 1961 4160 -3986 8 4076 -5475 -6905 5931 2732 -8509 -1823 5123 -1710
822a710j916N552l351j91P183m730q576Q260O313j0174k624R346k625l051N790
$$ -1710 -3626 1926 -1425 -1616 5567 837 -7739 521 6834 -3340 -5964 3382 757 -2294 3496
837C496k571o073P922L760j0739j911R518n97l540L037l552j980Q582Q09j2502
$$ 3496 925 -5148 2774 6534 -4205 -6116 3402 2805 -735 2302 -1250 -3230 5352 6161 -6341
852f341K908J4114p033j0900Q431M918q605N14P792m489l319N686j705k806L552
$$ -6341 -3433 10681 3648 -7252 1179 6097 -2508 -1994 5798 1309 -2010 3676 1971 -835 2717
867B717j145l964O101J026r953L218J0562o434q196Q498L920r295J492O350n587
$$ 2717 1572 -2392 3709 4735 -5218 -2000 8562 2128 -6068 2430 6350 -2945 -1453 4897 -690
882f90k168P755l431p036O473L485o466K163M017o337r69P987m115p753P269M746
$$ -690 -2858 4897 1466 -5570 903 4388 -2078 85 4102 -2235 -3204 4783 668 -7085 184 4930
898D930p358m18L980l283m4O393m424n776Q346K331j0959J420Q436o038k398Q646
$$ 4930 -2428 -2846 1134 -2149 -2193 4200 -224 -6000 2346 4677 -6282 -4862 3574 -2464 -4862 3784
914C784l281q362Q903N252j0784k564R351l76o070J542O21k4N011k633p936O436
$$ 3784 503 -7859 1044 6296 -4488 -7052 2299 1923 -4147 -2605 -1984 -2008 3003 370 -7566 -1130
930a130Q027r020m652J0836j154j0437N194O159o670r98P684k536m623N231P5
$$ -1130 6897 -2123 -6775 4061 2907 -7530 -2336 3823 -2847 -3845 3839 1303 -3320 1911 1986
945A986o215M374L670o237r78P621m406m255P420M2n194K652N642q104m50O181
$$ 1986 -4229 145 3815 -2422 -3400 4221 -185 -4440 2980 3022 -2172 480 6122 -1982 -2432 3749
961C749k820n654O353Q95n658N136M384q436O60Q874n034q686O798M968q063R49
$$ 3749 929 -4725 1628 2523 -3135 2001 6385 -2051 -1391 7483 2449 -6237 561 5529 -2534 -1585
977a585O441n248k174O360o32m367L872J420n246J803J886o126J920Q576n691
$$ -1585 4856 -392 -2566 3794 3162 -1205 2667 4087 -1159 644 2530 -3596 -1676 6900 1209
992A209o472R860K879j2672J420J0528l568p008M367J718l914L351J220o005L633
$$ 1209 -5263 4597 7476 -5196 -3776 6752 3184 -3824 543 2261 -1653 1698 2918 -3087 546
1007E46M689o509k106P554j300q087M872L510o808R54O182l607k218O550j798
$$ 546 5235 -1274 -3380 4174 2874 -5213 -341 3169 -3639 -2685 3497 -110 -2328 4222 2424
1022B424p865M560M472p262J197N724m384k855P180j310q023M964O145o879k836
$$ 2424 -5441 -881 3591 -3671 -2474 3250 -1134 -3989 3191 1881 -6142 -1178 4967 -1912 -4748
1037d748O727k631m460M761R06l345K166K789n984J953O826o507m041Q105q52
$$ -4748 1979 -652 -5112 -351 555 -2790 -624 2165 -3819 -1866 4960 -1547 -5588 2517 1665
1052A665q034M652O155q052j840R479j818p971M866L882m721L50K322m791J275
$$ 1665 -6369 -1717 4438 -3614 -5454 4025 2207 -5764 -898 2984 -1737 -1387 935 -3856 -2581
1067b581O502n056l502P775J039q919L549O839p188l124P455k32n118L466J223
$$ -2581 3921 -1135 -4637 3138 4177 -4742 -1193 5646 -1542 -4666 2789 2557 -2561 905 2128
1082B128o354M525N278o508j766P332j957p500M976M180p002Q41O778m613k575
$$ 2128 -4226 299 5577 -931 -2697 4635 2678 -4822 154 4334 -2668 -1827 4951 338 -2237
1097b237O272j354o427N339L617o292n19M588k727j460N689m026m461P394K901
$$ -2237 4035 2681 -3746 1593 5210 -1082 -1601 2987 260 -1200 4489 463 -3998 3396 6297
1112F297q563k25Q807k978q038N583K335n698L324K894m945R24N276m366l728
$$ 6297 -2266 -2491 6316 3338 -4700 883 3218 -2480 844 3738 -1207 -283 4993 627 -3101
1127c101N996j72n574M226K342p170O25Q026l563o394O588K262n327N28L356m657
$$ -3101 2895 2723 -2851 1375 3717 -3453 -2828 5198 1635 -4759 1829 4091 -1236 -708 2648 -2009
1143b009M58M331m458k586O684J046q624L948N048n675j241N830j993n804N713
$$ -2009 -1551 2780 -1678 -4264 2420 3466 -5158 -1210 3838 -1837 -3078 2752 759 -5045 668
1158F68J165o233K456L870m113p3O126m659m202N701J041o605P76N928m692m60
$$ 668 1833 -4400 -1944 1926 -2187 -2260 3866 -793 -4995 706 1747 -4858 -4082 1846 -2846 -3306
1174c306O557k253o773O458L784p122j027M665k706k43L522l896l240P733J372
$$ -3306 3251 998 -5775 683 4467 -2655 -3682 983 -1723 -1966 1556 -2340 -5580 2153 3525
1189C525q174K093O577m121n306O569P07n894L193L068m810J600M731l612m063
$$ 3525 -4649 -2556 4021 -100 -5406 1163 1870 -4024 -831 2237 -2573 -973 3758 146 -3917
1204c917N314O5m430L905J011o838L007O940n010n688O672K504m640R39L487n815
$$ -3917 1397 1462 -2968 937 1948 -4890 -1883 5057 47 -5641 1031 3535 -1105 -166 3321 -2494
1220b494M84O042m632l148O043N59m999M026K407o071n48P188l461m940N094J719
$$ -2494 -2010 4032 -600 -3748 2295 2854 -2145 1881 4288 -1783 -2331 4857 1396 -3544 1550 3269
1236C269n929K271M284m589m34O099k902m617N193O75n835K156K982m250N85O398
$$ 3269 -2660 -389 3895 -694 -1128 4971 2069 -2548 2645 3320 -2515 -359 2623 -1627 -1042 5356
1252E356m255n642P618L308q667o90O100j527j685K064k777k660P200n29p553
$$ 5356 1101 -4541 3077 6385 -2282 -2972 3128 1601 -84 1980 -797 -3457 3743 3214 -4339
1267d339K821P857n275l722M651j992l898M592K403o891J843O941l493n771N423
$$ -4339 -1518 6339 1064 -2658 1993 1 -3897 695 3098 -3793 -1950 4991 1498 -4273 1150
1282A150j37k400K323j17m588K778N575o408l625O600J699n385K396K233m281
$$ 1150 1013 -1387 936 819 -3769 -991 4584 -1824 -5449 1151 2850 -2535 -139 2094 -2187
1297b187P45M641n088l340P303J34n926L688K889n349J351M106l757l249O686
$$ -2187 -1442 3199 -1889 -5229 2074 2208 -3718 -30 2859 -2490 -1139 2967 -790 -4039 2647
1312B647r15o255K294N012m501q36M837k534k029M562l55n669K629K713m152R17
$$ 2647 1732 -4523 -2229 2783 -1718 -2554 2283 -251 -2280 2282 1927 -3742 -1113 1600 -2552 -1635
1328a635N167m609l643P631J271p725J420O098l299l029M213k047k315N404q79
$$ -1635 3532 -1077 -4720 2911 4182 -3543 -2123 3975 676 -2353 1860 -187 -2502 2902 2023
1343B023n671K716N771m439j498M609k121l212M221N18o617L538O267n545l157
$$ 2023 -3648 -932 4839 400 -1098 3511 1390 -1822 2399 2917 -3700 -162 6105 560 -2597
1358b597N539M31m231L192J59m907L997M693o576l241P185j48m596K558K550m065
$$ -2597 2942 3373 -858 2334 2493 -2414 1583 6276 -300 -3541 3644 3496 -1100 1458 4008 -57
1374e7J628L837n842k678N862M58m793K520K237l488J088L436n921p66P194r09
$$ -57 1571 5408 -434 -3112 2750 3208 -1585 935 3172 -316 772 4208 -1713 -2479 4715 3806
1390C806p848L791M636n468j603N899j637l552M676o9m861J361L197m367R36L353
$$ 3806 -4042 -251 4385 -1083 -2686 3213 1576 -1976 2700 2631 -2230 -869 2328 -2039 -1103 2250
1406B250k506l163O979p53p253L456N174m754j744M971l169l472N870N5o565L387
$$ 2250 -256 -3419 3560 2807 -4446 -990 4184 -570 -2314 2657 -512 -3984 1886 1941 -4624 -1237
1422a237M075l010j959L729k599j992M272p67n474L162N284n007l197O176o69
$$ -1237 2838 -172 -2131 1598 -1001 -2993 1279 512 -4962 -1800 3484 -1523 -4720 1456 787
1437G87k625K526L28m712L206K652m067k044N350o95m173L919J841n493K046M490
$$ 787 -1838 688 1016 -3696 -490 2162 -1905 -3949 1401 706 -3467 452 2293 -3200 -1154 3336
1453C336l982l334N199L39m639L275K298l841J234K896m271o00M508q88n411M948
$$ 3336 -646 -3980 1219 1558 -3081 194 2492 -1349 -115 2781 -1490 -2090 2418 1530 -3881 1067
1469A067K087n556L55N380k755l041N095O50m878K281K478n181Q16M513l603k401
$$ 1067 3154 -2402 -2047 3333 578 -2463 2632 3282 -1596 685 3163 -2018 -1202 3311 -292 -2693
1485b693O206m62n403K807L001l901L90M218m216k118N461L03o141K190M061m016
$$ -2693 3513 3051 -2352 455 3456 -445 -55 4163 -53 -2171 3290 3593 -2548 -358 3703 -313
1501c13l06M027k998j868N110q62o095L705M601m989k405N545l91n308L622P93
$$ -313 -619 3408 410 -1458 3652 2790 -3305 400 5001 12 -2393 3152 2761 -2547 1075 1868
1517A868l715J923L261m069r45L950k073k605L616P05m703L593L055n294j919
$$ 1868 -1847 76 3337 -732 -1677 2273 200 -2405 1211 1916 -2787 806 3861 -1433 -3352
1532c352N931p97n903L999K132l761M97L392k869j481M033j972l936M593J235
$$ -3352 2579 1782 -4121 -122 2010 -1751 -1254 2138 -731 -2212 1821 -151 -4087 506 1741
1547A741n370J278N020l892j638M357r73l490L718J629n021N49N224m526k596
$$ 1741 -3629 -2351 2669 -1223 -2861 1496 523 -2967 751 2380 -2641 -2092 3132 -1394 -3990
1562c990N425l83m048K380K263l719K23L352k968k135N827k11n555J463L892k377
$$ -3990 1435 1052 -2996 -616 1647 -2072 -1849 1503 -1465 -3600 2227 2016 -3539 -2076 1816 -561
1578e61r99K467k042j346M989j747m231L332L565n666m86N214k628k101L666K59
$$ -561 -1560 907 -1135 -2481 2508 761 -3470 -138 3427 -2239 -2725 2489 -139 -2240 1426 1685
1594A685m393K108M045m193j314M027j399k300L090r0l856L591L343n832K54M167
$$ 1685 -2708 -600 3445 -748 -2062 1965 566 -1734 1356 1266 -2590 1001 4344 -1488 -1234 2933
1610B933j336m357M078J544n199K471L625m056p25L694j512l211M500K21m511
$$ 2933 1597 -2760 1318 2862 -2337 134 3759 -297 -1022 2672 1160 -2051 2449 2670 -1841
1625a841J141M529l692k115M062p92l667L733J306m442J754M053m388k148M559
$$ -1841 -700 3829 137 -1978 2084 1292 -2375 1358 2664 -1778 -24 4029 -359 -2507 2052
1640B052l59k884K751l9l159K929K862o157j625O308K30o017J293M336k959l32
$$ 2052 1693 -1191 1560 1521 -1638 1291 4153 -2004 -3629 2679 2909 -3108 -1815 2521 -438 -770
1656g70J587j748p75M083j182l997L057J578l511r2M198k602k326M907j295m614
$$ -770 817 -931 -1706 2377 1195 -2802 255 1833 -1678 -1770 2428 -174 -2500 2407 1112 -3502
1672c502L209K933m281n11L957k490j694K984K67l998J959K961l958l90L781j447
$$ -3502 -293 2640 -1641 -2152 1805 -685 -2379 605 872 -3126 -1167 1794 -2164 -2554 1227 -220
1688b20k955M907k87n512L189L106m213m52L872k155j575L085m28l159J193L562
$$ -220 -3175 1732 1445 -4067 -878 2228 -1985 -2437 1435 -720 -2295 790 362 -2797 -1604 1958
1704A958k847k027M116j250l038L938M05m539K287M279l628l162N072k10k255
$$ 1958 -889 -2916 1200 -50 -3088 850 1255 -3284 -997 3282 -346 -3508 1564 1354 -901
1719i01J894n35l073L647K401n281j167O262k069m044L268K189k707j8L461m042
$$ -901 993 458 -2615 1032 3433 -1848 -3015 3247 1178 -2866 402 2591 -116 -134 3327 -715
1735g15j447M814j589k775K600J885k818r33L007k919k73M474j954l901K887K880
$$ -715 -2162 2652 1063 -1712 888 2773 -45 -978 2029 -890 -1163 3311 1357 -2544 343 3223
1751C223l831m94K949j495j230L224o35m913L496K672m019l60L604k013j742L951
$$ 3223 -608 -1102 1847 352 -878 2346 1711 -3202 294 2966 -1053 -1413 2191 178 -1564 2387
1767B387p46m437L156L310m940L11L359k329j382K681m03l006K608K201l257j137
$$ 2387 1641 -2796 360 3670 -1270 -959 2400 71 -1311 1370 967 -2039 569 2770 -487 -1624
1783a624M629k181l039L283j01l579K701L256m816j476M619j57l668J422J221
$$ -1624 3005 824 -2215 1068 967 -2612 89 3345 -1471 -2947 1672 1515 -2153 -731 490
1798D90j287J377R22m323k68O003j604m614K962J912k955J47K112l518K96N535
$$ 490 -797 580 1502 -2821 -3089 2914 1310 -3304 -342 1570 -1385 -1238 874 -2644 -2348 3187
1814C187l079m109K756K848k666p03L310k578j083L652k038l655M911K199n607
$$ 3187 108 -4001 -1245 1603 -1063 -1766 1544 -1034 -2117 1535 -503 -4158 753 2952 -2655
1829b655M92L278j979j741L735p79l321L501J653m123k74L875j456j435K839j724
$$ -2655 -2163 1115 -864 -2605 1130 351 -2970 531 2184 -1939 -2213 1662 206 -1229 1610 -114
1845a14k517L352J176l839n25M661j659k288L486m69l059J383K406l866L96L569
$$ -114 -2631 721 1897 -1942 -2467 2194 535 -1753 1733 1264 -1795 -412 1994 -1872 -1476 2093
1861B093j286j515K705j219k923L131J769l905q00M734m38l858J297J277k275
$$ 2093 807 -708 1997 778 -2145 986 2755 -1150 -1950 2784 2346 -1512 -215 1062 -1213
1876a213K724J841m879R91L147j180m283L429J005k148J358J276k908K76M044
$$ -1213 1511 3352 -1527 -536 2611 1431 -2852 577 1582 -566 792 2068 -840 -564 3480
1891C480l184l032L723K064l348L95J821j937J11K583k704k458L995J697m409
$$ 3480 296 -2736 987 3051 -297 98 1919 -18 93 2676 -28 -2486 1509 3206 -1203
1906a203L73L089k727o50L090j577k634L423K134m374l0K751j708j721L364j417
$$ -1203 -830 2259 -468 -1118 1972 395 -2239 1184 3318 -1056 -1086 1665 -43 -1764 1600 183
1922A83k262K987J206m749J145L427k199q50K303o38l782L420J545l684L74L013
$$ 183 -2079 908 2114 -2635 -1490 1937 -262 -1112 1191 553 -3229 191 1736 -1948 -1574 1439
1938A439k390n42K663o83k832K583J322m602L64M770j553k116J954P6k371J762
$$ 1439 -951 -1493 1170 487 -2345 238 1560 -3042 -2678 2092 539 -1577 377 453 -1918 -156
1954a56J655l554M42M583k678l547K627R49j530R70J020l029J820L080k859l306
$$ -156 1499 -2055 -1613 2970 292 -3255 -628 321 -1209 -239 781 -2248 -428 2652 -207 -3513
1970c513L965J151k663J15K410k453j75K290j633k120M577k0m050J374L132l298
$$ -3513 452 1603 -1060 -945 1465 -988 -1163 1127 -506 -2626 1951 1931 -2119 -745 2387 -911
1986i11r50L443j050j962K710J279l578N94L090k489j409K541n50k010L020J28
$$ -911 -1861 1582 532 -1430 1280 2559 -1019 -425 2665 176 -1233 1308 758 -1252 1768 1896
2002A896k338p6L097k116k088M336k281j796K823J113m766J083K819j18k027K057
$$ 1896 -442 -518 2579 463 -1625 2711 430 -1366 1457 2570 -2196 -1113 1706 1588 -439 1618
2018A618p54k060K647O64l591K15L560j461k188K542Q7k559K389K93l588J942
$$ 1618 864 -1196 1451 2115 -1476 -1261 2299 838 -1350 1192 1279 -1280 1109 1402 -2186 -244
2034b44L454j997k780K591L06k584J396Q72k282J309K671l682k077M001P93m004
$$ -244 3210 1213 -1567 1024 1330 -1254 142 1014 -1268 41 2712 -970 -3047 954 1747 -2257
2050b257P50K681j439j6J977l006k071M254L85l660K086J591k343p1J971j893
$$ -2257 -1507 1174 -265 -281 1696 -1310 -3381 873 1258 -2402 -316 1275 -1068 -1139 832 -1061
2066a061j772L519L11k679P84K439k191o38K175j690j166K336P57l519J607K089
$$ -1061 -2833 686 997 -1682 -898 1541 -650 -1288 887 -803 -1969 367 1124 -2395 -788 1301
2082A301k600J26J981j100j585K713Q64l851J55L363k144o71K048r04j566K626
$$ 1301 -1299 -1173 808 -292 -1877 836 1700 -2151 -1996 1367 -777 -1448 600 -304 -1870 756
2098G56O88l261J290K328k109j182K733j089j827K245O56k687Q77L195k757k335
$$ 756 1444 -1817 -527 1801 -308 -1490 1243 154 -1673 572 1228 -1459 -582 2613 -144 -2479
2114b479L331L51k520J598O06k547J947K243k521j734K829M57l001J377J192j961
$$ -2479 852 1203 -1317 281 887 -1660 287 2530 9 -1725 1104 1561 -1440 -63 1129 -832
2130h32L96K929j873k449K778J60k933K144K003k545j54K226j410k118K523L63
$$ -832 -436 2493 620 -1829 949 1109 -1824 320 2323 -222 -376 1850 440 -1678 845 1208
2146A208k718K751J796l517n59L072j674k002K291K27k631J814J941l435m15L354
$$ 1208 -1510 1241 3037 -480 -1039 2033 359 -1643 648 875 -1756 58 1999 -1436 -1851 1503
2162A503j269j172J916O42l276J298K340k228j376L047q68j979K574Q06l195M32
$$ 1503 234 -938 978 1620 -1656 -358 1982 -246 -1622 1425 557 -1422 1152 1958 -1237 -805
2178h05J654j150r28K704j217k118K779R12m260P02K764j262j745K091jk308K345
$$ -805 849 -301 -1229 1475 258 -1860 919 1831 -2429 -1727 1037 -225 -1970 121 120 -2188 157
2195A57p1k078J194K569k484j001L118q77k208J129J304k533J56K851j817q92
$$ 157 86 -1992 -798 1771 -713 -1714 1404 527 -1681 -552 752 -1781 -1625 1226 -591 -1483
2211a483K992j480j550J050J877k827N60K233j451j827J724J5k187K438J070k796
$$ -1483 1509 29 -1521 -471 1406 -1421 -861 1372 -79 -1906 -182 -167 -2354 84 1154 -1642
2227a642K83K240j342j452J856Q83k652J935J101k237m9K653j701j564K765L11
$$ -1642 -1359 881 -461 -1913 -57 826 -1826 109 1210 -1027 -1076 1577 -124 -1688 1077 1388
2243A388k648J461J340k529j8K232m53k252K622J033k942O55P76j216o02J940
$$ 1388 -1260 201 1541 -988 -1006 1226 773 -1479 1143 2176 -766 -111 665 -551 -1153 787
2259G87m15j984L128L8l360J383K018j511o47K377n46j741O13K25j676J170K692
$$ 787 372 -1612 1516 1554 -1806 -423 1595 84 -563 1814 1268 -473 140 365 -1311 -141 2551
2276B551k844r48K848p47j654J755L69k899J492J901j980j657L488r60j918J839
$$ 2551 -293 -1241 1607 860 -794 961 1330 -1569 -77 1824 -156 -1813 1675 715 -1203 636
2292F36J35k004J062J859j319j843K247k08j884J641L28k153J476J663j807j646
$$ 636 771 -1233 -171 1688 369 -1474 773 565 -1319 322 650 -1503 -27 1636 -171 -1817
2308a817K366L60k632J275O34j864J056J602j302j182K007J95k336J174J440k552
$$ -1817 549 909 -1723 -448 186 -1678 -622 980 -322 -1504 503 698 -1638 -464 976 -1576
2324a576N76J639j850o79K610N02l201J071K378j976k53M04q94q96L206p73k466
$$ -1576 -1000 639 -1211 -1890 720 1222 -1979 -908 1470 -506 -759 -355 -1249 -2145 1061 288 -2178
2341b178J709J536k060o31K032m48j860K601r81k010J239J827j941j313L038l77
$$ -2178 -469 1067 -993 -1624 408 -40 -1900 701 -280 -2290 -1051 776 -1165 -2478 560 183
2357A83j303J740P2k395N66K005k142o53L514j641j756J954K25k078J094K019
$$ 183 -1120 620 692 -1703 -1137 868 -1274 -1927 1587 -54 -1810 144 369 -1709 -615 1404
2373A404j064j414J548m07j910K826k23j951P20L008k965o85K513l32k364J239
$$ 1404 340 -1074 474 67 -1843 983 760 -1191 -471 2537 -428 -1113 1400 1068 -1296 -57
2389e7J170k422Q48K786k753j276L220j18j836L88J694k274J230J487k738j067
$$ -57 1113 -1309 -461 2325 -428 -1704 1516 1398 -438 -50 1644 -630 600 2087 -651 -1718
2405a718K993K71k859J116J451j388K08J833k557m03K727n84k020R20J691k010
$$ -1718 1275 1546 -1313 -197 1254 -134 74 1907 -650 -1053 1674 1090 -930 -10 1681 -329
2421c29j56J700r22j026J760l02k479J609J795j889q77J974m65j521K476n63k238
$$ -329 -485 1215 293 -733 1027 725 -1754 -145 1650 -239 -1116 858 393 -1128 1348 785 -1453
2438a453J348J265k061J66K709k039j198P18J414k248J163J396k195k16K512q87
$$ -1453 -105 1160 -901 -735 1974 -65 -1263 -545 869 -1379 -216 1180 -1015 -1231 1281 394
2454C94j539J141K52k121J183J824k554J9K081l29k172J332J175k232N20J897
$$ 394 -1145 -4 248 -1873 -690 1134 -1420 -1401 680 351 -1821 -489 686 -1546 -1026 871
2470H71j811j151L207o00k900K590P59j616L09J456j599q96J988m95k371K138
$$ 871 -940 -2091 1116 516 -2384 206 965 -651 -342 1114 -485 -1381 607 112 -2259 -121
2486a21J234j213j89J253j738r95K974j172j629J304J784j533o42J574r59p51
$$ -121 1113 -100 -289 964 -774 -1769 1205 33 -1596 -292 1492 -41 -683 891 -68 -819
2502h19K206j795j074J857J665k504o80K173m30j321J609p09j230K479l7j296
$$ -819 1387 -408 -1482 375 2040 -464 -1144 1029 599 -722 887 178 -1052 1427 1390 94
2518I4r38K880j924j395K116M87k396J190J720k283j61J895q61j025J415K84j484
$$ 94 -844 2036 112 -1283 833 1320 -1076 114 1834 -449 -610 1285 424 -601 814 1098 -386
2535c86Q51J539k413l1K420j419j491J973M36k176J060J221k007m75K021o10j717
$$ -386 465 2004 -409 -440 1980 561 -930 1043 1479 -697 363 1584 -423 -898 1123 513 -1204
2552a204K042P23l080J631J198k018j88K426j255j906K205N38j452J52J516k457
$$ -1204 838 1561 -1519 112 1310 -708 -896 1530 275 -1631 574 1112 -340 -188 1328 -1129
2568a129n12K801o45k566K211N41j340J18J362j186M4P17j003p87J081J486l538
$$ -1129 -1641 1160 515 -2051 160 701 -639 -521 841 -345 -301 416 -587 -1374 -293 1193 -2345
2585b345J295J727p97j622J860J68k288J702J021j643J07J882p46j705J410M79
$$ -2345 -1050 677 -120 -1742 118 286 -2002 -300 721 -922 -815 1067 321 -1384 26 505
2601E05j803J036Q26j780K57K111j479j229J566Q52k420J611J324k546N16J175
$$ 505 -1298 -262 564 -1216 -959 1152 -327 -1556 10 862 -1558 53 1377 -1169 -653 522
2617E22q18j273K310k21k060J979O24k008j19J979l60j945K266k09j773R31J430
$$ 522 -296 -1569 741 520 -1540 439 1063 -945 -1064 915 555 -1390 876 667 -1106 -175 1255
2634A255j933j82K108r93j562J781Q59k590R54J772j599o56K106m57k384K350
$$ 1255 -678 -860 1248 255 -1307 474 1333 -1257 -303 1469 -130 -786 1320 863 -1521 829
2650H29N75k062K87J916j485r75K498j804q13J634L89j860P41K039j919r12J817
$$ 829 1404 -658 -371 1545 60 -915 1583 -221 -1034 600 989 -871 -130 1909 -10 -922 895
2667H95M82j967J418O34k495M87J835j829o47K094J45j922J101J615k167p35K859
$$ 895 1377 -590 828 1462 -1033 -546 1289 -540 -1187 907 1052 -870 231 1846 -321 -1056 1803
2684A803j810j744K703q05j632J905J34j458N65J419j467p54K248p07j902J657
$$ 1803 -7 -1751 952 147 -1485 420 554 -904 -339 1080 -387 -1141 1107 400 -1502 155
2700A55J099k544M02K538j559j259J894m55j814J124J463k176K57K021r58j369
$$ 155 1254 -1290 -888 1650 91 -1168 726 271 -1543 -419 1044 -1132 -875 1146 188 -1181
2716a181J034R1j318J167J253j999k3K511j336k200J764P23j583N20J185j545
$$ -1181 -147 -56 -1374 -207 1046 -953 -976 1535 199 -2001 -237 486 -1097 -577 608 -937
2732i37k35K413j597p89J265K47j633P52J206j217r3J268o66j297J787P89k330
$$ -937 -1172 1241 -356 -1145 120 367 -1266 -514 692 -525 -618 650 -16 -1313 474 1263 -1067
2749a067N76J728j676o79J989r21j327J757Q73j567M51R28k260L31J515k43k245
$$ -1067 -491 1237 -439 -1118 871 -50 -1377 380 1253 -314 137 1065 -1195 -864 651 408 -1837
2766a837J514K092k315j96J576n63r51J190Lj923K368M65k281L7J871l46r28R69
$$ -1837 -323 1769 -546 -742 834 271 -680 510 513 -1410 958 1423 -858 -821 1050 704 -224 745
2784G45p70p19J564O81k486Q76J271l99j536J568n45j125J538J81k250J379J874
$$ 745 -25 -744 820 1501 -985 -109 1162 763 -773 795 250 -875 663 844 -1406 -27 1847
2801A847j132j514J456L98j265J74J128k124M34K224o56j485J303J51j613J050
$$ 1847 715 -799 657 1055 -210 -36 1092 -1032 -598 1626 970 -515 788 939 -674 376
2817C76J032k106J022J086p17j754J856l42j425J542N86j524j43J645n96j763
$$ 376 1408 -698 324 1410 693 -1061 795 453 -972 570 1156 -368 -511 1134 538 -1225
2833a225J652N76k036Q42J062k206L0J874q67j288K129J64j548J43J292j347l07
$$ -1225 427 1003 -1033 -191 871 -1335 -1305 569 -298 -1586 543 707 -841 -698 594 -753 -1060
2850a060J416n49j353K020L51k217P93J140o09j259J804o63j198J662R24k267
$$ -1060 356 -193 -1546 474 825 -1392 -599 541 -68 -1327 477 -186 -1384 278 1202 -1065
2866a065M83J936j179j703J769R9j852J763N62k030j12K140r11q56R78J10j808
$$ -1065 -582 1354 175 -1528 241 340 -1512 251 813 -1217 -1329 811 -100 -956 22 132 -1676
2883a676J187J095k051J298J236j315o12J958j54k274R71J764k165j24K241j035
$$ -1676 -489 606 -1445 -147 1089 -226 -838 1120 966 -1308 -337 1427 -738 -862 1379 344
2899C44j208J369Q38k491J021J006j577L30J937r74j665K009J67j338M39P74j100
$$ 344 -864 505 1343 -1148 -127 879 -698 -368 1569 595 -1070 939 1106 -232 207 981 -119
2916a19N9J724j652j403J857Q30k030O53J355q15p65J695j574m23J731J58k031
$$ -119 -60 1664 12 -1391 466 1296 -734 -81 1274 459 -306 1389 -185 -608 1123 1281 -750
2933g50J66K289j364p67Q35n20l29R67P94k353N48J898j501p30J267j10j053J532
$$ -750 -584 1705 341 -426 409 -111 -440 527 1321 -1032 -484 1414 -87 -817 450 340 -713 819
2951H19j29j314j8K405k146j213K015k07q72L33J025k134J027J425j257j083J817
$$ 819 690 -624 -642 1763 -383 -1596 419 212 -660 -327 698 -1436 -409 1016 -241 -1324 493
2968D93K9j600Q44Q94j498K20J610j369j007J383N28j187J28R28k076Q91K223
$$ 493 522 -1078 -234 660 -838 -618 992 -377 -1384 -1 527 -660 -532 396 -1680 -789 1434
2985A434k024o46J219K13j497Q57J093r68r8J079j504j242K407K62j834K33J155
$$ 1434 -590 -1236 -17 196 -1301 -444 649 -319 -417 662 -842 -2084 323 585 -1249 -1016 139
3002A39l28n06J513j428j262K473M64k487M68J962r88m68J53m57M8J639j19k250
$$ 139 -189 -695 818 -610 -1872 601 1065 -1422 -954 1008 20 -448 -295 -752 -704 935 816 -1434
3020a434J094J777k012n09J589K48j357J287j38j714R39K534k652j15J679l06
$$ -1434 -340 1437 -575 -1084 505 753 -604 683 545 -1169 -230 2304 -348 -463 1216 910
3036I10j136N43N13j545O96J292j757n01K133j80j884Q07O49o64n15J638j070
$$ 910 -226 317 830 -715 -19 1273 -484 -985 1148 968 -916 -109 540 -124 -639 999 -71
3053g1j147K270k29j294N98R22j344K20P68j065q19K078m66j608J276J039j453
$$ -71 -1218 1052 823 -471 127 1049 -295 -75 693 -372 -1191 887 421 -1187 89 1128 -325
3070c25K86J370j679p84J921j84j296N82L28p23N78P13j119j014K513n53k160
$$ -325 -39 1331 -348 -1132 789 605 -691 -109 219 -504 74 787 -332 -1346 1167 614 -1546
3087a546J319J365j198m74J126o56j002J868l16j612J027J050r80j682K290r37
$$ -1546 -227 1138 -60 -534 592 -64 -1066 802 486 -1126 -99 951 -29 -1711 579 -358
3103c58m95J598k00j769R50J150j727p2J432m15q01Q82L75j619J114Q86j848j91
$$ -358 -853 745 545 -1224 -274 876 -851 -923 509 94 -707 175 550 -1069 45 931 -917 -1108
3121a108J416L1j151J270r0j099M08J084j960N58J355J26j646J079M57j398J60
$$ -1108 308 339 -812 458 368 -731 -323 761 -1199 -641 714 840 -806 273 730 -668 -508
3138e08J088p05p56K037m62j800Q35J181j812P30J459j556q92J857k36j512R82
$$ -508 580 -125 -881 1156 694 -1106 -271 910 -902 -172 1287 -269 -1161 696 460 -1052 -70
3155g0R96j219j07J282r04l57J146q8j832J808M98j247n08J203l68q67J187j71
$$ -70 926 -293 -400 882 -22 -379 767 679 -1153 655 1153 -94 -602 601 233 -634 553 382
3173C82j016Q06P55o03o89P02r3o65J043O1j327J278P16j863L22Q95k30j539J773
$$ 382 -634 172 927 324 -365 337 244 -421 622 683 -644 634 1350 -513 -191 704 474 -1065 708
3192G08j65j439J010J231j718j55J502p81q60R22M77j574N82J167j153l55J821
$$ 708 543 -896 114 1345 -373 -528 974 193 -667 255 732 -842 -260 907 -246 -601 1220
3209A220r10j172Q04P74j521J090P84j756k4J514l35j267P93N59j492P75R97j304
$$ 1220 310 -862 -58 716 -805 285 1069 -687 -711 803 468 -799 -6 553 -939 -164 833 -471
3227d71l50J221k41j285Q85L4n22k5J474j094m35J315m47j353J114Q50j419K86
$$ -471 -821 400 159 -1126 -241 -207 -729 -754 720 -374 -809 506 59 -1294 -180 670 -749 -463
3245d63P19q49p03J831o34j146J027P27j039K0N26k18r77J342Q9j535J882j11
$$ -463 256 -593 -1296 535 -99 -1245 -218 509 -530 -510 16 -202 -1179 163 252 -1283 599 488
3263D88j188j40J518q24j111J641k79j351J118J143k178J55K295j605l36J528
$$ 488 -700 -840 678 -146 -1257 384 105 -1246 -128 1015 -1163 -1008 1287 -318 -654 874
3279H74m33j330R17R94j267n66J285j72o44L77K17j345J392Q75j491n50J377o9
$$ 874 441 -889 28 1022 -245 -811 474 302 -342 35 252 -1093 299 1174 -317 -867 510 441
3297D41r26P41K11j177J183O97j464R9J167k75j434J246m85l43N26Q43j441o7
$$ 441 -485 256 467 -710 473 1170 -294 -195 972 697 -737 509 24 -319 207 1050 -391 -458
3315d58J821p69j701R59J417j042k00P62j175L9J504l64k149J717J000j581l24
$$ -458 1363 594 -1107 -148 1269 227 27 789 -386 -347 1157 793 -1356 361 1361 -220 -544
3332e44J373j487K21J517j031j001R92J277k225L6J634k69j180R31J2j348J340
$$ -544 829 -658 -437 1080 49 -952 40 1317 -908 -872 762 493 -687 244 256 -1092 248
3349B48O79j338m88J331n74n91J292m31j289J178M14j155l23J298n46o04J027
$$ 248 927 -411 -899 432 -142 -733 559 128 -1161 17 431 -724 -1047 251 -295 -899 128
3366A28J03q49J74J140j367m18J730n78j189J342O9j499J023J104j536j16J469
$$ 128 231 -618 -444 696 -671 -1089 641 63 -1126 216 285 -1214 -191 913 -623 -739 730
3383G30n72j136P95K41j296R72O76j075K38Q87M7j340R45J04j092O24P16j096
$$ 730 158 -978 -183 58 -1238 -266 410 -665 -427 460 507 -833 112 216 -876 -252 464 -632
3401f32M34J027m99j383J173O86j044k6P93j172P3J751j102j337J191J260j232
$$ -632 -198 829 330 -1053 120 806 -238 -264 529 -643 -570 1181 79 -1258 -67 1193 -39
3418c9k23J175q23m75P90rj357R45J014j193j64J139q79o29J771j038n48Q74L65
$$ -39 -262 913 90 -385 405 396 -961 -16 998 -195 -359 780 -99 -728 1043 5 -543 331 696
3437F96j198J26R51k93k51Q9j0q59J162N89j257NP95j82o90P55j55j035J118M33
$$ 696 -502 -376 575 282 31 120 110 -749 413 1002 -255 -250 545 363 -327 428 273 -762 356 789
3457G89j715L64J412p43l88N98K79r37N88K93j132L0J712l40j712Q31K65o13P00
$$ 789 -926 -562 850 107 -281 317 596 -341 247 540 -592 -562 1150 810 -902 -71 194 -419 281
3476B81Q6j424K05J763n28j027M80J072j242L66O2q75O78Q31n40j597J406Q53
$$ 281 367 -1057 -852 911 383 -644 -164 908 -334 32 94 -781 -103 728 188 -1409 -3 850
3494H50j491l88J606j055J57M00k29r52P92J158j679K66R24k67o00M89K0p80J242
$$ 850 -641 -1029 577 -478 -321 79 -150 -1102 -310 848 -831 -565 359 92 -508 -19 1 -779 463
3513D63K33j305k08J635j485m63J462r2j032O81Q33j354k24J199l02q30O96O7
$$ 463 696 -609 -817 818 -667 -1130 332 240 -792 -111 722 -632 -856 343 41 -789 -93 -26
3531b6p08J125N27j103m45J831j233p77J005P98j297M95K33j026K6J937j089q44
$$ -26 -734 391 918 -185 -630 1201 -32 -809 196 994 -303 192 425 -601 -575 1362 273 -571
3549e71J007j15n77K96K65p44N29M99l57j546K160j88r42J00N70l10k62J476j440
$$ -571 436 321 -256 40 305 -439 90 589 232 -1314 846 658 -284 -184 386 76 -186 1290 -150
3568a50o07J030O53p76o19J526j541M67O09n54m20J237j13j159L29Q57p53o86
$$ -150 -757 273 926 150 -469 1057 -484 -17 592 38 -382 855 742 -417 -88 769 16 -670
3586f70R76m82m72Q54J51j277M43J234o87n18J149n24p61Q48l6q56O16R46p18
$$ -670 306 -176 -648 206 357 -920 -477 757 70 -448 701 177 -584 264 228 -628 -12 934 216
3605B16p97R82k66j071P68R58j360L3J025j4r45M97j10n32J557q95o13L8J618
$$ 216 -581 401 135 -936 -168 790 -570 -537 488 474 -471 26 -84 -616 941 46 -567 -529 1089
3624A089j377m34N33J083j125k52Q83r68M53N19l83q90J756J53j227j86N06o89
$$ 1089 -288 -722 -189 894 -231 -483 400 -568 -115 404 21 -869 887 1040 -187 -373 133 -556
3642e56N31P35j058o85J701m38j59k98P13m83j38q1l29L08M85N19j417P16Q29
$$ -556 -25 710 -348 -1033 668 230 71 -227 486 3 -135 -216 -545 -237 248 767 -650 66 895
3661H95l00r40Q79n21m09Q70j32j386R18R68j363M96P26l09j147J082K82j596
$$ 895 595 -345 534 13 -396 474 342 -1044 -126 842 -521 -25 701 392 -755 327 609 -987
3679i87J214J75o42j86M91L66j292J697lj563L90J205m95q06N53Q01j548J289
$$ -987 227 402 -240 -426 65 431 -861 836 833 -730 -340 865 370 -436 117 918 -630 659
3697F59K7j459Q38R63q19k68Q87j16q25M07L48r50J57J417j390m35Q48L39j389
$$ 659 686 -773 65 1028 209 -59 828 712 -113 294 642 -308 -151 1266 -124 -559 289 628 -761
3716g61K28P03p38P62P57j174n19Q96J4j160M73J052j39r4K05o63l74J298o85
$$ -761 -533 170 -568 194 951 -223 -742 154 168 -992 -519 533 394 300 505 -158 -532 766 81
3735H1j335R89Q02k30m44K04k6p99R82M30j743R31K84J83r77J061n27n20J057
$$ 81 -1254 -265 537 307 -137 67 41 -758 224 654 -1089 -158 126 309 -668 393 -134 -654 403
3754D03j0r16N09Q14j051r0O30m82l74Q38L06j400R63J120j317k65P06m15j19
$$ 403 393 -523 -14 800 -251 -341 289 -193 -567 271 577 -823 140 1260 -57 -322 384 -31 -150
3773a50L98n9p85P11K34k15r54P26L95q15Q45K86j202M33O21n84m41R57j54q39
$$ -150 248 189 -596 115 349 134 -820 -94 301 -514 331 617 -585 -152 469 -115 -556 401 247 -592
3793e92R78J4q02N63P96j389m51K218j127p73J045K19r69J40L15j033N39J022
$$ -592 386 400 -402 161 957 -432 -883 1335 208 -565 480 699 -270 -130 185 -848 -309 713
3811G13K27j473M36O91q33k25Q88n03j07P69n85k62L67K31n28KP00r8q55Q82j93
$$ 713 940 -533 -97 594 -239 -464 424 -79 -186 583 -2 -264 103 334 -194 -192 508 410 -445 437 244
3832B44j178J172M05o78j75P10m18p94J249j00n57M97L58r60l62J286o77l30M16
$$ 244 -934 238 643 -35 -210 500 82 -712 537 437 -120 377 735 -225 -587 699 22 -308 108
3851A08K48r56J099R0j035m53J466m86j093Q81J06J68m32N01j90l34N03n78k3
$$ 108 356 -600 499 589 -446 -899 567 81 -1012 -131 -25 143 -289 212 22 -312 191 -387 -410
3870d10P14J92j048R99k78l22m71R01M07j457P29P70q77k65M32k75k16Q89k60
$$ -410 304 496 -552 447 169 -153 -624 277 684 -773 -44 726 -151 -416 16 -259 -475 414 154
3889A54o71R55o90m10M94J009p12q41J252J99j466J51R82n28p35N44K24q62J516
$$ 154 -517 438 -252 -662 -168 841 129 -712 540 739 -727 -576 406 -122 -857 -313 -89 -951 565
3908E65m28l69J29O71q85K28N94p05K9N51j97o54j67J221j263N7P53L93j128R72
$$ 565 137 -232 -103 568 -317 -89 505 -200 -171 380 183 -471 -638 583 -680 -623 130 523 -605 367
3928C67oq38O13K31m40o15P04j42n34R07j25o51N77P49j006l03J243p52o09J207
$$ 367 361 -477 136 367 -73 -688 16 -126 -660 247 122 -529 48 797 -209 -512 731 -21 -630 577
3948E77K57j138N36O85j512L08R58n29p83Q49L60r80L24P71q87j15Q94m62p78
$$ 577 834 -304 232 917 -595 -287 671 142 -641 208 568 -412 -88 683 -204 -319 575 113 -665
3967f65O96N71r57P48O6m03k88M65J75q27L75P05j325N35M99l85o13J270m61j017
$$ -665 31 602 -355 393 459 56 -232 233 408 -419 -44 661 -664 -129 370 -15 -628 642 181 -836
3987h36O74Q10n54j75L95l80r86J467j09p91M09J90n3j82K03O4n73K91L54p85
$$ -836 -162 648 94 -81 314 -66 -1052 415 306 -485 -76 114 61 -121 82 146 -427 -136 218 -567
4007e67N90K52n18NP15o19j43J85L27j037M48J124p06r56P76L32j023P66K72o17
$$ -567 23 275 -243 -238 477 -142 -285 -100 227 -810 -362 762 56 -900 -124 208 -815 -49 223 -394
4027c94M18N30j451K47Q88m00k89P67q1n01N4O75q53lQ21j03n51K28q1l91L47
$$ -394 24 554 -897 -650 238 -162 -451 316 235 -266 -212 463 -390 -393 428 325 -226 2 -79 -470 -123
4048a23K58k10k4P73o87o93Q77J46j202Q58N94o42k62K43N73j044N91M36r95O16
$$ -123 135 -75 -99 674 -13 -706 171 317 -885 -27 567 -75 -337 -94 479 -565 26 462 -533 83
4068H3M85o15p9M44m4l47L65M25o22l57Q33r44N50O53m85o46M58L68p39l00J070
$$ 83 568 -47 -126 318 274 -73 292 717 95 -262 571 -373 177 830 345 -301 157 525 -214 -514 556
4089E56o27J38O66l43p36Q5J097q18L0P70j006m82J248l36m33M95N32r08q4R46
$$ 556 -71 67 733 390 -346 -261 836 18 48 818 -188 -670 578 242 -191 304 836 -72 -156 790
4109G90p33o12J082k82o56M03M60p51J52O69p26j52N08J69r33O38K86o74J72Q31
$$ 790 57 -555 527 245 -411 -8 452 -299 -147 522 -204 -356 152 321 -612 26 312 -362 -190 641
4129F41n15m49J91M08n61K83L18n09m53R63l77k23K40K53o41J93O05o23M0N26
$$ 641 126 -323 -132 276 -285 -2 316 -193 -646 317 -60 -283 -43 210 -431 -238 367 -256 -216 310
4149C10k80o89P54R9o51K53K95k77m7O59n14n31R29J35o09l17O27l29k5P1L71
$$ 310 30 -659 95 194 -457 -204 91 -186 -233 426 -88 -619 310 445 -164 -481 146 -183 -208 -137 234
4170B34o04K95L81q69O86J53q38k02J181k41p65P32L75r14m7J093k02r36Q57k45
$$ 234 -370 -75 306 -563 123 276 -562 -764 417 176 -589 143 518 -396 -443 650 448 -488 369 124
4190A24k95K73M28p78J01M01l64p82R18N25r20J43J60O94l91K89k22j053R32L65
$$ 124 -171 102 530 -248 -147 254 -110 -892 26 551 -369 -226 -66 628 237 526 304 -749 183 548
4210E48r30Q27L75r35r3R65p21j38L27J50o45J73K91m52j07L89q2k34N83q3k03
$$ 548 -382 445 820 -115 -208 757 36 -102 225 375 -270 -97 194 -258 -365 24 -58 -292 291 208 5
4231Ej91N94n87K22p6N14p52L39M96j002K0M10N68r86N53J16m63J56M88r43N12
$$ 5 -186 408 -179 43 -33 481 -271 68 564 -438 -418 -8 560 -426 127 243 -220 -64 424 -519 -7
4252gJ002n39j267J027m90n06K93N03p96M60N46l95l56O81l70Q7q3M06q27K33
$$ -7 995 456 -811 216 -274 -780 -487 16 -780 -320 226 -169 -525 156 -214 -127 -210 196 -631 -398
4272c98J016q54o19Q86K28r85L80N12m34k65R20l33m19O18K51j072L53O69m99
$$ -398 618 -236 -855 31 259 -726 -346 166 -268 -533 387 54 -365 253 504 -568 -215 454 -45
4291d5n02Q25n04l73Q41L71j236N37N06n95j67R84q88k51O33N09q91l4M54n20
$$ -45 -547 278 -226 -599 242 613 -623 -86 420 -175 -342 642 -246 -497 136 645 -246 -280 174 -346
4311c46k62J327p12n21Q42J13n17n4J75K52j40K14%j206J282Q9q71K01R78q44
$$ -346 -608 719 7 -514 328 441 -76 -130 45 297 157 371 371 -835 447 536 -335 -134 844 0
4331@L2L88M2j059O32K16n79L15M75m8o16O14l8o60P55j59m56P24l93n9k83O60
$$ 0 32 420 462 -597 35 251 -328 -13 462 414 -202 412 374 -286 469 310 -146 578 185 126 -157 503
4353E03j80r01J357n14k23l12j2m14J18P28k87n14O11L55r08L91J026p99p28R22
$$ 503 323 -578 779 265 42 -270 -282 -696 -578 150 -137 -651 -40 315 -593 -202 824 25 -703 219
4373B19p9n33O00J76p02k19R78n86l29O67k22k84j33P43n98N08M70n27n63N21
$$ 219 140 -393 207 383 -319 -538 440 -146 -475 192 -30 -314 -447 296 -302 206 676 149 -414 107
4393A07K90l75o1K61o21k54P44j0j99L58l54K3j79N19K58o72L54m13j74N43J49
$$ 107 397 22 -39 222 -399 -653 91 81 -118 240 -114 -91 -270 249 507 -165 189 -224 -398 145 294
4414B94o27m0P15p89J64N45j87j59j47J08n93P17L91n52l48P37K0q66R72l63m85
$$ 294 -333 -373 342 -447 -283 262 75 -84 -231 -123 -716 1 392 -160 -508 229 249 -617 355 -8 -493
4435d93J51J105j568K95P76j2o20P50J70o86J78M08l39j45N35m98m32Q14k22l36
$$ -493 -342 763 -805 -510 266 254 -366 384 554 -132 46 454 115 -30 505 7 -425 389 167 -169
4455a69m7N51k50k60J50L26m46M66O54o47n28N66k93l14R70o2r0l14M31p79P5
$$ -169 -216 335 85 -175 -25 301 -145 321 975 328 -200 366 73 -241 729 667 577 263 694 -85 -10
4476a0K61q2m59P23J22r13L09J94n94K63J012p56m7M30j09o32N98m74J26k13M76
$$ -10 251 169 -290 433 555 -358 -49 145 -449 -186 826 70 23 453 344 -288 310 -164 -38 -251 225
4497B25M16o26M03rq48P43K55m24o44L64Jn0M32K14r05o8O21m63J19R51j32k88
$$ 225 641 15 418 409 -439 304 559 135 -509 -145 -144 -194 238 452 -453 -521 100 -363 -244 707 575 287
4519B87k01L67n01q3O29q64m28R32L1n74L41Q05q86J23M09r61L54M06m62m73P75
$$ 287 86 453 -48 -131 498 -366 -794 138 169 -405 -64 741 -145 -22 387 -574 -220 186 -276 -749 26
4540B6O65j328L52L10J54k67N10j68o94M76l9m11M97MK32p01P64k63l93M94K93
$$ 26 691 -637 -285 25 179 -88 422 254 -440 36 -3 -414 83 87 319 -382 382 119 -274 220 513
4561E13q33j06K27J56j87M64l78k05j10P90p96Q9O32p06K69N40J74p58j29Q50
$$ 513 -320 -426 -199 -43 -230 234 -144 -349 -459 331 -465 -376 256 -450 -181 359 533 -225 -354 496
4581D96j002j72J073o61l93R43J77n20mJ72K13kp7l10J76L11k16o36P36n99K33
$$ 496 -506 -678 395 -266 -659 284 461 -59 -63 109 322 320 243 -67 109 420 204 -432 304 -295 -62
4602f2j56Q52oj339Q37j83j71M30J21m72M27K28k81k91p6Q01j052K14P44m50l49
$$ -62 -218 634 628 -711 126 -57 -228 202 323 -149 278 506 225 -66 -142 659 -393 -179 565 115 -234
4623b34N72j62k84J97N67o67j22O66q51l59J011J77q66N3P7K85n3M61r80J23N77
$$ -234 338 176 -108 89 656 -11 -133 533 -318 -677 334 511 -355 -302 -225 60 7 468 -512 -389 188
4644A88j03k41R5M82l26m59M42j56l6Q7K16l18j24P34o80O03K33k56l30J78o12
$$ 188 85 -156 -61 421 95 -364 78 -78 -114 -27 189 -129 -253 481 -199 404 637 381 51 229 -383
4665c83R1J52N43J22m09O4j4K90p40N96m89N8J25L54q08K78j91J18N61o50K83
$$ -383 -292 -140 403 525 116 180 166 456 -284 312 -177 -119 6 360 -448 -170 -361 -243 318 -332 -49
4686d9k62Q59p61k95Q72o42j06j31O13K0m28N82j013P24K48l01m67J16O90m15
$$ -49 -311 548 -213 -508 364 -278 -384 -515 98 118 -310 272 -741 -17 231 -70 -537 -421 269 -146
4706a46J86Q61j136K44O15o88J47L7k04M35M7Nl92nK17m7l36L33L93m45P2N23
$$ -146 40 901 -235 9 624 -64 83 120 -84 351 398 403 11 6 223 176 -160 173 566 121 193 716
4728G16q11j79J76J90k90L44J03m34j62L67m44R9O19n29J4K17Q59j128K4P64p5
$$ 716 -95 -274 -98 92 -198 146 249 -185 -347 20 -424 -325 294 -235 -221 -4 855 -273 -249 515 440
4749D40q54P65p55k16L88O26o68L60j61l28M15k2l15O84M1j97n54M28M6n39K80
$$ 440 -414 351 -404 -620 -232 394 -274 86 -75 -403 12 -10 -325 359 400 203 -351 77 123 -416 -136
4770a36K35m48r9M30k44k53k2Q30o85j17K07j25K46l84Q17j75k42Q0O02j028J040
$$ -136 99 -349 -448 -18 -262 -515 -537 293 -392 -509 -302 -427 -181 -565 252 77 -165 -85 517 -511 529
4791E29o01N05n53J45l36j48M12J56o93J191p31o0L10R1l35l73P55l87n77J345
$$ 529 -72 433 -120 25 -311 -459 -47 109 -584 607 -124 -184 126 217 -118 -491 264 -123 -700 645
4811F45k50J22o39K21k04o7J090j010l55M66j06j81k8N47j30p62J11N42m48L2
$$ 645 395 517 -122 99 -105 -172 918 -92 -447 19 -87 -268 -296 251 121 -641 -530 12 -436 -404
4831d04R06m55q7J81J20l3r8m24N8M8N07n08p23J863q37K27P8o36l53N32L57p6
$$ -404 502 47 -40 141 261 228 130 -294 -236 -188 319 -189 -912 951 114 341 419 -217 -570 -38 319 243
4853B43o69Q76l12k92Q9Q97j257Q59j87p38Q37K51j73o26J68j074J433k08K10
$$ 243 -426 450 138 -154 -65 832 -425 434 247 -491 346 597 424 -202 -34 -1108 325 117 327
4872C27n09j81Q17m93K12k14J69n6m70K86J33n56J027k36n96J67O17p71R01M93
$$ 327 -182 -363 454 -39 173 -41 128 72 -398 -112 21 -535 492 256 -340 -173 444 -327 574 1067
4892A067m26k25j13m84k39N37r9m95j19J304r69M1M86j59l18M34j15l63k90O89
$$ 1067 641 416 303 -181 -420 117 18 -477 -596 708 -261 -220 266 107 -211 223 108 -255 -545 144
4912A44l37J27L94l31n49P84R0p98L50O78j74j043R62l90l10Q48j001N40r0K57
$$ 144 -193 -66 328 -3 -552 232 322 -476 -126 552 378 -665 297 -93 -403 445 -556 -16 -106 151
4932A51k0j78N03n98K66p71J149j553M16J069j178K93K14Q51o53j02O00n96k2
$$ 151 131 -47 456 -142 124 -647 502 -1051 -635 434 -744 -451 -237 614 -39 -141 459 -137 -159
$$ [...]
8191i2
##END NTUPLES=NMR FID
##END=
