##TITLE=1H_TG-2288-2
 CDCl3, 8 sc, 
 4.6.2020
##JCAMPDX= 6.0         $$ Bruker NMR JCAMP-DX V2.0
##DATA TYPE= NMR FID
##DATA CLASS= NTUPLES
##ORIGIN= UXNMR, Bruker Analytische Messtechnik GmbH
##OWNER= root
$$ XWIN-NMR		Version 3.5
$$ Thu Jun  4 11:45:12 2020 Russian Standard Time (UT+4h)  she@DPX200
##.OBSERVE FREQUENCY= 200.1315
##.OBSERVE NUCLEUS= ^1H
##.DELAY= (6, 6)
##.ACQUISITION MODE= SIMULTANEOUS
##.ACQUISITION SCHEME= undefined
##.AVERAGES= 8
##.DIGITISER RES= 18
##SPECTROMETER/DATA SYSTEM= spect
##.PULSE SEQUENCE= zg30
##.SOLVENT NAME= D2O
##.SHIFT REFERENCE= (INTERNAL, D2O, 0, 15.7039)
##AUDIT TRAIL= $$ (NUMBER, WHEN, WHO, WHERE, WHAT)
$$ ##TITLE= Audit trail, XWIN-NMR		Version 3.5
$$ ##JCAMPDX= 5.01
$$ ##ORIGIN= Bruker BioSpin GmbH
$$ ##OWNER= she
$$ F:/spectra/data/she/nmr/H-F/1/audita.txt
$$ ##AUDIT TRAIL=  $$ (NUMBER, WHEN, WHO, WHERE, WHAT)
(   1,<2020-06-04 11:39:46.03 +0400>,<she>,<DPX200>,
      <created by zg, POWCHK disabled, PULCHK disabled
       configuration hash MD5:
       00 E9 B6 7A A2 85 ED C7 34 08 36 98 17 FE 4E 26
       data hash MD5: 16K
       F1 B4 ED FA 44 AD DF F3 A2 2B 02 51 E9 CD 50 B7>)
$$ ##END=
$$ 
$$ hash MD5
$$ 58 2C 4B C3 28 DE 00 74 9C 19 62 E0 35 97 29 B6
##$RELAX= 
##$RELAX= 
##$RELAX= 
##$RELAX= 
##$RELAX= 
##$RELAX= 
$$ Bruker specific parameters
$$ --------------------------
##$DU= <F:/spectra>
##$EXPNO= 1
##$NAME= <H-F>
##$PROCNO= 1
##$TYPE= <nmr>
##$USER= <she>
##$AMP= (0..31)
100 100 100 100 100 100 100 100 100 100 100 100 100 100 100 100 100 100 
100 100 100 100 100 100 100 100 100 100 100 100 100 100 
##$AQSEQ= 0
##$AQ_mod= 1
##$AUNM= <au_zg>
##$AUTOPOS= <>
##$BF1= 200.13
##$BF2= 200.13
##$BF3= 200.13
##$BF4= 200.13
##$BF5= 200.13
##$BF6= 200.13
##$BF7= 200.13
##$BF8= 200.13
##$BYTORDA= 1
##$CFDGTYP= 0
##$CFRGTYP= 5
##$CHEMSTR= <none>
##$CNST= (0..31)
1 1 145 1 1 1 1 1 1 1 1 1 1 1 1 1 1 1 1 1 1 1 1 1 1 1 1 1 1 1 1 1 
##$CPDPRG= <>
##$CPDPRG1= <>
##$CPDPRG2= <>
##$CPDPRG3= <>
##$CPDPRG4= <mlev>
##$CPDPRG5= <mlev>
##$CPDPRG6= <mlev>
##$CPDPRG7= <mlev>
##$CPDPRG8= <mlev>
##$CPDPRGB= <>
##$CPDPRGT= <>
##$D= (0..31)
0 1.2 0 0 0 0 0 0 0 0.06 0 0.03 0 0 0 0 0.0002 0 0 0 0 0 0 0 0 0 0 0 0 
0 0 0 
##$DATE= 1591256385
##$DBL= (0..7)
120 120 120 120 120 120 120 120 
##$DBP= (0..7)
150 150 150 150 150 150 150 150 
##$DBP07= 0
##$DBPNAM0= <>
##$DBPNAM1= <>
##$DBPNAM2= <>
##$DBPNAM3= <>
##$DBPNAM4= <>
##$DBPNAM5= <>
##$DBPNAM6= <>
##$DBPNAM7= <>
##$DBPOAL= (0..7)
0.5 0.5 0.5 0.5 0.5 0.5 0.5 0.5 
##$DBPOFFS= (0..7)
0 0 0 0 0 0 0 0 
##$DE= 6
##$DECBNUC= <off>
##$DECIM= 24
##$DECNUC= <off>
##$DECSTAT= 4
##$DIGMOD= 1
##$DIGTYP= 9
##$DL= (0..7)
0 120 120 120 120 120 120 120 
##$DP= (0..7)
150 150 150 150 150 150 150 150 
##$DP07= 0
##$DPNAME0= <>
##$DPNAME1= <>
##$DPNAME2= <>
##$DPNAME3= <>
##$DPNAME4= <>
##$DPNAME5= <>
##$DPNAME6= <>
##$DPNAME7= <>
##$DPOAL= (0..7)
0.5 0.5 0.5 0.5 0.5 0.5 0.5 0.5 
##$DPOFFS= (0..7)
0 0 0 0 0 0 0 0 
##$DQDMODE= 0
##$DR= 18
##$DS= 0
##$DSLIST= <SSSSSSSSSSSSSSS>
##$DSPFIRM= 0
$$ [...]
##$SUBNAM2= <"">
##$SUBNAM3= <"">
##$SUBNAM4= <"">
##$SUBNAM5= <"">
##$SUBNAM6= <"">
##$SUBNAM7= <"">
##$SUBNAM8= <"">
##$SUBNAM9= <"">
##$SW= 24.9337058887773
##$SWIBOX= (0..15)
0 0 2 0 0 0 0 0 0 0 0 0 0 0 0 0 
##$SW_h= 4990.01996007984
##$TD= 16384
##$TD0= 1
##$TE= 0
##$TE2= 300
##$TE3= 300
##$TEG= 300
##$TL= (0..7)
0 120 120 120 120 120 120 120 
##$TP= (0..7)
150 150 150 150 150 150 150 150 
##$TP07= 0
##$TPNAME0= <>
##$TPNAME1= <>
##$TPNAME2= <>
##$TPNAME3= <>
##$TPNAME4= <>
##$TPNAME5= <>
##$TPNAME6= <>
##$TPNAME7= <>
##$TPOAL= (0..7)
0.5 0.5 0.5 0.5 0.5 0.5 0.5 0.5 
##$TPOFFS= (0..7)
0 0 0 0 0 0 0 0 
##$TUNHIN= 0
##$TUNHOUT= 0
##$TUNXOUT= 0
##$USERA1= <user>
##$USERA2= <user>
##$USERA3= <user>
##$USERA4= <user>
##$USERA5= <user>
##$V9= 5
##$VALIST= <valist>
##$VCLIST= <CCCCCCCCCCCCCCC>
##$VD= 0
##$VDLIST= <DDDDDDDDDDDDDDD>
##$VPLIST= <PPPPPPPPPPPPPPP>
##$VTLIST= <TTTTTTTTTTTTTTT>
##$WBST= 1024
##$WBSW= 4
##$XGAIN= (0..3)
0 0 0 0 
##$XL= 0
##$YL= 0
##$YMAX_a= 110692
##$YMIN_a= -42578
##$ZGOPTNS= <>
##$ZL1= 120
##$ZL2= 120
##$ZL3= 120
##$ZL4= 120
##$ABSF1= 10
##$ABSF2= 0
##$ABSG= 5
##$ABSL= 3
##$ALPHA= 0
##$AQORDER= 0
##$ASSFAC= 0
##$ASSFACI= 0
##$ASSFACX= 0
##$ASSWID= 0
##$AUNMP= <proc_1d>
##$AZFE= 0.1
##$AZFW= 0.1
##$BCFW= 1
##$BC_mod= 2
##$BYTORDP= 1
##$COROFFS= 0
##$CY= 11.3945322036743
##$DATMOD= 1
##$DC= 2
##$DFILT= <>
##$DTYPP= 0
##$F1P= 16.9975609425685
##$F2P= -3.02152046262296
##$FCOR= 0.5
##$FTSIZE= 0
##$FT_mod= 4
##$GAMMA= 1
##$GB= 0.15
##$INTBC= 1
##$INTSCL= 1
##$ISEN= 128
##$LB= 0.24
##$LEV0= 0
##$LPBIN= 0
##$MAXI= 10000
##$MC2= 0
##$MEAN= 0
##$ME_mod= 0
##$MI= 1.114404
##$NCOEF= 0
##$NC_proc= 0
##$NLEV= 6
##$NOISF1= 3.799351
##$NOISF2= 2.8
##$NSP= 1
##$NTH_PI= 0
##$NZP= 0
##$OFFSET= 15.70392
##$PC= 1
##$PHC0= -9799.142
##$PHC1= 22.40082
##$PH_mod= 1
##$PKNL= yes
##$PPARMOD= 0
##$PSCAL= 0
##$PSIGN= 0
##$REVERSE= no
##$SF= 200.130013532006
##$SI= 16384
##$SIGF1= 3
##$SIGF2= 2
##$SINO= 400
##$SIOLD= 16384
##$SREGLST= <1H.CDCl3>
##$SSB= 0
##$STSI= 0
##$STSR= 0
##$SW_p= 3612.71676300578
##$SYMM= 0
##$S_DEV= 0
##$TDeff= 0
##$TDoff= 0
##$TI= <>
##$TILT= no
##$TM1= 0
##$TM2= 0
##$TOPLEV= 0
##$USERP1= <user>
##$USERP2= <user>
##$USERP3= <user>
##$USERP4= <user>
##$USERP5= <user>
##$WDW= 1
##$XDIM= 8192
##$YMAX_p= 0
##$YMIN_p= 0
$$ End of Bruker specific parameters
$$ ---------------------------------
##NTUPLES= NMR FID
##VAR_NAME=  TIME,          FID/REAL,        FID/IMAG
##SYMBOL=    X,             R,               I
##VAR_TYPE=  INDEPENDENT,   DEPENDENT,       DEPENDENT
##VAR_FORM=  AFFN,          ASDF,            ASDF
##VAR_DIM=   8192,          8192,            8192
##UNITS=     SECONDS,       ARBITRARY UNITS, ARBITRARY UNITS
##FACTOR=    0.0002004,     1,               1
##FIRST=     0,             0,               0
##LAST=      1.6414764,     0,               0
##MIN=       0,             -42578,          0
##MAX=       1.6414764,     110692,          0
$$ Real data points
##PAGE= N=1
##DATA TABLE= (X++(R..R)), XYDATA
0 0 0 0 0 0 0 0 0 0 0 0 0 6 -8 8 -8 8 -10 16 -16 18 -24 25 -32 36 -40 46 -53 60 -68 77 -86 99 -110 123 -138
35 -138 154 -170 191 -211 235 -259 287 -318 350 -389 433 -480 534 -596 667 -751 852 -975 1128
54 1128 -1326 1589 -1968 2556 -3597 6040 -28097 19472 39685 -34250 -42578 -23360 -8634 -12294
68 -12294 -21948 -40038 -23477 6570 -7719 -33959 -24707 -13448 -7220 4244 2210 -23579 -9617
81 -9617 19579 -3768 -32197 -10850 13629 5604 4592 7116 -6151 10231 31369 10658 -14055
94 -14055 10497 31218 8021 -739 7662 11437 24694 30974 5126 -10353 29830 50522 16208
107 16208 -7695 -408 13027 24173 26123 743 -6222 29230 31820 1944 1708 21540 12322
120 12322 4794 20368 4103 -14793 6851 24245 3492 -6964 15686 20509 11714 859 -14102
133 -14102 -4436 26612 23144 -16974 -15226 13535 7516 -3347 7851 11898 4135 11846 6294 -19301
147 -19301 -8029 16404 4533 -11802 2168 8698 -5215 1135 2909 -9116 -1283 12103 -3313
160 -3313 -18006 -1494 -2287 -18293 -8477 582 -7224 -5923 4276 -12649 -22987 -1268 6 -16760
174 -16760 -18654 -13742 -18766 -4933 10826 -17176 -35195 -6868 10672 -8771 -17558 -5753 -9970
187 -9970 -11169 -7570 -16480 -13147 4881 4274 -12948 -967 12123 -6800 -11326 3239 2188 -5479
201 -5479 7974 7347 -11167 605 18604 8099 -1485 11425 14297 7927 14345 4111 -10423
214 -10423 9145 31127 13537 -7954 5668 17411 20456 25053 8175 -8485 10619 33262
226 33262 10751 -10859 7502 19457 16110 14570 10033 2033 17268 28300 2676 -4533 19801
239 19801 22359 550 -358 11782 9528 16684 22315 5192 727 18478 20182 2051 2377 7856
253 7856 3825 14204 17519 -2748 -5427 24481 26150 -5277 -6640 11394 15081 9774 1222 -13855
267 -13855 -7987 21609 16124 -11800 -7697 12589 10968 238 -3345 -14025 -7931 11320 777
280 777 -22347 -11610 11595 2829 -10972 -7921 -9404 -3694 7570 -5076 -29296 -17634 7392
293 7392 -2760 -15983 -13404 -9858 -2658 8856 -3759 -28367 -12919 10580 -4498 -23184 -14528
306 -14528 -2112 -1780 960 -9212 -17716 3033 13620 -9398 -22014 -1722 4694 -7255 -3978
319 -3978 -4806 -11470 772 12094 -2804 -11928 6761 9332 -3403 -5938 -6697 -7498 7026 15534
333 15534 -7001 -13727 11108 17871 950 -5420 -713 1070 12513 15253 -10213 -15297 10284
346 10284 19326 2073 -1397 8622 7207 11435 10088 -5858 -5601 14578 14168 -5283 1761 13112
360 13112 6428 5079 10825 4671 1068 14457 11047 -5330 1296 10549 3862 1195 8642 3395
374 3395 2813 17318 9448 -8043 1297 16728 4540 -7691 1713 3855 3775 9481 1802 -7739 4344
389 4344 17254 1274 -6727 3994 1359 -4867 1466 2767 -7677 696 10292 -4114 -7578 5107
403 5107 3250 -6461 -118 1560 -10281 -5319 987 -7807 -8271 4872 3043 -9060 -2137 -1387 -10711
418 -10711 -5291 1469 -8817 -12644 2775 -1337 -16140 -9064 938 -2329 -2858 -1214 -10425 -9467
432 -9467 2748 -7893 -20181 -6836 6247 -3917 -10336 -2526 -4622 -4525 2006 -5378 -13757 -1434
446 -1434 7897 -7829 -12819 -3041 -3103 -443 6165 180 -9541 3705 11543 -7524 -12995 -89 3844
461 3844 -237 2642 -1391 -7209 7449 11390 -5350 -7973 8256 9257 -2350 -1965 -4116 -4912 8220
476 8220 9541 -6338 -5186 15517 11544 -5256 -2821 1888 2674 7431 5718 -8500 -4738 15040
490 15040 10052 -3305 1372 8854 6699 8406 7026 -9145 -4033 15665 11557 -5684 -1640 11417
504 11417 10029 9375 4514 -5068 4000 18973 7476 -12324 -2195 12198 5330 2627 2893 504
518 504 6679 16015 2830 -14011 -564 11525 2531 -5080 -2334 -1569 2234 8870 -3701 -13605
532 -13605 3799 13227 -2192 -13283 -6334 -6024 -3866 2629 -7319 -13670 1663 10777 -6830 -16132
546 -16132 -5504 -1802 -1551 -2622 -12298 -15494 430 6720 -12527 -15319 688 3400 -3138 -5123
560 -5123 -8916 -12792 41 2327 -14339 -13702 2137 3869 -6474 -5040 -5487 -8634 2485 2143 -13716
575 -13716 -13362 4190 1976 -12237 -8759 -3456 -2583 3226 1620 -12064 -10002 5243 -454 -14112
589 -14112 -7704 -66 -1894 -616 -1210 -10552 -4826 10020 1809 -11296 -4140 4882 -1858 -4267 -396
604 -396 -4174 943 10223 2643 -6744 2647 10844 1335 1587 5451 458 845 8597 4702 -2798 8888
620 8888 14631 3944 3543 8991 6031 3414 9550 5356 -1003 9775 12435 1042 1264 11824 8465
635 8465 2691 9446 5848 122 6511 8151 -2750 -1541 9709 4517 -483 6305 5259 887 4855
650 4855 5724 -5444 -2055 8893 1034 -5940 1465 4799 -2762 239 4392 -2711 914 8228 -57
665 -57 -8567 -1095 3176 -4631 -1374 2472 -3086 574 5884 -2636 -9993 3316 6053 -6492 -6525 -916
681 -916 -2732 -2205 2149 -5412 -8324 5444 5558 -7861 -8758 487 -1180 -4913 -2753 -8987 -8691 3409
697 3409 3720 -9079 -7797 3862 319 -4967 -3726 -7594 -7380 2533 2831 -10916 -6543 6480 1857
712 1857 -3692 -715 -581 -2114 5943 3211 -9907 -4194 9216 5112 -3046 1486 6199 5651 10525
727 10525 4620 -6012 2625 14798 6506 -4715 3587 9775 7814 10183 6321 -71 8292 19249
741 19249 6897 -5534 5098 11367 7555 5530 4523 1188 10124 19097 5902 -4077 7331 13689
755 13689 5656 1733 2061 1584 9389 15464 1462 -5002 8371 16150 4066 -13 4670 3853 6326
770 6326 7982 -1965 -5951 9786 14147 1045 421 6126 6401 5636 4918 -2250 -5693 7237 8345
785 8345 -3811 -3155 5668 5717 3283 4332 -2365 -3660 7725 6203 -6477 -5547 4332 2313 -3389
800 -3389 -864 -1801 -844 6908 4272 -9882 -8203 3841 -650 -5825 -3576 -1824 -1773 4133 404 -11065
816 -11065 -4081 7811 872 -8293 -5421 -2362 -5045 660 -508 -8466 -1755 6641 -562 -6771 -778
831 -778 2833 -1795 968 -43 -5287 -1661 5868 749 -4237 4740 4822 -858 1073 3502 -1062 1217
847 1217 7608 -969 -6283 5213 7403 58 2449 7921 2719 2222 6154 112 -2789 6337 7874
862 7874 -42 1001 5633 2206 3733 8018 4048 1151 6232 6783 -1827 988 6809 1610 1939 8622
878 8622 4477 -715 7139 8627 464 4425 9317 989 -2105 3449 4953 1728 7264 7011 -612
893 -612 3611 8107 1345 -2527 6823 5408 -1171 1581 819 -3711 2259 8610 409 -1509 6349 4020
909 4020 -4149 -747 2826 -2658 -835 1974 -4915 -4671 5313 3971 -5094 -3283 2176 -2707 -1707
924 -1707 -802 -5985 -5322 3465 299 -10305 -5631 1926 -522 -872 71 -6473 -7817 1417 -1713 -11005
940 -11005 -4869 2896 -1952 -4877 -2716 -5369 -4968 4106 -315 -9281 -5708 916 -5036 -8566 -2321
955 -2321 -2141 -1499 2787 -2358 -8044 -1586 6326 -2413 -8384 -2826 -1838 -1705 1032 -1792 -7074 2911
971 2911 10474 -1857 -9268 -1391 3316 1210 898 -2589 -7259 1612 7859 -1250 -4176 5462 7200
986 7200 636 536 -1183 -4663 3949 7606 -788 -4072 6457 7367 -446 1847 3615 3506 5773 6492
1002 6492 -3090 -4600 8369 8888 -151 -49 4777 4230 6762 7690 -2307 -1841 9909 7507 -3559
1017 -3559 -3047 4782 5103 7107 6828 -2621 -1404 9106 7592 -3408 -716 5043 1385 1558 2235 -2218
1033 -2218 -1598 8259 6275 -3900 7 5224 802 -1640 477 -1560 -1544 5188 468 -7472 -597
1048 -597 7826 802 -4581 -1041 -2511 -2639 2002 -3234 -10091 -2807 5636 -2469 -8154 -2746 -1773 -1286
1064 -1286 1238 -3046 -10478 -5386 1115 -5043 -7438 -1525 -1282 -4376 -667 -1994 -8398 -3440 1608
1079 1608 -5285 -7741 -1184 -1803 -6811 -2236 -1052 -5079 83 2436 -4517 -6209 567 1063 -6549
1094 -6549 -3308 -1519 -3942 243 2957 -3646 -4477 4543 2433 -3626 -1144 1344 -2238 -71 3006
1109 3006 -3184 -4236 4025 3012 -1507 2609 5006 -1003 -435 3873 347 -1603 3959 2477 -1825
1124 -1825 3679 8472 293 169 5475 4063 1714 4836 2409 -3570 3810 7654 408 -916 6484
1139 6484 5900 2618 6157 4792 -590 3802 5997 -333 -500 6529 4307 -868 5233 5593 1720 3501
1155 3501 4506 -794 -408 6634 2214 -4166 199 4056 1425 1927 3378 -2466 -276 7099 888
1170 888 -7070 -3143 1977 -613 -54 337 -4902 -1743 6052 653 -6942 -2367 1949 -3266 -3690 -2221
1186 -2221 -5587 -3458 2325 -1606 -7826 -361 3045 -3711 -5971 -2492 -3604 -4194 -1153 -5172 -8553
1201 -8553 777 3942 -4738 -7352 -578 275 -2006 -1452 -6973 -8971 1385 3997 -6364 -8919 -256
1216 -256 1429 -323 600 -4822 -6796 1218 4171 -6724 -8475 778 908 -1279 -41 -1440 -3875
1231 -3875 2931 4857 -5067 -4575 3232 2294 -3395 -1035 657 -270 4727 4626 -3727 -920 8785 5676
1247 5676 -3217 -801 2380 1740 4915 3602 -2230 1543 11363 7141 -1919 796 5205 5855 5013 3794
1263 3794 -2084 1161 10863 5334 -2201 3152 8542 6174 4357 4093 -1385 2679 8344 2914 -3362
1278 -3362 3184 9429 2509 1129 2859 1802 3130 6959 982 -3753 2780 6923 -1057 -3495 674
1293 674 1310 2234 5207 -232 -5420 2098 5532 -2043 -3552 1114 1265 -756 3564 -135 -3826 2437
1309 2437 3868 -2115 -3272 862 -1053 -4107 -445 -1326 -3399 1176 2749 -4349 -4203 2726 -350
1324 -350 -4371 -1759 -1191 -3319 -635 284 -7965 -4339 3299 808 -4324 -1230 213 -3838 -924 -322
1340 -322 -6728 -4403 2276 111 -5308 -1850 464 -2577 491 1946 -2567 -2818 1933 -1277 -5154
1355 -5154 88 1747 -3505 80 4575 1758 -911 3481 -557 -2537 4307 4444 -2331 -910 4781
1370 4781 2048 531 3658 1942 1295 6063 6312 -1510 -1372 5316 2995 637 4934 3303 1544 6439
1386 6439 6382 -566 1453 7532 3953 619 3542 3610 171 4044 5264 559 3620 9340 3859 -505
1402 -505 3549 4864 1183 3415 2951 -794 2743 9007 2253 -2176 3772 5923 2168 2727 1922 -932
1418 -932 1574 5789 1479 -3492 3367 6482 1632 1262 2179 -340 1546 3675 -2379 -4319 2782 5186
1434 5186 -2793 -3324 1650 997 2205 3407 -3731 -6230 1846 3175 -5562 -5301 398 861 67 -517
1450 -517 -4764 -5814 3470 3252 -5517 -4545 691 -526 -3311 -1948 -4814 -3964 3840 1943 -5767 -4436
1466 -4436 1094 -835 -4537 -1630 -3935 -3622 1843 695 -7331 -4191 4550 676 -3905 -2079 -902
1481 -902 -704 1412 -1146 -7157 -1351 6480 1161 -3715 -833 732 182 1680 -219 -6303 877 5820
1497 5820 458 -4746 -299 3496 1149 2380 1825 -2857 1921 6030 -292 -4713 427 4552 1472
1512 1472 2476 1780 -235 3048 6906 804 -2928 3911 5245 -495 -82 1652 385 2953 6843
1527 6843 -101 -1338 5929 5430 453 -240 3200 2089 2693 4148 9 -1446 4340 6071 230 282
1543 282 4435 2705 729 3422 -1111 -1559 4155 3674 -2456 -692 4305 1767 -71 2322 -732 -2244
1559 -2244 3303 1222 -4439 -1971 2601 310 -2566 1391 558 -2331 1548 388 -3920 -2233 3198
1574 3198 -1610 -4447 312 371 -1788 -553 -198 -3731 -1713 1768 -3114 -4897 -1259 -565 -4349 -1767
1590 -1767 454 -3904 -1244 2026 -2885 -4352 380 -43 -4624 -2644 -253 -2645 -1732 817 -2377
1605 -2377 -3177 1726 702 -3868 -783 1474 -2124 -3422 -240 -1307 -3467 2267 1588 -4097 -185
1620 -185 2393 507 -2363 683 -1399 -1794 1916 123 -3755 771 4110 469 -1286 2583 1095
1635 1095 -499 3159 650 -2721 210 5173 -819 -2584 3251 4196 2496 3594 881 -2243 1914
1650 1914 6128 424 -1340 3818 4121 1417 1885 2929 680 4091 5076 192 -949 4692 3487 -1090
1666 -1090 309 1948 1466 3793 5813 -1304 -1472 5059 4199 -1829 317 2095 664 2455 2997 -1412
1682 -1412 -1700 6192 3408 -2699 -1781 3109 755 447 83 -3287 -2364 4482 1903 -4055 -1244 2733
1698 2733 719 -1551 -1462 -3543 -1713 2409 -739 -7087 -2816 2474 -627 -1759 -1002 -1527 -1639 1419
1714 1419 -2192 -7124 -1919 2825 -906 -5108 -1891 -1426 -1088 1274 -1653 -4949 -608 3201 -3778
1729 -3778 -6260 -801 2009 210 679 -1719 -3433 -324 2934 -3894 -5666 -6 2041 -752 -2138
1744 -2138 -2234 -3813 1522 3449 -3016 -3621 1449 2076 -2248 -1059 -912 -2002 2241 2791 -2737 -3057 2485
1761 2485 2973 -1303 -797 1092 -516 1516 2700 -2268 -2384 3161 3263 -2363 366 2277 2146 1962
1777 1962 1794 -1659 -968 3875 2620 -1678 1598 3970 1081 1202 2020 219 1846 5424 2998 -2919
1793 -2919 -292 4125 1382 401 2729 1184 1032 3237 276 -2383 1383 5259 781 -1086 1065
1808 1065 316 -128 2724 1208 -383 2114 4706 -1146 -2482 742 249 -1254 901 195 -2523 430
1824 430 806 -1516 -291 3016 117 -3018 -813 176 -3164 -1645 -481 -1836 -2116 2795 530 -2293
1840 -2293 507 431 -2204 -1850 1099 -3456 -1904 2213 -861 -4638 -135 1085 -2068 -788 644 -2045
1856 -2045 -921 614 -2280 -5427 -1202 3150 -1301 -1356 -934 -2193 -1576 1155 -1619 -2861 993 1723
1872 1723 -3205 -3321 -249 260 -459 924 -782 -2447 1445 1596 -2820 -3637 1677 637 -1044 352
1888 352 -619 -901 2801 3054 -1882 -1940 3261 2136 -1942 -577 787 1226 3536 3879 -1380 -747 5509
1905 5509 3683 -587 -111 1525 921 3258 2694 -2398 928 5438 3608 -643 723 3117 2089 3067
1921 3067 1699 -1735 635 5052 1643 -1817 1443 2809 1781 2001 970 -804 975 5400 1279
1936 1279 -3386 -408 2223 -411 214 973 494 1013 3497 -508 -3572 1152 3759 175 -1678 1065
1952 1065 706 549 3236 -1159 -2482 3410 5232 -1104 -2925 -425 311 461 492 -1202 -2191 2168 3144
1969 3144 -2148 -3917 602 1021 -373 -38 -3106 -3456 1168 2362 -2907 -3685 1264 629 -996 -791
1985 -791 -2017 -2642 214 702 -3450 -3214 1149 -174 -2157 -389 -193 -1735 13 263 -3479 -1903
2001 -1903 2175 -261 -3173 -95 1034 -943 506 409 -3387 -537 3602 -419 -2967 -593 1604
2016 1604 89 311 231 -2177 267 3505 277 -3353 719 2054 -310 89 1100 -1366 -64 2959
2032 2959 473 -1801 2065 3068 124 262 1958 603 -36 2487 770 -1066 2266 2885 33 645
2048 645 2662 126 -295 1809 770 -820 2470 2523 -499 -565 3120 522 -74 2300 1496 146 1872
2065 1872 1262 -2642 193 3707 1663 -53 1100 1792 300 1695 1690 -1442 479 2848 73 -2068
2081 -2068 1111 1750 -263 1014 770 -695 -21 2523 -868 -3015 -59 867 -2009 -286 629 -1213
2097 -1213 -292 2117 -1509 -2122 338 -369 -3384 -1922 741 -2130 -1840 617 -1961 -2027 422 744 -4443
2114 -4443 -1997 1838 -770 -1609 -1063 -2575 -1533 1442 506 -3382 -1374 1963 -328 -1871 -917 -1884
2130 -1884 -1976 2327 274 -3852 -1906 2136 451 -1005 573 -704 -751 2119 22 -2851 -1659 1138
2146 1138 -423 -960 837 973 -998 1138 294 -1255 632 3036 -539 -2124 1547 1119 327 495
2162 495 1101 114 2376 3182 -256 -2091 1145 2960 1594 1266 1073 48 2124 3742 487 -751
2178 -751 2330 3889 1192 150 1128 276 2287 3986 -244 -968 3664 4526 659 -432 965 148
2194 148 1660 2135 -700 -813 2683 2830 -551 585 2383 1458 1153 1587 -1338 -1146 2641 2251 -651
2211 -651 149 1978 1165 299 995 -911 -1348 2059 1176 -2760 -1592 668 -997 -254 -18 98 -1030
2228 -1030 1431 264 -3440 -1459 1450 -1519 -2900 -324 11 -532 920 -952 -3481 -157 1202
2243 1202 -833 -2855 -1135 -649 -829 -742 -1199 -3308 -981 2240 -718 -2687 -546 -904 -1971 -125
2259 -125 -654 -2755 -1480 1617 -1198 -2569 -824 430 -843 231 211 -1599 -1229 402 -855 -1326
2275 -1326 890 1087 -1007 -214 2247 -294 193 969 -7 -756 1971 1135 -1789 134 2049 310 647
2292 647 2098 -110 -238 2357 1660 -832 -159 1036 159 1112 1671 -124 -26 2260 2883 487 1716
2309 1716 3417 107 14 2386 -8 82 2098 1641 244 2026 2736 -314 383 2078 1655 -175 693
2326 693 844 -1073 1220 1887 -624 -721 1873 1808 -492 -279 -217 -777 1138 890 -1222 -800 1924 -123
2344 -123 -1498 -394 943 -796 -415 683 -1815 -2132 1319 -232 -2148 -1399 633 109 -1034 -884
2360 -884 -2918 -1569 623 -559 -3865 -1506 845 -1505 -1676 -676 -1769 -1534 445 -1068 -2887 -533
2376 -533 321 -2193 -1618 -156 -565 -818 1077 -331 -2758 -57 618 -2606 -2889 399 -613 -493 -375
2393 -375 -819 -2032 603 1853 -1763 -2642 1117 1087 -1081 -723 -1534 -1281 923 2106 -782 -1784 1912
2410 1912 1063 80 60 -510 -2024 1210 2418 -1324 -1405 1825 2187 474 611 1049 -838 1671 2551 -1358
2428 -1358 -389 2161 1982 -624 292 1733 1182 1659 1922 -888 -199 2639 1386 -1183 -80 1974 1323
2445 1323 539 609 -861 430 3255 982 -2028 44 1710 284 1356 505 -1950 -298 2551 953
2461 953 -2036 -66 1653 827 -933 411 -1261 -252 1595 316 -2235 -26 2055 -175 -905 414
2477 414 -184 -373 1036 -98 -2026 75 1949 -1043 -1220 96 239 -1117 432 -229 -2553 -531
2493 -531 448 -1643 -1574 -111 39 -1176 177 -560 -2011 -60 1423 -1411 -2283 181 -300 -1484 -1193
2510 -1193 -160 -1306 -220 798 -2001 -1562 1069 -818 -1949 -940 195 -1115 -71 461 -1439
2525 -1439 -449 1381 -301 -1407 83 702 -658 -202 592 -1000 -246 1432 681 -920 660 1176 -905
2542 -905 152 1093 -520 15 1981 739 -923 1303 1601 80 556 1933 1095 -273 850 907 -498
2559 -498 1198 1746 -751 43 1860 576 539 1417 836 -77 903 1535 -1147 210 2442 860 248 788
2577 788 1530 -61 1266 1577 -611 27 1971 170 -1073 886 1504 420 1031 1615 -653 562 1875
2594 1875 521 -1419 739 1666 -813 -149 -244 -545 -142 1829 773 -2651 672 637 -931 -900 467
2611 467 -1002 4 1155 -1790 -2335 422 1648 -885 -1059 -493 -1169 -770 855 -1588 -2092 681 1116
2628 1116 -1961 -1950 -208 -670 -1043 -159 -1799 -2404 405 168 -2763 -2192 41 -132 -963 -1040 -1051 -1547 523
2647 523 156 -2467 -1574 328 -504 -487 -848 -670 -973 1211 126 -2126 -1051 1690 599 -1192 133
2664 133 -580 -70 394 349 -913 -592 1698 -46 -1121 -399 606 265 239 597 -1434 114 2008 664
2682 664 -1072 766 2248 435 872 546 -457 275 2245 577 -893 504 1889 380 1448 884
2698 884 334 1404 1390 -273 -1012 1860 2410 1162 773 913 -28 551 1237 281 -1327 1264 2190 -1035
2716 -1035 -352 980 37 1081 1381 415 -585 593 929 -1151 -1309 973 -229 -352 -4 -259 -768
2733 -768 1363 677 -1922 -998 -297 -516 -1454 303 -868 -1184 -15 75 -2285 -830 624 -365 -1060 -266
2751 -266 -554 -1484 -503 -288 -2216 -919 775 -1319 -1796 159 -446 -1653 -512 -326 -1935 -1614 -225
2768 -225 -548 -1947 -182 -250 -2165 7 73 -1451 -903 688 -1090 -1740 429 39 -1009 -289 145 -792
2786 -792 -510 439 -891 -845 792 172 -724 257 334 -257 567 941 251 -35 1243 904 -1188 166 1327
2805 1327 225 -409 1489 551 -20 1806 1090 -469 937 2092 1028 -200 718 402 621 1837 1447
2822 1447 -4 865 1467 466 -348 1342 1018 581 1028 495 -818 950 2071 -387 -273 1075 1148
2839 1148 131 -165 227 -136 607 1240 -926 -1143 952 1068 -269 -239 696 41 613 887 -888 -607
2857 -607 1013 804 -1318 -884 32 -112 23 425 -1180 -2027 1175 176 -2132 -1294 190 -481 -688 -166
2875 -166 -1761 -1526 946 424 -2016 -1425 -108 -725 -1432 -476 -781 -605 360 -198 -2498 -1568 517 -427
2893 -427 -1973 -1053 -466 -819 290 -344 -2394 -560 970 -695 -1571 -722 -803 -632 346 -883 -2550 -117
2911 -117 1653 -394 -1190 6 55 180 -120 -843 -1435 123 1608 -413 -1710 1070 835 -95 514 -257
2929 -257 -290 1043 1879 -479 -619 1398 1380 -445 -263 551 -237 1478 1503 -1347 -755 1361 919 -424
2947 -424 -159 176 393 403 1458 -397 -305 1412 1123 -546 171 663 142 391 775 -552 -418 1900 981
2966 981 -461 149 1390 33 -169 780 238 -435 1555 813 -896 89 1662 -259 -479 643 239
2983 239 -378 905 -763 -1704 84 1339 -410 -727 275 -415 -51 83 26 -1751 73 1086 -1022
3000 -1022 -971 -218 -18 -943 -219 -320 -1271 -140 -20 -1027 -1623 593 -317 -1276 -283 60 -687 -217 72
3019 72 -1281 -905 480 -759 -1677 -501 28 -1199 -618 241 -826 -1051 574 -875 -1576 -359 625
3036 625 -731 -833 166 -656 -750 737 37 -1554 224 794 -825 -1121 700 -774 -569 345 107 -1715
3054 -1715 807 1594 -860 -599 418 535 -204 890 73 -1200 535 1111 -924 -175 985 733 -290
3071 -290 627 -384 -411 910 964 -488 -328 1987 1441 -61 558 747 264 1698 787 -1085 -71 1625
3089 1625 904 -88 302 551 538 1249 940 -432 -131 2118 995 -633 264 1133 284 836 639 -381
3107 -381 333 1883 1145 -1089 377 751 -601 -172 28 94 396 1670 255 -1700 986 1495 -225
3124 -225 -381 746 -1106 -377 1222 -483 -919 412 1269 205 -837 196 -693 -294 795 -235 -1382
3141 -1382 128 493 -1047 -1362 -270 -56 148 793 -1027 -911 481 79 -1911 -1416 291 345 -620 -960
3159 -960 -790 -1581 136 76 -1414 -1286 586 42 -964 -801 -519 -1150 8 60 -1263 -896 875 711
3177 711 -1263 -554 211 -500 822 756 -697 -353 909 98 -247 -168 697 80 437 395 -1112 164 1523
3196 1523 36 -774 919 1061 250 803 686 58 717 1986 90 -394 90 1603 349 750 731 614
3214 614 652 938 665 -535 792 1419 -641 -140 1219 535 426 1310 509 -365 822 602 -288 -137 789
3233 789 898 -31 586 -479 102 814 1209 -610 -251 812 -115 -466 496 19 -875 123 279 -1014 -206
3252 -206 556 -273 -233 253 -385 -821 64 -135 -1017 -665 843 -353 -1392 61 -23 -1235 -551 -307 -625
3271 -625 -619 -202 -95 -1178 278 395 -1018 -1295 -215 -668 -1115 42 -1425 -1077 274 422 -849 -1186
3289 -1186 639 77 -452 5 -853 -1016 39 -61 -1106 -875 228 -137 -189 299 -329 -62 303 264 -1122
3308 -1122 -598 777 229 -223 -225 100 101 1020 113 -1114 23 1445 173 -803 -262 572 -26 1273 252
3327 252 -558 973 1558 1009 57 588 1175 554 581 517 -647 738 1542 634 -791 1467 1180 312 677
3346 677 386 -123 687 1571 -87 -402 1120 689 172 -564 107 -1 695 1081 -292 -938 437 1137 57
3365 57 -304 230 -206 265 785 -718 -522 728 562 -578 -518 624 335 -163 388 -634 -26 773 327
3384 327 -1007 -443 462 -435 -629 339 -1118 -467 775 254 -743 -521 225 -419 -756 -519 -585 -306 527
3403 527 374 -1368 -380 670 -429 -600 -672 -729 -542 229 -607 -1069 -392 230 -599 -316 -721 -487 -191 177
3423 177 242 -1233 -300 835 -534 -1271 212 -130 -412 -59 -79 -1253 -528 442 -810 -554 241 -98 -1160
3442 -1160 -481 198 -378 153 405 -708 -908 706 869 -475 89 514 -106 355 586 -178 -141 1008 395
3461 395 -268 161 610 -58 -258 762 22 -100 945 252 -254 850 862 456 -17 670 -62 8 291 237
3481 237 -460 452 1014 -48 204 564 405 38 547 299 -567 820 1469 -312 -573 546 851 -190
3499 -190 814 471 -323 660 719 -367 308 820 794 -693 -331 749 -328 432 298 -466 -275 394 204
3518 204 -823 -619 82 -197 132 108 -1178 -441 403 -97 -1104 -416 451 -240 147 -72 -749 -483 246
3537 246 -349 -422 -126 410 -715 -365 -399 -952 -445 636 -86 -1137 -84 542 -168 -750 -176 -299 55
3556 55 168 -622 -1215 560 556 -366 -368 173 -522 -232 268 7 -723 472 827 -580 -430 73 91 -176 168
3577 168 -254 -532 608 630 -465 -938 682 116 -405 272 -140 -15 860 856 -453 -341 768 551 -91
3596 -91 196 146 522 959 395 -174 7 1680 1036 -1 113 516 406 768 612 -21 244 1295 619 -297
3616 -297 382 1060 487 595 622 68 -69 833 159 -151 500 1170 413 -222 -139 -231 280 766 310 -456 765
3637 765 331 105 -182 275 -11 -516 438 139 -978 11 578 -228 -471 257 -172 -177 37 -406 -825 247
3657 247 531 -596 -934 230 -230 -432 17 -729 -936 20 88 -719 -400 46 -641 -842 -367 -180 -508 -233
3677 -233 288 -637 -1030 -262 -9 -1083 -104 149 -484 -70 334 -729 -308 73 -40 -509 9 -63 -561 -129
3697 -129 -106 -379 -549 802 70 -821 142 410 -353 42 339 -527 -170 165 309 -281 531 757 2 23
3717 23 1304 329 164 689 127 144 430 264 -199 195 926 108 269 878 360 53 458 431 -186 169 716
3738 716 363 14 740 244 444 1011 521 -407 177 947 140 -90 381 222 326 653 175 -2 260 736
3758 736 -17 -135 298 269 -72 88 129 -201 -192 790 -62 -732 134 130 -339 98 162 -526 215 629 -445 -471
3780 -471 119 644 -385 -313 -88 -227 -264 13 -386 -764 310 56 -466 -657 -152 -406 -203 -24 -173 -692
3800 -692 187 -113 -709 -524 -54 -378 -331 -129 -808 -456 251 80 -1169 -700 127 -237 -561 -55 -514 -470
3820 -470 176 47 -973 -629 240 -150 -426 -31 -472 -265 437 80 -771 -77 583 411 -395 -122 215 -443
3840 -443 477 283 -622 -4 808 -237 -350 763 538 151 228 316 -141 172 853 -138 -495 455 621 74
3860 74 291 226 158 155 876 236 -297 197 574 68 521 582 -189 255 738 -109 -440 651 580 -75 -18 308
3882 308 -208 233 511 -115 -230 337 181 -283 -131 523 212 -215 518 -1 -255 596 144 -382 -25 -24 -2
3903 -2 -86 179 -162 -247 164 189 -555 -121 487 10 47 186 -260 -179 151 -102 -591 -217 658 -815 -387 -9
3925 -9 -237 -956 194 -50 -533 -57 326 -222 -853 22 -255 -329 -313 -219 -660 -526 88 -454 -626 216 -4
3946 -4 -343 291 -3 -661 -348 120 -184 -49 394 -267 -505 120 521 -243 -134 241 -31 -206 305 80 -445
3967 -445 -95 -74 160 11 277 -196 -268 283 89 -382 304 503 369 -200 246 292 -241 633 171 -505 400
3988 400 469 30 29 642 436 181 407 160 -162 480 411 -256 205 852 740 58 389 -53 -16 81 428 -79
4010 -79 -80 1078 405 73 202 277 187 212 285 -210 -219 145 353 -208 -35 188 145 0 246 -459 -435 735 169
4033 169 -103 -64 241 43 -62 90 -326 -323 197 -52 -430 -95 175 45 -420 146 -531 -122 253 231 -427
4054 -427 -111 147 -252 -187 -366 -673 -96 534 -138 -683 -303 216 -284 -252 -337 -361 -196 -159 -219 -534 16 179
4076 179 -419 -434 133 204 -389 185 -102 -449 104 344 -238 66 410 56 99 219 154 59 422 136 -248 -388
4098 -388 387 147 -388 242 -57 -102 425 813 414 -161 379 97 33 227 325 -433 458 269 -266 -260 77 277
4120 277 -23 430 937 96 460 399 59 -43 622 703 -195 434 667 118 -26 503 60 267 725 -31 -416
4141 -416 421 255 -370 280 649 -67 352 268 505 -771 277 231 -86 -15 322 -118 -695 143 -16 -399
4161 -399 179 174 -579 -668 49 -49 -297 201 -127 -1203 -148 -277 152 10 313 -923 -1409 -769 132 -219
4181 -219 -434 -38 493 285 50 221 -1183 600 -509 83 -210 -50 191 -346 -151 322 -419 -311 633
4200 633 -240 40 91 -313 216 810 112 -193 157 -191 -244 -275 -829 -231 -345 72 550 547 72 -404 -783 409
4222 409 -411 -557 -602 393 890 29 569 150 129 237 445 262 -168 398 95 94 -501 178 -240 -294 710
4243 710 104 1190 927 47 174 979 763 -130 329 1486 620 -469 109 1201 1242 689 246 93 117
4262 117 86 -105 -102 53 -943 -383 -62 -189 -463 212 903 -817 240 212 -28 244 126 324 -613 -341 609
4283 609 80 -719 683 55 -562 57 -69 -104 450 514 -359 -236 -599 30 -400 -1242 -490 -261 -208 157 -330
4304 -330 -568 -357 230 -1011 -93 322 74 296 -12 187 -1156 -59 728 -398 -281 -1217 -146 -291
4322 -291 715 -162 -1298 -556 335 -756 -203 -93 94 -105 357 -361 -177 -5 -489 284 -536 228 96
4341 96 81 475 -160 -381 -103 207 -349 249 139 296 418 359 3 865 244 155 -264 -213 222 -505 -419 -29
4363 -29 135 -141 159 494 -433 643 828 471 -348 111 741 487 -309 915 213 -304 493 54 118 -404
4383 -404 378 -508 175 441 163 -52 1081 399 4 147 277 -270 182 457 204 311 -228 252 326 -203
4403 -203 472 -574 -686 151 195 -288 -593 -89 -721 22 201 224 485 -27 -600 -185 515 -68 -859 205
4423 205 -110 563 210 -284 -1064 -444 253 191 -468 60 672 91 -275 472 -419 -182 262 -740 -769 -5
4443 -5 -133 -531 -193 -277 -130 127 -110 -496 370 -461 413 -532 14 -36 -20 -827 173 -79 -192 189 231 411
4465 411 83 -71 -468 -788 109 37 502 99 553 -448 199 413 -151 -75 -38 -235 -523 288 -90 136 -247
4486 -247 296 -213 -31 223 -46 198 279 304 -318 -33 597 -388 227 -334 -199 -601 69 -163 -229 -226 397 -29
4508 -29 -292 -126 441 -520 612 274 -599 -312 -258 -140 -266 -116 344 207 677 -77 14 -237 262 12 -515
4529 -515 193 -266 -289 -771 248 189 -827 11 -4 -478 290 626 -222 -431 -238 -694 24 182 96 -396 450
4550 450 -66 83 174 -106 141 -381 -209 -174 -313 -270 -293 -266 -485 -568 -563 -1079 -52 -962 -514 -563 -117 -179 1
4573 1 365 -404 -384 -251 -502 -1120 -209 -489 181 313 -173 341 52 368 -321 -207 -102 417 -416 -1413 -397
4594 -397 -192 222 137 378 -771 -274 589 -396 -368 -722 59 -269 -137 -523 -86 -420 -147 -1 155 520
4614 520 96 425 -435 342 -628 22 159 -279 157 363 -706 -151 -69 406 110 704 388 -258 182 676
4634 676 -528 53 910 462 -637 29 492 -257 50 873 865 -171 241 221 122 277 241 370 456 -261 151
4655 151 -246 -319 157 227 259 273 -231 -548 177 -167 -415 275 -278 -6 -429 -80 -104 244 79 -316 195 355
4677 355 43 -75 -457 4 212 -633 173 -425 175 -524 441 -123 -432 -666 -378 -53 725 -338 -651 319
4697 319 -902 -90 -80 -325 331 -1096 253 246 -475 700 -932 -304 -169 139 340 238 659 -71 514
4716 514 -28 245 -1798 341 531 -437 -253 389 -194 893 -542 361 -113 -239 780 131 374 -439
4734 -439 730 29 -536 304 964 470 669 668 -708 -225 -103 774 148 -279 1107 -410 215 -115 -406
4753 -406 -78 301 144 -431 719 387 -70 647 -222 -803 745 1250 -173 599 -301 235 -39 478 302
4772 302 315 566 -46 -710 -605 197 631 51 -487 116 -163 75 164 475 -620 1054 -23 511 -400 -486
4792 -486 -291 -111 743 -217 -1035 493 183 -667 498 -583 217 314 -732 -1216 297 -76 819 505 259
4811 259 815 -13 -706 -373 -441 383 482 -575 -1008 -403 -74 -542 629 -6 -680 579 -389 -283 286 -261
4831 -261 460 -764 -365 111 -466 46 39 -174 -287 73 1026 -138 -272 553 -255 -900 -674 -1189 70 209
4851 209 512 -121 629 -1299 147 665 -568 276 -393 -1221 145 -504 183 280 -258 -169 -259 -957 -1067 723
4871 723 381 108 -227 323 -824 702 95 366 651 142 -310 -1194 323 787 -473 -674 401 716
4889 716 554 -704 745 557 1003 59 120 -287 878 1128 -334 -341 794 202 563 549 244 -818 -139
4908 -139 -241 138 1057 -54 -312 -359 61 272 -176 -549 -58 -176 635 -589 -70 -450 692 -235 -287 -320
4928 -320 -461 -525 -308 307 -645 -557 43 76 347 -143 -169 -611 590 131 -118 -1002 219 -1035 465 585
4948 585 299 -261 339 130 -88 -383 -387 -607 422 -324 8 -272 -570 405 3 -661 -475 918 -362 -73
4968 -73 -1017 -145 -633 -882 -740 353 -598 225 -673 -297 31 -267 1127 -258 288 -88 -618 -381 -457 -526
4988 -526 523 30 -19 -379 -524 129 846 71 184 -423 412 -278 -517 324 226 79 1021 1033 340 1023 662
5009 662 -164 -395 -829 159 64 731 1000 -518 177 752 266 -76 123 -98 -566 8 314 -894 -57 245
5029 245 -98 272 -600 -352 -44 -507 -164 415 177 672 7 -100 1475 280 -945 313 -338 -503 302
5048 302 -708 -107 -515 -501 -197 -385 -8 411 470 531 29 82 157 -266 -236 -681 -528 1261 -458 -32 -394
5069 -394 -487 -889 126 -270 -932 -464 -575 -963 131 712 -958 -391 238 -985 -297 574 -276 -347 728
5088 728 153 -252 346 363 -397 -338 -588 244 -276 -334 530 226 -139 375 538 -97 108 -432 340 -65 137
5109 137 -1001 -199 -335 -653 -313 -338 -197 -458 -689 689 188 -962 -764 -202 -127 -392 -348 -1034 -1192 -97
5129 -97 -184 -188 253 333 -215 153 440 -63 319 -430 497 -405 -479 441 221 250 856 465 -633 497 70 160
5151 160 -420 -256 -718 209 237 -230 163 481 100 737 745 419 -462 661 -469 -397 -28 -290 17 751 673
5172 673 -527 237 252 -64 470 527 -498 147 466 800 677 -580 -696 414 -489 -156 -20 -458 21
5191 21 180 778 -271 517 -310 -357 -87 -15 -507 122 -580 606 -1184 -340 77 -734 -39 -594 -873 273
5211 273 -547 -503 113 -478 200 -654 366 64 -159 103 -34 -189 505 -486 -261 1114 -43 429 632
5230 632 294 555 653 -196 -734 -284 -1096 -451 736 -291 -126 265 -341 -65 -508 -294 -307 -717 -544 513
5250 513 17 -1494 329 -233 129 641 150 -661 -319 455 -1035 442 232 -240 255 853 37 323 43
5269 43 413 -437 393 -535 755 130 -233 -156 -1018 460 -270 -756 -674 800 1072 645 282 1097 -382 698
5289 698 -741 373 -161 110 -128 -321 -15 301 -432 -5 -347 -203 -67 -345 -348 -359 -76 -18 -1267 811
5309 811 1065 -384 808 362 -828 253 192 390 34 -41 -205 615 -513 -285 408 -148 129 306 -1021
5328 -1021 139 -99 -1170 302 -630 -565 -811 -447 -695 -48 294 217 25 194 191 981 -142 -191 -130 -378
5348 -378 615 -153 -54 -280 485 -426 -292 264 215 -307 67 -155 -156 -939 -358 -812 -88 470 724 436 3
5369 3 -320 12 -315 252 -1050 -914 -612 236 -253 156 969 -375 87 -546 -45 648 51 -211 40 -837
5389 -837 -410 -534 -245 -14 4 949 627 31 -463 446 -806 -746 519 -73 -506 -178 17 -37 300 87
5409 87 -151 43 459 -207 126 225 -552 -79 -2 -480 23 874 -507 -246 -208 -602 -117 485 -357 725 -454
5430 -454 419 467 385 -28 327 368 -93 -147 -30 320 124 127 970 345 -9 -251 9 172 -324 -68 -663 195
5452 195 725 -160 -494 188 51 88 -32 -1059 -809 -290 391 371 5 -34 535 -296 -270 263 -435 -636 -214
5473 -214 -20 -796 420 981 -203 -518 -457 192 -2 -312 40 -351 60 50 -395 -1084 -761 684 -273 -214
5493 -214 806 -405 209 -150 -140 475 -253 695 -301 -62 -360 249 539 -35 -99 -132 580 -5 -501 214
5513 214 229 -705 31 -414 -244 290 105 157 34 -35 400 -640 135 204 -368 -66 26 -232 -271 390 375 -92
5535 -92 265 601 -99 -270 -236 -642 111 -156 -78 94 269 -476 -90 334 -433 307 -223 187 -216 -225 -5 162
5557 162 -108 404 158 -81 -158 261 -497 192 -538 181 -133 459 -201 -177 -138 -464 373 -487 -22 346 111
5578 111 163 -225 -203 -892 -39 -93 -257 287 -2 128 125 -463 18 -163 -335 102 -122 226 420 9 -472 257
5600 257 -42 -528 257 105 32 -221 -439 82 -153 101 -372 -90 -328 -226 -412 -706 176 366 -137 193
5620 193 642 129 -513 30 -381 -661 -128 481 80 -84 -299 369 -54 49 13 187 284 -430 -132 490 455
5641 455 -160 17 308 290 -180 73 207 -17 97 33 -518 -176 717 21 -276 -117 -170 591 56 69 -149
5662 -149 -212 810 103 -136 116 -111 -113 -421 266 118 165 219 134 -250 -358 -5 -335 202 437 352 -440 294
5684 294 -597 -107 225 378 -149 14 -250 -403 -268 -470 -153 -719 -174 -240 -165 -536 48 123 -294 511 -242
5705 -242 -358 -141 -388 -174 -239 -119 384 -103 -67 -26 -740 -372 0 -208 -333 -629 -291 85 -145 6 -47
5726 -47 -315 -81 -134 -487 98 -689 -380 107 209 -63 -49 81 456 -252 -183 -371 145 -4 -330 274 -184
5747 -184 -148 -268 -323 249 -90 -344 -138 385 -207 -339 -121 -77 463 669 -66 -194 391 -492 -6 1 46 -166
5769 -166 397 -34 -109 23 415 223 -97 172 585 -216 218 288 486 213 413 50 -72 455 156 -221 474
5790 474 -284 -352 203 -48 169 -19 -47 -135 -236 226 256 -500 37 -442 245 -422 -136 148 -168 -214 -162 74
5812 74 -357 0 94 177 156 384 -90 250 556 189 24 -13 414 -36 26 628 444 -44 -1 -415 -173 -58
5834 -58 -132 -75 47 326 -40 212 196 -101 -80 7 -213 9 -106 -143 -153 -90 101 -101 16 283 38 -60 391
5857 391 119 -833 -644 335 197 -125 -10 60 220 93 31 -228 -243 -96 142 -441 39 45 -148 -60 -384 -58
5879 -58 30 -331 17 -193 -345 350 -479 -135 -182 93 22 31 -414 -1 232 227 -192 124 -9 -16 31 304 -103 -278
5903 -278 355 -450 126 286 44 -242 -13 -68 -164 -195 -15 3 166 -287 -194 274 254 674 -5 375 -114 -136
5925 -136 521 67 -407 -61 145 -76 35 175 -24 416 151 71 680 -302 -274 9 228 4 54 453 91
5946 91 -326 -90 62 -178 66 101 84 35 88 -96 -195 19 -82 -204 124 283 255 174 -193 -133 229 2 -281
5969 -281 118 38 -67 168 -96 -295 -149 -247 171 161 -385 -106 257 -9 100 77 194 -252 37 74 -85 -168
5991 -168 -415 165 -78 215 -65 -231 51 -88 -327 331 -208 -240 -218 248 84 136 199 19 130 130 120 43 286
6014 286 183 469 -530 -231 -333 60 100 99 -15 -363 -4 504 54 22 356 -272 456 -68 -157 84 65 1
6036 1 -11 259 188 -189 -190 307 123 -220 13 235 -167 163 114 121 100 32 -143 -324 -188 -98 -287 -409 221 -28
6060 -28 -31 155 98 -192 274 213 -99 -262 -63 336 -6 63 -81 -12 132 136 -41 -196 -81 98 -61 166 290
6083 290 -179 101 -144 -171 -41 -57 18 -261 214 -104 19 178 141 184 -135 -24 -65 -166 -45 -74 -174 -29
6105 -29 -67 -268 -63 66 38 -3 1 -56 -270 -320 -28 -315 -82 -68 -158 -97 292 -220 -504 -136 -145 -105 -119 -1 -93
6130 -93 116 -153 87 -116 -199 9 97 16 -82 -121 -132 -156 -97 -161 205 271 11 53 117 170 -349 -85 -30 -114 -97 140
6156 140 -112 -209 170 27 -150 -35 14 117 -147 328 95 289 -14 -64 7 53 -6 95 40 138 -42 -110 108
6179 108 56 345 -438 66 -244 -14 82 -92 -13 253 110 -158 219 262 -113 -9 28 -2 210 48 -35 30 187
6202 187 247 56 -81 172 -241 197 -73 25 82 8 -427 -308 34 -244 -112 -30 122 -264 -324 -143 47 -10
6224 -10 -398 -25 -109 -33 44 -143 45 144 -49 -316 -253 -56 -140 -91 -301 142 -270 130 -94 -33 -300 -13 72
6247 72 -90 -357 -37 219 -167 281 -345 120 78 -11 -119 -247 112 -168 200 -127 -34 -18 118 -117 210 -133
6269 -133 -51 -216 175 188 -147 -71 -146 124 -438 -142 172 234 -460 83 -196 -28 296 25 -274 71 287 -26
6291 -26 69 208 -14 -181 151 38 -191 189 222 -285 95 -181 25 -7 477 62 -220 35 55 -19 171 -53
6313 -53 61 302 121 121 243 88 57 -33 80 59 11 -144 330 90 168 124 -84 18 6 -71 187 166 169 -247 -274
6338 -274 127 -148 -36 136 265 38 -130 105 -91 -56 1 231 -198 208 -148 -132 -167 -169 80 31 -40 325 21
6361 21 78 -40 197 98 99 -139 -201 -149 116 -122 -193 -43 -103 -49 204 -250 -96 -187 127 -90 -38 43 112 -215 -284
6386 -284 6 -304 35 143 -170 -148 -98 297 59 80 43 -145 -84 430 -69 -1 -19 275 -185 17 -44 -14 26
6409 26 49 -26 165 175 -247 225 -26 118 164 42 -18 -253 -99 341 37 242 -13 -7 -142 -18 418 -57 -245
6432 -245 100 77 -229 -20 92 81 146 104 -233 25 183 154 -249 179 -62 12 -9 37 -142 -108 244 325 -130
6455 -130 -51 -184 -262 -43 116 -4 73 61 -17 174 -115 -21 -195 -24 110 -124 -49 -75 -186 -179 -99 -30 118 104
6479 104 28 -4 -159 94 -44 -137 -18 131 137 -60 -197 138 150 457 63 -154 -27 136 49 -123 88 27 161
6502 161 172 218 -308 -98 187 44 393 -174 -53 -174 -30 190 85 330 -13 -115 -221 286 235 -271 -332
6523 -332 -137 73 -268 15 -111 -76 -138 -182 -119 -12 77 124 4 -25 -115 -180 239 -322 -309 -162 9 -55 104 -26
6547 -26 -213 -129 180 254 136 -141 120 7 178 171 -210 66 52 300 -204 172 28 13 126 149 -24 -56 52
6570 52 -21 149 79 -152 150 371 319 -341 -103 64 338 60 315 -9 -82 -64 -119 -180 65 -360 -15 26 269
6593 269 -291 74 37 50 476 146 113 -56 408 -201 -35 -42 -129 13 13 20 -211 52 -192 -155 -164 165 -120 -109 -223
6618 -223 -482 -182 -28 -281 -266 -206 -65 -17 -43 -295 -150 59 -41 -146 83 -8 -32 208 97 -200 -27 -52
6640 -52 -238 -92 -336 182 168 -61 196 90 -128 -121 1 -125 168 5 -186 -313 306 -2 -232 121 -330
6661 -330 38 -63 82 181 -228 -232 17 197 -57 -147 187 93 303 -141 -44 156 -233 94 2 51 -91 -7 99
6684 99 224 190 157 498 -202 63 130 -47 -4 143 213 125 120 -163 -188 -146 312 -229 370 7 9 -181 154 284
6708 284 82 138 42 19 220 133 241 10 312 -245 160 60 -154 108 26 157 -135 -46 -135 75 -95 21
6730 21 86 59 -2 243 26 -43 -93 9 397 54 -172 -90 -178 124 -304 -169 -243 -134 4 -117 -352 -69 11
6753 11 -153 -113 -21 22 184 -244 -226 -231 -222 35 -41 240 -58 -282 -123 120 -115 143 144 -137 22 -34 162 -50
6777 -50 -144 -128 -121 -110 -143 27 81 -82 7 13 194 -298 142 -164 -410 -15 26 -46 114 224 200 -59 -146 -431 -19
6802 -19 -301 -55 62 138 -134 140 10 4 141 15 48 -190 -53 -18 116 -4 41 30 -142 136 63 213 -83
6825 -83 -157 311 109 -30 -208 -81 -167 -53 -102 -62 -60 4 322 82 6 522 -72 -157 -75 -119 -253 -145 174 -47
6849 -47 158 221 -171 -186 342 368 -173 90 271 -142 -122 48 24 133 -377 -51 -204 89 283 -49 -140 83
6871 83 -5 71 111 154 -51 -147 10 -233 57 18 51 18 -134 156 140 -145 -109 308 -83 111 125 -388 116 96
6895 96 307 -187 -127 -14 -34 -141 -188 -150 39 100 -38 124 82 52 -107 136 -291 -39 23 141 -120 -60 152
6918 152 -183 -139 200 -89 139 -73 -30 -37 -123 -106 148 455 -38 61 0 123 32 71 -58 -66 222 -225 111 -147
6942 -147 -47 -162 15 -159 -40 230 -10 75 200 132 -49 292 -160 99 29 225 33 60 -119 -179 212 -223
6964 -223 307 204 79 -92 -28 -113 214 -180 -159 -121 265 31 -38 182 -109 -95 -5 -73 -161 57 -175 77 -410
6987 -410 53 79 72 141 -27 170 49 212 -140 108 78 -139 -1 235 -53 -2 83 -51 15 -315 -191 -26 -149
7010 -149 -101 249 120 -47 171 -166 117 34 129 -10 -153 498 142 170 -262 167 -228 -82 53 -182 -509
7031 -509 -107 -142 -100 -404 25 -156 -321 207 427 -98 107 -230 -277 -228 241 -31 -119 129 4 47 53 309 -199
7054 -199 126 -205 318 134 32 38 -88 76 41 116 67 128 224 -21 -69 -88 -292 -53 126 -52 -88 -95 72 147
7078 147 85 -69 107 45 181 151 147 -282 -3 97 72 -19 -333 232 24 37 10 30 14 -104 40 322 37 -45
7102 -45 -140 126 403 58 -279 -23 114 -23 -176 175 -203 -241 145 -188 -124 -176 39 48 90 75 -100 96 -114
7125 -114 289 -269 -82 -50 78 -55 -70 297 -128 230 -4 -240 -198 91 75 -134 -11 176 -251 -17 129
7146 129 51 -194 -83 -305 -64 -148 -93 19 -234 14 -113 -369 -1 -252 102 172 -13 -37 6 87 -371 -186
7168 -186 -91 -123 20 -107 -65 43 -197 -169 -12 -239 65 -242 -117 122 154 -155 -11 -38 -69 -49 71 -131 -162
7191 -162 81 -263 -19 1 138 -111 -53 -218 -221 86 -94 -1 -72 -40 160 -60 -161 6 96 -239 -84 118 245
7214 245 166 194 190 -120 375 -171 -21 -71 -198 -142 22 148 -17 78 -297 15 -112 -68 352 -28 -71 26 -114
7237 -114 -152 395 35 -352 -146 -154 231 11 30 -29 -179 -358 123 -215 99 -219 108 -95 145 23 121 -54
7259 -54 -40 143 -362 36 88 164 149 113 -257 155 98 -286 -370 -22 -47 24 -137 -43 -47 403 -13 -135 7 71 -10
7284 -10 -229 149 150 58 111 -44 -70 -101 1 139 -152 213 -93 -92 188 -69 -38 44 -23 11 107 -18 95 -169 19
7309 19 303 -204 -151 213 -79 4 75 -109 -34 102 100 -330 377 488 199 164 87 -60 -261 185 82 20 40 70
7333 70 43 30 247 -163 -38 -193 -152 219 -239 178 202 56 184 379 125 166 -142 450 166 170 -305 71 -158
7356 -158 358 254 -78 40 -139 70 67 38 -244 -48 326 -220 350 220 58 201 -75 -136 -52 254 153 -198
7378 -198 102 -31 177 190 -176 -109 -87 -140 151 -168 -38 192 89 40 -87 10 -175 -27 -32 -44 -105 95 -70
7401 -70 13 -110 -10 39 -130 -148 -26 73 129 102 -133 12 334 -152 -198 254 -20 -327 90 111 -96 -136 228
7424 228 120 -18 -75 -28 320 -393 -122 49 -86 66 -109 -128 -150 84 -72 75 -64 -115 -12 -35 -129 104
7446 104 171 -38 -203 -298 205 -76 -310 10 -14 25 -49 113 -286 130 51 -294 -360 310 258 -32 32 -33 -8 138
7470 138 187 -288 -77 50 16 -33 -35 26 57 27 14 139 313 258 280 -30 -341 -100 7 175 6 198 -117 61
7494 61 -140 150 87 -137 106 169 70 29 66 -34 -85 -54 -121 46 53 74 46 -275 -145 152 4 -98 64 -152
7518 -152 -230 33 38 -9 198 -24 -20 -421 -16 -127 -288 42 199 -324 14 -95 -145 -145 -189 19 -114 -56 158 -11
7542 -11 -173 61 -209 77 354 34 110 -91 -184 -167 -238 -63 -148 -149 123 -218 -160 -109 -149 50 -75 97 159 -49
7566 -49 -144 -89 50 352 -145 81 178 -150 200 19 293 -126 -211 255 132 -76 -168 229 163 -345 73 -231
7588 -231 -283 191 -12 39 120 -64 200 192 206 138 -44 -5 159 -63 213 45 29 -48 145 268 89 -186 -13
7611 -13 -258 103 239 212 -106 -1 -258 -68 27 100 -41 -194 336 54 24 -76 -158 -82 -173 -25 201 -16 337
7634 337 -188 -58 -14 -121 -111 -7 -10 -5 135 134 286 166 210 179 -10 302 175 249 -62 91 -163 51 108 -280
7658 -280 31 283 242 -276 -177 130 -164 -119 -140 -1 160 170 -139 -197 -207 326 -21 -134 -104 -1 67 -123 -321
7681 -321 -21 11 53 -76 24 -179 -84 -81 6 146 161 -98 61 172 25 260 212 -79 -178 -71 43 -86 -60
7704 -60 75 -163 77 3 85 16 69 -188 55 37 180 51 -249 15 -240 -131 175 -145 -102 -30 -26 -258 354
7727 354 390 -201 -90 33 23 128 343 -23 69 -141 129 -17 273 101 163 -144 183 -151 8 93 -117 231
7749 231 -107 187 -16 230 -35 366 -144 2 36 37 -1 279 -277 -13 -53 88 163 -22 202 -30 -18 302
7771 302 92 -2 328 -94 45 -250 98 -155 39 153 -56 -71 -134 73 21 -106 51 -8 238 118 73 30
7793 30 -187 134 52 80 276 -112 -363 101 -50 -91 85 45 82 -233 -67 -164 -130 166 183 -3 -310 223 89
7816 89 36 128 -55 -163 73 97 70 140 393 36 -74 309 -194 153 -132 23 -211 339 250 -38 -147 -275
7838 -275 14 -175 -119 137 -135 -107 306 -283 -111 19 -114 56 -134 391 67 -171 -59 44 -87 162 231
7859 231 -279 -21 1 -64 -75 105 -335 -274 73 -187 -62 189 -75 -296 245 356 -1 -48 53 133 14 -188
7881 -188 70 258 45 -4 39 293 -122 48 10 -187 29 -57 -1 161 -76 -213 228 -210 -57 392 53 277
7903 277 40 69 32 -26 120 -145 -54 160 238 -30 134 -108 -116 -42 -85 -167 -358 158 41 132 -306 -37 -144 -308
7927 -308 233 -132 -289 -297 102 -9 -9 250 176 71 344 234 -296 11 86 146 -47 1 80 -280 85 -172 -87
7950 -87 168 -132 -150 -110 222 215 -258 89 389 -386 -186 -86 24 28 -270 -129 -346 2 -42 82 247 19 52
7973 52 -348 162 137 19 -200 -131 -145 -40 -133 52 -303 -41 262 128 44 222 119 -104 37 303 316 -10
7995 -10 248 12 167 201 -41 -223 220 -74 150 150 -101 248 290 -99 181 -83 248 -259 213 342 -13 104
8017 104 -2 -27 -216 -60 143 -138 191 396 -50 -231 61 301 -52 -252 -232 199 88 202 -29 -35 -93 127
8039 127 -75 75 300 -62 -168 -226 50 -204 2 49 -66 22 38 -142 -257 184 12 -232 58 -77 32
8060 32 -73 -164 -219 -8 5 215 -196 -108 127 191 -137 -20 39 25 -89 1 -84 -358 93 -108 -30 -106 -95 -16 70
8085 70 -135 127 12 56 117 -42 -207 149 -191 -179 34 -240 -236 -89 -154 107 -118 -54 -189 -103 175 84 -172
8108 -172 -61 246 -104 169 -94 82 -17 84 35 138 -18 -83 -61 44 280 -115 27 151 160 23 81 -3 45
8131 45 -125 167 -210 77 207 -76 119 137 -54 66 -279 -2 -256 103 150 -189 148 121 -113 54 130 61
8153 61 -385 5 164 126 194 216 119 -147 -213 107 242 -64 128 -208 -230 115 94 50 -138 140 -219 -206 -88
8176 -88 -94 -20 223 20 -17 176 57 -23 -151 -70 -372 -133 88 -2 -610
8191f10
$$ Imaginary data points
##PAGE= N=2
##DATA TABLE= (X++(I..I)), XYDATA
0 0 0 0 0 0 0 0 0 0 2 -8 8 -8 8 -11 16 -16 23 -24 31 -33 40 -47 55 -63 72 -84 96 -107 122 -139 156 -176
32 -176 196 -220 246 -274 305 -338 376 -416 461 -510 566 -626 694 -769 857 -954 1066 -1195
50 -1195 1350 -1534 1763 -2050 2426 -2943 3701 -4927 7244 -13209 62892 110692 5560 962
64 962 35872 54563 35750 31408 15921 34415 54590 39682 8330 19304 39770 36631 35924
77 35924 30825 5747 14787 37674 20589 -11847 13159 41145 24731 12731 15111 8755 13451
90 13451 30245 11532 -16281 9595 29916 6795 -8190 7197 16010 15707 19753 -2754 -14417
103 -14417 20598 35781 -2315 -28686 -6015 12736 16626 12572 -8649 -11595 16640 22435 -12470
116 -12470 -16460 10649 1986 -9801 374 -4381 -21249 -2880 19253 -5434 -17571 3025 8376
129 8376 -8655 -18617 -19730 -10951 14508 7918 -30338 -25625 8960 7500 -12896 -1917 5904 -7062
143 -7062 -2829 -4561 -19456 -9895 18458 9267 -13557 3093 13911 1396 2003 10091 2962 4653
157 4653 20381 7620 -6214 11324 18392 5733 10270 27103 17416 12987 22839 10696 1600
170 1600 19684 28016 7361 5413 19044 16019 22968 31577 9524 -8148 19885 40748 12556
183 12556 -374 13327 14678 8514 11438 10322 8301 23994 21696 1091 7816 20361 5768
196 5768 -4989 13122 15347 2261 11547 13580 -1303 4275 23829 13012 -3608 10273 14301
209 14301 3922 4832 2540 -6017 7789 29390 7850 -13854 2973 18452 14707 7861 -1874
222 -1874 -14711 2915 24814 1162 -19673 -191 18710 7017 -553 -954 -7311 3620 11031
235 11031 -9686 -19631 4327 10672 -15464 -15166 2428 1501 -421 1322 -10322 -18842 -352 2176
249 2176 -17274 -16212 -5070 -4445 -3107 1320 -14246 -18201 9473 9059 -21026 -23916 1776 5315
263 5315 -7728 -12112 -18407 -8421 15230 9736 -18650 -16196 10203 5703 -9413 -10760 -11586 -4860
277 -4860 9858 4416 -18995 -6771 18237 6793 -10974 -6945 1078 972 7109 -1317 -21545 -6662
291 -6662 18241 7938 -10717 -4975 5557 5749 11468 -1265 -19652 -5203 18743 5498 -17439
304 -17439 -2942 12896 8713 4959 -1802 -6066 7967 18476 -4470 -17553 6699 15541 1553
317 1553 -1118 5326 1719 7593 18710 3315 -6784 9478 14263 -1576 -5283 3894 3895 13098 18478
332 18478 -1229 -7894 14275 22313 -630 -7063 3695 6661 11692 10094 -7413 -12503 14587
345 14587 23686 -218 -4596 6973 7551 3290 1963 -7675 -8735 12229 11381 -8476 -5002 9985
359 9985 4239 -4370 2784 -992 -6894 3862 2441 -12184 -8427 5882 -661 -7256 1342 -1777
373 -1777 -4374 3983 -612 -17031 -9317 8043 -4507 -16758 -6363 1299 -3057 -1860 -4761 -14328
387 -14328 -3214 7524 -8197 -17812 -5694 -1640 -11562 -5543 -831 -9978 -4884 3788 -6500 -14178
401 -14178 -467 1294 -11354 -6370 -1644 -9862 -7963 2434 -2950 -7793 5664 3454 -9456 -4761
415 -4761 918 -5602 -4658 5661 -3002 -7959 6107 5079 -8792 -3284 11123 5016 -918 2185
429 2185 -3739 -3493 6319 1799 -9923 2765 18121 3809 -4815 4200 5620 2382 6083 3866
443 3866 -5690 5812 14719 -299 -6287 6214 11463 6654 10697 6418 -3413 7372 14095 -1226
457 -1226 -8696 8798 14822 4807 7032 4903 1286 9928 15121 -497 -5983 12437 12671 -1980
471 -1980 -1889 2965 3833 10582 13125 -3492 -4060 14961 9951 -9078 -6999 4955 3563 2740 2622 -8559
487 -8559 -4193 11818 7459 -10289 -6196 5067 -886 -2960 -4828 -13837 -9420 8811 5159 -15409
501 -15409 -9673 4838 1300 -5036 -8337 -11879 -6400 7469 -3056 -22060 -9490 7719 1503
514 1503 -7835 -4116 -3661 -2178 5025 -6977 -19626 -6137 9686 -403 -11411 -3667 -567 815
528 815 4319 -4729 -12407 1893 12900 -5936 -16133 -4213 1625 897 3037 -1275 -8295 4354
542 4354 12958 -6188 -14267 -1052 6845 767 -774 -4599 -7630 7381 12691 -5253 -9482 8007
556 8007 12594 -774 -3246 -1450 -3005 6950 9556 -2914 -4631 13766 14861 581 1004 3866
570 3866 3887 8703 11106 -2659 -2848 15614 13494 -1011 1471 11417 11098 10197 9595 -1629 38 14752
586 14752 10145 -3592 2032 13829 8686 5724 6565 -208 3656 14901 8417 -8158 -13 11538
600 11538 2847 -1549 3192 3447 3326 9295 3329 -8314 2119 9542 -236 -3853 1822 542 -2920
615 -2920 6121 3381 -5181 4159 10810 -546 -5920 3145 1690 -2888 3785 2063 -3710 3652 8970
630 8970 -1461 -3789 8670 5622 -2269 2493 3420 -2970 1407 6750 -3269 -2693 8998 6020 -1974
645 -1974 2656 6022 -1554 926 3852 -4963 -2393 7816 3694 -6583 1351 6995 -1746 -572 4616
660 4616 332 -1332 5254 101 -9359 644 5966 -829 -816 4900 1781 279 6040 -877 -6791
675 -6791 4875 9341 -2771 -5277 5790 4794 2564 6544 1655 -330 8600 11552 -3410 -5046
689 -5046 7837 6128 857 2735 1986 1170 10565 12288 -2670 -2025 10248 7104 -1609 -82 1706
704 1706 695 8408 8165 -4314 -998 11957 7897 -3381 713 3743 -154 5522 3209 -6504 -2703
719 -2703 11466 7721 -3988 1205 6481 4219 3824 388 -7014 -928 12452 3675 -8554 1432
733 1432 9548 5364 2932 2923 -2738 3654 12700 1197 -9722 948 11844 4450 -520 2347 882
748 882 7976 12460 883 -7839 2306 11932 297 -3939 894 2608 6258 7745 -965 -8304 6177
763 6177 12658 -2544 -7221 186 1390 569 996 -4249 -6585 7970 10475 -4507 -8592 2399 3961
778 3961 -3344 -2051 -6390 -7584 4454 5305 -6545 -6612 5334 3659 -3227 -1786 -5066 -5553 2405
793 2405 4214 -9378 -8001 5376 2675 -4481 -1448 -63 -208 4247 2900 -11568 -7829 4893
807 4893 2561 -6673 -2562 1472 -936 2844 -969 -9012 -2664 8683 2125 -10169 -5092 987 -2850
822 -2850 851 708 -4218 -2044 7786 383 -8567 -223 3160 -2990 -3223 -108 -4088 -1722 7691 2294
838 2294 -4859 2673 4628 -2376 -1465 2420 -1202 643 4699 -402 -4192 6125 9299 424 1415
853 1415 7769 1803 -604 3051 958 -2639 5248 9693 -1217 -423 5174 3236 2267 5988 2872
868 2872 -2580 3622 3842 -3701 -1173 5216 2230 -1028 4358 2133 -4634 2545 5361 -2236 -2424 3705
884 3705 -2719 -7817 1791 3722 -1851 383 1560 -4687 -3466 3808 -3882 -7209 673 1213 -5318
899 -5318 -5499 -929 -4750 -854 4483 -2732 -7542 -249 219 -9058 -5399 120 -4473 -4883 -1405 -4776
915 -4776 -6081 2931 2949 -7767 -5528 -2 -4143 -6009 -2004 -4457 -5719 2283 -415 -10049 -5224
930 -5224 4001 1366 -3862 -2438 -5993 -7077 829 858 -7704 -2987 6219 987 -4691 -1570 -1664 -1378
946 -1378 3364 1551 -7831 -3716 5463 -556 -3899 3060 4699 1733 3800 1753 -5402 1120 9086
961 9086 257 -6123 1373 6214 2771 4733 3819 -1222 6560 12256 341 -8185 2531 9220 4146
976 4146 1869 -136 -2007 5560 11960 2843 -3248 7093 8726 494 -1343 610 672 5234 9963
991 9963 167 -3024 7333 8113 -814 -12 5006 2246 1787 3842 -4176 -3912 7221 7966 -2504 -2744
1007 -2744 4814 2459 2280 1254 -5413 -4683 5707 3896 -8319 -6597 3900 3598 1720 -127 -5411
1022 -5411 -5930 3843 3294 -8835 -6488 1331 -201 -3869 -2251 -3550 -3969 4658 1646 -8680 -6416
1037 -6416 1444 -2237 -6995 -2328 -2948 -2839 1260 -1333 -8524 -2788 6096 -1424 -8656 -3536 -2195
1052 -2195 -3056 -295 -2265 -8366 -1516 6548 -1556 -8561 -2041 1653 -1350 -580 -2456 -8675 -2608
1067 -2608 4446 -1194 -5109 1068 2752 -2183 582 424 -4375 -628 4416 -905 -5629 1279 2808
1082 2808 -2662 1621 3725 545 1363 4792 -1022 -4634 4777 4621 -3104 -483 4354 3011 2611 6424
1098 6424 552 -1534 6892 6514 -2349 -1093 5554 2122 2773 6078 1112 -498 6761 7600 679 2309
1114 2309 6238 -247 -1121 4061 2724 -417 4336 4987 -861 3623 6721 565 -1994 4517 3588 -1469
1130 -1469 1850 1061 -2986 1974 6366 -314 -3647 4908 3484 -1830 88 23 -3390 -1368 3506 -2789
1146 -2789 -3995 4505 2254 -3876 -115 3176 -2708 -3099 1072 -3994 -3551 2496 -460 -6475 -2386
1161 -2386 4214 -1509 -1809 237 -3594 -3303 2801 -1232 -9919 -4886 2319 -368 -2264 -1770 -3988 -2948
1177 -2948 3752 48 -9207 -4212 1776 -2785 -5656 -2335 -3208 -3567 2429 57 -6530 -597 3613
1192 3613 -3282 -7032 -854 -579 -2929 679 -1260 -3956 2642 6348 -2539 -5761 2343 3050 -102
1207 -102 -1197 -2536 -3597 4285 8268 -2854 -5125 4914 6729 2988 1452 101 -2467 4787 7604
1222 7604 -2806 -3872 5578 7676 1420 2542 2164 307 5853 6432 -1822 -2972 6887 6759 -1423
1237 -1423 1541 4714 3313 5644 5496 -1190 53 9005 6019 -3708 -177 4351 4284 4023 3861 -807
1253 -807 1235 10420 5156 -5328 -1809 5720 3779 2186 1831 -2070 1508 8255 4341 -4790 328
1268 328 7213 2110 -1353 -467 -2645 -128 4415 893 -4554 1189 7575 -235 -3913 -552 563
1283 563 -637 2156 -2011 -7706 649 4117 -2689 -5841 247 1238 -1842 1110 -3388 -8106 -1612
1298 -1612 2641 -4784 -7813 -783 259 -3287 -557 -3499 -5594 -714 2673 -4331 -7128 -354 -886
1313 -886 -4582 -2272 -1512 -4545 -122 2222 -3512 -4062 2084 260 -5419 -2077 1845 -2912 -18 -42
1329 -42 -3736 -2160 5827 3676 -4587 -547 1896 -1472 -222 1853 -2271 -1562 6018 2695 -2623 935
1345 935 4255 1267 1344 3905 -98 -1292 4218 2046 -2149 2913 5853 1627 1396 5929 2186 -961
1361 -961 3651 2779 -529 4345 5731 -1784 -588 6514 4330 521 3911 4625 1338 4664 4480 -3014
1377 -3014 -1683 5313 3907 799 4310 4727 530 3748 4464 -1723 -799 5954 2704 -2219 1335 2961
1393 2961 -432 1690 4343 -1103 796 5662 221 -5117 -193 1709 -1619 -1692 160 -2450 -738
1408 -738 4934 -829 -6391 -756 3048 -2381 -4150 -2116 -3894 -2630 2465 -3034 -6711 206 3617
1423 3617 -3944 -5186 -2077 -3367 -3073 -577 -4600 -7902 -461 2201 -5358 -6258 -345 -981 -2564 -1324
1439 -1324 -5502 -7602 163 1531 -6390 -5850 1855 1842 -2830 -1676 -4041 -4850 2783 1745 -5939 -6318
1455 -6318 1468 872 -3407 -2026 -1699 -785 3419 2422 -6400 -4927 2590 1265 -3014 -160 212 197 3159
1472 3159 2830 -3677 -942 7551 2305 -2968 -1118 2141 696 1827 836 -3248 1137 8280 3778
1487 3778 -2821 1538 5080 1244 1328 1003 -2080 2003 8494 2912 -4590 2683 6970 3411 2269 1912
1503 1912 705 2692 6470 1106 -4737 2247 6853 1625 1196 2981 1281 2157 4985 48 -3425
1518 -3425 2696 5572 -1673 -2177 2254 895 2129 3296 -997 -4136 1865 4222 -3310 -4418 1754
1533 1754 1205 -647 52 -649 -3599 2727 3536 -3768 -2822 971 -59 -2497 -1153 -2012 -2546 2001 1865
1550 1865 -4323 -4451 1233 -906 -4799 -1549 -2190 -4419 -856 325 -6132 -4895 1338 -239 -4002
1565 -4002 -864 -710 -2801 -1911 -736 -4626 -2962 2409 -1910 -4978 -859 785 -2911 -1130 968
1580 968 -3945 -1728 1893 -1522 -5267 -432 1159 -2327 -473 2497 -200 -606 2736 -327 -4219
1595 -4219 1377 2526 -2383 -1345 1263 735 -435 2550 -36 -1385 2808 2493 -2193 -1021 3106
1610 3106 205 -1815 1877 1697 -306 3820 3776 -1735 737 5222 1597 -1431 2132 1445 -231 3414
1626 3414 3616 -378 2007 6637 1329 -919 2500 4389 1027 2254 3351 -2378 509 5946 573
1641 573 -1609 3395 4860 1913 1570 1330 -3209 942 4788 236 -3160 3980 4511 -990 -251 1022
1657 1022 421 778 3009 -2490 -3703 2775 1622 -1682 -858 1363 689 674 2141 -3304 -4467 2494
1673 2494 2418 -3848 -4178 1917 -149 -1597 500 -2815 -3029 2615 896 -5078 -4203 1841 -1027 -1824
1689 -1824 -2660 -3435 -1999 2694 398 -5427 -4259 2198 -1016 -3635 -1809 -3109 -2050 1635 -1265
1704 -1265 -5964 -2344 3718 333 -4248 -1911 -2099 -2129 648 -1296 -5334 -1248 4127 -260 -5333 -481
1720 -481 -67 -166 1352 -492 -3927 -1439 3544 -1615 -4174 701 3686 1545 332 -1009 -3258 1194
1736 1194 4664 -1411 -2746 2395 4406 -153 -998 450 -398 3794 4843 290 -3380 3493 3287 -1169
1752 -1169 364 2169 1965 3578 4029 -911 -1290 4833 5228 25 -81 1923 2080 1926 3092 -867 -1261
1769 -1261 3772 3514 -1544 -78 4733 1879 40 1321 -495 -256 3434 3376 -1272 507 4182 -41
1785 -41 -777 1333 -83 220 3350 603 -3715 -24 3350 1348 -457 1116 1009 -705 1598 -127
1801 -127 -3756 -554 3848 -334 -4080 -515 3 -1995 435 188 -1553 -518 964 -2683 -4087 -491
1817 -491 176 -3449 -888 -729 -3260 -1702 105 -1449 -2826 653 -395 -5108 -1907 -946 -3050 -2319
1833 -2319 448 -1459 -2449 1068 -95 -3752 -1181 559 -2728 -2735 326 -1792 -2303 1520 -120 -4415
1849 -4415 -232 1850 -581 -1715 231 -1356 -2274 1022 -279 -3407 1238 5434 905 -1697 953
1864 953 173 347 2846 745 -1188 1714 3236 -720 -3089 2055 2947 2670 2899 2305 -777 44 3174
1881 3174 -975 -493 4633 3433 42 720 1353 1137 3299 3955 -449 -817 3939 2180 -1694 666
1897 666 2517 1824 3685 2763 -1246 -502 4346 3368 -2379 -1213 2101 1051 1999 1352 -1253 435 3967
1914 3967 2836 -2565 -480 3050 445 86 161 -1116 -607 4463 1006 -2432 -306 1708 -419 -1560
1930 -1560 -662 -1661 -767 2037 -1002 -5312 -1941 2246 -993 -2300 -546 -1241 -1517 -1258 -2769 -5698
1946 -5698 -228 2466 -2528 -4119 -1672 -40 -1720 -666 -2920 -3609 631 1554 -5184 -6022 -1260 84
1962 84 -1260 -985 -1956 -3417 173 1513 -3235 -4993 27 67 -1326 -1627 -2516 -2526 1170 1810 -2869 -3478
1980 -3478 1817 1405 -1732 -1101 -998 -1589 -66 1751 -2095 -1727 2309 1594 -1807 99 632 -815 25
1997 25 1062 -1407 -363 2919 801 -2574 264 2463 1208 834 916 -444 -580 3463 1624 -3077
2013 -3077 644 3684 1555 626 1748 1111 1189 4301 576 -2901 1208 3622 825 421 2140 654
2029 654 557 2802 966 -1036 1860 3935 449 -335 1867 664 -961 1537 1614 -827 1854 2924
2045 2924 -1804 -875 1885 -57 -1585 297 -506 -2032 -259 2250 -2010 -2566 950 303 -2597 -887
2061 -887 1083 -2985 -638 -548 -3132 -728 1623 -808 -3063 -663 -287 -2229 -1635 -352 -2413 -2360 635
2078 635 -1841 -3501 -501 321 -2322 -2255 -681 -2661 -2115 -321 -2029 -3411 -586 253 -2272 -1349 155
2095 155 -1643 -1852 337 -474 -4263 -577 -941 -2772 -1778 668 -947 -1616 45 -1018 -1936 875 1010
2112 1010 -2514 -1455 2137 296 -1974 -519 -794 -165 2721 1207 -2295 -1395 3170 1089 -1399 -262
2128 -262 153 1321 2287 2292 -1150 -295 3942 1248 -360 484 1355 901 2115 1375 -1314 -3 4399 1743
2146 1743 777 1605 2268 64 685 1934 -763 1431 3424 869 -1298 1663 3775 456 238 1173
2162 1173 499 1477 2684 -362 -2515 960 2565 17 310 409 -476 1335 2474 -995 -3423 332
2178 332 2742 -584 -1225 234 74 619 1898 -1456 -3225 2009 2347 -1497 -2842 -752 122 -438 502
2195 502 -1944 -1770 796 1440 -3085 -2794 783 -198 -1283 -950 -2431 -2966 899 849 -4251 -1838 883
2212 883 199 -2249 -1648 -2345 -1977 760 545 -3669 -2649 42 -429 -3256 -812 -283 -1031 776 -395
2229 -395 -3369 -2335 1376 -981 -2533 135 186 -425 -248 -217 -2435 -206 2197 -749 -2743 -809 1094
2246 1094 -228 -723 699 -1649 988 3014 216 -2642 -1193 1188 -284 579 559 -956 563 2869
2262 2869 -376 -2576 919 2179 198 430 739 -664 -1 1979 1130 -1258 1960 2506 -944 867
2278 867 2137 1057 286 1671 443 692 2271 907 -1368 430 2727 1301 569 1180 -1 -302
2294 -302 2045 1296 -929 -340 2040 270 -340 1316 42 -545 1398 1408 -1317 -821 580 -837 -2141
2311 -2141 355 610 -1159 715 771 -1921 -479 305 -2122 -2366 722 96 -2641 -737 -706 -1752 -1403
2328 -1403 -142 -1821 -2161 206 -239 -3384 -2486 -1042 -1414 -778 515 -1625 -2700 398 172 -2653
2344 -2653 -1957 -390 -1643 -1585 -1012 -2392 -2654 391 -67 -2199 -1092 898 -459 -1611 -1847 -2253 -1246
2361 -1246 238 194 -3065 -783 1074 -509 -1390 -540 -417 -1044 1000 -805 -2906 63 1230 -719
2377 -719 -1903 386 1433 -191 1836 312 -1799 27 2040 128 -1186 1808 1618 342 803 1142
2393 1142 -136 2089 3257 179 -1029 2096 2690 82 721 1228 496 2901 2828 212 28 2644 3658
2410 3658 782 27 47 -294 1095 2249 55 -125 2782 2982 -201 -559 892 744 1424 1865 -1364
2427 -1364 -1112 2066 2105 -501 128 1668 1363 434 653 -1071 -1271 1612 425 -1828 -69 1824 444
2444 444 -1151 80 -676 -980 1601 -162 -2758 -1095 1197 -233 -1246 -930 -832 -701 860 -38 -2892
2461 -2892 -1196 1180 -1066 -2195 -659 -1424 -1806 -195 -504 -2131 -1376 973 -1306 -2788 -800 -1011
2477 -1011 -1025 -470 -706 -3033 -1402 832 -1881 -2500 188 367 -1448 -468 -1150 -2222 -664 952 -1166
2494 -1166 -1549 1544 785 -807 -53 182 -807 900 1814 -975 -1517 1554 1408 -262 191 1434 -17
2511 -17 847 1805 -122 -189 1927 1485 -943 517 2176 599 985 1918 294 14 1814 1587 -674 659
2529 659 2493 139 498 1621 443 -127 1802 1564 -720 339 2784 -80 -132 1301 452 424 1660
2546 1660 860 -766 926 1826 213 -104 2066 671 -526 342 743 -502 355 1453 -537 -91 1678
2563 1678 588 -776 -519 588 -825 -179 95 -2489 -1106 1004 671 -1235 -513 -231 -1741 -581
2579 -581 29 -1548 -1283 569 -633 -2795 -375 434 -859 -889 -620 -1913 -1436 211 -977 -2821 -576
2596 -576 6 -1662 -1782 -705 -1449 -876 567 -2129 -3490 -684 310 -1475 -1763 -4 -556 -656 -308
2613 -308 -1099 -2226 711 804 -1483 -2280 -485 -140 -332 448 -506 -1359 962 1354 -1585 -1501 816 775 -400
2632 -400 246 -655 -1242 1315 1236 -1310 -990 1619 871 -877 490 81 -53 1515 1295 -1167 -1239 1659
2650 1659 1230 -452 1055 1462 406 1191 1661 -809 232 2825 1301 -672 695 1824 670 1691
2666 1691 1252 -570 415 1974 1019 -1039 138 1383 1585 757 641 -1459 914 2495 944 -1100
2682 -1100 -35 1430 69 -729 27 -165 560 1410 -241 -1980 354 1623 -127 -697 182 -499 -271
2699 -271 525 -964 -2356 831 1456 -364 -1668 -162 -299 53 -29 -703 -1448 78 833 -1964 -1763 659
2717 659 -12 -661 -203 -1114 -1715 152 757 -1663 -1600 2 -280 -1086 -183 -677 -1659 103 -219 -1837 -2204
2736 -2204 -211 27 -1745 83 -502 -1309 571 239 -2313 -1621 1207 766 -1444 -133 13 -1598 445
2753 445 321 -1043 -1229 1487 -669 -1684 -120 858 -468 234 359 -828 -600 1422 84 -836 955
2770 955 1621 -814 209 1169 -113 -11 755 77 -747 1597 1655 284 692 1420 743 368 826 766 -333
2789 -333 1346 1667 483 579 880 638 132 952 450 -572 1079 1235 -903 456 1602 1108 -64 1282
2807 1282 845 -303 907 954 -981 581 1219 -473 -1459 732 955 170 941 894 -684 175 1695 -654
2825 -654 -1709 193 933 -850 -439 -324 -857 389 1383 -61 -1179 -83 295 -935 -524 -313 -751
2842 -751 14 345 -1334 -1921 164 244 -1862 -1482 -132 -946 -710 -98 -1305 -1650 827 367 -1479 -1291
2860 -1291 -102 -255 -581 -842 -2062 -1889 189 334 -2324 -1317 391 -136 -1067 -498 -1226 -909 818
2877 818 -462 -1870 -1583 203 -14 -1129 -258 -130 -338 773 566 -1565 -319 1538 -244 -1564 -142
2894 -142 -101 -477 660 -269 -1332 -32 1975 231 -1615 500 852 -446 1300 -95 -1135 760
2910 760 2191 294 -1151 776 1383 -208 -11 743 -980 1017 1899 41 -1202 1490 1949 12
2926 12 373 283 4 1115 1667 -13 -710 1417 1940 -287 378 1064 183 990 2048 -348 -1174 2116
2944 2116 1637 -600 -346 814 666 549 1126 -70 -924 1664 743 -959 -411 890 276 -617 88 -926
2962 -926 -1072 1068 654 -1574 -186 702 -784 -1144 -87 -415 -933 86 -277 -1557 -776 788 -1057
2979 -1057 -1460 -604 -646 -1129 110 -867 -1641 -710 939 -1117 -1803 -7 -270 -1199 -417 -630 -1634 -600
2997 -600 427 -1672 -1665 212 -6 -887 -660 -422 -1264 -74 119 -1170 -1036 729 -78 -1249 -257 448
3015 448 -559 -23 657 -546 -1068 274 372 -894 -389 1006 83 -85 785 -233 -391 1386 815 -1009
3033 -1009 74 1390 66 -27 954 474 -216 1686 822 61 855 1522 233 -429 1610 916 461 910
3051 910 1064 -185 1337 1980 83 -323 820 657 487 978 617 -450 1456 1370 -89 -360 1342 1140
3069 1140 -459 -8 181 -457 384 1275 -245 -598 1324 1289 -596 -600 602 -373 579 307 -1397 -898 1252
3088 1252 335 -741 -344 607 -138 136 -104 -1136 -725 618 287 -2042 -280 231 -472 -423 -784 -1125
3106 -1125 -326 652 -391 -2542 -897 550 -850 -1103 -1236 -1388 90 104 -749 -2041 -342 1195 -490
3123 -490 -1597 -798 -1020 -108 288 -489 -1438 369 1770 -1085 -1216 -266 -52 32 410 -704 -1568 -58
3141 -58 1358 -748 -1119 64 827 -37 153 -227 -504 862 1241 -391 -542 505 583 -232 60 312 -1067
3160 -1067 989 538 -654 -664 1445 657 -235 733 358 263 345 1278 3 18 1754 975 -514 -393 1638
3179 1638 419 1040 1515 -169 178 1275 1345 -459 190 834 759 684 473 -381 47 1474 1243 -692 258
3198 258 1051 545 -306 305 -220 -137 1321 -322 -1539 69 1465 -150 -1102 297 -19 -696 584 -394
3216 -394 -1196 286 665 -717 -90 -61 186 -770 250 72 -1055 -4 456 -1138 -1000 750 -184 -1136
3234 -1136 -439 -293 -502 -169 -159 -1350 -709 168 52 -969 -297 162 -525 -303 114 -1674 -578 804
3252 804 -422 -1416 35 284 -1456 -157 74 -547 -863 180 -637 -1298 -190 581 -777 33 242 -597
3270 -597 -452 682 -441 -1673 449 1005 -745 -648 709 -383 -201 754 153 -669 694 1387 -861
3287 -861 -536 526 244 -69 895 -281 -175 229 1219 -542 79 681 667 -450 771 845 -179 967
3305 967 1202 -665 188 1465 959 -418 388 715 506 993 659 -714 -665 2111 536 -209 386 890
3323 890 704 851 55 -250 332 1244 559 -630 688 1064 351 521 462 -584 168 1413 -193 -1192 591
3342 591 388 117 11 602 -450 388 1476 -597 -1451 1022 1133 -860 -604 34 -494 160 264 -1117
3360 -1117 -1127 404 260 -496 -761 233 -372 -221 270 -507 -826 154 361 -1345 -906 109 -140 -493 -125
3379 -125 -968 -1035 584 92 -1372 -1514 268 -365 -1070 -6 130 -1153 -81 139 -1591 -505 745
3396 745 -136 -495 -514 -235 -968 695 43 -1461 -719 396 131 -836 -21 -10 -333 786 109 -636 -19
3415 -19 1278 54 -198 378 402 -31 571 790 11 626 1661 752 -84 645 1059 191 391 1095 315 476
3435 476 631 422 175 1023 1346 580 300 798 192 843 1395 -35 21 970 1613 -116 65 1127 -35
3454 -35 597 794 459 -96 492 950 -165 48 619 276 -37 890 680 2 942 462 -710 386 586
3473 586 133 -373 146 -231 -244 404 405 -700 -87 726 -621 -1446 662 -236 -620 -687 -662 -504 -90 463 -676
3494 -676 -809 492 47 -959 -318 -436 -1159 -376 270 -591 -906 537 -426 -473 -271 287 -342 -427 328 -1108
3514 -1108 -832 523 -353 -991 -540 325 -299 -53 327 -702 -671 365 -258 -1331 -276 467 6 189
3532 189 455 -651 -72 575 480 -1108 -50 1328 -540 -437 256 71 379 690 128 -365 260 896 -31
3551 -31 49 402 768 192 718 -282 -547 780 1645 -8 -348 519 445 622 480 457 -383 312 1039 261
3571 261 -256 621 1082 232 614 391 376 246 948 -260 69 1281 565 -557 466 19 48 768 831 -206
3591 -206 -462 385 621 138 -304 471 124 229 246 -929 -209 772 293 -904 -609 387 -236 28 444 -609
3611 -609 -406 751 -35 -1240 -528 203 -239 -237 25 -850 -751 117 -234 -1065 170 433 -491 -1230 -46 -396
3631 -396 -776 -15 -334 -987 -418 705 -663 -598 -10 -300 -212 385 -403 -747 -127 85 -605 -829 477 -47
3651 -47 -165 -200 -286 -752 -168 317 -498 -411 47 601 -58 -169 -21 -184 562 703 62 -312 745 212 -572
3672 -572 49 456 91 320 895 -470 -148 763 659 -354 719 499 -19 64 807 580 141 656 354
3691 354 -124 84 765 -274 481 969 28 -10 181 36 -370 623 972 -288 324 535 40 -226 347 250
3711 250 -289 603 632 24 -257 665 269 80 31 254 -257 350 899 161 59 762 220 -108 327 -128 -393
3732 -393 290 48 -783 -119 502 19 -502 -179 194 -191 -125 -70 -950 -473 810 -195 -575 18 242 -223
3752 -223 -33 -173 -612 -215 10 -284 -1153 -212 53 -653 -650 -46 -384 -380 259 -532 -702 -466 293 -393 -494
3773 -494 -569 -706 -398 194 -371 -1174 -157 206 -558 -814 -287 -66 -184 -374 -312 -530 382 516 -330 -397 295
3794 295 -249 -282 20 -171 -596 367 439 -601 -546 608 213 -364 37 -241 -223 755 392 -777 -444 342
3814 342 390 -325 259 -86 -59 783 613 -512 -182 660 387 -142 319 170 -8 644 328 -239 238 721
3834 721 463 -152 164 472 -3 517 632 129 275 903 228 -314 328 669 79 13 365 29 211 688
3854 688 9 15 607 500 122 213 -241 -398 70 454 -161 -461 195 464 -149 -185 -106 -257 -334 148 -224 -658
3876 -658 -72 193 -271 -256 -337 -387 -283 341 -82 -944 -59 52 -699 -683 136 -378 -389 224 -334 -452 -325 95
3898 95 -965 -639 -338 -340 -759 -243 -118 -594 -158 -269 -593 -502 273 -296 -515 227 -69 -475 -116 420 -586
3919 -586 -424 431 -259 -60 195 113 -278 148 363 -467 0 491 40 -545 231 361 -222 438 419 -77 39
3940 39 433 -141 -292 543 321 75 416 361 -64 159 639 321 -117 544 381 9 312 782 -346 210
3960 210 776 348 66 587 465 -308 420 502 326 90 146 116 26 520 243 -277 287 481 366 -517 245
3981 245 147 -206 354 228 -262 27 439 -202 -360 143 153 -363 285 165 -379 148 137 -107 -487 350 -211
4002 -211 -623 -452 -34 -348 -83 349 -278 -337 118 14 -476 -476 -33 -339 -63 -127 -523 -697 213 189 -393 -231
4024 -231 -254 -84 -176 174 -609 -734 574 211 -28 -379 199 -114 -123 389 -456 -210 395 346 -550 -22 162
4045 162 -324 -179 99 -370 -264 774 539 -424 -128 419 -206 220 -10 -173 -119 266 -111 -280 199 340
4065 340 199 -200 348 75 -223 384 242 -200 126 603 -325 -180 385 726 63 470 139 -131 330 468
4085 468 7 -178 517 335 383 211 202 -385 23 820 -230 -562 307 255 100 224 304 -184 -187 526 -168 -513
4107 -513 29 -127 -99 290 -216 -420 183 425 -230 -171 251 -121 -629 374 571 -330 -473 4 15 -732 50
4128 50 -1 -668 -53 586 -355 -237 -450 -420 -64 404 181 -674 -187 1024 -234 -393 487 -182 40 377
4148 377 138 -716 -47 359 -125 -180 -36 -83 -130 -140 -216 -710 -408 695 -484 -440 6 465 82 -124 -174 -399
4170 -399 -162 53 541 -244 164 233 -877 603 772 219 41 -1097 497 54 774 40 -270 5 372
4189 372 162 -60 -677 -231 -820 153 -100 86 -29 -336 -999 -437 -340 -533 -243 360 -32 95 98 23 179
4210 179 -242 155 472 179 1153 1097 -473 367 743 696 143 236 411 170 -265 -165 -18 599 -508 -157
4230 -157 623 -398 157 305 205 136 -740 -52 701 -496 -916 -223 509 192 168 -739 544 216 176 -842
4250 -842 -109 -77 -284 387 -99 -203 112 71 277 -283 -636 870 -4 -362 272 -19 -732 968 -213 -373
4270 -373 -1568 158 148 -900 -816 274 16 111 -279 -759 -208 517 -682 -206 580 -424 -766 -80 -263
4289 -263 -643 -461 -123 215 -480 -335 223 -472 202 -394 -211 -667 256 -47 -571 874 549 -547 -468 456
4309 456 -83 -1594 686 304 -1226 229 389 -51 -461 -342 -344 192 401 190 219 345 118 80 -176 -193
4329 -193 -319 -118 -186 -275 267 334 263 132 376 194 113 393 -293 6 -771 253 -74 79 341 -93 328
4350 328 -196 562 227 159 167 -2 132 128 528 710 -291 -113 528 83 260 -110 57 90 664 477 -172 148
4372 148 46 652 -261 1224 -220 -247 463 640 339 128 -599 -648 -176 346 -245 -126 382 -453 -524 69
4392 69 188 164 -251 -468 -464 -359 118 -1185 -204 -266 -120 -189 -616 -400 -556 -113 -125 12 -142 -302 -1284 467
4414 467 -694 1175 240 -12 38 -505 -427 225 360 -1019 -482 601 -840 -229 -219 -170 -681 -184 49 -548
4434 -548 486 728 -108 -233 50 -15 404 -55 949 -447 -290 -57 -142 -899 429 65 -45 285 395
4453 395 186 712 619 -656 -36 256 294 -221 266 509 282 -43 115 -222 -729 582 130 -263 189 809
4473 809 -227 62 -48 361 -45 698 -603 202 -159 -477 59 -429 821 -203 -706 171 -548 125 -312
4492 -312 1333 -261 234 -196 451 -148 532 -230 -392 889 469 784 -608 72 -664 -362 -604 164 -461
4511 -461 -427 148 -191 -403 876 -245 361 207 -361 -237 -75 60 -275 -679 219 -455 -75 -1043 611
4530 611 424 731 445 459 -106 -506 516 -748 -282 -777 -612 -26 146 -211 -469 -51 -105 -254 -194 375
4550 375 141 454 -466 154 -668 -14 849 11 257 86 -324 429 161 -239 -452 911 -171 -320 239
4569 239 818 189 293 -172 -185 67 -709 193 -194 -663 -27 -151 758 243 -569 -143 656 320 35 437
4589 437 26 57 -203 -134 306 500 122 -393 207 83 -196 347 83 114 -478 303 -69 -793 -60 423 647
4610 647 -34 -12 550 328 -272 -58 96 -188 374 1093 -984 -44 231 -943 -494 244 -97 -400 5 180
4630 180 737 -385 -336 229 -156 131 -220 -673 -46 -321 47 -116 520 2 -732 -633 444 -350 -482 238
4650 238 -162 -654 -926 -318 -521 221 154 -221 -815 741 -379 -485 -551 72 -345 326 -351 -1461 -249
4669 -249 799 692 -429 -104 -381 53 516 369 400 -270 69 -103 -145 -324 -14 162 354 513 17 -867
4689 -867 -334 560 -271 -481 -82 -177 -163 -13 -452 -718 -845 -550 -982 -27 142 -720 -559 268 -240 1049
4709 1049 84 155 107 -568 -254 -4 386 118 543 724 382 295 -795 -299 -695 498 -89 -267 89 784
4729 784 -43 -665 127 409 -262 761 -742 112 -426 -210 -630 -1120 -1061 -135 679 31 -282 687 505 158
4749 158 -392 -595 -172 -324 712 -547 83 510 381 -63 -143 -89 -1 31 2149 -142 -309 1 -441 -268
4769 -268 -86 420 54 -61 415 -140 -1079 731 -192 -274 -254 253 -141 93 -74 415 -638 144 113 -563
4789 -563 -858 -516 223 -1104 -319 -284 349 451 208 -1914 -543 473 -1164 -276 172 -651 129 -911
4807 -911 -398 -550 -601 -70 -235 -542 -748 -542 -702 -868 -28 -332 -112 376 -491 -652 -225 610 -453 290
4827 290 -66 -228 116 -25 70 370 723 154 -668 -191 400 -372 579 -439 -365 -1042 -9 541 -635 -241
4847 -241 507 -78 104 -648 -405 48 1310 616 -517 61 572 600 -377 866 -1010 -496 -548 -937 -191
4866 -191 -80 -581 -203 -397 186 13 -953 361 283 18 -829 147 -321 496 -605 177 552 413 277 -98
4886 -98 420 344 266 278 9 -104 -561 158 -190 -226 188 503 -609 55 -251 -179 -541 283 -160 -317 -27 120
4908 120 843 6 -999 -355 271 301 -121 -10 191 -292 46 -153 564 -733 -1007 157 274 -602 -14
4927 -14 672 -894 491 157 -80 -620 405 134 136 632 167 -733 -544 489 117 -105 757 1121 -303
4946 -303 524 -297 44 -467 652 -100 -502 838 150 -788 140 488 262 91 162 -499 -32 -174 452 504
4966 504 276 -394 -38 -121 214 -41 195 1319 598 -201 213 -841 -127 -1041 -615 450 1 138 -189
4985 -189 352 183 367 753 -507 118 -200 -259 965 -539 -361 -123 -11 -53 273 -283 417 -171 158 5
5005 5 802 148 -5 -105 -321 48 -37 140 175 -160 -910 371 -173 -390 -75 82 -297 -227 304 -718 -283
5026 -283 734 478 -168 -437 215 270 -569 202 -246 -1073 37 1094 435 497 491 -255 -908 74 -586 -875
5046 -875 1168 461 -187 -322 504 -708 197 55 268 -609 -122 -414 -379 -119 -13 104 -452 92 -288 -290
5066 -290 142 -406 -169 -130 17 340 292 6 730 -409 150 -422 -529 -519 261 992 -365 -134 -185 57 304
5087 304 262 -185 582 659 713 -188 507 27 -170 -181 -173 335 743 368 672 -597 749 303 587 -255 112
5108 112 245 -740 375 371 -919 -142 -476 -96 -197 -219 -677 437 628 328 344 -461 -357 -649 1061 -398
5128 -398 33 50 296 -647 -660 -136 -106 439 -40 429 80 298 -271 269 620 -584 176 -132 -146 -213 216
5149 216 -423 -5 110 -425 -574 54 256 108 246 12 29 -179 618 428 446 -376 318 -58 1063 32
5169 32 551 -41 -758 -678 -713 -66 -207 726 -1093 -610 -75 -20 606 13 -341 777 -527 -189 713 -126
5189 -126 -70 -163 179 -460 -269 -45 206 -468 -229 -755 59 299 275 -212 -124 334 -882 -147 -290 -60 139
5210 139 -503 -491 312 -492 -39 647 59 351 -611 -42 404 257 68 652 -76 -646 431 -360 1151 202
5230 202 358 1197 -320 -207 501 364 119 173 7 400 -765 -280 -887 -513 585 138 -652 117 325
5249 325 -47 186 420 -60 -1031 602 -247 379 283 -244 -356 301 940 599 20 109 653 -748 628 -45
5269 -45 -250 475 -24 272 1001 308 86 291 585 591 -525 724 -58 -46 -418 -1162 -131 363 -52 243
5289 243 -539 -130 176 -623 -547 -600 -353 -624 -547 -355 -598 -336 297 -1069 79 794 387 -346 270 202 24
5310 24 -752 -345 333 -236 -526 -208 328 -464 435 -260 -724 -1379 -693 -446 154 -72 245 -301 -208 23 -261
5331 -261 -3 -495 128 162 -415 -596 -6 -426 166 -782 -397 -347 -169 16 294 807 -529 257 -285 612
5351 612 -307 -670 -514 -914 -23 -869 -404 -732 -220 -611 -727 505 -141 945 -573 -555 -1377 -95 62
5370 62 340 439 1071 399 146 -374 6 752 86 123 585 355 711 88 593 516 -249 -622 111 -206 227
5391 227 581 985 883 -419 -1075 -488 -928 267 164 -606 -2 308 -408 -120 -220 227 391 117 -318
5410 -318 -103 -260 -451 -782 1375 20 -347 684 -778 10 671 -813 -209 -275 207 456 -282 76 640
5429 640 163 169 237 -233 -267 -596 -93 -600 -198 123 -495 -168 -198 -317 222 -495 -428 -265 -916 -123 -349 274
5451 274 -790 -227 -368 -301 130 -459 -222 356 188 632 729 416 -619 -289 1132 -255 -357 282 -744
5470 -744 -256 167 407 92 35 -324 446 18 -130 643 -141 707 327 -237 199 460 -475 -172 98 -530
5490 -530 -213 -289 365 520 257 -49 -164 -238 -320 1104 -167 358 159 -222 -150 534 85 -405 -159 -290 -204
5511 -204 718 -641 613 -581 -112 -24 -199 113 61 -737 966 -123 185 23 179 123 -307 -240 -175 259
5531 259 -411 647 133 -146 31 -119 -679 -412 368 -489 -236 -623 -474 -177 122 327 -203 337 -341 -231
5551 -231 -377 153 -69 33 55 204 -811 148 431 -48 520 -101 28 -223 748 -258 -277 101 -254 -397
5571 -397 227 -110 401 64 37 -587 533 -116 -416 150 52 237 139 -48 -61 4 -492 -192 -240 37 -179 284
5593 284 -46 -220 47 119 -232 -124 237 -271 -159 409 156 -378 -232 -449 -39 150 -570 -192 346 336 -141
5614 -141 -456 -413 506 -420 -419 229 -329 7 -181 216 -389 -80 507 -209 -115 294 190 119 556 14 74 -77
5636 -77 45 76 396 640 493 -34 455 -739 -334 -338 -145 219 -271 258 -67 226 387 -150 -326 -18 -4
5657 -4 159 -250 -406 279 -61 242 -203 -345 366 -525 -438 213 -129 -190 95 123 -598 -538 275 -88 449 -175
5679 -175 -212 -241 -555 412 289 90 170 310 156 -501 -578 -59 89 -398 65 -708 -94 131 36 -225 -35 -158
5701 -158 -571 -137 -111 140 -15 -148 365 -1090 137 202 36 325 -35 -469 199 -62 -572 -30 493 14
5721 14 521 196 322 152 157 -635 469 -335 244 -148 -99 701 -127 -289 -167 -109 261 -80 547 55 -628
5742 -628 149 -146 43 -332 -177 325 -282 -549 -568 -122 -31 -89 308 -578 355 -122 537 37 -36 66 680
5763 680 238 210 478 188 -264 -97 693 -219 6 -255 -54 -457 -251 110 188 24 355 -397 141 -37 -129
5784 -129 -128 -57 -175 -401 -686 -200 72 -468 -2 217 105 275 497 269 -285 -126 -7 23 -470 -587 103
5805 103 -158 102 -14 -244 -81 95 221 343 52 -611 174 84 258 193 120 -356 -512 226 519 -434 24
5826 24 -179 86 -325 234 169 -157 128 -262 1 -311 325 -619 420 105 -329 14 -181 423 -112 -45 304
5847 304 -356 -218 265 -8 -44 -282 -144 -509 -44 357 333 15 -51 -135 -56 381 124 358 -54 437 -25 -330
5869 -330 -54 135 408 582 -56 52 -54 104 255 340 291 67 86 25 350 54 -353 244 14 120 177 -165
5891 -165 -91 -19 59 532 256 17 160 -8 79 127 37 -45 -270 -91 -65 94 -166 267 -323 -72 284 119 -155
5914 -155 -79 259 46 -26 -314 382 90 -53 177 -248 -113 -605 319 -79 -220 3 -147 -641 36 -93 130
5935 130 220 -83 133 -57 -475 122 -98 -59 347 -395 133 229 202 -259 -74 377 74 -208 83 -89 -105 243
5957 243 194 126 -160 223 -383 -25 -278 -348 271 217 173 -163 110 63 -227 -30 265 -291 57 -61 -35 191
5979 191 -311 -471 -184 -332 152 -102 127 -60 -331 112 -11 246 228 240 272 285 113 -51 110 -80 -18 -100
6001 -100 -128 -125 259 -134 -112 230 316 -175 -1 183 58 103 -148 15 -58 213 69 -30 -75 151 -149 -91 21
6024 21 35 -176 257 -34 47 42 -6 168 10 195 163 17 -3 17 33 -251 -79 96 -412 146 80 -167 76 101
6048 101 -135 236 124 47 -225 -346 312 -207 -313 235 242 -170 48 44 138 200 126 71 -25 19 312 -28 -131 -133
6072 -133 64 46 -206 95 -94 100 13 122 147 133 -56 -132 46 -72 -95 -29 -116 -128 201 11 -65 -116 -23 -151
6096 -151 -244 80 22 -67 -36 76 -33 -91 34 -26 -97 161 468 -120 364 42 -302 -46 265 -77 -3 275 183
6119 183 49 -57 28 -197 -83 31 -1 -37 334 -113 170 67 -31 121 5 183 -132 156 41 53 -171 225
6141 225 -6 21 -32 -38 -29 70 297 85 -266 262 79 -239 80 -51 -16 56 72 -373 -254 4 155 -235 -57
6164 -57 -118 -268 -5 65 143 -458 164 -225 -90 140 -154 -339 306 120 37 -243 266 24 -173 -168 134 -37
6186 -37 340 254 -26 -97 -19 198 -91 19 10 120 -94 -132 -142 -78 -18 85 153 107 -169 160 70 -48 72 175
6210 175 74 229 -145 -94 142 -48 71 -58 -267 -259 -245 -231 -25 -195 133 -206 -250 -14 114 -130 -45 180
6232 180 184 -34 133 88 -26 14 19 -146 25 187 -153 -51 183 -20 -4 131 -118 -226 163 -110 -123 247 461
6255 461 42 -329 -57 -158 -42 -131 33 -47 62 107 198 -267 227 -52 277 29 -100 -161 -41 93 229 89
6277 89 -139 202 -15 229 291 259 19 -106 84 151 -11 243 179 123 -1 18 -16 72 -49 153 184 542 8
6300 8 -205 75 -112 -138 10 -91 -101 -111 93 208 -100 86 61 -175 422 24 -25 -89 23 22 314 5 -205
6323 -205 -77 70 30 -159 201 151 -270 -56 -123 -473 -325 4 67 -148 275 107 -161 -349 241 -320 -97
6344 -97 -227 -177 -64 56 36 40 -123 -165 -207 -418 -321 61 -156 -3 -62 -118 -11 -91 -53 -147 -116 76 -151 -166 -58
6369 -58 -67 -219 39 174 17 84 -60 61 -44 4 -32 -236 -197 22 -395 19 -99 -153 141 -204 93 -241 -59
6392 -59 138 -12 -209 -56 -108 119 145 68 -316 282 16 18 118 -277 74 -66 235 -19 381 -102 99 37
6414 37 -405 161 164 -63 118 86 68 163 -241 -30 139 195 -235 240 215 183 70 -8 -132 -248 121 54 -145 -218
6438 -218 -51 -37 108 364 218 -232 -126 -218 59 135 52 -68 131 39 143 -98 -350 -137 -144 -377 -100 -313
6460 -313 -439 -236 -285 -157 -43 -278 249 -28 -18 -144 -179 159 96 322 -65 -172 62 -103 273 99 -253
6481 -253 152 168 17 -32 170 -199 -198 -107 -283 -269 304 81 -104 -83 83 -71 -335 41 53 -160 -64 -2 -108
6504 -108 270 -78 -30 101 34 294 184 126 -24 -350 80 43 -120 162 -152 204 -5 51 261 -305 -71 247
6526 247 0 76 271 101 -9 126 -69 -12 -364 0 82 -16 100 -50 214 5 -4 -156 173 -76 -7 -82 25
6549 25 209 -87 96 151 -137 63 220 71 174 122 -140 -53 102 121 200 -1 -19 98 -81 -21 83 196 -18
6572 -18 -207 -251 -113 303 251 -358 -134 -23 116 -86 -53 -316 -50 319 -85 145 221 127 2 -3 16 -70 52
6595 52 6 156 64 -156 113 -222 -167 98 -72 -124 -151 19 92 -237 74 133 -155 110 68 -267 293 20 -40
6618 -40 449 -344 149 -317 -28 86 206 85 -86 401 -121 142 2 30 90 -57 -175 -131 -157 8 147 104
6640 104 -117 -314 40 210 -111 -229 -45 7 20 435 38 -63 158 -30 -20 148 194 100 -7 73 -368 -186
6662 -186 417 190 -151 -222 396 -55 207 222 14 -152 -148 173 33 89 194 -156 -57 267 17 -148 -168 224
6684 224 -236 386 145 58 181 -1 15 -90 102 40 -155 11 130 -192 152 72 154 -352 233 346 -314 346
6706 346 -74 -86 36 -266 -107 -310 35 52 0 24 70 -132 -205 -101 112 -254 109 205 -109 376 -176 16
6728 16 5 -57 75 -167 -269 23 -395 53 115 -65 -182 -132 -242 -59 -64 72 157 -46 138 -102 -271 71 131
6751 131 291 -76 155 208 -164 198 80 147 104 147 -235 215 -103 3 110 225 -168 -72 263 0 -91 184
6773 184 119 -204 -102 227 59 154 -112 341 -43 -215 5 173 -24 279 26 -69 163 329 221 -115 85
6794 85 218 100 21 38 -10 186 -83 -103 67 -45 -13 -92 249 56 215 128 189 562 13 166 -10 197 150
6817 150 -58 -11 128 -73 -116 -159 141 132 -51 28 -71 -145 -126 184 66 -182 -119 142 -67 -65 293 14 -89 -21
6841 -21 -319 -131 -6 9 -6 173 94 -148 -204 -130 -23 -239 -113 -310 -48 -164 90 -81 -201 -386 28 -106
6863 -106 43 -109 -288 255 -258 -83 -176 -90 151 -34 187 -51 34 -147 119 -154 -145 162 -112 225 100 90
6885 90 -480 -188 290 -411 -25 -112 -302 120 -15 43 -255 53 3 -210 155 -114 -63 226 95 124 113 213
6907 213 138 173 126 221 -83 191 -56 258 57 64 291 74 148 326 -176 116 -118 -319 -278 -68 295 -157 59
6930 59 110 -74 -38 145 23 157 -25 96 -279 221 -125 -156 322 -23 245 133 204 114 -4 59 360 34
6952 34 203 70 102 -108 -199 30 60 -112 38 -77 -262 -86 -108 39 194 53 -113 -137 32 -295 79 72 81
6975 81 -140 -446 59 24 209 357 65 -65 79 -43 -144 -13 -48 -132 197 -141 -106 -182 196 -90 6 94 -130
6998 -130 -28 -145 344 185 -256 162 -237 372 7 -92 -166 30 145 -141 -276 157 -18 78 -127 230 -192
7019 -192 -174 -130 62 211 -132 21 -269 -150 75 -256 -340 76 519 -176 -43 -44 -78 -64 75 -155 191 -73
7041 -73 238 30 47 -79 32 9 -73 375 36 8 126 16 -102 336 -106 -117 -7 -52 -217 35 7 51 358
7064 358 451 -49 -15 87 26 -93 -138 90 -139 280 -89 51 -13 97 -51 -179 272 -123 50 -150 82 55
7086 55 199 115 -131 44 -125 198 -228 -68 -161 -243 -125 -168 185 157 112 -25 -50 -132 -113 -192 72 125 -203 -125
7110 -125 94 2 -95 -165 85 -226 -200 30 -185 -228 17 182 -343 -104 52 89 -149 269 -67 -172 51 -177
7132 -177 -170 109 196 58 92 104 -47 -78 -105 -12 30 98 64 190 -476 -294 6 -216 -214 -173 210 54 107 41 111 -260
7158 -260 -31 -100 37 -81 -110 -251 -62 48 -210 -40 -146 210 66 39 165 155 15 23 178 -62 78 -23
7180 -23 231 33 -10 -357 -166 263 -75 244 45 -165 -9 65 -92 -359 -71 83 195 72 -46 -78 341
7201 341 236 176 6 375 -137 -85 176 -36 220 21 -17 18 44 155 202 -35 130 207 -253 4 226 -177
7223 -177 123 -4 220 109 297 -150 203 57 -195 -107 -181 46 41 75 -119 126 -12 -131 200 190 80 -89
7245 -89 135 -99 34 -24 -171 -62 122 175 -280 163 -176 26 28 -94 15 35 -68 -204 -29 -235 -105 -157
7267 -157 -19 157 -196 143 36 -119 -46 3 -25 -27 -67 -169 43 182 -162 -69 -12 -387 -177 -47 24 29 17 37
7291 37 -93 212 30 -33 295 47 191 -66 -17 -72 -15 -207 -368 99 -43 -139 360 -93 -372 176 362 113
7313 113 -35 433 206 175 66 -123 235 217 104 -289 -423 108 4 -196 -7 -9 -116 -138 27 255 251 273 177
7336 177 183 -150 193 0 -6 -23 39 -156 65 52 -247 39 -58 -178 -264 30 -56 -14 48 60 21 -162 59 -28 -8
7361 -8 -37 167 14 -133 126 -236 -222 139 -73 -221 -31 -145 -180 109 193 -245 36 107 -6 40 -38 54 150 121
7385 121 -12 -379 -148 146 -171 24 178 191 -54 42 -56 -181 12 115 76 -161 -90 123 -347 135 -55 117
7407 117 1 -236 107 14 0 143 93 -151 68 -156 -42 -81 20 -129 -118 81 -216 173 -121 4 -47 -146
7429 -146 37 62 30 341 107 141 48 -18 28 268 56 -126 35 5 61 40 286 46 -2 183 58 -197 -19
7452 -19 -31 63 -76 31 132 -107 84 -219 109 19 244 3 34 33 215 -71 288 46 -76 -214 14 206
7474 206 -252 -127 -529 243 -4 102 -365 -335 -14 -85 322 142 20 -144 -7 119 -76 -154 -32 -88 -288
7495 -288 78 -91 -326 192 -83 -105 -38 185 -163 -237 1 -175 -31 -95 69 12 -108 105 -303 18 9 81 -115
7518 -115 65 -57 -283 -131 -63 -125 267 -152 16 142 -2 7 4 -120 16 166 25 -142 137 118 185 246 161
7541 161 -195 125 350 -138 -31 -51 -151 -201 -157 -20 67 -134 115 60 -8 236 -96 -23 307 -295 -74 -8 -99
7564 -99 -51 64 276 -280 94 -85 -134 8 -193 184 -36 -93 57 -29 216 -155 -20 -16 113 266 56 361
7586 361 331 154 217 -123 173 10 217 117 44 -128 223 38 147 255 -233 -70 66 -180 -76 -254 114
7607 114 263 121 155 -91 -110 32 -15 -23 -93 -121 -14 -124 175 -296 -145 195 42 -131 95 107 239 88 40
7630 40 -2 -317 148 -184 -106 -107 -122 -177 43 -383 18 114 268 15 -263 -110 -93 -218 -45 -99 -166 -185 -33 -19
7654 -19 -171 -3 125 -321 -353 115 -123 -13 -30 63 112 4 295 -87 170 -10 -139 67 -12 119 3 30
7676 30 -342 166 -69 110 82 -63 152 -116 289 256 -71 82 198 -258 381 238 238 -62 148 186 64 -89
7698 -89 -47 -101 269 -32 92 133 -88 286 -430 -29 341 -15 -11 -78 277 6 -190 -191 -100 -74 -12 185 -44 -102
7722 -102 9 203 38 82 -67 198 -100 102 -220 -166 209 143 232 174 45 -47 -280 -43 43 30 31 171 19
7745 19 -89 61 -53 93 -178 -109 1 184 -57 -8 138 130 -53 32 -58 -152 -26 -261 147 143 -309 63 -152
7768 -152 -211 38 -11 110 -41 341 -6 -167 -49 -252 77 -42 -71 -52 48 240 -56 70 102 103 -33 -51 232
7791 232 65 305 157 -101 -202 41 125 -261 -35 -107 195 -26 -169 49 -122 -143 -206 -180 32 209 1 323
7813 323 275 -343 -31 272 221 -6 87 126 -132 136 59 86 -3 23 45 78 70 -104 -51 173 151 153 -68 171 27
7838 27 92 -201 83 367 174 166 402 117 -153 211 -46 123 39 57 -138 152 -66 86 318 64 169 -111
7860 -111 33 -113 -91 -96 249 -417 -105 -102 54 358 -107 94 103 -473 144 201 97 7 -162 -168 17 83 -279 172
7884 172 306 69 -314 -1 -289 -193 -142 -285 -96 -62 27 -80 -213 122 -91 -49 276 -135 -165 -129 77 -168
7906 -168 14 -117 -118 -79 14 -44 -279 -89 34 -235 134 -26 -99 231 64 -11 48 24 -125 -129 -16 -81 20 93
7930 93 227 104 71 51 150 -149 -252 151 -18 -331 366 107 19 57 -37 -104 130 9 -110 -125 355 -61 -305
7953 -305 32 14 28 54 -12 38 -298 41 91 173 70 -7 66 -113 277 25 -168 -86 95 -265 148 267 -56
7976 -56 -255 105 4 125 167 -183 0 -97 108 -288 27 11 -169 -38 153 61 0 241 -79 178 30 148
7998 148 -229 22 212 -353 -92 -3 71 -31 134 281 -96 -237 133 -341 -347 -162 79 -41 -275 124 174 23
8020 23 98 54 -321 338 -159 -56 -161 -136 -246 -1 -129 -44 -118 -4 -112 -60 -166 180 1 30 20 81 -100
8043 -100 -47 93 -400 -129 -19 14 -92 146 -299 -180 132 -5 234 32 21 111 -116 315 -150 224 254 71
8065 71 -121 -315 206 -195 -162 27 -36 251 45 168 109 -24 -173 -331 36 -28 42 62 -151 198 -129 -58 69
8088 69 -170 -309 -133 -72 -26 202 45 -62 -310 9 121 98 -92 239 71 -201 342 161 -60 203 -36
8109 -36 3 86 -8 135 60 1 -201 -6 59 -136 40 33 105 214 106 66 -307 19 102 144 -141 310 129 -47
8133 -47 -15 1 135 -120 -81 195 -68 226 -127 91 121 36 80 -126 -16 -159 55 -240 1 209 -39 -136 -126
8156 -126 -114 158 31 -48 -35 188 76 -33 110 -412 -88 73 -222 -39 -155 50 56 -97 94 -244 17 -230
8178 -230 7 -235 -184 53 109 87 223 -14 -156 -69 127 -138 405
8191D05
##END NTUPLES=NMR FID
##END=
