##TITLE=1H_TG-2288-1
 CDCl3, 8 sc, 
 4.6.2020
##JCAMPDX= 6.0         $$ Bruker NMR JCAMP-DX V2.0
##DATA TYPE= NMR FID
##DATA CLASS= NTUPLES
##ORIGIN= UXNMR, Bruker Analytische Messtechnik GmbH
##OWNER= root
$$ XWIN-NMR		Version 3.5
$$ Thu Jun  4 11:51:15 2020 Russian Standard Time (UT+4h)  she@DPX200
##.OBSERVE FREQUENCY= 200.1315
##.OBSERVE NUCLEUS= ^1H
##.DELAY= (6, 6)
##.ACQUISITION MODE= SIMULTANEOUS
##.ACQUISITION SCHEME= undefined
##.AVERAGES= 8
##.DIGITISER RES= 18
##SPECTROMETER/DATA SYSTEM= spect
##.PULSE SEQUENCE= zg30
##.SOLVENT NAME= D2O
##.SHIFT REFERENCE= (INTERNAL, D2O, 0, 15.7039)
##AUDIT TRAIL= $$ (NUMBER, WHEN, WHO, WHERE, WHAT)
$$ ##TITLE= Audit trail, XWIN-NMR		Version 3.5
$$ ##JCAMPDX= 5.01
$$ ##ORIGIN= Bruker BioSpin GmbH
$$ ##OWNER= she
$$ F:/spectra/data/she/nmr/H-F/1/audita.txt
$$ ##AUDIT TRAIL=  $$ (NUMBER, WHEN, WHO, WHERE, WHAT)
(   1,<2020-06-04 11:50:07.15 +0400>,<she>,<DPX200>,
      <created by zg, POWCHK disabled, PULCHK disabled
       configuration hash MD5:
       00 E9 B6 7A A2 85 ED C7 34 08 36 98 17 FE 4E 26
       data hash MD5: 16K
       F7 CA 4F 71 61 22 07 26 AB CB 4C 8C 97 CC 8F 28>)
$$ ##END=
$$ 
$$ hash MD5
$$ A4 F8 B6 8F 97 F3 29 3E C2 42 78 1F BB DF 7B 3D
##$RELAX= 
##$RELAX= 
##$RELAX= 
##$RELAX= 
##$RELAX= 
##$RELAX= 
$$ Bruker specific parameters
$$ --------------------------
##$DU= <F:/spectra>
##$EXPNO= 1
##$NAME= <H-F>
##$PROCNO= 1
##$TYPE= <nmr>
##$USER= <she>
##$AMP= (0..31)
100 100 100 100 100 100 100 100 100 100 100 100 100 100 100 100 100 100 
100 100 100 100 100 100 100 100 100 100 100 100 100 100 
##$AQSEQ= 0
##$AQ_mod= 1
##$AUNM= <au_zg>
##$AUTOPOS= <>
##$BF1= 200.13
##$BF2= 200.13
##$BF3= 200.13
##$BF4= 200.13
##$BF5= 200.13
##$BF6= 200.13
##$BF7= 200.13
##$BF8= 200.13
##$BYTORDA= 1
##$CFDGTYP= 0
##$CFRGTYP= 5
##$CHEMSTR= <none>
##$CNST= (0..31)
1 1 145 1 1 1 1 1 1 1 1 1 1 1 1 1 1 1 1 1 1 1 1 1 1 1 1 1 1 1 1 1 
##$CPDPRG= <>
##$CPDPRG1= <>
##$CPDPRG2= <>
##$CPDPRG3= <>
##$CPDPRG4= <mlev>
##$CPDPRG5= <mlev>
##$CPDPRG6= <mlev>
##$CPDPRG7= <mlev>
##$CPDPRG8= <mlev>
##$CPDPRGB= <>
##$CPDPRGT= <>
##$D= (0..31)
0 1.2 0 0 0 0 0 0 0 0.06 0 0.03 0 0 0 0 0.0002 0 0 0 0 0 0 0 0 0 0 0 0 
0 0 0 
##$DATE= 1591257006
##$DBL= (0..7)
120 120 120 120 120 120 120 120 
##$DBP= (0..7)
150 150 150 150 150 150 150 150 
##$DBP07= 0
##$DBPNAM0= <>
##$DBPNAM1= <>
##$DBPNAM2= <>
##$DBPNAM3= <>
##$DBPNAM4= <>
##$DBPNAM5= <>
##$DBPNAM6= <>
##$DBPNAM7= <>
##$DBPOAL= (0..7)
0.5 0.5 0.5 0.5 0.5 0.5 0.5 0.5 
##$DBPOFFS= (0..7)
0 0 0 0 0 0 0 0 
##$DE= 6
##$DECBNUC= <off>
##$DECIM= 24
##$DECNUC= <off>
##$DECSTAT= 4
##$DIGMOD= 1
##$DIGTYP= 9
##$DL= (0..7)
0 120 120 120 120 120 120 120 
##$DP= (0..7)
150 150 150 150 150 150 150 150 
##$DP07= 0
##$DPNAME0= <>
##$DPNAME1= <>
##$DPNAME2= <>
##$DPNAME3= <>
##$DPNAME4= <>
##$DPNAME5= <>
##$DPNAME6= <>
##$DPNAME7= <>
##$DPOAL= (0..7)
0.5 0.5 0.5 0.5 0.5 0.5 0.5 0.5 
##$DPOFFS= (0..7)
0 0 0 0 0 0 0 0 
##$DQDMODE= 0
##$DR= 18
##$DS= 0
##$DSLIST= <SSSSSSSSSSSSSSS>
##$DSPFIRM= 0
$$ [...]
##$SUBNAM2= <"">
##$SUBNAM3= <"">
##$SUBNAM4= <"">
##$SUBNAM5= <"">
##$SUBNAM6= <"">
##$SUBNAM7= <"">
##$SUBNAM8= <"">
##$SUBNAM9= <"">
##$SW= 24.9337058887773
##$SWIBOX= (0..15)
0 0 2 0 0 0 0 0 0 0 0 0 0 0 0 0 
##$SW_h= 4990.01996007984
##$TD= 16384
##$TD0= 1
##$TE= 0
##$TE2= 300
##$TE3= 300
##$TEG= 300
##$TL= (0..7)
0 120 120 120 120 120 120 120 
##$TP= (0..7)
150 150 150 150 150 150 150 150 
##$TP07= 0
##$TPNAME0= <>
##$TPNAME1= <>
##$TPNAME2= <>
##$TPNAME3= <>
##$TPNAME4= <>
##$TPNAME5= <>
##$TPNAME6= <>
##$TPNAME7= <>
##$TPOAL= (0..7)
0.5 0.5 0.5 0.5 0.5 0.5 0.5 0.5 
##$TPOFFS= (0..7)
0 0 0 0 0 0 0 0 
##$TUNHIN= 0
##$TUNHOUT= 0
##$TUNXOUT= 0
##$USERA1= <user>
##$USERA2= <user>
##$USERA3= <user>
##$USERA4= <user>
##$USERA5= <user>
##$V9= 5
##$VALIST= <valist>
##$VCLIST= <CCCCCCCCCCCCCCC>
##$VD= 0
##$VDLIST= <DDDDDDDDDDDDDDD>
##$VPLIST= <PPPPPPPPPPPPPPP>
##$VTLIST= <TTTTTTTTTTTTTTT>
##$WBST= 1024
##$WBSW= 4
##$XGAIN= (0..3)
0 0 0 0 
##$XL= 0
##$YL= 0
##$YMAX_a= 198483
##$YMIN_a= -96103
##$ZGOPTNS= <>
##$ZL1= 120
##$ZL2= 120
##$ZL3= 120
##$ZL4= 120
##$ABSF1= 10
##$ABSF2= 0
##$ABSG= 5
##$ABSL= 3
##$ALPHA= 0
##$AQORDER= 0
##$ASSFAC= 0
##$ASSFACI= 0
##$ASSFACX= 0
##$ASSWID= 0
##$AUNMP= <proc_1d>
##$AZFE= 0.1
##$AZFW= 0.1
##$BCFW= 1
##$BC_mod= 2
##$BYTORDP= 1
##$COROFFS= 0
##$CY= 11.3945322036743
##$DATMOD= 1
##$DC= 2
##$DFILT= <>
##$DTYPP= 0
##$F1P= 16.9975609425685
##$F2P= -3.02152046262296
##$FCOR= 0.5
##$FTSIZE= 0
##$FT_mod= 4
##$GAMMA= 1
##$GB= 0.15
##$INTBC= 1
##$INTSCL= 1
##$ISEN= 128
##$LB= 0.24
##$LEV0= 0
##$LPBIN= 0
##$MAXI= 10000
##$MC2= 0
##$MEAN= 0
##$ME_mod= 0
##$MI= 1.114404
##$NCOEF= 0
##$NC_proc= 0
##$NLEV= 6
##$NOISF1= 3.799351
##$NOISF2= 2.8
##$NSP= 1
##$NTH_PI= 0
##$NZP= 0
##$OFFSET= 15.70392
##$PC= 1
##$PHC0= -9796.556
##$PHC1= 18.60082
##$PH_mod= 1
##$PKNL= yes
##$PPARMOD= 0
##$PSCAL= 0
##$PSIGN= 0
##$REVERSE= no
##$SF= 200.130013532006
##$SI= 16384
##$SIGF1= 3
##$SIGF2= 2
##$SINO= 400
##$SIOLD= 16384
##$SREGLST= <1H.CDCl3>
##$SSB= 0
##$STSI= 0
##$STSR= 0
##$SW_p= 3612.71676300578
##$SYMM= 0
##$S_DEV= 0
##$TDeff= 0
##$TDoff= 0
##$TI= <>
##$TILT= no
##$TM1= 0
##$TM2= 0
##$TOPLEV= 0
##$USERP1= <user>
##$USERP2= <user>
##$USERP3= <user>
##$USERP4= <user>
##$USERP5= <user>
##$WDW= 1
##$XDIM= 8192
##$YMAX_p= 0
##$YMIN_p= 0
$$ End of Bruker specific parameters
$$ ---------------------------------
##NTUPLES= NMR FID
##VAR_NAME=  TIME,          FID/REAL,        FID/IMAG
##SYMBOL=    X,             R,               I
##VAR_TYPE=  INDEPENDENT,   DEPENDENT,       DEPENDENT
##VAR_FORM=  AFFN,          ASDF,            ASDF
##VAR_DIM=   8192,          8192,            8192
##UNITS=     SECONDS,       ARBITRARY UNITS, ARBITRARY UNITS
##FACTOR=    0.0002004,     1,               1
##FIRST=     0,             0,               0
##LAST=      1.6414764,     0,               0
##MIN=       0,             -96103,          0
##MAX=       1.6414764,     198483,          0
$$ Real data points
##PAGE= N=1
##DATA TABLE= (X++(R..R)), XYDATA
0 0 0 0 0 0 0 0 0 0 -4 7 -8 8 -8 8 -16 16 -21 24 -30 33 -39 47 -53 61 -72 83 -93 107 -122 136 -155 172
32 172 -192 216 -240 271 -300 333 -371 411 -455 503 -556 618 -684 757 -840 936 -1044 1171
50 1171 -1316 1492 -1706 1972 -2317 2780 -3437 4454 -6243 10352 -42770 40114 73816 -76262
64 -76262 -96103 -50523 -10314 -25503 -49595 -74445 -52899 -2161 -18967 -58969 -58846 -46322 -11707
77 -11707 11647 -2905 -61415 -28729 36092 -4575 -60015 -35521 21616 22236 12280 293 -28392
90 -28392 16477 61882 30353 -24103 6994 54513 24799 5957 1520 11194 49039 64961 16238
103 16238 -30093 39297 90649 41176 -15367 -25735 16065 51274 53781 -9538 -31394 37074
115 37074 50447 6532 -7848 19294 10022 5514 34546 -5563 -43604 -7755 38473 13145
127 13145 -22404 5749 24701 28401 3200 -38482 -23926 36873 53364 -18492 -35414 4134
139 4134 13567 17895 20311 11731 -2845 31072 35058 -22378 -20166 20062 28595 3441 6078 7967
153 7967 -4840 24705 25108 -7717 -7246 18012 12609 -15136 -1166 -12802 -28787 -1644 13846
166 13846 -7487 -23665 1183 -8002 -24182 -10161 -20828 -28643 -20368 -19329 -45990 -28596 17718
179 17718 -15312 -54232 -32296 2578 -8103 -22095 -16411 -36186 -29805 -10074 -15904 -20283 -8748
192 -8748 426 -14469 8185 16647 -22092 -22592 11028 19843 -6642 -661 4950 -6987 18814 30257
206 30257 6549 -4607 33985 41225 5119 1787 -45 4482 28038 38398 8800 -12096 24190
219 24190 29517 17344 24423 16617 -366 7317 35120 7354 -16162 10203 21406 16220 13638
232 13638 15090 4146 17926 30068 -11745 -12107 28331 32343 -11919 -16854 21565 22416 21716 14918
246 14918 -34 8798 33453 27667 -12883 -1161 20766 14791 16371 12572 1140 4893 45214
259 45214 36289 -13036 -5856 23619 29898 9995 -1147 -13872 -3233 41600 25281 -18320 -15364
272 -15364 25908 29287 160 -11500 -21298 667 26635 -4124 -41607 -18908 33213 11639
284 11639 -25651 -21950 -6736 11449 8789 -19221 -48366 -17340 22745 -4289 -28068 -21216 -5337
297 -5337 1998 10357 -6114 -42524 -12182 23658 1729 -36037 -27897 4784 10769 8888 -16723
310 -16723 -27341 16247 35141 -6661 -42839 -6001 21370 6728 -4654 -18675 -10652 17891
322 17891 30618 -8559 -28023 17693 31454 3253 -21753 -15030 772 18905 22817 -19378
334 -19378 -21709 21768 35758 3809 -18255 -5784 2871 23290 21561 -25109 -32072 11537 40193
347 40193 6833 -17016 -1320 12842 29510 9578 -26113 -20031 26186 31037 -19167 -20750 9239
360 9239 20712 11914 1144 -5364 -2823 27275 15604 -20196 -13735 10279 13791 -1070 4378
373 4378 -5741 729 27662 12419 -18883 -14267 20625 15460 -9278 -8296 -11221 5558 21311
386 21311 7123 -23690 -8245 31684 16412 -11233 -17776 -9911 4241 13114 35 -28326 -1208
399 -1208 29496 5589 -19587 -8918 11351 4413 3988 -3971 -23190 -5514 9081 -3151 -14468
412 -14468 1055 8422 -3121 4490 -3621 -22188 -9985 11749 335 -24850 -8252 773 -4573
425 -4573 -3137 -7644 -9861 1958 16953 -9270 -26380 -3974 1367 -10273 -10495 1468 -5557 -1330
439 -1330 12143 -6676 -11390 3721 7622 -7710 -5587 6935 -8547 -7444 5210 2169 -3172
452 -3172 7940 13274 -2103 6249 6486 -12049 -6455 10776 4761 -13542 3955 14616 -1797
465 -1797 -480 2073 -197 1237 11703 -552 -15614 1855 -431 -10011 -1742 9099 -1395 -6332
479 -6332 15108 3578 -14989 -8776 2133 2226 -3401 -1343 -14792 -3813 17991 3609 -14120
492 -14120 -1448 21390 7602 -4720 -4065 -11619 2920 15583 4544 -13293 4879 27179 6857
505 6857 -1713 3834 4755 10577 15728 4423 -15935 5645 19373 2645 -787 6644 12382 11308
519 11308 18837 -1020 -21376 2691 20242 3854 -17100 -4547 7134 8100 6555 -15344 -14448
532 -14448 14311 23280 -13059 -32335 -4060 4376 -2825 -10782 -14183 -8058 10702 16364 -20011
545 -20011 -24018 1898 7991 -1469 -12101 -15448 -13973 9100 13346 -17657 -18133 11116 21521 699
559 699 -11156 -9550 -5966 14615 7809 -21142 -17691 17488 25385 -7441 -13989 -3929 9084 16876
573 16876 -1278 -24578 -14907 21441 11288 -24949 -19209 4654 14848 4710 -5940 -20483
585 -20483 -10331 15329 -1801 -26108 -19542 3108 5758 -3800 -9546 -23923 -4641 21392 6717
598 6717 -26625 -20225 11316 6417 -8143 -17063 -13862 10470 24445 4955 -25103 -2810 27487
611 27487 13229 -5680 -8644 2794 13389 19437 246 -15696 14350 33659 15975 -5673
623 -5673 2637 15161 14402 16855 -1347 -11398 11798 26539 8996 -7948 7872 14200 13646 13933
637 13933 -4093 -11035 8165 24305 -2218 -20644 762 14171 12329 1571 -7991 -5766 14857
650 14857 17924 -15328 -19347 6926 15527 -606 -6539 -1612 -1644 13843 16311 -3907 -5435 10740
664 10740 15688 -2907 -2923 2122 1949 16885 16251 849 -4222 18152 20370 1684 4527 6291 6006
679 6006 10685 11367 -3863 -6300 20428 18764 1040 1007 9574 8823 4172 5245 -6919 -3133 13148
694 13148 4075 -9386 -2140 12406 2497 -1806 6328 -2778 -3696 2671 1674 -9274 -3280 5574 -4464
709 -4464 1465 7502 -100 -3315 10294 12638 -7266 -1932 7472 2654 2391 5955 5373 2526 16105
724 16105 14814 1564 8682 13792 8670 5333 13766 7186 -1270 14316 14809 7217 8497 15306 10135
739 10135 8549 19093 3950 -3794 9754 15783 2994 -3235 8661 8092 10696 11143 -1019 -497
753 -497 12829 14940 -8922 -7767 8477 4815 1467 2097 1156 -970 12219 13808 -5429 -2460 7769
768 7769 6392 155 1629 -1079 -3360 15342 17212 -3133 -3458 14418 18309 4307 2756 412
782 412 4495 18383 8458 -8049 -1355 24596 20991 2142 3328 6308 12672 15990 6895 -8975
796 -8975 787 23248 9737 -7276 -1136 12398 15543 11891 5130 -9464 655 18774 5785
809 5785 -10302 -4816 10556 8576 8628 -814 -11281 7105 24905 9099 -17666 -7834 12088 9582
823 9582 2483 -5977 -3942 12662 22522 3168 -16898 7441 22319 10024 -3362 -4011 2189 11137
837 11137 17803 801 -6578 13834 22703 8321 -4219 2806 8166 13437 14341 -7564 -11447 11371
851 11371 24213 4265 -6929 5164 10561 13808 5816 -9851 -10211 13274 22704 -6470 -16974
864 -16974 -269 13908 13160 1658 -7056 -5491 14621 10771 -16802 -14471 5906 13121 592
877 592 -4750 -6589 -4397 13589 10475 -6905 -9412 7440 8075 -7499 -5725 -5494 2565 13277 8569
892 8569 -11345 -9286 15438 12991 -4201 -6720 -1871 5459 7541 -483 -14709 -1666 22583 10435
906 10435 -8624 -8375 3609 5945 6044 -236 -14417 -2248 11413 2354 -11621 -2781 11726 4901
920 4901 464 -3200 -9503 -878 7480 2709 -11812 -2379 5426 -1461 -641 -1748 -1841 3523 12366 -2766
936 -2766 -17542 -2816 8689 2675 -5121 -1448 -358 2428 9517 -3767 -7725 6368 12433 -2496
950 -2496 -10602 -2145 -2096 1219 8725 1223 -4833 1725 8909 -1389 -2020 5001 -1341 -2804 3157 32
966 32 -7544 858 10391 1121 841 5021 -409 -4486 2005 1767 -6483 4011 5430 -5894 -5586 4950
982 4950 5409 -856 4024 1709 -5153 1262 2057 -4574 -4302 4997 436 -6186 3671 1820 -4212 1770
998 1770 9248 1810 -6909 -2542 -4620 -693 5802 2322 -8118 -688 12066 616 -4942 812
1012 812 1596 972 3697 -110 -11075 -2842 9640 2012 -901 1411 2487 -520 5230 4319 -7820
1027 -7820 773 7724 -587 -7240 -304 4700 2338 7672 624 -5178 2614 9872 -1717 -12469
1041 -12469 856 7445 987 -2558 -8194 -4018 8886 13714 -5192 -12061 3579 7833 -1355 -7648
1055 -7648 -5416 -3089 5237 9437 -8366 -12600 3016 11288 1882 -5470 -6593 -7306 3596 4780
1069 4780 -9457 -10794 4498 10844 -4459 -7990 -1720 1620 5632 495 -11005 -10544 9779 9040
1083 9040 -10794 -8428 5277 9929 3717 -3328 -8267 -3054 15099 5962 -14357 -10600 6496 8453
1097 8453 234 -2445 -7056 935 14515 5723 -11647 -10528 6985 6407 -2314 -4849 -8999 608
1111 608 12350 5940 -12485 -6368 13273 4962 -5620 -8425 -2562 4108 7122 -1676 -14494 893
1125 893 15504 4089 -8337 -3925 6317 5016 3808 -5871 -12373 4541 14732 3341 -10447
1138 -10447 -498 10687 6883 5567 -4154 -8040 3830 13755 2351 -12430 -126 8430 8805 2996
1152 2996 -3081 -4673 4756 13851 -3086 -12826 1565 9151 3178 -4562 -794 -631 7362 8623 -7541
1167 -7541 -7616 5307 8405 -6997 -8548 -1092 54 4464 2472 -7454 -6796 6961 9626 -6517 -6702
1182 -6702 -1807 1129 1925 565 -8650 -9285 9233 11080 -4419 -7436 456 3071 1662 1136 -6068
1197 -6068 -7753 7161 5522 -5070 -4865 4816 3878 3 3475 -1728 -810 3421 -468 -7229 -2279
1212 -2279 6204 -204 -3680 3587 1835 1165 3602 2422 -7127 -2651 6192 -1067 -3765 -1909 118
1227 118 -1534 4588 4413 -8288 -2420 7467 795 -6666 -2342 -397 -2508 4280 4204 -3833 -1035 6571
1243 6571 3305 -1856 3735 428 -4849 3204 4522 -785 -2012 6476 4972 2195 8344 2776 -2073
1258 -2073 4589 8814 -124 -2281 6645 1312 661 3544 2293 358 5262 8596 -2755 -939 6134
1273 6134 1937 -4103 -273 3660 -1360 3574 5727 -3838 -2879 5532 5911 -999 -1505 -1580 -3286 3951
1289 3951 2379 -7057 -6137 8021 8984 -3108 -2584 -1532 871 4815 1545 -7695 -5090 8936 5488
1304 5488 -5583 -1295 3783 3312 2372 4354 -4705 -1616 7673 1439 -6773 -1845 7866 3887 1579
1319 1579 1174 -3610 2398 8931 186 -8920 -2518 8182 3758 -1569 -4550 -5355 3372 12822 1743
1334 1743 -11478 -1487 9936 1824 -6245 -6147 -2109 3325 7279 -975 -10526 2900 10780 2930 -4716
1349 -4716 -2528 767 1800 5852 -3425 -7695 2910 11268 1776 -3855 2848 5111 3485 3572 -4064
1364 -4064 -4705 7274 11868 -3505 -7681 4180 9285 7115 1425 -1247 -482 11501 11044 -7748
1378 -7748 -9927 4638 12701 4825 -1923 -1843 2120 11538 7041 -6764 -7621 8515 10586 -3011 -3543
1393 -3543 -1724 1106 8601 6615 -3903 -5227 8750 7333 -3428 -4612 -388 2057 5441 2183
1407 2183 -6673 -4256 11512 7917 -5285 -4546 4102 6673 1385 -1225 -9660 -931 10268 4468
1421 4468 -6869 -2629 7904 4646 1332 -1757 -5856 1748 8502 1604 -7814 -2091 6019 1300
1435 1300 -1787 676 -1149 2018 6400 188 -11941 -3442 5229 794 -2531 -1085 -1102 1665 5788
1450 5788 -2074 -9068 1047 8248 -401 -8892 -3686 -893 -262 2208 -4351 -5152 2561 6190 -4157
1465 -4157 -9130 -194 563 -999 -171 -3152 -6303 36 7148 -2575 -4965 473 1450 -742 962 87
1481 87 -6290 -1050 4255 -1865 -2770 2781 4520 -357 844 380 -4823 1774 3115 -3644 -3778 3605
1497 3605 3222 -3634 526 3463 -229 1875 4283 -164 -3210 2989 -285 -3616 2464 2622 1105
1512 1105 482 5964 837 -2839 3139 3543 -270 315 1386 -3832 25 6266 419 -1833 4224 4232
1528 4232 483 1024 3107 -4169 1500 6024 891 -3861 1537 3758 -1046 2916 3995 -1520 1254
1543 1254 5248 922 -5606 605 2573 -55 1623 -486 -1927 2676 8000 625 -6853 2053 4372
1558 4372 -851 -2080 -556 -1947 1357 5673 -3272 -3977 4346 5726 -2612 -4239 710 -999 271
1573 271 2393 -4165 -5615 2635 5725 -1905 -5091 140 50 1792 802 -6651 -7796 2975 5016 -6386
1589 -6386 -6066 1263 3331 1640 -1589 -6216 -4914 6094 4450 -8311 -7044 2539 4290 -691 -2082
1604 -2082 -3829 -1015 6997 3449 -8049 -5027 5030 3506 -3846 -1339 -1815 1317 6665 3048 -6358
1619 -6358 -3698 8582 5043 -3868 -4644 -1572 3348 5531 2062 -7141 -236 10982 4639 -4687 -3808
1634 -3808 4222 3878 2621 -1186 -7228 2050 9795 2174 -6518 58 7867 3913 1955 -2628 -4805
1649 -4805 3267 9089 2441 -6324 1003 7102 4084 1008 -844 -951 4651 8790 -1061 -7856 1714
1664 1714 7573 3699 -896 240 1775 6584 8272 -2620 -6794 4569 8917 -168 -5290 -178
1678 -178 1984 5142 4556 -2443 -2992 5549 7625 -2689 -4505 1331 1533 1079 55 -2939 -3368 5234
1694 5234 6717 -3870 -4512 1103 2507 -456 -935 -4929 -4935 3847 2339 -7109 -6570 3449 5103 -1297
1710 -1297 -2627 -5440 -3543 2407 280 -6837 -4829 5561 1742 -4666 -2810 -1729 683 3575 2384
1725 2384 -6297 -5259 1974 -1106 -2999 -1038 573 -1058 2286 1847 -5054 -2481 3702 1868 -2807
1740 -2807 -1589 1020 -2338 1203 979 -3444 1123 6271 817 -6051 -782 2408 -1361 -450 194 -2427
1756 -2427 -883 3548 -331 -4151 2351 3191 -1256 -1460 1405 -1390 -1358 3932 -728 -4282 741 3217
1772 3217 526 2160 3370 -1910 -1904 2729 1445 -1886 1161 4141 587 542 2691 -752 1405 5276
1788 5276 3907 -799 402 1732 -2071 483 4114 1065 615 3904 3733 -1820 -769 1426 1193 3188
1804 3188 2696 -2397 -5220 2262 2424 -3266 464 2716 1642 55 -152 -4057 -3151 3513 1455 -4302
1820 -4302 -2814 1867 -262 -2657 229 -1966 -1253 3140 -645 -5674 -3474 2983 -1143 -2770 -687
1835 -687 -2681 -164 3652 941 -5509 -1675 3550 -532 -4322 -2686 -517 1727 2798 -1461 -7842
1850 -7842 474 6990 1214 -4553 -2271 588 -68 614 -4066 -5772 2629 6676 -406 -7100 -1922
1865 -1922 765 693 1911 -2236 -4881 -388 3532 -2838 -7097 -329 3918 2424 286 -4090 -4056 433
1881 433 4664 -2519 -5988 1244 3699 908 -2317 -1477 -841 5443 4939 -3598 -4645 2679 5135 -1961
1897 -1961 -2933 1418 2763 4845 2706 -3051 -1933 6138 5475 -3065 -3234 681 3359 3697 1257 -3240
1913 -3240 -2240 7532 6680 -2641 -2919 2316 4207 2081 -1279 -6025 -1369 7482 4505 -4543 -4315 4119
1929 4119 3348 -838 -1509 -3286 806 5322 274 -7325 -4033 3943 3717 17 -1293 -1709 370 3162
1945 3162 952 -5497 -772 4668 926 -1808 -1895 291 1142 3093 972 -4837 -17 4672 -80 -5191
1961 -5191 -1539 2078 1927 2173 -1796 -4336 1777 6321 -1042 -5704 -444 2345 -78 -1991 -3234
1976 -3234 -2907 1064 4485 -3092 -5308 919 2283 -472 -3015 -2983 -4435 531 3980 -2941 -5576 -456
1992 -456 2619 -392 -1654 -2190 -3879 551 2287 -2403 -5368 -59 2685 -1354 -668 412 -1133 881
2008 881 1266 -1610 -3658 2100 1594 -2297 -661 1559 162 -564 1476 640 -1036 2777 918 -2229
2024 -2229 -609 2465 -531 -1245 1961 -26 -904 2726 1841 -2056 -1134 2078 -204 -1038 813 -1820
2040 -1820 -1457 1907 2752 -1564 -321 2588 -229 -803 845 43 -2053 457 2215 -1853 293 1352
2056 1352 -543 618 3266 1053 -2507 1319 3099 -1145 -1291 1302 845 1276 3236 -352 -2631 3246
2072 3246 3978 -239 -2860 1111 462 -463 1247 -1255 -1867 2379 3598 -826 -2098 1324 -578 174
2088 174 873 -2046 -3250 500 3629 -2036 -3482 413 809 548 -361 -1838 -4201 931 2463 -3559
2104 -3559 -3578 306 1156 -1297 -867 -1075 -1930 1853 532 -4360 -3080 2682 576 -4277 -2420 -433
2120 -433 439 2221 384 -3969 -3152 3319 1438 -4649 -2622 -196 924 1580 433 -5377 -2236 5355
2136 5355 2963 -3508 -3710 635 1844 905 -1372 -5899 -544 6167 2781 -3949 -2502 2396 1367
2151 1367 287 -973 -2736 442 3649 607 -4497 -230 3610 1704 266 -6 -43 474 3254 -451
2167 -451 -4667 1089 4795 1713 -1222 -131 1185 2849 4653 -1128 -3210 2200 6486 514 -4308
2182 -4308 -396 2341 3794 3724 -1336 -2519 3177 6137 -1429 -4378 1072 2214 2537 854 -2039 -2117
2198 -2117 3164 5219 -1720 -2504 1378 3277 613 -668 -2351 -2360 2929 3997 -2186 -3263 1515 3918
2214 3918 -423 -1488 -1921 -983 3647 2112 -4374 -4622 2202 3298 -1122 -1744 -410 558 1920 116
2230 116 -4132 -3555 2419 1078 -2702 -1224 62 -503 -178 998 -2684 -1489 2438 -355 -3670 -2548
2246 -2548 669 -1757 -1009 38 -1920 255 2775 -43 -4882 -2043 2218 467 134 -1491 -3287
2261 -3287 132 3053 494 -4173 169 3576 420 -1459 -1596 -1633 -978 2603 543 -2590 520 2078
2277 2078 623 -704 816 -922 -1065 2482 685 -2094 -917 1446 -136 34 1975 -193 -845 1783
2293 1783 694 -2164 -432 1955 -1407 -686 1928 877 -302 -170 448 -1072 1612 2316 -1771 -1043
2309 -1043 1249 242 -1883 194 1458 -1394 843 1877 -164 -1063 164 -390 -1301 1961 932 -2698
2325 -2698 -735 1985 192 -1902 773 592 -116 1226 -457 -3173 -1820 1665 172 -1548 291
2340 291 -765 -1447 585 253 -3037 -1770 1853 -892 -2347 -1540 -1597 -1546 467 573 -3419 -1485 1971
2357 1971 -795 -3552 -1752 -58 -665 -377 -2010 -4009 -139 2638 -467 -4127 -984 1184 -502
2372 -502 -526 -1801 -3295 -737 2422 -924 -3534 395 1756 -1 -241 -1181 -1850 -190 2763 -898
2388 -898 -3751 155 1535 122 -1661 -517 -676 1601 2270 -3007 -3832 479 2715 -1699 -2839 441
2404 441 688 1675 116 -3486 -2882 2998 3295 -2819 -3865 -692 846 1071 -107 -2242 -2387 3173 3224
2421 3224 -2296 -2515 127 1784 873 -196 -2618 -2054 3383 3000 -2421 -2818 1963 2831 -163 -884 -2630
2438 -2630 -479 3168 1174 -3536 -2012 3294 1969 -1145 -1185 -38 704 1483 -779 -4261 -902 3514
2454 3514 380 -2588 -2043 470 1115 1980 -583 -4282 -837 3166 335 -3708 -2351 78 639 1431
2470 1431 -902 -3522 265 3529 215 -4384 -1412 1751 836 -163 -1788 -1682 960 3878 -529 -3547
2486 -3547 933 2506 270 -1046 -470 -634 852 2634 -1258 -2542 1276 2818 126 -1103 -6
2501 -6 -724 697 2105 -1193 -2903 441 3289 -406 -1588 -402 -68 1337 1164 -1946 -3288 991
2517 991 2181 -1980 -1731 595 801 -105 87 -1062 -1366 1690 1317 -1973 -1603 1116 710 -535 489
2534 489 -540 -988 1857 1642 -1053 -1314 1406 577 -461 949 -345 -693 1769 1909 -1409 -605 2766
2551 2766 1177 -925 -228 -404 -437 1156 957 -2336 -438 1491 441 -854 508 1010 -1281 284
2567 284 942 -1435 -972 548 85 -1103 1269 790 -1616 27 1081 -490 -1082 861 44 -1811 657
2584 657 4 -802 1203 2008 -907 -1563 1392 299 -541 765 525 -881 -32 1444 -461 -265 2032
2601 2032 950 47 313 125 -1053 756 2212 -1284 -1302 1007 1329 -711 -529 168 -114 1547 1091
2618 1091 -2198 -2439 1351 1541 -1547 -684 91 -210 772 474 -1704 -1405 1775 723 -2621 -1290 -51
2635 -51 123 549 633 -1275 -1317 2184 1212 -2167 -836 1031 463 146 80 -1775 -385 3407 1464 -1752
2653 -1752 -1464 2095 982 -801 -700 -1445 1291 2462 746 -3138 -573 2799 817 -538 -823 -908
2669 -908 1149 1681 472 -3382 217 2917 290 -1732 -1167 -84 527 2220 -1045 -3172 -210 3237
2685 3237 -21 -1916 -775 304 1247 1584 -2080 -2379 1728 3259 -427 -2789 -334 1256 545 177
2701 177 -1005 -996 2296 2901 -1782 -2592 1366 2375 436 -732 -716 -1476 1554 2133 -1376 -2014 1569 2435
2719 2435 -504 -1073 -1104 -803 1923 1469 -2536 -3156 1288 2366 -877 -1454 -596 33 1161 237 -2960
2736 -2960 -2268 2344 1608 -2399 -1640 443 639 100 129 -1882 -789 2288 278 -2530 -1310 1287 772
2753 772 254 245 -1753 -405 2308 1308 -2036 -1310 1514 613 -288 -732 -1378 155 2476 901 -2694
2770 -2694 -585 2416 486 -764 -672 -683 -166 1203 -390 -2572 428 2211 -143 -1769 -51 -76 -441
2787 -441 800 -274 -1671 -37 1451 -342 -1700 663 382 -260 877 -351 -2071 -313 1895 -390
2803 -390 -1497 352 741 441 692 400 -1266 887 2210 -662 -1589 655 919 -558 390 942 -1060
2820 -1060 -76 922 -602 -931 553 521 -1506 108 553 -1389 -690 1130 -180 -1243 323 -170 -1213
2837 -1213 -196 -247 -1561 -631 477 -999 -2072 354 410 -845 -138 -18 -1100 -783 987 -982 -1667
2854 -1667 4 284 -981 -157 598 -1201 -308 1532 7 -1413 -653 432 -905 -177 248 -1565 -361
2871 -361 1824 -260 -2167 -155 1067 -597 -429 -728 -1496 -439 968 -503 -2195 277 884 -1174
2887 -1174 -717 -103 -916 -956 820 -864 -2427 544 1123 -661 -982 -19 -482 -70 1341 -1187 -2240
2904 -2240 321 1806 -404 -1914 65 571 904 893 -1519 -1753 1563 2483 -1134 -1924 704 751 389
2921 389 152 -860 -819 1690 1705 -1695 -1454 891 871 -197 -46 -876 -1001 1294 904 -1848 -1801 1079 1113
2940 1113 -957 -1105 -1575 -607 1611 474 -2327 -1722 1946 1321 -1860 -1639 -825 612 810 -171 -2941
2957 -2941 -1062 2106 696 -1907 -963 158 666 868 -44 -2281 -830 2086 280 -2200 -775 1368
2973 1368 484 579 -391 -1631 205 2304 642 -2285 -1001 1373 731 -146 -742 -1461 676 2183 -615
2990 -615 -3231 -61 1966 432 -1141 -974 -645 336 1441 -1178 -2242 470 1787 -343 -1854 -476
3006 -476 -481 -10 1278 -1116 -1745 557 1676 -475 -1262 147 260 693 861 -1022 -1683 625 1848 -1244
3024 -1244 -1407 529 753 566 210 -566 -1123 1300 1365 -2010 -1118 792 642 -387 -570 -288 -784 1222
3042 1222 574 -1370 -1437 945 305 -1316 -426 -757 -370 565 860 -1361 -1506 908 189 -1003 -399 -749
3060 -749 -409 469 687 -1644 -885 1558 871 -896 -233 669 -306 496 315 -971 -91 1669 777 -872
3078 -872 332 1061 -193 559 1142 10 -483 944 498 -718 646 1127 128 675 955 83 -246 1300
3096 1300 615 -921 291 926 238 -208 479 -260 15 1698 337 -780 527 601 -907 124 882
3113 882 -315 -458 1339 939 -430 91 760 -234 571 1005 -437 -728 1024 1181 -1050 -143 1113 320
3131 320 1025 655 -784 -695 1437 885 -1303 65 746 14 -322 704 -194 -490 1245 605 -1045 -363
3149 -363 399 -394 -462 185 -767 -370 1153 708 -1196 -1044 747 -113 -1023 -144 -884 -232 892 -368 -2257
3168 -2257 -731 1649 489 -969 -325 -449 27 411 -337 -1892 130 1995 122 -1216 -302 247 424
3185 424 1652 257 -1442 309 1582 -83 -1161 -84 782 521 950 -256 -1139 621 1949 -33
3201 -33 -1870 433 1264 327 97 -153 -512 1086 2240 -809 -1582 879 1577 -3 -434 -258 -382 1256
3219 1256 1731 -854 -964 1246 1487 -158 -246 238 -189 1298 1278 -1036 -1216 953 1573 -341 -506 545
3237 545 617 993 570 -930 -947 2105 1796 -1255 -995 570 1075 440 -184 -1102 -595 1735 666 -2121
3255 -2121 -809 759 680 -74 -229 -1369 -633 1199 20 -1849 -1488 859 -298 -664 -452 -1541 -239
3272 -239 939 216 -2041 -1058 729 155 -754 -662 -809 283 721 83 -1584 -109 1212 251 -1169 -197
3290 -197 350 6 134 -555 -1233 503 1288 -471 -926 202 1024 16 288 -504 -1207 -26 1283 -215
3308 -215 -1046 53 483 270 505 -619 -949 367 1673 -515 -1650 108 1125 -241 -54 262 -555
3325 -555 955 1472 -738 -761 994 974 -245 73 1236 -258 289 868 60 -464 885 963 -713 313
3343 313 597 372 -168 889 235 -954 814 1121 -150 707 327 260 119 799 -97 -1089 510 870 -212
3362 -212 3 404 -3 -166 549 -302 -788 242 123 -631 -182 92 -571 -516 556 -291 -666 -274 436 -665
3382 -665 141 220 -678 -175 289 -527 -675 376 764 -610 -1090 441 161 -120 275 -719 -1153 576 983
3401 983 -593 -1219 441 -18 -194 341 -870 -1176 61 479 -351 -838 80 -129 18 467 -729 -1211
3419 -1211 66 1200 -846 -967 158 -8 -142 -15 -834 -854 515 794 -1109 -859 954 392 -317 71
3437 71 23 -29 785 871 -292 -42 1090 737 -48 -247 597 589 1265 811 -1325 -526 1942 1662 67 -136
3457 -136 483 779 808 354 -1247 -78 1677 798 -893 -124 887 378 541 524 -794 204 1645 483
3475 483 -1034 -135 976 1083 798 267 -636 432 1194 451 -685 -102 998 430 445 -127 128 753 1238
3494 1238 112 -964 526 1867 419 -636 -314 144 655 1397 61 -1517 276 1668 -27 -609
3510 -609 54 41 288 846 -337 -940 310 944 -982 -903 562 527 142 -12 -855 -1143 306 1330 -326
3529 -326 -902 -392 624 217 -567 -687 -422 513 658 -1549 -1565 -66 701 -327 -391 -338 -388 855 -57 -952
3549 -952 -987 619 471 -438 -305 52 -65 979 677 -430 -665 521 262 -824 -286 -169 117 98 298
3568 298 -641 -323 1071 414 -1087 -560 575 468 363 140 -932 164 957 320 -883 -424 864 -25
3586 -25 94 203 -723 -13 853 222 -584 899 929 121 -19 411 -109 414 1256 988 -227 178 583 387
3606 387 349 1224 140 631 1566 957 -561 -8 1124 657 159 404 136 615 692 275 -177 696 947 132
3626 132 -355 492 133 -83 425 -220 -692 -155 682 -509 116 339 48 -406 288 142 -1033 267 570
3645 570 232 -110 48 165 -157 475 57 -1123 -268 673 40 -413 512 70 -387 696 398 -278 -130
3664 -130 655 -125 -94 37 -184 -731 41 457 -488 -227 869 -139 -703 -476 -502 119 552 285 -1202 -28
3684 -28 1016 -345 -622 -172 308 -261 -63 -84 -702 314 459 122 -1016 114 88 -499 249 9 -390
3703 -390 280 649 -20 -1229 164 742 55 414 -335 162 697 1564 26 -324 945 708 -25 -410 11
3722 11 670 539 820 -532 -207 579 924 -58 -98 8 690 697 371 -166 -62 855 624 -133 -434 617 265
3743 265 165 875 -203 -394 900 788 -977 -313 712 763 88 223 -580 -83 1170 -171 -1003 -930 -18
3762 -18 937 -321 -157 -152 251 447 260 -543 -435 526 263 -382 -266 -229 -187 559 225 -802 -647 955 70
3783 70 -643 -247 95 124 770 -59 -1079 91 881 114 -884 -676 420 280 105 -526 -998 332 1221
3802 1221 -77 -964 226 533 145 -289 -633 -472 -133 357 -460 -875 -60 300 -343 267 46 -567 300
3821 300 734 -127 -684 511 299 -42 -607 -154 -403 956 754 -954 -847 706 654 -211 -550 386 28
3840 28 524 764 -460 -342 1250 706 -235 114 -262 314 72 615 166 -548 601 1201 -232 -602 363
3859 363 -502 227 1187 -475 -659 894 813 -730 -576 484 74 150 712 -214 -891 369 200 -422 405
3878 405 836 -95 -219 -172 199 -297 -23 412 -806 -291 399 -397 -220 321 -750 -119 220 1373 -501
3897 -501 -427 -4 -168 -61 468 -27 -1057 654 383 -678 -73 169 -87 -533 150 -52 -352 102 -555
3916 -555 29 -363 121 -104 -230 452 -119 185 -251 160 -793 -619 292 508 290 399 429 660 571 -193 -1180
3937 -1180 -353 533 -301 -964 322 -355 356 154 -6 -588 -945 711 307 -129 -209 -45 -276 516 -274
3956 -274 -831 -189 1015 152 -148 128 -661 -11 286 457 -111 -42 792 -58 -224 -389 345 586 -230 453
3976 453 -669 190 538 -263 -1115 142 768 636 -4 6 -81 -660 703 -143 -142 62 852 113 -81 317
3996 317 -350 -25 436 124 -890 348 625 491 -199 -279 159 414 453 -720 -655 195 942 46 -327 -229
4016 -229 -359 455 240 -491 -353 601 1151 -1072 -118 -13 1138 415 649 -372 83 722 218 -1056 -54
4035 -54 -65 618 865 -254 -683 16 614 496 -1108 -681 200 501 -738 -368 -40 -220 533 -286 -970 -1040
4055 -1040 138 226 -420 -1079 -140 -23 280 509 -464 -139 271 -89 -900 -472 -621 -691 -212 -32 75 -881
4075 -881 282 683 -661 -235 823 474 -205 -607 -556 389 955 88 -998 -620 131 19 -704 -113 22
4094 22 -303 -67 -194 -173 157 416 -185 329 -162 -376 -33 158 323 -197 334 326 -283 -178 -105 52 289 559
4116 559 -142 -433 350 293 593 126 -301 269 180 877 -48 34 290 886 -210 -524 127 313 197 954 938
4137 938 -432 2 1017 -122 37 480 77 -338 229 357 -911 18 624 493 86 437 -395 146 113
4156 113 181 -214 644 1068 -615 -462 -69 691 -190 -10 -336 153 -36 -500 -600 190 535 -464 -1050 -79
4176 -79 656 -577 -123 -67 -244 -466 -31 -195 8 818 177 -119 256 751 -50 -909 108 231 -75 509
4196 509 -325 -545 443 712 -238 -405 -239 80 -262 -347 430 -89 212 286 -589 -13 500 -45 -109 5 154
4217 154 -321 -296 77 105 -872 252 915 533 319 -534 107 464 91 -872 -154 180 542 -466 -151 117
4237 117 444 -90 -265 435 -323 -25 821 167 23 468 119 -62 92 166 23 967 281 55 -762 143
4257 143 350 183 590 54 -783 580 137 -966 -374 776 -64 88 -236 -302 -145 773 -56 -834 381
4276 381 55 271 -643 181 -396 -96 409 -201 -309 -529 807 244 -783 -42 141 135 -276 -105 -598 337
4296 337 584 78 44 -510 -64 -171 267 92 -618 453 775 338 -707 113 550 385 175 185 -576 -15
4316 -15 484 269 -784 665 -129 -421 -414 281 -505 -449 474 -188 -492 370 571 32 360 294 -280 212 622
4337 622 144 -163 -216 703 49 -264 495 745 91 641 336 -787 44 484 -497 2 462 -234 440 48
4357 48 240 -396 -14 244 418 -44 613 -200 167 1069 -374 -175 492 709 108 -269 581 469 79 360
4377 360 -389 28 351 110 -238 -136 662 542 185 0 221 120 56 596 -706 705 40 -231 -112 894
4397 894 502 -255 447 -34 -294 -638 424 -132 -368 318 -75 -266 537 337 -364 -361 513 -331 -459 -220
4417 -220 -615 279 -460 -333 -415 -147 42 -192 -552 -372 277 -671 41 -564 -166 -528 387 -536 -118 -82 576
4438 576 -579 -30 503 -283 -162 654 182 -711 59 -247 -849 129 279 -169 482 257 -103 1 94 496
4458 496 -13 -225 -176 363 -42 -411 -420 -469 235 250 371 333 444 -409 -346 -78 -249 526 -61 270 -31 451
4480 451 -117 -693 313 766 -383 10 646 486 229 -196 -18 279 -218 105 462 -444 1228 1212 166
4499 166 -428 166 -1008 244 284 -39 -502 805 418 -177 -371 -739 464 238 -343 -164 -402 -6 1010
4518 1010 -13 -715 29 301 -134 197 -161 -567 898 319 -324 -1000 281 -65 33 116 161 253 -63 24
4538 24 94 -1191 696 -275 -74 618 -415 -536 -176 180 -1232 -704 113 -449 -96 667 -301 -319 741
4557 741 733 -143 -302 681 344 -578 -813 170 -194 227 229 -127 -269 251 -141 -436 -267 -15 -65 369 4 -517
4579 -517 -693 607 394 -416 39 422 -237 -124 -744 5 258 151 662 -755 172 369 353 -155 586 -480
4599 -480 -172 718 37 -570 247 562 182 44 550 -435 221 405 124 -317 617 183 148 -350 393 296 93
4620 93 362 506 346 -285 245 294 179 -427 198 241 718 297 -830 424 452 -161 -441 -45 591 456 502
4641 502 -160 -324 491 94 -306 -142 -389 -332 -125 581 -137 234 -204 -20 205 -144 98 -16 317 160
4661 160 -359 -139 699 299 476 99 479 -298 -293 -115 515 -34 -46 249 -597 -127 386 117 -248 60 -230
4682 -230 91 902 -150 -7 118 -861 -368 -17 493 715 169 -4 240 -378 -315 -55 369 395 -528 -247
4702 -247 659 117 22 -391 -478 231 403 -509 807 105 120 -83 -850 267 564 469 -143 -11 -15 -101 -136 307
4724 307 619 494 -1436 699 583 784 560 238 354 394 486 49 195 381 728 -474 -46 282 -426 -641
4744 -641 -537 35 446 940 1223 -16 200 611 -131 387 6 347 -127 675 -182 -2 14 -373 -161 -803
4764 -803 408 743 430 930 -771 18 -270 -748 -303 456 -620 -5 185 99 45 -49 634 274 -216 -402
4784 -402 471 -264 93 603 -751 -560 334 140 -968 -130 -271 625 -116 -99 -242 -955 -362 46 -112 -640
4804 -640 267 -15 585 -183 392 -531 597 103 -128 -557 -381 553 196 609 634 -768 -246 293 -779
4823 -779 -437 -218 -23 -909 73 150 -592 861 -231 -228 -787 193 297 541 -194 153 87 -109 4 -139 -1228
4844 -1228 558 -126 240 -553 85 856 850 -129 -538 -488 -361 413 -127 492 45 -211 -1009 121 161 -1100
4864 -1100 386 998 151 146 1218 496 -339 -519 1046 -333 403 625 -485 -570 159 57 302 308 42 -273
4884 -273 617 736 488 328 570 143 90 346 896 1 -210 784 302 469 462 -430 176 -2 -49 735 -185
4905 -185 80 -211 303 -518 -785 -49 -393 -159 -565 783 335 -265 -765 -28 -394 -427 -668 -570 -100 396
4925 396 232 -787 672 -71 629 -611 633 326 0 -439 -390 560 -370 291 -399 -657 426 -342 -277
4944 -277 -253 -67 -414 -1095 486 -432 115 -456 -623 -14 216 -441 -83 -115 5 162 -109 -465 189 1001
4964 1001 -381 -860 -359 872 -214 -669 -214 438 -507 -66 -305 76 392 -546 808 244 -889 -625
4982 -625 55 -143 -295 129 -34 544 1045 -403 -126 -299 -61 135 250 475 -194 -275 -171 -51 175 683
5002 683 461 496 482 340 -159 899 330 268 582 223 -560 131 -95 597 -85 -382 -248 -225 -379 594 733
5023 733 -253 -757 -44 735 127 -502 228 -692 1066 156 483 27 -349 294 -396 533 -553 561 204
5042 204 -56 -784 -463 48 433 -388 579 149 734 -223 234 197 42 261 444 160 862 -71 -805 -8
5062 -8 -347 -461 -105 -641 274 -308 291 335 147 668 -371 -539 -261 337 1120 -205 -32 127 -341 494
5082 494 183 456 -25 -78 188 -301 -421 -547 -176 255 -160 -180 207 -88 91 -376 375 275 -151 273 -448
5103 -448 -213 -133 -498 954 -396 -217 -150 -289 -472 235 470 772 624 -146 247 462 155 620 -353 -620
5123 -620 -1159 760 -42 -158 -207 711 617 125 -1287 519 903 -110 -112 249 -299 77 338 23 -157 58
5143 58 102 34 50 -924 -169 212 780 -743 -692 -230 -41 -321 155 -594 150 531 -546 -497 -451 -57 -530 -573
5165 -573 -8 354 -436 459 -299 -395 -20 557 -306 421 61 34 -941 821 604 -100 291 1362 -332 -200
5185 -200 888 461 -293 -94 537 -900 88 299 153 -730 -101 -274 26 -8 -444 -226 1865 244 778
5204 778 -702 701 557 291 -575 -308 -127 -304 659 -614 -189 197 281 337 -676 -74 418 -506 -240
5223 -240 161 -307 77 280 -91 -569 379 -111 121 541 184 -279 -63 316 -191 460 -363 -76 1 -56 145
5244 145 573 -33 -443 -519 -518 298 359 -42 -640 -628 -390 105 -102 112 -37 -220 472 202 737 -398 -140
5265 -140 503 -28 114 -692 -350 -368 -448 -48 -648 -563 582 734 572 28 -483 -186 201 212 799 -547 292
5286 292 523 -359 -260 -175 265 441 -357 1093 615 241 350 -629 -47 -58 -304 195 555 -616 72 804
5306 804 386 -122 223 -139 146 806 479 97 -243 595 421 426 -539 369 92 -276 376 -133 145 -326 180
5327 180 -418 -342 168 300 -42 173 130 -259 -39 308 -619 -316 188 531 381 221 125 -240 819 -530
5347 -530 -309 -146 362 208 -405 257 393 678 241 -13 139 -317 88 -31 220 107 -548 416 369 -518
5367 -518 -538 -853 2 -197 36 -191 343 434 -111 156 139 558 532 61 18 -425 513 117 -892 -379 -122
5388 -122 404 1107 121 -200 5 85 167 173 -831 85 239 150 -104 -398 -169 180 -238 -345 -10 -122 376
5409 376 -147 -156 -70 310 -241 -129 -127 543 474 -324 608 -597 588 301 460 -976 18 260 158 -139 -572
5430 -572 -128 -525 -109 1052 241 93 -654 -54 62 488 -121 -150 613 32 -401 -527 -273 -734 164 361
5450 361 -207 -98 246 360 -551 -115 -87 442 -269 -457 31 83 324 -323 63 -133 208 391 -358 -278 60
5471 60 613 513 626 311 -324 -48 584 -130 23 -303 253 230 -280 -276 137 -96 246 281 80 584 576 58
5493 58 -8 -217 -294 164 -74 -49 -318 468 207 -46 841 -61 -222 249 590 -375 559 574 -9 -70 213 56
5515 56 175 657 -355 213 -58 604 -243 275 148 57 126 -71 53 -563 -114 580 -50 -465 -82 19 21
5536 21 222 248 -28 -283 477 276 260 355 190 157 12 137 242 -316 38 -283 -72 -112 724 169 -50 236
5558 236 -368 -178 481 559 -20 151 -536 -53 158 380 437 247 513 186 -195 -390 741 -368 18 -257
5578 -257 -565 -66 364 -130 -67 -357 300 -288 -584 357 -223 -229 371 -346 -413 291 -315 -81 3 -60 -1 101
5600 101 346 69 -315 21 427 52 -318 -409 -188 133 411 -517 -529 344 767 -359 -10 -178 -208 582 -109
5621 -109 39 -269 -118 767 -193 -650 316 -331 370 110 -2 -414 237 253 -251 -145 56 222 -127 163
5641 163 9 -32 245 253 -415 -102 468 -212 360 -200 -693 -116 72 171 -217 -419 20 118 -165 189 -78 -206
5663 -206 551 -6 -406 -451 417 229 -38 238 -136 -258 -36 468 -251 183 336 309 18 -31 -168 -26 -165
5684 -165 260 -119 -47 186 281 100 -3 -146 185 479 164 -29 -212 503 51 -379 -311 -105 68 -10 469
5705 469 -94 381 122 141 -346 -146 83 -338 383 519 562 -406 -17 -30 -208 -78 -178 -98 135 128 105 358
5727 358 -432 236 -457 261 -114 7 -198 68 -164 -315 -29 -57 -209 -159 669 -424 -88 256 -244 -92
5747 -92 217 43 555 130 9 -53 -61 30 11 17 28 28 -210 27 114 229 -72 234 311 -122 -78 -136 -235 262 268 55
5773 55 -147 -128 176 -211 -203 188 54 102 -77 -89 -334 -163 208 -231 84 -189 51 -227 133 -253 -35 80
5795 80 -43 80 -114 118 -59 434 333 -128 74 -235 -153 -56 8 76 7 -215 196 -51 2 -76 211 -232 218
5818 218 -82 -20 -2 127 -19 -249 142 53 -87 196 -19 229 110 385 -131 -286 18 8 45 -399 -77 77
5840 77 -42 40 -202 -529 42 275 -163 -293 220 -125 240 169 172 -84 116 0 30 28 59 -168 -108 80 -241
5863 -241 -4 113 229 0 -98 199 152 -434 66 -18 37 209 -218 -357 -77 178 223 149 -10 -94 -93 281 23
5886 23 -170 -62 162 241 -65 378 -169 -113 99 -169 -114 -9 48 -17 13 -36 169 -22 -198 -148 -118 203 38
5909 38 186 -227 0 -82 -81 -121 -92 -155 329 110 -274 -66 204 -127 -58 -165 -317 -87 296 291 -268 -66 -7 -49
5933 -49 -29 3 183 -65 40 217 -144 -24 107 132 -26 -11 4 -272 -123 262 -166 40 97 109 34 -302 10
5956 10 86 31 78 -65 100 149 53 -174 -71 30 -206 -243 -171 16 -56 -347 88 -191 -40 185 -19 -228 -93
5979 -93 28 -183 105 -32 -154 -310 -42 -82 41 42 -220 131 -57 128 122 -99 -148 26 101 -56 148 96 192
6002 192 257 -228 -120 -86 -17 -256 14 -198 -141 250 357 -268 -333 48 -103 271 -98 7 -44 -71 223 -152
6024 -152 -38 215 113 -105 144 151 170 262 -247 -17 128 133 -11 -207 165 241 -177 146 233 238 192 106 76 17 13
6049 13 0 -56 180 -145 -165 74 446 17 -69 312 -126 -13 32 71 56 86 179 335 177 -88 -88 -141 91 -98
6073 -98 -326 58 -179 7 -157 -60 27 153 207 17 -181 17 224 -107 189 30 154 144 -78 17 -55 -161
6095 -161 262 -163 -206 66 195 -42 37 46 -107 -26 207 -155 -240 215 192 6 -307 93 38 15 333 -173 -274
6118 -274 26 317 -108 73 -23 36 -71 -870 159 -77 -29 86 -116 352 148 30 -40 139 146 102 -89 14
6140 14 144 -118 -49 58 156 23 36 -71 132 103 -505 -397 -133 -79 -108 -213 24 66 166 138 -137 -73 528
6163 528 597 186 445 -594 95 0 4 -133 54 511 -11 18 -461 -282 -197 106 346 -384 169 585 137 -122
6185 -122 -393 -62 709 -166 -759 45 -464 40 -224 -211 -146 428 593 77 -465 370 216 -261 -281 28 -547
6206 -547 -161 -21 194 -545 -284 -636 292 -343 361 -89 -226 -814 -346 88 199 515 198 915 -375 482
6226 482 277 140 -67 220 185 88 -347 -166 -363 313 -447 -228 -18 -275 236 -233 -344 -77 34 -167 -489
6247 -489 -251 -431 290 -226 216 -127 544 -660 433 307 -105 -192 281 -237 -172 -93 403 32 148 48
6267 48 -49 238 -427 -217 -280 83 -167 -279 73 -544 -748 -365 -222 -345 -435 451 -335 427 -130 -446 370
6288 370 -394 -526 510 -420 112 -363 46 545 386 -464 115 275 224 187 487 449 6 -616 -387 360 -397
6309 -397 439 206 50 -17 250 -297 -4 395 -281 585 168 390 480 108 82 322 23 247 124 -431 351
6330 351 118 -423 -338 180 46 12 284 1156 344 -157 41 -26 -109 -336 -94 -248 -755 -219 127 358 236
6351 236 -373 -279 -21 -5 53 -85 -80 -205 367 149 99 -162 144 -250 -86 -161 -534 -127 -561 420 434 119 -427
6374 -427 -654 217 480 -302 80 -380 248 -571 -226 1 267 -83 42 221 -154 -307 -186 -763 -222 70
6394 70 486 296 205 -126 182 453 -610 -351 247 -192 6 -249 -128 139 299 -451 35 208 -118 -10
6414 -10 -68 -113 -22 9 455 -112 61 293 38 252 -136 -54 -276 360 449 304 44 73 -213 249 -74 -5 -141
6437 -141 375 -60 -55 -133 11 192 163 -173 2 82 -157 352 -186 -177 -88 484 535 -514 74 -64 19 141 414
6460 414 225 72 -277 -68 -557 314 -32 143 -213 81 137 50 66 271 -42 137 151 262 24 33 -88 43
6482 43 98 -236 -36 -256 13 -88 48 30 136 112 25 -215 -316 89 -86 -83 4 -221 77 -158 -61 173 463
6505 463 -186 120 87 -178 -134 -159 187 -298 12 203 -61 381 74 -10 166 70 217 -292 -4 -267 74 66
6527 66 -87 -521 82 194 28 -164 19 313 -15 287 57 -141 38 334 185 -65 -68 309 261 -75 60
6548 60 -141 61 38 -44 -71 432 177 97 -204 327 -241 184 -65 -135 -39 -85 314 -36 66 -318 -77 10 10 -157
6572 -157 -322 -3 172 209 263 -10 49 199 144 -47 -432 319 -13 -233 -23 -118 46 -201 -56 44 -215 -46
6594 -46 335 148 -54 -3 -151 -35 324 -171 -247 -219 -56 -119 -324 275 -87 -36 229 8 -63 99 -97 -154 119
6617 119 -198 -177 126 -122 -78 -163 32 -27 57 -345 -83 78 -5 109 -17 139 305 302 21 -266 40 -10 128
6640 128 -41 -281 -382 -307 58 -87 67 253 -1 -184 120 79 -156 31 91 -350 -110 7 -57 -363 397
6661 397 -107 132 -217 57 -142 -93 -35 -170 -5 -19 257 -110 -3 -6 -117 -265 422 46 -166 -53 189 -193
6683 -193 1 -32 -7 1 39 144 137 -109 444 117 -16 139 64 -106 154 91 -360 80 46 90 -61 -30 -94 232
6707 232 52 49 115 100 65 -122 -296 112 -96 -71 279 -10 -255 -41 6 134 -117 266 37 -93 274 -136
6729 -136 181 -191 -201 82 -150 70 -36 37 -144 80 -341 29 -152 -232 -98 40 -57 -40 -9 -263 -207 -268 153
6752 153 -49 -239 -4 -12 -138 -98 -263 29 -169 130 -169 148 -112 62 -102 43 -188 456 200 -64 -31
6773 -31 -289 111 232 544 -39 -99 53 -19 68 -122 -193 141 -11 -61 -192 260 87 50 -83 121 55 160 31
6796 31 -30 22 27 -120 -33 -127 -400 -140 -68 175 65 -139 -74 -164 116 392 29 -253 -191 123 -98 162 -254 421
6820 421 211 -189 -87 -191 -129 24 161 -170 15 -170 -135 86 -129 -52 -90 -17 97 75 -37 270 -339 -133
6842 -133 108 -133 194 205 -91 -67 2 -95 35 -76 -9 -221 83 74 -169 -117 272 -86 93 -129 -66 -103 -55 -30
6866 -30 72 -174 82 88 0 121 -16 -322 51 -6 -190 284 92 -76 39 345 58 90 -164 77 -170 -166 13
6889 13 -228 -80 -107 -102 -64 -36 84 -151 208 109 29 257 -30 -166 67 91 -124 19 241 286 -176 -4 -152
6912 -152 204 -119 -80 -80 -27 -26 90 24 -39 182 2 73 -86 -78 -51 258 -29 -359 -99 -127 -120 -193 -276 -104 -292 147
6938 147 94 -174 -325 -80 71 29 -6 41 204 151 -162 -108 128 -117 224 11 -67 134 239 24 117 -27 156
6961 156 -224 -35 -28 -44 196 161 379 36 -78 71 153 56 -239 -16 22 -90 -53 88 -46 -267 25 -58 -239
6984 -239 -136 17 -246 56 214 -120 -151 190 -227 -176 -241 -38 150 21 -91 67 -275 274 253 -133 -78 -109
7006 -109 147 -210 -67 23 24 67 60 -230 0 149 153 -152 55 -268 -20 -29 -174 -374 51 86 -143 -28 -310 14
7030 14 -45 -188 -107 -198 -117 155 -37 -156 -166 70 -15 -135 -90 170 202 163 81 37 -148 101 6 114 -178 -239 -10
7055 -10 107 122 231 73 -92 -41 89 131 66 96 -109 -269 -77 419 -185 -179 101 110 -151 -234 65 -187 -64 163
7079 163 94 84 357 239 -186 -142 330 180 96 30 111 -82 -84 356 -128 -3 360 -200 -20 -19 -234 -217 49 -40
7103 -40 -145 247 237 -104 -135 -6 232 -106 -62 250 132 183 -32 -8 -30 -23 3 -115 -224 101 62 -113 -213 -45
7127 -45 -207 -90 -38 -349 -4 133 -21 -104 -107 51 278 -231 -67 -372 39 -152 -82 28 -133 22 16 50 101
7150 101 -46 -167 -241 77 -155 -5 -187 37 -38 439 -35 -99 -14 -121 23 -92 198 157 164 121 -160 44 44
7173 44 -42 -185 -277 192 -186 11 26 -190 -203 37 193 118 -86 -193 -3 124 165 -183 -193 -16 262 99 59
7196 59 159 -101 43 155 -17 -79 471 -135 115 -77 106 47 182 175 29 44 -144 -99 83 255 -180 -131 113
7219 113 142 -119 -224 -47 78 7 230 387 -41 26 68 -23 -94 -57 168 -94 -122 37 -76 -213 15 119 -80
7242 -80 -86 -24 173 58 236 228 -269 76 446 121 170 217 -7 322 458 -28 -250 -183 -169 -87 81 118 164 -123
7266 -123 55 -188 285 -51 -30 -57 48 -135 -143 -33 178 121 -184 208 -210 200 250 -178 -41 -1 123 140 -143
7289 -143 138 136 241 -45 235 -65 11 154 173 -205 -48 -62 -59 169 52 -3 -1 244 -207 112 -86 54 -59
7312 -59 -171 67 107 -209 59 -82 37 374 -101 -64 -59 393 94 231 5 -129 84 348 21 -306 -116 208
7334 208 41 -224 -170 -46 -171 161 -188 -207 -59 -281 -102 -261 -161 55 97 -193 -150 -62 61 293 -130 -163
7356 -163 73 -162 -30 279 -223 -7 222 117 19 126 9 77 -96 110 101 48 -67 88 -145 155 355 66
7378 66 264 -244 138 146 117 -162 -126 84 51 47 226 -8 -130 -75 -260 160 198 94 51 -56 -108 -5 115 -155
7402 -155 -127 90 -158 -66 99 -64 -126 -384 165 7 -85 116 -4 -120 226 221 -50 -256 -134 -30 -221 153
7424 153 -71 -12 -195 117 -125 126 140 -64 -19 81 -29 118 35 -232 -1 -126 -336 -144 -83 356 136 189
7446 189 422 185 52 95 81 60 16 424 -160 -23 -66 175 -148 -224 179 -370 8 -79 218 -12 -19 -112 202
7469 202 119 56 48 102 -158 -166 -19 180 176 -72 -76 348 -125 -400 -125 -237 -53 63 143 -307 -107 119 120 100 131
7494 131 195 -36 179 107 -134 -181 118 168 -7 85 2 -123 -19 89 -273 -219 -76 202 -104 -84 -103 -111 -10 -127
7518 -127 -178 -26 166 184 29 146 -341 -119 -240 80 51 79 35 -72 -128 88 155 -119 225 -75 -67 183 71
7541 71 -3 -136 39 131 -85 -73 -98 -299 271 -104 -147 -177 -127 170 -127 263 189 -25 104 336 34 -191 79
7564 79 54 -121 28 -11 253 294 51 9 -226 -13 -85 -42 -125 213 118 85 -25 -20 -1 69 214 230 -43 -124 -155 -77
7590 -77 284 109 -256 37 -124 -44 40 88 31 -100 -17 -4 -191 -165 338 -188 -175 189 265 225 49 -232 193 -1
7614 -1 321 -162 -35 45 -119 130 152 40 -74 81 86 -143 -307 -41 63 -45 -288 -18 138 -210 129 -78
7636 -78 -156 79 -294 114 -201 227 67 113 -55 -207 177 -62 5 -85 -12 125 -241 31 175 26 113 201 45
7659 45 17 -5 195 126 95 38 -116 -10 -103 79 -56 -32 8 -104 126 -122 -6 -177 74 -214 35 -238 144
7682 144 -113 171 18 94 -70 32 125 107 -50 -50 -110 22 -21 37 -97 168 26 390 106 50 91 -165 -170 97
7706 97 -32 -121 -265 -185 -177 -34 -74 43 117 -38 -29 -71 40 -194 254 137 96 -62 -137 76 46 233 117 -210
7730 -210 55 -64 165 292 93 149 -69 23 189 -321 -32 -70 -186 -87 -48 122 14 10 -1 138 -142 7 165
7753 165 101 62 145 -232 -61 -378 -12 127 -172 219 11 -30 -45 -155 -135 -15 -199 26 -40 -91 184 -193 -144
7776 -144 214 68 -148 37 -224 153 -40 -170 33 184 78 105 99 -147 322 -82 -145 -254 166 17 5 -154
7798 -154 131 -458 91 153 -241 32 43 -59 -91 84 -307 -101 93 109 -79 -48 -33 -173 -307 -54 -31 -29 -113
7821 -113 177 -34 29 111 -60 44 250 -66 -2 92 -129 31 -283 -296 139 -110 136 -32 -190 -260 -194 -12
7843 -12 98 17 -85 63 -372 30 107 -212 -15 281 -138 -22 -107 302 -104 66 71 20 -47 -73 11 -89 30
7866 30 -36 -216 -79 -309 -94 40 55 116 -79 57 -200 -26 12 -74 -1 -253 -57 2 139 39 -366 -203 14
7889 14 194 -134 -9 382 -111 176 -61 244 22 158 -359 139 -121 192 91 -105 47 35 154 -57 -75
7910 -75 98 -319 -118 192 45 34 -68 40 97 131 53 127 40 193 -500 -358 240 -181 35 -99 -3 -57 -154
7933 -154 17 57 307 -34 -54 223 122 362 123 -65 -34 37 -178 -222 -64 -23 122 -416 70 147 -56 -131 -6
7956 -6 366 64 194 -279 328 -69 115 -150 -55 311 88 -278 371 10 -22 173 -72 -115 106 -126 -218 20
7978 20 25 82 358 31 176 -62 -31 179 -75 22 344 120 -4 -4 16 -320 -58 109 45 134 141 165 149 -116 -212
8003 -212 162 -248 -19 96 47 107 -193 79 359 -329 70 -68 212 -104 105 -261 -80 -228 365 358 -149
8024 -149 25 -77 318 -217 224 129 -123 -72 61 24 426 -223 129 125 -356 203 318 75 214 -244 -148 9
8046 9 -58 58 79 76 -110 5 -96 66 -21 -17 145 -23 -20 299 188 93 -172 -23 -181 53 -104 -136 21 47 283
8071 283 -123 -82 31 38 -49 -72 -180 -130 1 -213 -22 219 -74 47 195 315 137 42 88 332 -119 11 122
8094 122 64 -120 210 -88 146 44 -39 14 -274 94 -90 137 72 -152 114 77 65 -72 236 73 142 -164
8116 -164 -116 -73 -143 105 28 -106 -72 -197 -127 339 123 37 17 34 -114 -198 -71 173 -35 184 104 67 0 -49 30
8141 30 135 195 -233 -169 104 -148 -188 -72 -165 27 -90 340 152 -103 -97 30 -150 -162 76 66 -41 37 -123
8164 -123 -10 -171 -108 -68 -146 -239 -112 -305 36 -29 -232 -47 322 -103 266 -99 -195 -187 -127 -104 171 -34 -336
8187 -336 -156 -166 -75 -49
8191d9
$$ Imaginary data points
##PAGE= N=2
##DATA TABLE= (X++(I..I)), XYDATA
0 0 0 0 0 0 0 0 0 -8 8 -8 8 -16 16 -22 24 -30 38 -44 52 -62 70 -82 94 -109 125 -144 164 -186 211 -239 270
31 270 -302 339 -379 423 -470 523 -581 645 -715 791 -876 971 -1073 1190 -1320 1466 -1632
48 -1632 1826 -2047 2313 -2630 3021 -3513 4159 -5044 6345 -8446 12420 -22632 105846 198483
62 198483 8132 -7864 70646 115434 67626 53061 26707 61212 89390 70577 20973 23613
74 23613 58027 67013 73050 45256 -9980 19957 68069 41884 -29976 7798 68021 49105 24303
87 24303 6065 2120 26382 62753 29916 -34105 9174 52153 26954 -7094 5621 29482
99 29482 42591 55957 4669 -23927 39371 80895 25784 -41126 -11636 36806 61501 47679
111 47679 -12290 -16538 40258 64028 3318 -15770 25093 14843 7966 17240 -543 -34474 -389
124 -389 53316 10885 -23659 -3732 20600 6986 -25598 -38915 -27832 33316 31918 -41680 -53192
137 -53192 -2432 23219 -378 902 -5999 -21347 8774 9217 -29954 -33396 23814 33281 -5096
150 -5096 3314 10914 12039 25568 32234 6301 -1010 40377 31691 8447 19485 26503 22820 36934
164 36934 63827 32930 18010 42938 39739 27320 28820 38483 22288 30161 42196 17396 34154
177 34154 63193 39585 -8246 15822 59846 31594 12022 12490 9141 8973 26085 28665 7002
190 7002 22393 25255 9293 17521 20671 -4303 -16052 26109 30805 -3353 713 11384 11047 16090
204 16090 32064 6603 -8351 30566 30626 -1815 -11459 7850 17080 25493 38452 2160 -9615
217 -9615 24433 36862 16211 6739 15236 -3896 6384 30664 6186 -11577 8494 33422 13203
230 13203 5011 8864 -3833 8409 10385 -13842 -24362 16453 23608 -27704 -25295 11216 16730
243 16730 -2722 -13185 -15016 -16886 11041 -2854 -35548 -23813 3847 3244 -13515 -5737 -13266
256 -13266 -10941 21498 6095 -32598 -29632 15873 14074 -15129 -15367 -17392 3704 30698 19471
269 19471 -24578 -18973 30929 22642 -8839 -17673 -7382 13376 25984 8651 -29602 2487 48360
282 48360 20308 -20253 -14593 19016 19029 10198 -11737 -28980 8339 37387 14198 -22527 -5572
295 -5572 17718 10880 13403 -6328 -27672 -3944 29858 8772 -34551 -11369 20267 20976 5768
308 5768 -13522 -13939 13111 33076 -13176 -42422 3036 30754 11852 -13505 -8794 1496 21053
321 21053 29533 -12688 -22862 15183 33655 -4246 -27244 -3444 11689 26200 14957 -15145
333 -15145 -15580 24304 36566 -8622 -23478 -3288 12280 18379 6395 -20430 -28736 23311 43176
346 43176 -1985 -23737 -7695 16335 12180 -4682 -29145 -21293 27638 21426 -23552 -28700 11444
359 11444 22319 -4018 -8276 -12643 -5986 13445 1686 -27477 -23269 14619 9536 -8745 -6689
372 -6689 -7302 -1243 10212 1622 -31894 -21126 18420 6177 -17847 -20189 -4361 3429 11829 714
386 714 -29922 -8450 23413 8148 -28530 -26739 -2685 3831 11409 -5254 -23218 635 25272
399 25272 5342 -29191 -7340 14227 3719 -2411 -9384 -13750 -2360 16704 5393 -10738 10450
412 10450 12609 1272 -89 361 -11749 -4957 24632 6464 -15394 -342 15999 8796 541
425 541 7257 -596 8120 17517 -5827 -17755 434 17686 -405 -2215 11598 4060 5164 9912
439 9912 488 -11011 5754 14120 -7649 -2401 7061 1110 -3202 8664 13427 -1804 10082 11397
453 11397 -386 412 3775 -3807 -6707 17609 10496 -7176 7341 17453 5275 -4589 9201
466 9201 6797 2809 12655 -1184 -10633 1967 11442 -294 1358 16745 1100 -3661 8786 4149
480 4149 -16227 -12643 10515 303 -6000 -4491 -11737 -2962 9836 1796 -23219 -7912 12304
493 12304 -7261 -20402 -18116 -10710 -6498 6209 -4171 -24373 -2476 12619 -4235 -20978 -10393
506 -10393 -319 -4961 2525 -9444 -20353 620 15039 1451 -11060 6112 8368 3704 5953
519 5953 -6943 -17153 2977 26543 4373 -15001 4039 17852 16561 3660 -5044 -4568 20749
532 20749 28791 -11877 -22672 8169 23659 7401 -3603 2328 3132 19416 16802 -13861 -17215
545 -17215 10199 20938 -3998 -9725 -4774 -603 16784 14238 -8147 -15950 17240 25147 -5904
558 -5904 -12774 -6880 6412 14153 9584 -11189 -9377 30081 27988 -5067 -13832 7268 21313 15061
572 15061 4458 -15358 -213 33503 20293 -12358 -7657 28316 27839 9504 355 -8808 5905
585 5905 21804 11463 -14825 -4414 24256 15298 2543 -4551 -6868 7111 23160 8000 -28584
598 -28584 -14801 15907 10339 -10835 -16162 -1897 10369 19263 -5521 -30746 -4959 20537 6816
611 6816 -22347 -14671 1711 7503 10618 -8604 -14459 9285 29282 5340 -19392 58 12568
624 12568 11775 6848 -1953 -3628 14411 32030 8346 -6205 12673 22235 17180 8973 3993 -2468
638 -2468 17698 31832 5393 -7589 13939 32893 18679 5341 3660 4161 23019 19308 -6253
651 -6253 -10678 18164 28461 1743 -1469 5994 10857 15338 13225 -745 -8976 13473 14348 -4647
665 -4647 -3729 4497 10743 11818 15220 -1440 -6415 16515 15812 -548 -3221 8432 7542 7591 11804
680 11804 -1966 1466 21270 21277 701 -2266 14903 9780 4880 6001 -333 5090 16211 13390
694 13390 -5774 4286 18507 6138 -682 4146 4073 -5176 3096 3890 -8412 -249 6436 819
708 819 -3274 3474 -1765 -11694 3007 2155 -14099 -11952 -176 -1179 -10529 -911 -2640 -5941 4545
723 4545 378 -9997 -9512 4147 -3650 -9144 2075 -2625 -6644 3422 11161 -468 -1634 10672
737 10672 3173 2150 7406 1676 -6067 6723 19360 2181 -259 10907 14149 10851 7767 4589
751 4589 -57 14938 15248 -5310 -2677 13616 15782 3133 5297 7658 2814 13687 11186 -2626
765 -2626 -5197 9058 8696 -4279 2141 1313 1503 13143 13019 -4254 -9287 13688 12283 -3657 -5326
780 -5326 -2243 4914 9137 6444 -9314 -1083 23482 13969 -6127 -6635 6870 8209 7193 2787
794 2787 -11630 3481 20721 9985 -9956 -1531 18163 11483 4582 -3252 -9987 104 14424
807 14424 6039 -14964 -3485 11876 7351 1041 -7623 -9581 966 16923 -2138 -28432 -11673
820 -11673 8820 5750 -10451 -12000 -6248 2797 10059 -12194 -24839 -3881 12100 -4028 -22107
833 -22107 -12326 -5233 2474 4699 -10506 -15488 1047 12494 -8182 -19296 -6387 1136 3529
846 3529 -2530 -12892 -14563 8544 19785 -4754 -14679 -1395 8882 3387 -5474 -11748 -11532 14376
860 14376 16178 -10336 -19165 2385 18180 6052 -4194 -11270 -5076 11345 5676 -15460 -15714
873 -15714 12017 15436 -3391 -7184 -6415 1204 8888 6656 -11538 -14297 7007 4254 -8255 -8820
887 -8820 275 6089 8166 3787 -15824 -8737 13777 10017 -9743 -13378 2066 3896 4840 -1943
901 -1943 -11536 1520 18806 9037 -15865 -10732 8401 6694 3006 -5195 -9959 -1035 13230 5750
915 5750 -12650 1470 12917 4559 -4795 -5541 -5610 -1319 10821 1008 -11612 -2211 7455 2291 -3697
930 -3697 1102 -2732 554 6920 -6938 -16803 -3683 12412 2824 -8850 -1343 808 1881 2502
944 2502 -3832 -10558 1528 8604 -7846 -12475 -2487 2265 2748 4729 1495 -8954 -329 5991 -3109
959 -3109 -4285 232 555 -5650 2202 681 -6925 3130 7919 1683 -4193 1419 -632 -7283 3111
974 3111 661 -3517 -293 5157 -2920 -6269 7821 5435 -1337 -82 -378 -4453 -2862 5065 -3158
989 -3158 -2064 6327 486 -3389 1256 4807 -3797 -856 8076 -2604 -8770 -3944 1689 2301 4701
1004 4701 2802 -8648 565 10493 1237 -6836 -1664 4209 -3305 463 -2023 -8241 -667 9574
1018 9574 5567 -6139 1450 1807 -3224 2445 1014 -6085 -2487 6564 580 -8935 2508 5571 4122
1033 4122 2262 -156 -5676 -976 8833 -4301 -10707 2821 10603 2452 -6749 -919 699 9562
1047 9562 10379 -7981 -12289 2012 10881 -4161 -8350 765 1550 7870 6174 -4753 -11117 5717
1061 5717 12786 -2721 -9154 -4716 -1237 2915 4893 -4992 -9548 8571 11004 -5427 -10037 -793
1075 -793 4917 268 -1792 -10420 -8894 8722 7418 -9490 -9062 8243 9750 -1557 -6751 -9949
1089 -9949 291 10171 2936 -13892 -9321 11315 9531 -914 -6759 -2823 3691 9548 4540 -14581
1103 -14581 -8528 10137 8504 -3190 -6565 -1675 3485 12406 5075 -12755 -4314 11859 7147 -9717
1117 -9717 -8365 2745 5554 7064 -3709 -10015 694 14989 3143 -14432 -4107 5591 3842
1130 3842 -663 -8257 -5652 4643 14685 469 -13144 -169 10896 4721 -2359 -5250 -6278
1143 -6278 3515 13379 -2198 -12458 110 12936 7560 -1438 -3699 -5024 6384 10714 -3610
1156 -3610 -11325 3313 14974 1185 -5140 -252 3726 6217 5040 -4320 -8525 7120 9668 -5690
1170 -5690 -7142 3015 6883 2669 -200 -4060 -6844 7689 7560 -7390 -9773 -869 4746 -785
1184 -785 -654 -7972 -7051 8391 8585 -5923 -12003 822 2285 -2186 -2274 -9119 -5451 4484 7272 -6820
1200 -6820 -7627 4778 2726 -3663 -3778 -2330 -3818 1301 2021 -7276 -437 7597 770 -3623 1821
1215 1821 4590 -1710 126 731 -5792 -1965 5781 2791 -5737 816 3798 402 4881 969 -5834
1230 -5834 -3329 7619 1143 -8533 -1224 1171 865 3495 4012 -4134 -2930 6119 1487 -4428 -22
1245 -22 1224 -3755 -854 4778 -2250 -3367 5720 3166 -1233 1526 2003 -5796 542 6672 -1752 -3006
1261 -3006 3264 4850 -668 2188 4990 583 3830 4804 -2542 -3449 5260 4156 -4466 1440 4820
1276 4820 2084 2946 4171 -948 -3821 5841 3983 -4600 -2718 -947 -542 2623 2913 -3358 -5539 9384
1292 9384 6121 -6181 -7571 -3118 -461 -729 809 -9918 -5314 6926 3559 -8389 -6983 3281
1306 3281 -1468 -1858 -2390 -7904 -4322 2435 -919 -10347 -3020 6913 1279 -2818 -2457 -4191 -2007 3503
1322 3503 -1150 -12562 -1963 7489 1854 -5262 -5568 -805 3335 9467 -724 -11987 -1486 10285
1336 10285 1795 -11206 -4942 1019 5487 6544 -3275 -10426 605 11069 -852 -10425 -3134 984
1350 984 2605 894 -4375 -7144 2665 10805 -970 -7080 -179 3976 -370 -2127 -3870 -5195 5496
1365 5496 8244 -6464 -8872 2759 10655 1787 -3528 -5608 -1242 7004 4359 -8987 -10284 7297
1379 7297 13514 1052 -4248 -2815 2467 9196 3686 -8425 -7248 8106 8232 -5219 -7427 -1196
1393 -1196 4857 5303 4184 -5135 -6773 6022 5063 -6897 -10054 -925 2635 3146 1292 -8255 -4457
1408 -4457 7713 4456 -10470 -8645 3456 1471 -3535 -8093 -7929 -2525 7093 1408 -12106 -6515
1422 -6515 5373 734 -6597 -7997 -6718 -1038 4988 -1211 -12362 -4088 4870 1893 -6317 -2760
1436 -2760 -2171 -1878 731 -5092 -11179 -4128 5216 910 -6817 -2313 -1145 124 2210 -5494 -8588
1451 -8588 -1047 7254 -3064 -9932 -1866 2213 1770 -377 -2035 -4139 1375 5378 -7147 -8005 -529
1466 -529 3501 -1683 -1913 -340 -4959 2476 6469 -1348 -5402 550 2987 -2644 -331 -1396 -5187
1481 -5187 426 6073 497 -4135 3504 5213 -1297 -724 -148 -2404 -361 4194 -632 -3453 6263
1496 6263 4054 -2536 168 4670 2275 -73 3334 -2031 -3194 2814 2652 -808 1942 6430 -415
1511 -415 103 4261 -1457 -3427 1676 4562 -2224 -1460 824 -2291 992 5082 202 -3629 2887 3886
1527 3886 -3646 -2022 -711 -3375 -750 3554 48 -5992 1204 2979 -1216 -630 1243 -3142 -3335
1542 -3335 2203 -1920 -7449 -584 3196 -498 -2920 -324 -2136 -823 4586 -2723 -8734 -1262 3923
1557 3923 -3093 -6202 436 -1952 839 3373 -3692 -5056 1508 4913 -5250 -6618 -33 -368 -228
1572 -228 -978 -3026 -5938 3037 6079 -3664 -5835 275 2090 -990 -532 -4203 -6045 4595 5712
1587 5712 -4380 -5153 3069 5116 -1245 -2457 -4284 -2555 4927 2348 -7133 -6411 6514 6389 -1608
1602 -1608 -2543 -2030 1164 4086 1874 -8008 -3694 7291 4283 -2401 -2391 2387 2698 4167 3075 -6500
1618 -6500 -829 8079 3773 -5620 -4328 3989 4772 4779 1355 -5047 2601 10651 4309 -7749 -2591 5491
1634 5491 4601 1714 -2482 -3418 3028 10760 2912 -7216 1823 7517 3229 -1952 -4003 -2513 1939
1649 1939 8084 19 -7653 -536 6881 1962 -3211 -1695 -1457 2463 4579 -3965 -9638 -739 7984
1664 7984 1009 -5091 -1759 379 3210 1695 -5938 -9324 3066 7043 -3759 -7698 -1409 2838
1678 2838 2716 539 -3614 -5491 3165 4366 -6027 -7413 -551 2331 -1725 -1601 -2784 -2955 4780
1693 4780 3718 -5698 -8101 1323 3343 -1807 -2613 -4666 -2932 3230 2519 -5640 -6148 5076 4631 -4095
1709 -4095 -5369 -5010 -3057 1192 1802 -6046 -4067 4704 2098 -5797 -4758 960 596 1045 172 -7598
1725 -7598 -4338 2402 1941 -2772 -396 2362 -469 326 334 -3403 -2184 4069 2900 -4042 -167 2283
1741 2283 246 1482 2292 735 141 6336 883 -6034 216 4735 1027 -813 2483 720 892 5142
1757 5142 1215 -2001 2248 4794 -226 -1160 2414 49 -712 3345 932 -2027 1432 5274 536
1772 536 611 1122 -2242 -2257 2253 2312 -3251 447 3763 -939 -557 763 -478 -1129 4340 2335 -4425
1789 -4425 -2038 292 -1690 -495 3858 1513 -1381 2283 1267 -3657 -2153 1190 1959 -102 1132
1804 1132 -3664 -4505 2957 2999 -2382 -1611 3584 642 -2627 -1417 -3540 -1677 2062 1084 -5344 -3274
1820 -3274 3314 -1020 -2619 -1016 -1921 -2478 -579 -948 -7190 -3402 1999 -1348 -5013 -2144 -479 -1129
1836 -1129 1952 -1209 -7858 -3234 2904 -1055 -5720 -2492 1139 412 1901 -2505 -6029 321 7038
1851 7038 4 -7035 -1912 2047 1149 -126 -1201 -1195 3878 8237 -1443 -6630 151 4091 2775 1061
1867 1061 -1292 -2370 1894 6628 -127 -4053 2497 7038 2160 -1690 -2202 -2236 3036 5946 -820 -3740
1883 -3740 2511 6533 -593 -2756 -135 2230 4835 3034 -3419 -5489 4737 5543 -1536 -1968 1673
1898 1673 4211 2944 2119 -2846 -1766 5929 4319 -3444 -3905 3011 5144 2094 1219 -2987 -197 7073
1914 7073 5429 -3619 -4729 3816 3767 82 -1932 -3901 1021 7388 4391 -6261 -4451 4327 3016
1929 3016 -2069 -3705 -2568 -468 3349 -1145 -8496 -2624 5446 2986 -3970 -4183 -2056 -1625 528
1944 528 -2145 -6616 -2887 2057 -758 -5791 -3425 -1216 -625 367 -2253 -5822 -2908 2604 -2597 -7179
1960 -7179 -1924 2035 1660 -1092 -2976 -3802 -51 4245 -3195 -6605 -688 3428 248 -3273 -1545
1975 -1545 -1001 3103 3720 -3094 -5120 1131 3895 -1398 -3693 -950 -1483 2168 3731 -737 -5113 1074
1991 1074 4978 -605 -1368 -1731 -1274 186 2655 -1566 -4724 2132 4326 538 -704 1429 981 -2
2007 -2 1882 -1350 -1664 2471 3212 -1400 -1101 3937 1450 -486 2271 1294 -677 1897 1896 -1258 247
2024 247 3896 728 302 2515 1865 -66 2397 2693 -2059 -451 2780 1090 -576 601 438 -763
2040 -763 2824 2382 -1780 -761 1575 91 -2087 288 -105 -2770 -135 1189 -1662 -1744 789 -440
2056 -440 -2429 932 -1258 -4576 -1343 716 -2039 -4324 233 -837 -1214 -37 -2732 -3677 -483 2011
2072 2011 -3653 -4905 -863 -856 -1746 -1261 -1683 -3442 422 2844 -3142 -4607 -457 -92 -1441 -1479 -1865
2089 -1865 -3749 738 2585 -2195 -3901 105 2062 -894 -1041 -2761 -2985 546 2026 -2521 -3915
2104 -3915 2032 1976 -2033 -1308 -1077 -352 601 428 -3373 -2448 3509 872 -3702 -1854 1871 2196 1034
2121 1034 284 -3403 -1926 4321 1449 -3403 -1991 2775 2778 2029 687 -3529 136 5820 3164 -3979
2137 -3979 -2901 2726 2748 1333 -1300 -2696 1471 6945 3316 -4536 -2033 3730 2755 -333 -1117 -1017
2153 -1017 191 4265 920 -4147 305 4121 1572 -1380 -549 -549 -440 2277 -1549 -3762 631 4589
2169 4589 341 -3668 -922 303 1496 972 -2849 -4423 828 4983 -2068 -5961 -841 2213 2466
2184 2466 -94 -3408 -4110 1481 3201 -4164 -6234 -715 3140 -464 -2197 -3293 -3300 1647 2505 -3150
2200 -3150 -5093 214 1520 -2055 -3258 -2921 -1541 2016 1788 -3161 -5602 890 2011 -2904 -3835 -2392
2216 -2392 -499 1082 560 -5603 -5118 2760 2423 -2404 -3267 -759 139 -511 -502 -4453 -2721 2340 1579
2233 1579 -3315 -2833 1049 -933 -634 -493 -2369 -1273 1819 -32 -4046 -2125 1537 61 -1243 77
2249 77 -211 -989 2119 -433 -5127 -1148 2884 1230 -1809 -1868 -880 548 2967 -581 -4334 -255 3600
2266 3600 16 -3645 -1472 -1360 -27 2391 992 -2313 -470 2775 167 -1254 -69 -1144 -1151 1038
2282 1038 1436 -2292 -1267 2401 218 99 1066 -155 -1668 460 968 -2038 -507 1425 -931 -1469
2298 -1469 1121 1402 -2100 -597 146 -1256 -2 552 -1741 -2778 126 35 -2246 136 430 -1216
2314 -1216 -1118 728 -1590 -3124 -658 -1106 -1538 59 1 -2788 -2150 1900 -547 -2415 -347 -285 -901
2331 -901 -953 -851 -4101 -1794 2602 182 -2276 -517 -286 -1631 -35 388 -3044 -1801 1515 -333
2347 -333 -3056 -1899 97 -947 523 -23 -2859 -1097 1395 -395 -4512 -1294 587 -258 -1182 -1804
2363 -1804 -2189 -171 3103 -893 -4457 -818 1631 19 -1701 -1171 -1625 15 2897 -568 -2422 196
2379 196 2668 -70 -1663 -627 -1065 1118 2727 -645 -3085 1021 3678 374 -992 785 931 2057
2395 2057 1492 -1380 -2961 2471 4331 -1014 -1706 1284 3089 1796 508 -1708 -1191 4096 3250 -2868
2411 -2868 -3502 1593 3161 1068 492 -1430 -796 3452 2669 -2699 -3567 1270 2245 64 -309 -2082 -720
2428 -720 3082 2714 -2632 -2788 2421 2225 -894 -1994 -1169 412 2557 1271 -3565 -1210 3761 1833
2444 1833 -2040 -1437 812 797 908 -745 -3298 238 3701 959 -3492 -1226 1744 1149 934 -1571
2460 -1571 -3251 -213 3307 369 -4480 -1406 1633 1304 534 -1397 -2497 -634 3017 -737 -4515
2475 -4515 -1517 2047 798 -1696 -1405 -1475 1305 2918 -1498 -3918 392 2690 -552 -2434 -224 -188
2491 -188 916 1652 -298 -2024 1423 3635 -823 -1022 156 671 986 1654 -441 -2246 2581 4056
2507 4056 -119 -1281 797 2002 1341 1563 -1386 -1971 2347 2836 -419 -1509 2214 1718 162 531
2523 531 -522 -166 1790 1622 -1454 -1574 2322 1027 -663 283 316 74 1210 1616 -1627 -1561 1406 792
2541 792 -416 397 743 -716 1204 2005 -1627 -497 2052 1254 -1693 -600 504 -93 1074 1335 -1183
2558 -1183 -656 2012 1223 -1592 298 787 -967 -344 598 -748 -1243 1023 185 -876 816 12 -1689
2575 -1689 -486 1471 -1024 -2166 393 -422 -1618 -562 450 -797 -281 971 -1682 -2031 348 214
2591 214 -1618 -769 364 -1461 -704 1017 -805 -967 1345 1034 -1570 -516 72 -1177 811 1824
2607 1824 -589 -1690 1559 2039 -572 -217 908 728 1468 938 -1557 -1841 2504 2524 -947 -535 1188
2624 1188 784 573 879 -1182 -693 2212 939 -2353 -1522 1507 926 342 837 -1042 -979 1915 1292 -2005
2642 -2005 -1368 1564 933 -499 -533 -963 -140 2440 1457 -2606 -1175 2402 1223 -518 -1388 -8 1210
2659 1210 2519 -424 -2862 819 3503 1117 -1279 -1889 -491 579 2153 92 -2082 673 2998
2674 2998 -690 -3127 -415 819 1762 942 -1315 -3352 -66 3129 -702 -3029 -132 1343 958 -493
2690 -493 -1488 -1936 729 3134 -1492 -3373 -404 1028 255 -689 -1053 -526 1396 1427 -2267 -3016 1257
2707 1257 2811 -666 -1551 -815 -81 1627 1513 -806 -1991 1909 2556 -1102 -1425 36 659 1558 1721
2724 1721 -1405 -1976 2759 3082 -489 -1547 823 959 1061 286 -2083 -680 3026 2141 -1988 -1896 1446
2741 1446 1129 252 134 -1217 -419 1839 701 -2727 -929 2488 1042 -211 -462 -1050 -272 1870 1077
2758 1077 -2532 -904 1655 743 -1125 -500 -8 533 2469 357 -2768 -439 2262 1014 -1656 -541
2774 -541 340 384 1291 -362 -1461 462 2668 -223 -2316 -141 240 -454 78 -354 -1352 221 1746
2791 1746 -777 -1637 395 899 -350 -369 -543 -2323 -348 2251 -694 -1992 -21 1000 -310 -279 120
2808 120 -1385 366 1329 -737 -2088 734 1661 -610 281 680 -404 -128 1076 -287 -1299 1011
2824 1011 818 -946 279 909 -394 -165 1960 504 -943 588 667 -633 56 752 -798 -265 1574
2841 1574 -202 -913 839 1122 -808 -790 592 -833 -452 720 -396 -1284 238 1411 -1056 -124 969
2858 969 -881 -613 1006 169 -1877 -295 743 -344 52 302 -505 -173 1671 159 -2077 264 1381
2875 1381 140 -855 99 -300 59 1386 -80 -1157 949 1378 -177 -1145 296 -183 -314 1110 -230
2892 -230 -1473 490 1921 -368 -1241 575 -249 176 470 -868 -2123 650 1988 -1190 -1749 214
2908 214 1040 544 1 -1033 -1555 1473 2058 -1412 -1768 1091 2007 283 -2 -158 -81 1751 1750 -1088 -1264
2927 -1264 1653 1800 -260 -27 279 267 1892 1994 -700 -1008 2141 1785 -748 -267 165 891 1882 1348
2945 1348 -1469 -634 2949 1761 -1237 -1207 546 1049 822 -149 -1959 -146 2391 701 -2501 -1029
2961 -1029 1650 712 231 -457 -1534 -143 1734 422 -2531 -573 1913 426 133 -228 -1012 102
2977 102 2344 386 -2660 -267 1817 882 -604 -476 45 640 2196 -591 -2531 345 2451 563
2993 563 -1835 -560 67 763 923 -903 -1367 829 2169 -599 -1958 -114 97 -42 637 -614 -1608
3010 -1608 602 2108 -831 -1695 -9 679 205 42 -942 -1438 1230 2101 -691 -1402 1050 1906 199
3027 199 -15 -304 -268 1844 1600 -1144 -913 2366 2040 17 461 561 855 1674 1605 -636 -270 1932 1309
3046 1309 48 550 1084 696 1022 1588 -540 -618 1887 1454 -78 -176 834 146 1296 923 -572 -110
3064 -110 2141 1419 -1298 -325 1184 352 -69 341 -84 -22 1397 559 -1278 436 1206 -91 -235 961
3082 961 -320 -123 1015 408 -683 339 1120 -240 -156 594 -457 -676 1182 414 -525 -47 718 -274
3100 -274 -477 494 -570 -43 1130 338 -1427 -498 563 -1082 -370 552 -170 -693 645 333 -1740 -598
3118 -598 246 -764 -219 282 -1148 -1393 609 819 -1021 -602 729 240 -219 -105 -424 -991 1011 645
3136 645 -1306 -306 1306 384 -434 515 -288 -476 901 977 -1098 -545 1075 -23 -316 595 59 180
3154 180 1027 1013 -1032 -302 1610 234 -352 199 277 235 944 -17 -1599 108 1918 313 -1214 -257
3172 -257 524 -185 308 -232 -926 633 1923 240 -1545 -250 897 233 982 -357 -1120 -109 1704
3189 1704 73 -1272 477 1184 743 135 -579 -1147 200 1754 -580 -1448 175 1431 337 -345 -110
3206 -110 -396 1014 1545 -995 -1897 677 1428 -530 -1195 126 -16 607 668 -925 -1506 600 1074 -671
3224 -671 -1074 -59 -341 363 439 -1393 -1659 967 1252 -981 -837 264 436 -349 -379 -1232 -626 1658 696
3243 696 -1901 -1443 935 1039 -362 -524 -1185 -86 1409 195 -1977 -1021 1730 1105 -498 -626 -769
3260 -769 -459 1186 493 -1835 -714 1208 414 -992 -668 -736 -4 1287 205 -2017 -1147 1290 380
3277 380 -1229 -883 87 110 768 51 -1268 -7 1603 190 -1673 142 1061 189 -151 -55 -475 844
3295 844 1761 -403 -1088 892 1286 355 -111 -175 -400 345 1587 45 -591 125 977 409 -178 -372 -312
3314 -312 936 1344 -513 -1052 462 1543 -93 -360 210 -126 512 988 -1056 -1117 677 924 -588 -233
3332 -233 375 225 57 531 -38 -407 783 423 -597 -524 579 11 -77 679 -237 -824 476 654 -384
3351 -384 -278 -281 -389 -171 563 -688 -821 83 681 -763 -630 486 -615 -791 -23 -146 -1139 9 -142
3370 -142 -1103 -547 496 -708 -985 136 -633 -1366 -397 -135 -646 -846 -106 -630 -862 -106 -595 -972 302
3389 302 360 -1048 -1263 114 182 -1111 210 -290 -618 343 584 -367 -808 534 363 -151 285 -141 -539
3408 -539 684 1578 14 -491 743 322 522 213 200 -788 274 1334 -655 -658 1251 1136 -111 -22 429
3427 429 -61 998 982 -816 -489 1865 847 -908 238 431 159 778 818 -503 -438 962 719 -219
3445 -219 -362 632 460 621 187 -517 -61 1852 1327 -359 -454 753 917 698 401 -686 293 2093 557
3464 557 -1102 -866 826 511 213 -327 -559 10 498 -107 -2135 -236 987 -541 -372 -219 -1213 -339
3482 -339 529 -550 -1752 -916 493 -296 -899 -940 -1204 -679 330 -557 -2187 -182 854 -195 -2284
3499 -2284 -969 -294 111 182 -860 -1132 -143 919 -488 -1640 -508 249 56 172 -594 -654 263 544
3517 544 -697 -1179 202 371 -374 -551 -635 -757 1118 949 -960 -1317 215 565 -275 -443 -443 -575 755
3536 755 645 -1330 -1518 800 1009 182 -502 -149 83 485 401 -884 -768 1069 1838 -82 -310 112 92
3555 92 667 1446 58 -469 840 1006 -423 265 578 432 721 743 75 404 1201 1024 -702 263 1365
3574 1365 552 303 168 -66 256 972 409 -1191 -128 928 159 -439 215 -705 -389 417 5 -800 274
3593 274 881 -339 -615 -479 -579 -342 432 111 -1206 -653 203 -670 -256 237 -272 -460 363 -370 -1550
3612 -1550 -124 720 -314 -1108 -291 284 -439 -271 -93 -323 111 555 -789 -797 -327 -400 46 -97 374 -532
3632 -532 114 349 279 -581 -419 -86 -624 422 119 -1089 -606 316 -232 -856 432 -155 -375 -425 -294 -992
3652 -992 -185 342 -521 -841 -92 -317 -571 -134 -30 -484 -284 1304 148 -281 -85 -233 -710 640 515
3671 515 -357 144 754 -353 -988 -35 583 187 0 407 -711 -151 1392 111 -1149 -1 836 77
3689 77 -214 -308 -300 298 666 95 -646 408 738 -463 -124 -98 -29 597 289 90 -886 501 784 -144 -220
3710 -220 -528 -832 336 564 -317 -1129 463 1157 -200 -868 314 -159 279 29 -347 -758 407 412 -852
3729 -852 -748 548 356 110 208 -226 -394 986 1035 -435 -616 245 -11 -540 252 -550 -433 491 631 -839
3749 -839 -482 762 669 128 -639 -913 -17 20 437 -1425 -1104 834 712 -792 -319 -50 354 128 43 -1193
3769 -1193 -981 764 -243 -601 139 100 -123 -36 -360 -1471 -209 596 412 -995 -70 165 -54 704 -349
3788 -349 -1129 -40 1439 308 -1005 -415 350 68 401 156 -835 368 994 321 -998 -249 364 71
3806 71 -335 -25 229 247 742 -704 -1134 -70 442 -247 -77 -243 -142 105 842 21 -677 418 958 -487
3826 -487 -378 -45 150 299 273 -59 -413 653 1003 95 -760 765 508 323 46 156 -369 145 407 -220
3846 -220 -1128 408 -187 -401 450 -610 -345 196 223 -831 -307 -210 -233 220 152 -168 -844 267 411 -145
3866 -145 -504 -196 312 151 306 -527 -166 -96 120 -595 -109 807 -427 -780 19 538 -415 358 261 -343
3886 -343 -522 354 -311 -546 88 -249 -265 59 702 -862 -521 141 249 -249 263 -160 -554 155 -24 -1204
3906 -1204 -767 237 409 -526 189 -55 57 -119 238 118 -162 1057 801 -34 -28 396 -402 -136 484 -230
3926 -230 -492 1011 810 76 -694 163 -286 -467 554 -365 165 728 919 -528 -487 475 229 466 237
3945 237 -109 -526 885 1009 -245 108 542 -191 338 175 -710 -186 463 50 -675 -624 437 156 1163
3964 1163 -84 -430 -388 565 372 -250 -182 1523 280 300 -509 176 152 1116 -251 -754 -130 952 188
3983 188 -291 263 -145 20 382 -577 -1096 144 728 -494 -879 -812 -402 -97 449 -187 -635 -547 540 308
4003 308 -984 -671 182 44 755 -1336 -1423 296 -207 -32 -880 27 -9 -455 -15 -993 -486 130 207 -480
4023 -480 -563 146 -111 -685 -121 451 -238 284 742 -854 -419 203 190 -55 -199 -433 329 976 492 120
4043 120 -419 349 783 -367 -343 580 87 534 441 -552 -438 1245 927 -492 -367 317 67 -54 356 -756
4063 -756 -49 394 94 -540 -266 439 351 -39 -413 -527 -603 -197 616 -392 -463 -121 -1 -345 -497 -474 297
4084 297 1380 365 -744 -47 396 634 39 356 -374 470 415 -475 -869 90 1038 -592 114 -42 -110
4103 -110 4 -140 -274 -277 437 468 -61 -285 -151 52 -251 -37 232 -521 24 734 -283 -274 -305 -542 164 387
4125 387 -642 -616 183 797 -811 -429 243 638 -845 38 302 -501 -159 41 -418 -647 -279 218 -234
4144 -234 184 115 -571 497 793 141 -404 -86 267 411 130 148 -164 556 -592 447 -459 158 -163 -232
4164 -232 -222 277 350 -54 265 -434 -229 478 179 -110 -720 745 -494 112 209 -411 -869 -15 -40 -115 -823
4185 -823 -347 -793 -253 172 -98 151 135 -182 -405 -65 -166 378 715 -118 -228 -549 576 100 -246 -552
4205 -552 -287 -431 -182 605 -486 -366 -66 645 -470 -172 356 86 -30 571 -399 106 375 229 -203
4224 -203 -62 -61 29 1001 18 -417 -734 502 659 -993 -261 472 -704 -605 -7 -733 -239 345 214 -1099
4244 -1099 -340 543 -263 -408 -349 -194 -330 509 -21 -167 -452 -175 597 300 597 155 -576 463 208 -658
4264 -658 18 993 558 -366 -56 173 -36 572 -140 -1222 -189 553 -82 -1085 -336 181 -328 492 29
4283 29 -781 -335 294 -125 -165 387 -187 -157 93 478 -764 4 918 97 -1014 176 594 -373 238 -209
4303 -209 -299 656 409 170 -341 541 856 -177 -37 -401 106 143 446 -797 -312 344 -200 -259 -496 469
4323 469 -406 4 310 -782 -421 221 526 162 -500 -399 -320 -33 -254 93 127 71 794 -169 -416 -213 56
4344 56 388 39 -403 189 96 144 -662 -20 1272 73 397 762 -278 -569 504 115 -177 90 48 -96
4364 -96 -276 -477 -74 73 -101 661 -626 -499 191 539 46 -283 -296 -672 123 269 -897 252 681 43
4384 43 -205 -642 744 -98 -221 324 -440 -225 283 355 291 507 18 -41 -482 -557 12 -154 176 130 -327 -321
4406 -321 56 179 230 -50 -238 -219 565 -219 -255 192 583 17 -343 224 161 -279 -155 56 -1024 657 237
4427 237 -382 -424 338 124 68 583 116 -436 312 -35 145 775 205 -249 -163 -22 240 -440 -653 39 249
4448 249 225 -41 48 57 37 409 -450 243 186 172 -400 297 -73 -539 397 512 -556 17 1038 378 -487 734
4470 734 82 98 372 587 -350 470 192 191 238 -173 208 761 533 -439 -290 -359 1178 -419 -188 -176 416
4491 416 0 115 449 -548 621 651 -275 -640 73 326 -560 158 18 -325 -99 784 -248 -814 77 -29
4511 -29 -72 74 564 -1077 -20 -342 -316 -513 -329 709 -444 388 -740 81 198 -221 -79 654 214
4530 214 750 -194 85 574 564 -344 182 293 -472 1154 847 -358 325 -120 57 -91 -7 -464 140 931
4550 931 -88 -514 -1116 -133 -230 -276 480 -106 -1425 1234 428 -605 864 385 64 -716 245 -387 -871
4569 -871 691 381 42 361 223 484 155 381 195 91 767 317 -489 59 699 473 -224 -1085 220
4588 220 -322 1190 330 -198 -58 -318 -519 -398 371 -44 -118 -848 -469 -338 23 -30 96 -499 -104 318
4608 318 -69 559 -524 -506 189 387 361 -322 142 410 -549 -111 -204 -349 -179 -131 670 13 443 -201 633
4629 633 41 -750 -347 -126 90 -287 -543 -306 661 -197 -472 -878 -1099 -300 822 -1139 -444 -314 67
4648 67 -33 -161 29 -403 272 -224 -212 227 802 409 1004 -16 419 110 382 256 -984 394 1494
4667 1494 174 -609 321 23 123 400 307 181 283 555 536 -94 -213 -500 380 548 456 1036 -694 932
4687 932 748 430 -10 28 -108 -425 237 -782 599 305 225 -333 142 30 42 331 185 -732 -46 744
4707 744 521 -356 -250 787 -421 -196 -840 -420 87 405 96 -565 -40 1112 336 300 291 1088 -742 792
4727 792 237 -347 -329 379 -1156 483 225 426 612 829 -70 510 87 252 -206 923 -52 3 20 590
4747 590 343 -746 -509 177 286 -288 -315 378 -459 64 -375 -583 78 160 1168 -728 318 -168 -49
4766 -49 221 470 -652 302 515 -56 176 -390 -744 758 -786 120 -548 -364 375 543 -779 404 -424
4785 -424 87 -647 -86 21 580 749 -591 -249 66 -805 -91 263 -456 352 -294 1136 -131 160 817
4804 817 -939 577 284 14 249 553 1399 21 -593 -6 10 83 -110 -75 374 230 -198 -582 -364 276
4824 276 379 951 -1747 436 80 -53 429 233 960 633 716 156 377 1083 192 0 -348 -860 390
4843 390 912 548 32 -236 917 -74 36 53 -174 -446 -481 589 -78 -26 305 -192 485 585 213 -1033
4863 -1033 927 253 -843 -856 759 37 -315 -471 540 6 -73 1046 -500 326 137 -88 560 -127
4881 -127 -143 -185 -29 164 57 639 -57 233 -187 -917 -272 607 -377 284 -443 -345 438 -390 -566 -286 311
4902 311 233 -616 493 160 -1288 -644 57 166 -805 145 -112 993 45 -27 -526 1074 246 306 587 -193
4922 -193 565 -525 234 -1 -234 -87 373 366 -253 578 549 237 81 -514 -1147 400 683 -581 1054 76
4942 76 57 -564 807 559 236 73 -215 -441 -231 -187 -715 -27 200 9 354 -29 180 498 -760 619
4962 619 137 -19 862 -469 -199 143 223 -284 42 -397 -814 358 57 -140 -412 -705 -415 891 -359
4981 -359 44 9 -693 -189 -299 -51 1023 -8 93 -243 409 377 -412 555 -706 170 368 192 -639 586
5001 586 1101 -506 -371 -208 111 222 428 48 -613 -307 -749 522 164 1211 212 -1015 181 625
5019 625 -196 -58 -845 34 356 -144 493 -40 -849 -350 -815 1039 -19 -104 -626 338 -357 -350 -704 16
5039 16 290 -129 -258 -293 67 -734 347 -665 -771 -414 92 869 -612 0 -924 113 -28 58 786 -642
5059 -642 -108 -375 -195 -567 -123 -113 -432 -113 -804 642 24 -649 364 573 -460 1089 313 -468 59
5078 59 -577 216 142 -454 -229 685 1619 -175 -1083 255 259 110 -112 -26 -651 342 282 83 -529 -410 370
5099 370 -649 79 79 451 306 216 -345 -1131 634 621 240 421 -108 -13 -8 -428 -275 -901 301 -56 -288
5120 -288 250 363 -43 415 250 313 -852 0 -95 -29 484 -128 102 624 80 721 -444 98 71 -54 -834
5141 -834 -354 21 -90 -87 -136 65 -224 713 -570 211 43 202 -546 383 20 -7 198 228 -488 -349 -664
5162 -664 177 -37 -746 -568 135 -85 -154 103 -1095 -244 470 81 196 86 -582 325 98 -292 293 -354
5182 -354 524 -652 392 597 -587 -39 22 -742 -29 -339 -617 -986 -492 263 175 469 -726 270 -719
5201 -719 999 169 -904 -382 -655 -15 -1008 47 -549 -117 -117 700 297 541 233 457 -288 98 -620 287
5221 287 179 21 -843 -379 -349 -657 -611 133 132 -1046 46 832 806 597 -119 318 755 -374 -205 -533 119
5242 119 192 -405 -300 -211 -355 761 465 -581 -170 732 -781 -264 177 -281 357 907 366 891 -452
5261 -452 212 184 72 316 -898 -590 -624 85 544 -49 3 386 48 -172 -256 -94 191 485 -204 -374 641
5282 641 -186 -789 -123 -365 -437 217 179 -331 -511 400 247 -97 811 477 250 -198 209 525 -276 -4 285
5303 285 -228 110 399 -331 -219 679 157 380 -460 488 183 812 -405 339 282 -83 -102 140 513 54
5323 54 108 497 19 -92 587 158 451 26 133 159 155 -220 455 -742 55 113 371 -1090 -231 528 148
5344 148 -280 474 82 -431 287 147 -170 -125 -197 471 37 357 -242 41 209 -97 -391 98 710 -351
5364 -351 -125 325 208 220 -32 451 153 -215 262 367 -365 592 181 -457 -117 -308 -805 -881 919 240
5384 240 -618 380 -123 -848 403 275 -451 -222 469 364 -556 -188 155 133 -298 -576 -682 -78 -337 -355
5404 -355 91 -330 230 0 -302 3 -253 158 210 332 -647 -341 80 331 296 -100 -214 -152 -373 173 -257
5425 -257 446 2 272 -723 -318 -205 36 -421 7 -269 -606 749 480 -184 -540 172 256 -87 -489 -124
5445 -124 -101 132 -260 307 171 -119 -191 297 554 -335 140 384 335 303 155 -358 19 820 -42 295 89
5466 89 -123 128 507 420 -13 391 109 -64 -18 236 224 -694 589 549 409 -393 -18 -357 477 339 -269
5487 -269 -314 81 -400 -212 -168 279 -331 -3 700 392 66 189 440 163 -315 117 377 -225 -272 -12 -280
5508 -280 550 287 401 -300 116 183 -104 230 708 114 -301 258 -505 448 27 452 -60 -108 -357 328 -249
5529 -249 666 661 268 56 414 170 350 261 36 -315 433 -719 -64 482 667 -184 -208 520 -73 -386 200
5550 200 547 -378 -102 83 263 539 145 -410 -95 430 -241 -415 -24 -134 438 -30 -49 -398 -311 585 42
5571 42 52 307 -107 158 -371 -172 -246 -536 -393 195 -450 131 -571 319 -55 -165 174 -157 548 -266 -759
5592 -759 399 422 -67 -3 2 -155 308 299 -714 -410 65 -62 160 40 -110 -338 80 -17 112 -310 -21 222
5614 222 -120 27 364 -88 33 -257 94 -111 -65 388 -436 -191 252 54 -52 -272 -47 -208 250 407
5634 407 -242 -18 583 314 167 174 97 193 -165 492 15 -205 -239 -239 -148 -178 -32 -440 2 155 -228 -13 536
5657 536 -399 -130 393 261 92 -284 9 239 -742 -82 321 -265 309 5 151 275 361 -284 -131 780
5677 780 -344 -167 -102 -151 -78 146 240 74 -195 6 -214 -725 12 127 39 -610 -814 -512 194 -3 190
5698 190 -213 442 307 330 113 56 2 -386 285 163 -415 67 255 294 -510 -2 -18 323 436 -248 -91 -73
5720 -73 99 -148 257 -4 82 83 44 99 57 383 51 35 224 403 182 48 216 205 30 -23 -144 -203 -14 248
5744 248 369 181 37 73 319 -106 -152 -161 302 239 69 24 111 361 125 286 -102 179 156 229 141 11 341
5767 341 80 -170 -58 7 -130 -150 309 16 281 -168 -173 -152 -114 60 62 -29 -18 259 -341 -38 -125 -75 -17 94
5791 94 -52 -297 375 184 -370 -106 8 -213 144 156 -143 -135 48 -101 -43 -91 203 -34 20 86 -373 -255 178
5814 178 497 62 -144 -246 -111 281 -303 -132 -246 138 124 -167 40 44 122 -44 65 265 -62 270 326 49
5836 49 150 -208 -340 150 176 -24 146 -122 153 -52 31 385 -134 158 376 -125 200 159 165 -226 -392 65
5858 65 -146 154 59 -53 242 -2 44 -118 -141 272 0 7 -163 -202 108 231 112 -308 173 39 -5 -173 249
5881 249 -34 140 149 33 -227 88 292 101 -95 -230 167 -100 -175 38 -284 -54 -91 -96 -91 99 331 -155 -169
5904 -169 70 -205 -158 -94 150 -372 133 396 239 -99 -254 -45 79 113 65 -357 -53 258 248 -171 -81 35
5926 35 128 17 -131 -138 13 103 -86 102 -61 43 -253 183 11 -419 282 267 56 81 30 -20 65 -30 -141 -288
5950 -288 248 213 -327 -25 -102 57 41 73 -317 -119 -8 313 -35 -115 75 -129 81 40 -50 -40 315 123 -405
5973 -405 -29 -149 -142 -79 142 30 -36 312 239 8 -127 -26 -1 21 269 -61 -59 -176 193 122 -152 156 350
5996 350 86 255 2 -315 317 232 114 -8 327 9 -104 -14 46 -357 34 112 87 248 291 20 140 -101
6018 -101 51 -230 -83 10 -250 -103 116 172 -312 98 335 -196 -136 -40 68 -31 77 -149 -82 270 514 7
6040 7 -123 123 -125 61 48 -165 -279 218 104 25 -153 -112 -253 -5 -52 -127 -200 53 181 -25 -41 167 6
6063 6 164 136 393 -477 -97 45 4 -111 204 -96 -252 205 62 -174 -267 361 -139 84 32 66 6 34 356
6086 356 -347 33 194 102 65 -34 -139 -143 -6 -39 167 -35 578 189 -162 228 -66 2 171 124 109 -4 -91
6109 -91 -374 -106 368 79 -149 219 -9 15 295 168 19 -144 393 165 -83 -73 -58 -83 262 107 49 313
6131 313 67 294 270 274 236 200 43 227 111 317 -38 9 -316 55 -142 -429 -262 306 193 19 273 66
6153 66 -235 -33 -24 -32 290 25 19 -205 388 -14 294 -57 -314 123 -54 451 -126 -85 566 458 -487 -430 31
6176 31 142 -488 -1098 -481 223 -912 10 521 -405 142 -129 224 -114 -95 -527 85 1035 -453 554 -270
6196 -270 -374 -599 -280 -109 -85 -698 155 -546 -80 -275 486 -493 119 -510 -181 119 27 -887 -824 -368 -313
6217 -313 -745 131 473 -571 -446 -169 -145 141 -150 -915 258 472 364 232 17 -193 63 -671 -365 357
6237 357 35 -253 -210 -462 563 -218 -330 539 1008 -419 -106 -150 -72 -509 -249 -67 -376 -137 -306 -449
6257 -449 49 -76 106 52 -29 -27 -368 346 355 -19 5 -285 -439 186 615 -85 9 -379 21 -264 -128 -632 -270
6280 -270 -242 143 -313 -577 352 94 -44 -590 314 -206 244 -613 85 230 286 25 90 222 -193 -17 -402
6301 -402 -254 677 -372 -1 -161 -259 -244 497 268 -245 -138 -353 -201 -251 -236 -319 424 58 1 -7 -438 -134
6323 -134 -631 -76 367 -664 -493 53 -213 403 -150 516 469 239 277 303 -409 -495 178 -288 222 -66 510
6344 510 196 -337 -21 95 -714 -116 92 -93 -94 -110 126 154 474 -391 -289 -232 -120 152 -356 124 161 599
6366 599 232 -85 -33 10 -670 -197 1050 29 -17 -182 291 -9 393 285 484 472 441 -100 200 -485 327
6387 327 320 643 -130 -173 -97 -219 0 -211 -198 -252 -94 -63 -25 -334 333 243 -347 40 238 105 -192 311 20
6410 20 103 235 581 115 290 -56 222 -43 -17 -285 -320 -51 204 -111 -286 50 -12 -261 -235 25 25 -97 115
6433 115 -222 -227 -123 197 106 47 439 19 -306 233 115 -341 481 54 -382 -191 -3 204 -339 -211 205
6454 205 -162 -2 134 -546 -305 386 338 -48 111 227 -394 208 -43 -240 222 -131 195 63 176 -119
6474 -119 -254 315 -8 30 -187 79 165 -29 -28 -89 371 -26 -251 -174 -149 221 -160 -65 289 -59 -279 157 357
6497 357 -75 -472 68 -49 -2 -94 -232 159 346 127 -10 -224 78 -60 -185 -38 53 -43 262 89 -11
6518 -11 70 18 -121 -115 -261 105 56 132 195 -100 179 355 39 26 -83 -76 -170 180 -11 -56 -207 255 113 -45
6542 -45 -221 -93 168 -281 215 50 -89 -23 109 88 195 -96 3 -39 479 -4 -221 -11 52 35 34 220 23
6565 23 -79 301 -3 -34 -76 -115 -99 -28 -65 -227 -94 136 342 4 181 31 -105 242 57 -172 101 237
6587 237 49 -76 251 -1 100 44 161 -268 -203 -9 90 -186 184 205 -146 182 43 81 -89 -153 40 -155
6609 -155 67 -16 -267 394 -87 71 48 -116 94 -42 15 -92 -99 188 -151 207 -208 124 1 256 392 -140
6631 -140 -83 181 170 -77 -159 19 -112 -140 171 135 166 189 -78 -307 -42 316 212 192 98 -84 -105 132 -78
6654 -78 -278 -105 -98 -49 -121 53 215 -48 29 236 -54 102 47 -4 -165 277 49 -7 -106 14 -146 -121 201 -201
6678 -201 -269 -234 -224 -41 -164 -208 -50 -5 -28 107 -287 -190 74 -262 -296 -188 53 33 110 -22 -107 64 285 -419
6702 -419 61 260 -31 85 72 155 -280 11 -17 168 -270 -13 77 130 48 67 -212 84 91 -193 -132 -131 116 -198
6726 -198 -203 -86 -56 -175 140 -157 17 36 325 17 130 -204 22 -76 59 82 -133 59 -56 176 22 104
6748 104 -12 34 -63 -109 -320 151 137 -52 110 94 -179 -63 -37 85 -357 34 17 10 -124 44 -27 -51 -46 -372
6772 -372 -20 105 -8 -133 -68 -50 132 -277 -207 -70 -33 58 5 -2 234 -250 56 420 -99 -151 143 119 65 210
6796 210 -69 128 115 -22 -75 14 -38 294 20 228 -135 195 173 107 -25 44 99 177 -11 -222 -24 132 -172
6819 -172 1 55 -79 -124 270 106 -42 -344 21 -31 -73 48 -386 -33 -27 165 -347 -194 -80 -26 -125 -1 -114
6842 -114 -127 -61 -124 -201 156 192 -10 129 119 175 144 70 1 -197 150 -134 29 -218 -51 465 -199 271 273 59
6866 59 70 122 243 -204 -44 83 -5 133 23 -110 -4 -108 -181 -13 -76 143 -117 -63 -199 183 109 79 -200
6889 -200 112 137 -171 -280 16 -43 11 113 -27 175 355 46 147 -249 180 60 193 97 29 15 -130 -14
6911 -14 109 264 -96 230 -9 -146 59 -55 -204 169 69 71 -240 -4 -127 1 108 -69 -44 283 -87
6932 -87 -57 325 -99 -56 -65 -107 79 -289 -157 39 -38 -62 97 -144 -28 -92 -168 -70 227 -60 39 95 72 -286 152
6957 152 322 90 -271 -86 250 -160 60 166 116 281 40 -20 -30 13 211 -30 -176 346 -33 -177 -19
6978 -19 -78 66 -14 155 8 53 -152 -153 -292 84 -268 90 -252 -197 -364 -55 163 161 -330 50 220 -30 -283
7001 -283 129 -249 -81 43 70 -120 -245 -106 -359 126 47 72 -97 27 96 -129 49 170 151 95 56 48 102
7024 102 370 430 104 -80 -11 -25 371 -221 -117 -100 247 66 137 36 41 57 25 376 162 -53 333 16 -98
7047 -98 -250 72 79 -46 305 101 228 1 -293 141 -174 246 -23 -82 -51 26 5 222 93 -323 -89 163
7069 163 251 -342 -91 -17 208 24 125 104 147 -180 -38 -59 72 -72 -3 151 -220 -149 80 -52 255 -182
7091 -182 -57 178 75 -69 -51 -289 -19 131 -130 -168 113 112 -156 34 -216 -353 -188 318 -146 -336 294
7112 294 -183 -67 8 93 280 20 -79 55 -139 -219 35 -47 -59 80 202 -168 -6 -155 110 -17 -36 -194
7134 -194 -277 103 0 54 -115 -205 -165 166 -218 -209 -114 445 28 -224 334 -22 242 274 29 21 -107 71 -131
7157 -131 -14 284 -80 229 84 -134 -75 -49 -223 51 101 340 -169 -7 79 104 48 -222 29 -239 -276 -27
7179 -27 -70 -146 319 -14 199 -2 20 -277 -109 -68 149 35 -10 -49 54 65 -36 -130 137 -57 -29 104 -100
7202 -100 30 -243 -342 -233 -40 -14 -268 -14 -129 -55 -214 -5 165 -65 72 120 -209 -140 -574 -103 -51 33
7224 33 -216 -128 -38 -114 187 40 121 -14 312 15 -163 21 -49 -172 144 89 71 11 167 -300 62 -295 48
7247 48 35 -131 102 267 -26 -143 -353 213 -248 70 45 36 279 -33 10 -99 105 -267 458 50 -98 69
7269 69 182 31 172 55 -37 -21 29 -40 104 -298 -73 -153 -105 -21 88 -68 -208 -69 -170 109 -10 -123 -204
7292 -204 40 -107 209 29 -74 -65 -3 57 85 194 8 39 93 279 160 253 16 197 80 -66 337 -87 163
7315 163 -110 73 -36 96 70 -113 222 217 130 -278 -19 -47 58 -304 169 -52 372 419 41 -59 143 -68
7337 -68 98 -123 -201 -124 18 -120 -11 -147 42 328 95 97 78 -279 84 -50 207 -55 182 -140 -19 141
7359 141 -8 -335 154 60 164 -296 -24 251 -81 -179 -67 1 -157 -11 -36 -161 284 154 -139 -35 44 -382
7381 -382 -83 245 -98 -307 -163 71 0 -243 57 135 -294 241 20 -313 58 -181 60 130 21 -109 -118 292
7403 292 134 -370 -33 -211 -231 -119 31 51 -32 66 -146 -148 107 381 146 39 120 63 136 68 132 59 28 408
7427 408 44 65 -232 8 167 147 79 -115 278 453 45 244 39 135 -93 269 11 -334 -86 34 10 26
7449 26 255 -205 39 -134 -14 103 165 137 113 -41 -80 -235 -47 -100 -171 147 -7 167 -86 -218 94 -44
7471 -44 22 206 -125 -138 38 39 -94 -83 229 155 -48 211 -141 -124 53 -63 -26 109 107 -243 -310 131 306 -85
7495 -85 -213 107 -52 -28 179 -151 -108 115 -8 136 -387 65 -83 -195 113 44 -266 7 39 310 399 218
7517 218 -197 241 140 46 17 -118 -13 99 155 186 2 -40 39 64 -302 -35 341 -92 244 47 72 122 3
7540 3 90 -291 -207 -69 44 45 -12 -73 -16 135 -36 -61 408 36 -290 -87 96 -62 -108 -288 -101 -181 134 108
7564 108 -179 74 -185 247 -176 42 -53 -97 -20 108 223 90 59 123 -151 227 206 -40 230 -33 -117 -141 129
7587 129 367 -34 -335 -113 143 61 53 -169 77 91 -50 -173 -188 31 63 -174 -21 -206 -106 -33 -292 59
7609 59 -176 131 5 -77 168 24 -118 -61 62 -36 -34 218 148 -126 133 -87 -170 1 101 71 326 245 92
7632 92 272 -100 -103 192 -110 -184 97 -31 -391 231 50 71 157 -194 -51 -48 20 -145 -80 57 -101 -203 80
7655 80 -17 102 50 -183 43 -59 253 -60 -189 -298 -116 240 -199 -50 14 103 30 177 1 176 -138 -126
7677 -126 -148 -1 -144 234 -85 -135 94 127 46 225 -71 -307 145 141 34 -129 89 182 65 -202 177 -367
7699 -367 -69 -95 54 58 20 -255 117 -44 71 -54 -207 -7 -44 39 284 45 -176 26 147 -186 168 206
7721 206 -175 -227 -6 232 -56 -66 -44 255 -2 -29 -148 -77 -223 -69 68 -161 -62 220 -79 -90 123 -195
7743 -195 274 -90 -526 401 20 130 94 370 16 59 63 -3 10 -11 -163 -253 -100 56 159 -115 -87 -12 -152
7766 -152 -250 358 -29 163 -79 -308 -145 157 76 -261 44 118 -199 132 83 -110 -230 300 67 25 88 -36
7788 -36 -22 -155 24 -61 121 6 -27 157 -16 -69 161 86 -138 17 -207 142 146 -212 16 151 118 138 -34
7811 -34 63 33 -138 -158 52 81 118 -113 -70 131 -251 -148 -130 33 282 -289 161 -122 46 139 146 92 -95 -91 -217
7836 -217 -104 -159 -95 -111 78 -180 145 -79 159 239 296 91 -53 -119 -57 112 -52 -74 -91 -1 -110 259 -184
7859 -184 -43 112 -61 74 -188 -80 219 89 -19 125 195 59 92 -73 183 16 177 -220 -148 87 -253
7880 -253 135 90 190 98 47 -41 20 -6 -131 164 -337 18 -167 -45 21 -31 -132 -159 -44 96 -4 -66 -214
7903 -214 170 81 -156 138 195 6 -145 76 34 -12 64 178 -125 63 196 171 -166 -125 40 250 147 71 -53
7926 -53 -31 -15 -153 -207 143 313 11 -80 -6 19 -113 -222 205 -235 196 97 -176 51 75 -182 -362 78 159
7949 159 152 167 -40 -181 -3 115 -22 10 -118 -167 -26 186 62 53 -116 45 251 70 168 222 -110 73 -205
7972 -205 -175 44 -65 120 110 55 290 -70 -48 77 -120 159 136 -191 -267 -83 -39 231 23 -115 -17 -213 12
7995 12 -16 -379 0 38 -20 62 -329 -264 256 28 -153 -212 74 -208 187 -1 7 -8 -297 -108 -74 -202 -84 330
8019 330 0 -97 40 -108 -218 28 -133 37 -292 -38 121 72 -94 -1 45 -68 45 32 82 -18 -37 -116 18
8042 18 4 43 49 179 227 275 198 303 13 -189 87 -228 -63 0 -48 216 -199 178 107 179 270 -190 278 204 -328
8067 -328 -314 141 -71 -146 279 146 295 -29 -323 -23 68 83 -318 -129 -36 18 -29 -41 -146 -165 -21 318 -163
8090 -163 -148 -267 240 69 -222 22 -327 -149 -83 164 17 -19 -9 63 192 -56 125 332 187 -175 179 -160
8112 -160 -9 -42 260 305 72 237 -75 -124 54 -36 -275 -291 9 46 154 -106 125 48 -117 -179 70 -235 77
8135 77 -251 -145 -41 -13 130 -149 121 160 -120 -90 -34 130 -143 -60 -364 -246 118 99 -254 56 105 -81 -153
8158 -153 27 0 -6 -1 -44 -300 -91 76 54 105 39 41 -207 10 -66 271 -90 -233 60 29 -154 1 146 -118
8182 -118 -224 87 -95 22 -171 -134 73 -5 -136
8191a36
##END NTUPLES=NMR FID
##END=
