##TITLE=1H_TG-2285-3
 CDCl3, 8 sc, 
 23.3.2020
##JCAMPDX= 6.0         $$ Bruker NMR JCAMP-DX V2.0
##DATA TYPE= NMR FID
##DATA CLASS= NTUPLES
##ORIGIN= UXNMR, Bruker Analytische Messtechnik GmbH
##OWNER= root
$$ XWIN-NMR		Version 3.5
$$ Mon Mar 23 14:11:07 2020 Russian Standard Time (UT+4h)  she@DPX200
##.OBSERVE FREQUENCY= 200.1315
##.OBSERVE NUCLEUS= ^1H
##.DELAY= (6, 6)
##.ACQUISITION MODE= SIMULTANEOUS
##.ACQUISITION SCHEME= undefined
##.AVERAGES= 8
##.DIGITISER RES= 18
##SPECTROMETER/DATA SYSTEM= spect
##.PULSE SEQUENCE= zg30
##.SOLVENT NAME= CDCl3
##.SHIFT REFERENCE= (INTERNAL, CDCl3, 0, 15.7039)
##AUDIT TRAIL= $$ (NUMBER, WHEN, WHO, WHERE, WHAT)
$$ ##TITLE= Audit trail, XWIN-NMR		Version 3.5
$$ ##JCAMPDX= 5.01
$$ ##ORIGIN= Bruker BioSpin GmbH
$$ ##OWNER= she
$$ F:/spectra/data/she/nmr/H-F/1/audita.txt
$$ ##AUDIT TRAIL=  $$ (NUMBER, WHEN, WHO, WHERE, WHAT)
(   1,<2020-03-23 14:10:12.79 +0400>,<she>,<DPX200>,
      <created by zg, POWCHK disabled, PULCHK disabled
       configuration hash MD5:
       00 E9 B6 7A A2 85 ED C7 34 08 36 98 17 FE 4E 26
       data hash MD5: 16K
       61 00 50 35 37 F9 80 40 A0 19 0B 18 D7 91 96 6F>)
$$ ##END=
$$ 
$$ hash MD5
$$ FA E1 8B DB 61 78 1F 5E 31 CC 7C 57 53 F8 98 4D
##$RELAX= 
##$RELAX= 
##$RELAX= 
##$RELAX= 
##$RELAX= 
##$RELAX= 
$$ Bruker specific parameters
$$ --------------------------
##$DU= <F:/spectra>
##$EXPNO= 1
##$NAME= <H-F>
##$PROCNO= 1
##$TYPE= <nmr>
##$USER= <she>
##$AMP= (0..31)
100 100 100 100 100 100 100 100 100 100 100 100 100 100 100 100 100 100 
100 100 100 100 100 100 100 100 100 100 100 100 100 100 
##$AQSEQ= 0
##$AQ_mod= 1
##$AUNM= <au_zg>
##$AUTOPOS= <>
##$BF1= 200.13
##$BF2= 200.13
##$BF3= 200.13
##$BF4= 200.13
##$BF5= 200.13
##$BF6= 200.13
##$BF7= 200.13
##$BF8= 200.13
##$BYTORDA= 1
##$CFDGTYP= 0
##$CFRGTYP= 5
##$CHEMSTR= <none>
##$CNST= (0..31)
1 1 145 1 1 1 1 1 1 1 1 1 1 1 1 1 1 1 1 1 1 1 1 1 1 1 1 1 1 1 1 1 
##$CPDPRG= <>
##$CPDPRG1= <>
##$CPDPRG2= <>
##$CPDPRG3= <>
##$CPDPRG4= <mlev>
##$CPDPRG5= <mlev>
##$CPDPRG6= <mlev>
##$CPDPRG7= <mlev>
##$CPDPRG8= <mlev>
##$CPDPRGB= <>
##$CPDPRGT= <>
##$D= (0..31)
0 1.2 0 0 0 0 0 0 0 0.06 0 0.03 0 0 0 0 0.0002 0 0 0 0 0 0 0 0 0 0 0 0 
0 0 0 
##$DATE= 1584958212
##$DBL= (0..7)
120 120 120 120 120 120 120 120 
##$DBP= (0..7)
150 150 150 150 150 150 150 150 
##$DBP07= 0
##$DBPNAM0= <>
##$DBPNAM1= <>
##$DBPNAM2= <>
##$DBPNAM3= <>
##$DBPNAM4= <>
##$DBPNAM5= <>
##$DBPNAM6= <>
##$DBPNAM7= <>
##$DBPOAL= (0..7)
0.5 0.5 0.5 0.5 0.5 0.5 0.5 0.5 
##$DBPOFFS= (0..7)
0 0 0 0 0 0 0 0 
##$DE= 6
##$DECBNUC= <off>
##$DECIM= 24
##$DECNUC= <off>
##$DECSTAT= 4
##$DIGMOD= 1
##$DIGTYP= 9
##$DL= (0..7)
0 120 120 120 120 120 120 120 
##$DP= (0..7)
150 150 150 150 150 150 150 150 
##$DP07= 0
##$DPNAME0= <>
##$DPNAME1= <>
##$DPNAME2= <>
##$DPNAME3= <>
##$DPNAME4= <>
##$DPNAME5= <>
##$DPNAME6= <>
##$DPNAME7= <>
##$DPOAL= (0..7)
0.5 0.5 0.5 0.5 0.5 0.5 0.5 0.5 
##$DPOFFS= (0..7)
0 0 0 0 0 0 0 0 
##$DQDMODE= 0
##$DR= 18
##$DS= 0
##$DSLIST= <SSSSSSSSSSSSSSS>
$$ [...]
##$SUBNAM2= <"">
##$SUBNAM3= <"">
##$SUBNAM4= <"">
##$SUBNAM5= <"">
##$SUBNAM6= <"">
##$SUBNAM7= <"">
##$SUBNAM8= <"">
##$SUBNAM9= <"">
##$SW= 24.9337058887773
##$SWIBOX= (0..15)
0 0 2 0 0 0 0 0 0 0 0 0 0 0 0 0 
##$SW_h= 4990.01996007984
##$TD= 16384
##$TD0= 1
##$TE= 0
##$TE2= 300
##$TE3= 300
##$TEG= 300
##$TL= (0..7)
0 120 120 120 120 120 120 120 
##$TP= (0..7)
150 150 150 150 150 150 150 150 
##$TP07= 0
##$TPNAME0= <>
##$TPNAME1= <>
##$TPNAME2= <>
##$TPNAME3= <>
##$TPNAME4= <>
##$TPNAME5= <>
##$TPNAME6= <>
##$TPNAME7= <>
##$TPOAL= (0..7)
0.5 0.5 0.5 0.5 0.5 0.5 0.5 0.5 
##$TPOFFS= (0..7)
0 0 0 0 0 0 0 0 
##$TUNHIN= 0
##$TUNHOUT= 0
##$TUNXOUT= 0
##$USERA1= <user>
##$USERA2= <user>
##$USERA3= <user>
##$USERA4= <user>
##$USERA5= <user>
##$V9= 5
##$VALIST= <valist>
##$VCLIST= <CCCCCCCCCCCCCCC>
##$VD= 0
##$VDLIST= <DDDDDDDDDDDDDDD>
##$VPLIST= <PPPPPPPPPPPPPPP>
##$VTLIST= <TTTTTTTTTTTTTTT>
##$WBST= 1024
##$WBSW= 4
##$XGAIN= (0..3)
0 0 0 0 
##$XL= 0
##$YL= 0
##$YMAX_a= 165887
##$YMIN_a= -59249
##$ZGOPTNS= <>
##$ZL1= 120
##$ZL2= 120
##$ZL3= 120
##$ZL4= 120
##$ABSF1= 10
##$ABSF2= 0
##$ABSG= 5
##$ABSL= 3
##$ALPHA= 0
##$AQORDER= 0
##$ASSFAC= 0
##$ASSFACI= 0
##$ASSFACX= 0
##$ASSWID= 0
##$AUNMP= <proc_1d>
##$AZFE= 0.1
##$AZFW= 0.1
##$BCFW= 1
##$BC_mod= 2
##$BYTORDP= 1
##$COROFFS= 0
##$CY= 11.3945322036743
##$DATMOD= 1
##$DC= 2
##$DFILT= <>
##$DTYPP= 0
##$F1P= 16.9975609425685
##$F2P= -3.02152046262296
##$FCOR= 0.5
##$FTSIZE= 0
##$FT_mod= 4
##$GAMMA= 1
##$GB= 0.15
##$INTBC= 1
##$INTSCL= 1
##$ISEN= 128
##$LB= 0.24
##$LEV0= 0
##$LPBIN= 0
##$MAXI= 10000
##$MC2= 0
##$MEAN= 0
##$ME_mod= 0
##$MI= 1.114404
##$NCOEF= 0
##$NC_proc= 0
##$NLEV= 6
##$NOISF1= 3.799351
##$NOISF2= 2.8
##$NSP= 1
##$NTH_PI= 0
##$NZP= 0
##$OFFSET= 15.70392
##$PC= 1
##$PHC0= -9785.347
##$PHC1= 10.80082
##$PH_mod= 1
##$PKNL= yes
##$PPARMOD= 0
##$PSCAL= 0
##$PSIGN= 0
##$REVERSE= no
##$SF= 200.130013532006
##$SI= 16384
##$SIGF1= 3
##$SIGF2= 2
##$SINO= 400
##$SIOLD= 16384
##$SREGLST= <1H.CDCl3>
##$SSB= 0
##$STSI= 0
##$STSR= 0
##$SW_p= 3612.71676300578
##$SYMM= 0
##$S_DEV= 0
##$TDeff= 0
##$TDoff= 0
##$TI= <>
##$TILT= no
##$TM1= 0
##$TM2= 0
##$TOPLEV= 0
##$USERP1= <user>
##$USERP2= <user>
##$USERP3= <user>
##$USERP4= <user>
##$USERP5= <user>
##$WDW= 1
##$XDIM= 8192
##$YMAX_p= 0
##$YMIN_p= 0
$$ End of Bruker specific parameters
$$ ---------------------------------
##NTUPLES= NMR FID
##VAR_NAME=  TIME,          FID/REAL,        FID/IMAG
##SYMBOL=    X,             R,               I
##VAR_TYPE=  INDEPENDENT,   DEPENDENT,       DEPENDENT
##VAR_FORM=  AFFN,          ASDF,            ASDF
##VAR_DIM=   8192,          8192,            8192
##UNITS=     SECONDS,       ARBITRARY UNITS, ARBITRARY UNITS
##FACTOR=    0.0002004,     1,               1
##FIRST=     0,             0,               0
##LAST=      1.6414764,     0,               0
##MIN=       0,             -59249,          0
##MAX=       1.6414764,     165887,          0
$$ Real data points
##PAGE= N=1
##DATA TABLE= (X++(R..R)), XYDATA
0@%%%%%%%%%Lj1J6j6J6k4L2l2M0m8N6o9P7q8J04j20J37j59J82k06K35k66K99l33
33a75L72m18M67n19N76o40P10p86Q70r63J066j182J311j456J618j801K014k262
51a198K557k913L353l910M647n676P223r843J5461n1534O5023N3194j02466l3112
65e9194J2149K2013J1357m329l6088J5766L8882j5502l5961J4818Q734r34L3287
78D998J3533m7215m348L9472k0790m4899L2058M0990j3427j5470R17m467K2050
91C402K3254l2952k2518M5575J4526n1090j5212L0890J1195J0707J0575l5303
103f951j9804N8414L5627n1578m3034J2362K1224K1481N163l8007j1983N4239
115C7153J5342n2089p834M0893N79j7802L351j5149j4106K9877J0467l5585O154
$$ plain form
0 0 0 0 0 0 0 0 0 0 0 3 -8 8 -8 8 -16 16 -16 24 -24 32 -37 40 -48 56 -64 73 -86 96 -110 125 -141 158 -175
33 -175 197 -221 246 -273 303 -337 373 -413 457 -506 560 -622 689 -767 851 -950 1064 -1198
51 -1198 1359 -1554 1799 -2111 2536 -3140 4083 -5760 9701 -41833 23190 76384 -26082 -59194
65 -59194 -47045 -25032 -13675 -18004 -54092 -38326 556 -14946 -50907 -36089 -27355 -28289 4998
78 4998 18531 -28684 -33032 6440 -14350 -59249 -27191 13799 372 -15098 -14181 -18648 3402
91 3402 26656 -6296 -28814 16761 31287 -19803 -35015 -4125 7070 17777 28352 -6951
103 -6951 -26755 31659 67286 15708 -27326 -14964 6260 27741 32904 -5103 -17086 37153
115 37153 52495 406 -7428 33465 34044 16242 19593 4444 -9662 20215 30682 -4903 1251
128A251M6555J353l0042j5913j4248J0534M8282j056o1630p836M6136l3k4465
141a112J2567J4146m0P658k1146m0926J9406M5286k3268l7527K3501K5896r980
154A4461n359p490j4644K2800K5720l5395l1566K8303J6063k4559k712J2363k176
167d191J6185J5529l7150k6970L7930K4594l0181k4043n71P860L5297J8542m9559
180a6728l3929M8696L7236k9770k3362O315q84N608O650k2768m444M1279J1334
193B5233l3708k233K0459r467p675J0495j0204o403K7839j012l6823O225L7798
206B0524j94j3462N415n495m630J4285j4367l0736K7888M5417k0452l9314P220
219g901K0828J5636J3729k5229m0841K1786M5154j8910l9053O943K0706J2728
$$ plain form
128 1251 47806 49159 19117 3204 -11044 -510 47772 46716 -14914 -22750 23386 23353 -1112
141 -1112 11455 25601 25561 33219 12073 -28853 -9447 35839 12571 -24956 -1455 24441 14461
154 14461 9102 1612 -13032 9768 35488 93 -31473 -3170 12893 -11666 -14378 -2015 -4191
167 -4191 11994 27523 -9627 -36597 1333 25927 -4254 -28297 -28868 -21008 14289 32831 -16728
180 -16728 -50657 -1961 35275 5505 -17857 -11542 -12426 -6818 -168 -22936 -27380 13899 25233
193 25233 -8475 -10708 9751 284 -7391 3104 -7100 -13503 14336 13324 -23499 -17274 20524
206 20524 20330 6868 12283 6788 2158 16443 2076 -28660 -772 44645 24193 -15121 -7901
219 -7901 12927 28563 42292 17063 -23778 -1992 43162 24252 -14801 -7858 12848 25576
231B5576J2316j8011k9947K3370L3452k9378l1031K3509J6546j6579l893K739
243H669m463J8416J6018k5690j5511K4741L254k3640K554P106j2487R409J6962
256B5338k1500j1828L3594J0975l2531j1655J3295N591O173p566l4063K918N0779
269B9520N505m5709n539K9691N196r114o353j8910m11K8378l836l0808J0224K7727
283A5561q303j1325M746p012J985K0908j4002l8940J3145L7061p273k1873K253
296a3069M954J0400J8147j7600l4072J6877L1813j9325k4417J1449J0074J399
308c370R478q765j7269K2794K2566k9477k4186K0263J2340j0535J01k170o198
321a4428J9858J1706k7794o633L4874L915l2396p238R730K720J2415L961k6691
$$ plain form
231 25576 37892 19881 -10066 13304 46756 17378 -13653 9856 26402 9823 5930 8669
243 8669 4206 22622 38640 12950 -2561 22180 25434 1794 4348 11454 -1033 8376 25338
256 25338 3838 -7990 25604 36579 4048 -7607 5688 11279 17452 9886 -24177 -21259 29520
269 29520 35025 -10684 -16223 13468 18664 9550 3197 -15713 -16124 12254 8418 -22390 -12166 15561
283 15561 7258 -4067 679 -6333 -4348 16560 2558 -36382 -23237 13824 6551 -15322 -13069
296 -13069 -8115 2285 20432 2832 -31240 -14363 17450 -1875 -26292 -14843 -4769 -3370
308 -3370 6108 -2657 -19926 2868 25434 -4043 -28229 -7966 4374 -6161 -6060 -8230 -14428
321 -14428 5430 17136 -10658 -17291 17583 21498 -10898 -18136 -8406 -5686 6729 10690 -16001
334a6001j873L8012O237k9477q076P751L937J5761N55l7181j0844M1204J6086
347B6091k6356n888J4318K947K435n156k2705L057K9831o542l0450J1995K5265
360A8842r964j0697P554r82K933J3610j5758k6484J5941K2792j5527j2211J1921
373A970M385M747J1633j7685k5377K2035K6177k1635k4053J0618J0387M458N656
386A3316j6097j4902K9190K3769k8972k3495J5296Q556p584k41n931l090K4926
399A4741J0342l2931j1692L0117R206j8669m026m02m829J0978L539k2659J486
412a4799L2350L145k2033j244K908p200Q915N549k0976j938K7013j819k5376L969
426a1536J7241J987K744n153k0977L700K5764j2231l0288J3026K7750k665j0034
$$ plain form
334 -16001 -17874 20138 26375 -3102 -11178 -3427 510 16271 16826 -20355 -31199 10005 26091
347 26091 -265 -6153 8165 11112 13547 8391 -14314 -11257 18574 12032 -18418 -6423 18842
360 18842 8878 -1819 5735 4753 7686 21296 5538 -20946 -5005 17787 2260 -9951 1970
373 1970 6355 11102 22735 5050 -20327 1708 27885 6250 -17803 -7185 3202 7660 13316
386 13316 -2781 -17683 11507 35276 6304 -17191 -1895 6661 -923 -1164 -7095 -10185 14741
399 14741 25083 -7848 -19540 10577 19783 1114 -2912 -3314 -8143 2835 6374 -16285 -14799
412 -14799 17551 20696 -1337 -2581 327 -6873 2042 7591 -13385 -15323 11690 9871 -15505 -11536
426 -11536 5705 7692 10436 5283 -15694 -11994 13770 1539 -28749 -15723 12027 9362 -672
439f72l743p541J0430J9615j7505k6893J6694K2756j4669j5220M815L415J0471
452A953J5509j5358k1196J7288J6618k1094j4105J1251L944L491R889j2611j5614
465b0035K1113J7508k1495j2908J5796M854o556k621j2465m522K8535J3127k7841
478g510q391K6453L388j9039m473J227K235J5322r89k6582J661K9566o36j8606
492f374N077Q667l766M476m392k2732M018K7986k060k0284N842J1950j092L150
506A0466m554j9393P532K8323r477k9857M278J8558N92p42k102p928J2125J8812
520B6633k0320k7339J4660K0526j1483q638N605m66N454Q679j5546j1415K3348
533I698J3097k2875j3592Q384J201K554O797j1856p471K4459J1500k6508j3325
$$ plain form
439 -672 -4415 -11956 -1526 18089 584 -26309 -9615 13141 -1528 -16748 -11933 -8518 1953
452 1953 17462 2104 -19092 -1804 14814 -6280 -20385 -9134 -5190 -1699 8190 -4421 -20035
465 -20035 1078 18586 -2909 -15817 -21 4833 -1723 -4344 -16809 -21331 7204 20331 -7510
478 -7510 -15901 10552 13940 -5099 -9572 -8345 -6110 9212 8223 -18359 -16698 12868 12232 -6374
492 -6374 -1297 7370 3604 8080 3688 -19044 -15026 12960 10900 -9384 -3542 8408 7316 10466
506 10466 5912 -13481 -5949 22374 12897 -16960 -12682 5876 6468 5726 3624 -4304 7821 26633
520 26633 6313 -21026 -6366 14160 2677 -5961 -356 -822 4632 13311 -2235 -13650 9698
533 9698 22795 -80 -13672 -5288 -4087 -1533 5264 -6592 -14063 10396 21896 -4612 -17937
546a7937J4784O307k208p76j4452o253K3598Q756k5071n514K3610M959j0744m373
560e314q133k923J7814M07k5367K993K7707m45j9020J000O472Q26O698o706j9848
575b3839P964K2760j1112k0410R777J3868j92M510l812j7721M728J9893j0300
588c886j9541Q692J3700j984k35m213j1090J3456K1912j5465k2892J3357J4969
601F780j2664r689L013L711J3763Q770k0153j2921K3311J2850k0171r323R705
614c018J687J809L245j3071m864K3456J0387j9562o484J1497r0k215K032j1751
628f942m771K1431O119k1632j950K0130K220q955k352o025R99J6487l796k5780
642a4817L827K6762j157j5964J003N204L805Q608j0516k2296Q309K3028p663j6827
$$ plain form
546 -17937 -3153 3154 946 170 -14282 -20535 3063 11819 -13252 -18766 4844 9803 -941 -5314
560 -5314 -13447 -16370 1444 1851 -23516 -20523 7184 6739 -12281 -11281 -4809 -3983 2715 -3991 -23839
575 -23839 -15875 6885 -4227 -24637 -14860 -992 -1184 3326 -486 -18207 -13479 6414 -3886
588 -3886 -23427 -14735 -1035 -3019 -3254 -7467 -18557 -5101 16811 1346 -21546 -8189 6780
601 6780 -5884 -15573 -12560 -8849 4914 13684 -6469 -19390 3921 16771 -3400 -12723 -3018
614 -3018 -1331 478 3723 -9348 -14212 9244 19631 69 -6415 5082 4992 2777 4809 -6942
628 -6942 -11713 9718 15837 -5795 -7745 12385 14605 5650 3298 -2727 -1728 14759 10963 -14817
642 -14817 -10990 15772 14615 -1349 -346 4858 8663 17271 6755 -15541 -7232 15796 8133 -8694
656h694O515O838r81O169k776j4491Q315J7160j3800j8938Q541R515l352K092
670B113j054p322J0562J2589j7256j4853J5917J0362j1765o199n68l396J2023
683A153J2576j6424j2838K0426J2445j7667j1872M035M131Q480N11j8923k439
696a6406K5855N287k2814j432J6549q44o710p83q088j686J5853K055j6009K012
710g161J3599r33j516R79j1259j210K0060j932k6561J086K4687J734j2599o18
724a644L359N713Q198j0630j7202J1598J7179j2585j3272J0391N952k108O852
737A1801k618j2295Q897J5356j3393j6507R019R869k064q86o029n602J6772J3240
751B5560j9204j3123J6326Q219j2099m018k77l892J0590J1011j4320j0230J6037
$$ plain form
656 -8694 -2179 4659 3678 9847 7071 -7420 895 18055 4255 -14683 -6142 3373 21 2113
670 2113 1059 -6263 4299 16888 -368 -15221 696 11058 -707 -6906 -7474 -10870 1153
683 1153 13729 -2695 -15533 4893 17338 -329 -12201 -8166 -4035 4445 4956 -13967 -16406
696 -16406 9449 14736 -8078 -9510 7039 6195 -515 -1298 -9386 -11072 4781 6836 -9173 -7161
710 -7161 6438 5505 3989 4968 -6291 -7501 12559 10627 -15934 -14848 9839 11573 -1026 -1644
724 -1644 1715 7428 15626 4996 -12206 -608 16571 3986 -9286 1105 7057 4949 11801
737 11801 9183 -3112 5785 21141 7748 -8759 260 10129 8065 7179 1150 -4452 12320 25560
751 25560 6356 -6767 9559 17778 5679 1661 1384 -2508 8082 19093 4773 -5457 10580
764A0580R062j0906n832m15j692R012K495j8613l732K5076O281k1969l424J3684
778I607K161l530l857r612K591J5511m819j8179N861J5969k378l858J254q524
792a803j781J4380k053j8649L002J5127l339p703J564j7N911J2286j0130k0273
806a3478Q135J7003j0243j2924P316P205J973K338j0390r365J6963J4525j6920
819B138j5417R594N900l486J942l177n936J2227J0357j4231r458J2319M536o523
833G85N4l678p165R487R641j2472m428J7012L873j3529l471M019P24O412j472
848E792j7147J48K1897K335j7418Q06J1657O49j187m687j3870L926K1160j361
862A2700k0380m46J2544J845J05M99p939K319J2696q346j8095P441J4722n021
$$ plain form
764 10580 19642 8736 2904 2489 797 9809 12304 -6309 -10041 15035 21316 -653 -4077 9607
778 9607 11768 8238 4381 -5231 -2640 12871 8052 -10127 -4266 11703 9325 5467 6721 -1803
792 -1803 -3584 10796 8743 -9906 -6904 8223 4884 -2819 -1255 -1272 4639 16925 6795 -13478
806 -13478 -5343 11660 1417 -11507 -4191 3014 4987 7325 -3065 -12430 4533 19058 2138
819 2138 -13279 -3685 2215 -1271 671 -2506 -8442 3785 14142 -89 -9547 2772 7308 785
833 785 839 -2839 -10004 -517 9124 -3348 -7776 9236 13109 -420 -3891 128 852 7264 5792
848 5792 -11355 -11207 10690 13025 -4393 -3587 8070 8719 7532 2845 -11025 -7099 14061 12700
862 12700 -7680 -8126 4418 6263 6368 6867 -1072 1247 13943 5597 -12498 -5057 9665 4644
876D644n487M450l021l0R258l771j0549Q088R261j1904j0455M684L548O350Q623
891A3689j0801j4186J3675J5223j4691j3536R531P544k465l667q444k098J7324
904G098P946j5946o361J2841m85r147L269J429n905N682M846j2777l059J5366
918D797M605p532j755k639k868Q406R19j6470J33K1215O37j8395j746J0939N186
933E432L189n117j4985J477J5424l480j4168O125J0337l212q36k32p955L838J4932
948A0769n415j7096L972R761n209l392M095P28M698O472j1654j1239J3379J1643
962A1512j2137p838N096l52N70O982n125o922J2627J0032j3550j1228O067M703
976D37L570J393j1524p939J7466R788j5754o164J5372L803r171l675k772l82J0487
$$ plain form
876 4644 -843 3607 586 556 9814 6043 -4506 3582 12843 939 -9516 -4832 -1284 5066 13689
891 13689 2888 -11298 2377 17600 2909 -10627 -1096 6448 3983 316 -8128 -10226 7098
904 7098 15044 -902 -7263 5578 5093 -4054 -785 644 -5261 421 5267 -7510 -10569 4797
918 4797 9402 1870 115 -2524 -5392 3014 3933 -12537 -12404 8811 9448 -8947 -10693 246 5432
933 5432 8621 3504 -11481 -10004 5420 1940 -12228 -6103 4234 1022 186 -46 -8001 -4163 10769
948 10769 5354 -11742 -7770 1991 -3218 -6610 -2515 -1787 2911 9383 -2271 -13510 -131 11512
962 11512 -625 -8463 -3367 -3719 -3149 3833 -1292 -8214 4413 14445 895 -10333 -4266 437
976 437 4007 5400 -6124 -14063 3403 13191 -2563 -8727 6645 10448 1277 -2398 -5170 -5552 4935
991D935K736j3163R0J1756k449o708O158K238n195N051o5j4874m39J7030J916
1006I017j0796P1M071J530M442l361j2664N815J6460q115j8724M092J2274K018
1020F130N01k804q714M503J3105p900j3749P327Q714n791l656P83k682N601J0672
1035A2040p720j0651Q516N942j0328l454N916o32O96L637q201n543J4884Q267
1049A3369j3131p047O909J228p07J7q801k758J6734O131j7011o433J2591M791
1063E882k496j344q585l390J1880K930j4612j51J3992N53p183J759n96k274O356
1078B721l48j1655K301J1260n676q840P112N803j591K633k686j0719N148J3553
1092I016o987j3656L233Q658J217J850n267q367J0239J5091j1021j6423O520J0342
$$ plain form
991 4935 7671 -5492 -5402 6354 3905 -2803 3355 5593 398 5449 5384 -9490 -9929 7101 9017
1006 9017 -1779 -1708 2363 3893 8335 4974 -7690 -1875 14585 6470 -12254 -8162 4112 6130
1020 6130 6631 3827 -4887 -384 12721 4821 -8928 -1601 7113 1322 -2334 -1551 -4233 1368 12040
1035 12040 4320 -6331 2185 8127 -2201 -5655 261 -371 325 3962 -4239 -9782 5102 13369
1049 13369 238 -6809 100 1328 621 638 -8163 -10921 5813 11944 -5067 -11500 1091 5882
1063 5882 3386 2042 -6543 -9933 1947 4877 -9735 -9886 4106 4659 -2524 -765 -1361 -3635 2721
1078 2721 2373 -9282 -6981 4279 -1397 -10237 -3125 2678 1087 3720 1034 -9685 -4537 9016
1092 9016 2029 -11627 -8394 264 1481 3331 -1936 -10303 -64 15027 4006 -12417 -5897 4445
1106D445k863k988j489l230O042Q910q263o452J0999L696j1451k283O002k057
1120i82Q82M188o882l211J2515M374j1642l197P412Q37J5k80j1377k406J7069
1135G315M979j4460m288J0953K908k269j174p534j495J1761P25j3709K49J1012
1149D973q73m176L792j595k250N915j766j1815M412J1690o819r289N348N248O52
1164C447J997m226q879P593J1416r775j2843N317O332L84L174m276r695P564J4256
1179A1786p453j3261L866O477j912m53m037n143Q132R567r527o810J0585L974
1193E791j0308k303N091j404J224J477p680j200J2813K006j1783N29P560q87j324
1208c98n61q420j114J4636K471j4070j872J0079K851n72j225q454p83J2748L02
$$ plain form
1106 4445 1582 -1406 -2895 -6125 -83 8827 564 -5888 5111 8807 -2644 -4927 1075 -982
1120 -982 -100 4088 -2794 -6005 6510 10884 -758 -3955 3457 4294 4309 4029 -7348 -9754 7315
1135 7315 12294 -2166 -6454 4499 7407 5138 3964 -3570 -5065 6696 7421 -6288 -6039 4973
1149 4973 4100 -76 3716 2121 -129 5786 4020 -7795 -3383 8307 1488 -7801 -2453 2795 3447
1164 3447 5444 1218 -7661 -68 11348 1573 -11270 -5953 379 763 3937 -339 -10034 -2470 11786
1179 11786 4333 -8928 -5062 1415 -497 -950 -4987 -10130 -1998 7569 -1958 -8768 1817 5791
1193 5791 -4517 -6820 -1729 -3133 -1909 -432 -8112 -9312 3501 5507 -6276 -5747 1813 926 -398
1208 -398 -959 -9379 -10493 4143 6614 -7456 -9328 751 3602 3030 1805 -6649 -7432 5316 5618
1223E618j4694K14J1282R10l348J156l155R66R052k825j2309L467J0002n348o802
1238e814N222L036l56M142l244p751O883R235q856p957N874K591k408K873k119
1253A351n342Q694R718j0154j0226O680N710k535q09m005m040Q827P703j1094
1267D78p170J1965O361p525l108o12k147M478L315r421j846J3212J480j1399k10
1282b149O476o88O91o8q444o76J0869j135j1527K728Q934m14r07p1p471o17J0737
1299F268j252j2480J337R690j531k330M06l528J383R886l606j1365L664Q860o502
1314a100n919L915K206J262M694m527p251P474P303r813o905P898L363k457m0
1329A03m641l698J0375Q144r849p011P258L407l897j32m097m503J0017Q440r648
$$ plain form
1223 5618 -9076 -8862 2420 3330 -18 1138 -2017 -1051 8001 5176 -7133 -3666 6336 988 -5814
1238 -5814 -592 2444 2088 6230 2986 -4765 2118 11353 2497 -5460 414 3005 597 3470 1351
1253 1351 -3991 4703 14421 4267 -5959 721 6431 3896 3087 -918 -4958 3869 11572 478
1267 478 -6692 5273 11634 4109 1001 389 -1758 2720 6035 -3386 -5232 7980 9460 -1939 -2149
1282 -2149 4327 3639 4330 4262 -4182 -4858 6011 4876 -6651 -3923 5011 4597 3690 3619 -3852 -4469 6268
1299 6268 5016 -7464 -6127 3563 2032 -298 108 -3420 -2037 7849 4243 -7122 -3458 5402 -1100
1314 -1100 -7019 -3104 -898 364 5058 531 -6720 754 8057 -1756 -8661 -763 2600 143 103
1329 103 -4538 -8236 2139 10283 434 -6577 681 4088 191 59 -4038 -8541 1476 9916 268
1344B68p787Q549N067l712p12j717l077O444K947j1084k433J2127J677q304K328
1359E81N648k141j396p04o100K718J0189l875j0680M258Q173k399p93P9m638K077
1375I97J0481m516j3588J519R626M69j311o08m071K992Q650n162j0898N518Q387
1390H485m733m230J814k316O11O682k635o417O760O410q829n927M977J461p85
1405A328J918m502m047R930N571j1531m432R032K565m004o87l262l405O734M261
1420E469q727k004R116J372m456N35k550l760O177L247r780j823J1263Q41r422
1435d502l05M201K368L537k754j0068K095J0561m263j0414N053Q005j468r06r31
1450B09n627J646R206k506q993L019M303l307n1J007l566L382R211m547r844L782
$$ plain form
1344 268 -7519 1030 6097 2385 1673 -44 -3121 3323 6270 -4814 -7247 4880 6557 -1747 581
1359 581 6229 4088 2692 1988 -4112 -1394 8795 4920 -5760 -1502 6671 4272 3479 3558 -1080 997
1375 997 11478 6962 -6626 -5107 4519 4988 3677 3069 -1002 1990 10640 5478 -5420 98 8485
1390 8485 3752 -478 1336 -980 -369 6313 3678 -2739 4021 10431 1602 -4325 652 2113 1328
1405 1328 3246 -1256 -5303 4627 10198 -1333 -5765 3267 5832 1828 1141 -2121 -5526 1208 5469
1420 5469 -3258 -5262 3854 5226 770 1305 -1245 -5005 1172 4419 -5361 -7184 4079 4920 -4502
1435 -4502 -4807 -606 1762 5299 2545 -7523 -5428 5133 870 -9544 -4491 3514 2046 1140 209
1450 209 -5418 -3772 5434 2928 -6065 -3046 1257 -2050 -2101 -1094 -4660 -1278 7933 3386 -6458 -2676
1466b676N707m727j897K837j238Q60M739n051n483Q783O352q086m613M518N40
1481E65k59J110n372l380J0583N597r860l816O964J351k617P25l401l321P984
1496B853L081r414j611Q888M55l376J379j859j399N651n4j0586n68J0974N41n839
1512h84J562L27j488M602L37q159J553Q824l238q810K239M572j39K146j104m965
1528b625L738P310o823r241O325O365l871k400R05j646K384N564m657m962O194
1543B560K889o201j628J330l141L739P002o128p904P779P639o377m600J450M12
1558a179K058K355p031l387R487L093q657q72P579p88l670J296k688j858O479
1573B217J022r140J97Q338p6k948Q71k740p29P113j64j0825mR616q35n830J981
$$ plain form
1466 -2676 3031 -1696 -3593 -756 -1994 -1134 3605 -1446 -6929 1854 8206 120 -4493 25 565
1481 565 306 1416 -3956 -7336 3247 8844 -1016 -4832 2132 3483 866 1591 -1810 -5131 2853
1496 2853 5934 -3480 -5091 3797 4252 876 2255 396 -1003 4648 4594 -5992 -6560 4414 4955 -884
1512 -884 678 1005 -483 4119 4456 -3703 -2150 6674 3436 -5374 -3135 1437 1298 3444 2340 -2625
1528 -2625 1113 8423 1600 -7641 -1316 5049 1178 -1222 -317 -1963 421 5985 1328 -3634 2560
1543 2560 5449 -752 -2380 -1050 -4191 -452 6550 422 -7482 297 7936 1559 -3041 -1591 -1179
1558 -1179 879 3234 -3797 -7184 2303 5396 -3261 -4133 3446 2658 -1012 284 -2404 -4262 2217
1573 2217 3239 -5901 -5704 2634 2558 -390 481 -2259 -2988 4125 3961 -6864 -6868 2748 1913 -3917 -1936
1590a936J716L32M172k170q187K480Q700m095o307K823K294j038L302m24n893
1605d231L315P645m883p399M174L964k825j097k47j822N200M901p516n558Q651
1620B272M429o316k588J199j551J886M356m045l343O095L253m850r07J636k899
1635a373K216L628o406l658Q648L712q759k328O644K677r18j839n819qQ379k36
1651D560r107J605P817k296l760K701r76j518O063j6q775L07O206j744l118K214
1667A63j27Q55M874k220r309K910Q632l963n647K765J846j635J830p19l993N086
1683A348N876o473o387M522L474k430m11j850k906N428O286o825n389O162L226
1698C651m200j014K16k099K593L126o071k437P515K255m977J45K596k510N80J185
$$ plain form
1590 -1936 -220 112 4284 2114 -6073 -3593 5107 1012 -5295 -2472 -178 -1216 2086 1662 -4231
1605 -4231 -916 6729 1846 -5553 -1379 2585 -240 -1337 -1584 -3406 1794 6695 -821 -6379 2272
1620 2272 6701 385 -2203 -1004 -2555 -669 3687 -358 -3701 2394 5647 797 -110 1526 -1373
1635 -1373 843 4471 -1935 -5593 3055 6767 -1992 -4320 2324 5001 4083 2244 -3575 -3583 4796 4560
1651 4560 -4547 -2942 4875 2579 -1181 1520 544 -974 5089 5073 -3702 -3395 2811 1067 -2051 163
1667 163 36 891 5765 3545 -5764 -2854 5778 1815 -3832 -1067 779 -856 974 255 -3738 1348
1683 1348 7224 751 -5636 -1114 2360 -70 -481 -2331 -5237 191 6477 -348 -5737 425 3651
1698 3651 -549 -1563 -1347 -3446 -853 2273 -3798 -6235 1280 3535 -1442 -1297 1299 -1211 -631 554
1714E54n293j735Q343K954p122j499L095o24J696K282m782j812O538q11r002J097
1730f121P698M82j853K25k929O71N294k797p139L854P580m204n346J791P64J391
1746f39M674j785n438K680M532m150m321L178N41M81M056l255o474N178P971m451
1762B778o233K821K046r74J302k499k927M383M061n851k127P403R46n180o29Q54
1778A74j915K466K588m989j102O588O73o374o0K833P79K982n4q324k183Q047J364
1795C493n911J342M075o09l08r40m942K73Q294L87p695l41K935j116N27K218k755
1812a073R75O235l001r314J712O816j279k494Q64p41Q55L557l993l939N770N201
1828F151o210l814K973m71q18L366o29m386M066M145m464k889L778l18j649J300
$$ plain form
1714 554 -4739 -6474 1869 4823 -2299 -3798 -703 -1327 369 2651 -2131 -3943 2595 1784 -7218 -6121
1730 -6121 1577 2059 206 431 -2498 -1827 3467 670 -6469 -2615 4965 761 -4585 -2794 -2030 -639
1746 -639 4035 2250 -3188 -508 4024 -126 -4447 -1269 -728 -247 3809 554 -5920 -742 7229 2778
1762 2778 -3455 -634 1412 438 1740 -759 -3686 697 4758 -1093 -3220 4183 5129 -51 -680 174
1778 174 -1741 725 3313 -1676 -2778 3810 4483 -1891 -1951 882 1661 4643 4589 -3735 -5918 2129 3493
1795 3493 -2418 -1076 2999 2390 2082 1142 -3800 -3527 4767 5154 -2541 -2882 53 -1063 -536 1682 -1073
1812 -1073 -98 6137 3136 -6178 -4466 2350 1071 -1423 -559 -1300 -445 3112 -881 -4820 950 6151
1828 6151 -59 -3873 -900 -1371 -2189 1177 548 -3838 228 4373 -91 -2980 798 480 -1169 131
1844A31k403k374N897M100p820l759P470K834l648r91o02l37L644n51p068j41
1860e618Q764J909m860j29l21k243L271K595n012j302N487l74n035N87K442K65
1876D26L262R72n225j374M911j696n298L815M181k383j217M05k453J876N392k381
1892C213n775K875M211l937k582J136ML096M036m860n745N621N199m695l845K222
1908A74O56O36J416l178k966N520L599m847k338L756k61j109J451l024l658N305
1924A132M119n362j808M315Q93k316M73k235j247N108J869o933k208N706N75l060
1940i79K035R53j259J670j025m923P26O133j618n105K452K922j826K1R6k393K374
1957B54N133l515o772J660L989o09M70j33l478K499N774l144p060K682M848j260
$$ plain form
1844 131 -2272 -4646 1251 5351 -2469 -6228 1242 4076 428 -563 -1165 -1502 2142 1591 -5477 -5618
1860 -5618 3146 5055 195 66 -255 -2498 773 3368 -1644 -2946 2541 2167 -2868 -2281 161 426
1876 426 3688 4660 -565 -1939 2972 1276 -4022 -207 3974 1591 374 779 -1674 202 5594 3213
1892 3213 -2562 313 4524 587 -1995 -859 -855 2241 6277 1417 -4328 1293 6492 1797 -2048 174
1908 174 830 1466 2882 -296 -3262 2258 5857 1010 -1328 2428 2167 1058 2509 -515 -4173 1132
1924 1132 5251 -111 -1919 2396 3289 973 1446 -789 -2036 3072 4941 -1992 -4200 1506 2081 -979
1940 -979 1056 2009 750 2420 1395 -3528 -2802 3331 1713 -3392 -940 1982 156 177 273 -2120 254
1957 254 5387 1872 -4900 -3240 749 140 610 477 -3001 -502 5272 2128 -4932 -2250 2598 1338
1973A338j871j215j864K636M909l251m932M236L946l516j781J443j634Q7L084
1988A615k494k554M514K229m817k39M107r25k025J050j891j244M529R98o011j36
2004c294N951K53k396K95j580j221M672L08o389m19O207n7l193j48M19O90L979
2021D077j096o535M71O468r39n323J218K004L00K176n02m857J382N086j992m418
2037b480K108J621j947R55N59l053J816M529k531m149K539K469k400p60O10k018
2053b132J939L531l585k976M290L060l986j799K034n24N07J117m106j630O678
2068B418K514o266j633M077L89l54K20l699q46M917P90n520j70M814j86j010P02
2085A157k223j441M072P32n360l61M185J75k142R27j552M66M399m2o464P37M612
$$ plain form
1973 1338 -533 -1748 -3612 -976 3933 682 -4250 -14 3932 416 -1365 78 -1556 -1469 1615
1988 1615 -879 -3433 1081 3310 -1507 -1746 2361 1436 -589 461 -1430 -2674 1855 2853 -3158 -3294
2004 -3294 2657 2910 514 809 -771 -1992 2680 2988 -3401 -3820 2387 2330 -863 -1011 -592 98 4077
2021 4077 2981 -3554 -3083 3385 2446 -2877 -1659 345 645 2821 2319 -2538 -1156 3930 1938 -2480
2037 -2480 -372 1249 -698 257 816 -2237 -421 4108 1577 -2572 -33 2436 36 -724 -114 -2132
2053 -2132 -193 3338 -247 -3223 1067 4127 141 -1658 376 -148 359 1476 -2630 -4260 2418
2068 2418 4932 -1334 -2967 1110 1499 1145 1365 -2334 -3180 1737 2527 -2993 -3163 1651 1465 455 1157
2085 1157 -1066 -2507 1565 2297 -3063 -3424 761 936 -1206 -279 -1831 -1365 3034 2992 -3472 -2735 1877
2102A877j887k792J412J307j124J921k52k943K309L452l665l525L762J677k525
2117i96m94j05j190L422L354m407l526M326K348l067j549lj024L506L472m963
2133h96l858M315L712k112j725l40j204K830K387m975l508N086L538l181n38J637
2149A168j390J48J499k421p16L763m25m434J019M200j473j857J549J6k85K746
2165C107j611n731J758N390j200k415Q32m53M26L179r96m882J332N190j669l459
2181a202J22k68Q71L637j285m182K516M592l207m051K111J801j570P58m37k104
2197a898K669K622m221k170M685J129k699p4m44k520K139L624l380k535L704K006
2213B637k461o67p52q19K465K294m187k162M272N81l743O98K659n53o1M71k694
$$ plain form
2102 1877 -10 -2802 -1390 -83 -1207 714 462 -2481 -172 3280 -385 -3910 -148 1529 -996
2117 -996 -1490 -1595 -2785 637 3991 -416 -3942 384 2732 -335 -1884 -1887 -2911 595 4067 -896
2133 -896 -4754 -439 3273 1161 -564 -904 -2108 722 3109 -1866 -5374 -288 3250 69 -469 1168
2149 1168 -222 -74 1425 -996 -1712 2051 1626 -2808 -1789 2411 938 -919 630 646 361 3107
2165 3107 1496 -4235 -2477 2913 1713 -702 130 -323 103 3282 2286 -2596 -1264 3926 2257 -1202
2181 -1202 -1080 -1348 -477 3160 1875 -2307 209 4801 1594 -2457 -346 1455 -115 643 206 -1898
2197 -1898 771 3393 -828 -2998 1687 2816 117 43 -401 -2921 -782 2842 -538 -3073 631 2637
2213 2637 176 -491 -1243 -2062 403 2697 -1490 -3652 620 1201 -2542 -1844 815 262 201 672 -2022
2230b022o87M232j293m791J885M164q63j371m85j662J076N094j707o113J176M686
2246A319j102k332J7n90J323M542j232n658J347K716j170p12J073j227m92L232
2262A054l39l785J754L375j825j722J776l50j212L78n39j209L990K552m795k471
2278c368M152J407k569m35L47l11K354K46m722p49N211J521k255k51p15j170K484
2295A177J988m588k339M781J919k865q50L37K08K316M60l694r70M889q55m217
2311b303P33K714j088J07J087j755N37K926k133m064J727L108j683p08Q78j136
2327a053n2L368j968l389L173L290l124l122R72L55R45J918j563k994K980K737
2343B473l271k009K351j53j16J506k328k903L154L426l407j838L168J238k265
$$ plain form
2230 -2022 -2709 1523 230 -4561 -2676 1488 625 -746 -1231 -2893 -1817 3277 1570 -4543 -3367 1319
2246 1319 217 -2115 -2098 -2688 -1365 3177 1945 -3713 -2366 350 -820 -1532 -459 -1686 -2178 1054
2262 1054 715 -3070 -1316 2059 234 -1488 288 -62 -1274 -896 -1435 -2644 1346 3898 -897 -3368
2278 -3368 784 2191 -378 -813 -466 -777 1577 1823 -2899 -3648 1563 3084 829 578 -137 -1307 1177
2295 1177 3165 -1423 -3762 1019 2938 73 -777 -440 -232 2084 2544 -1150 -2120 2769 1914 -2303
2311 -2303 -1570 1144 56 163 1250 -505 32 2958 825 -3239 -1512 1596 -87 -795 83 -1053
2327 -1053 -1105 2263 295 -3094 79 3369 245 -2877 -1905 -1550 -605 1313 -250 -3244 -264 2473
2343 2473 -798 -2807 -456 -609 -725 781 -1547 -4450 -1296 2130 -1277 -3115 53 1291 -974
2358i74j00j317p11L515J199m882p22M434N37k393N63K80j029J898O64l680p06
2375c424L611P00k858N09R85q83K294Q53l685p27L981N8l751J064J763n84K16
2392A22M5j667J280L483j932m182K767K882k720j628O83M8J933K580l278l530
2408c114L383L337k009j700J08p52O45K596j739l226K997L010j881j520P78o19
2424B94R0J550j543k390L135J699l660m69L343J63j595N73o47j294J922Q36l823
2441a816M42L414k63j903K03k51J60L085o44n329L74M783k46l599k3J664p7J772
2459A746J84l504K7L547j367k089R49M54j225J424Q02k899P42L832j509l630J453
2476a063J882p35q89m60j044K407K684l555k612L812K443l061j485J374l97K74
$$ plain form
2358 -974 -1074 -2391 -3102 413 1612 -3270 -3992 442 979 -1414 -851 -571 -1600 298 962 -2718 -3424
2375 -3424 187 887 -1971 -1462 -477 -1360 934 1787 -1898 -2625 1356 1414 -2337 -1273 490 -94 122
2392 122 167 -1500 -220 3263 1331 -2851 -84 2798 78 -1550 -867 -819 1114 3694 416 -3114
2408 -3114 269 3606 1597 -103 5 -747 -102 2494 755 -2471 526 3536 1655 135 913 294
2424 294 384 1934 391 -1999 1136 2835 -825 -1294 2049 2212 617 1190 543 -751 1171 2007 -1816
2441 -1816 -1374 2040 1777 -126 77 -174 -14 3071 2427 -2902 -2528 2255 2009 -1590 -1613 51 -26 1746
2459 1746 1930 -1574 -1547 2000 633 -1456 -507 -53 -1278 146 948 -1951 -1209 2623 1114 -2516 -1063
2476 -1063 819 84 -805 -1265 -2309 98 2782 -773 -3385 427 2870 -191 -1676 -302 -699 -425
2492d25J319j835j606K869K105k704n12J607j492M88K002k135k401L264J738k970
2508f88r90L038J31j131L18j311l29L129k34m012j87L919j61j766J029p06m59
2525d10K653K53m127o0L544m18k020M37J25l77K128J91k896P74L285k051l200
2542b169J854J178q55J048m0k494J279K808j713k363J833J360j818L93n00j967
2558b166J780L335k318l157K706J964j811j115K29j03J381O98l275j301M314J457
2574B618l540l13K083p98m28J450j702j453K834L53k751l14K472j71P6Q10k480
2591a254j016L323N81l552l46K828l91r11N89p80K75K671n50l679M63L263j601
2608h7j810J443N55j33J048p87l105J907L522j756k391R77j53j82J340k88k109
$$ plain form
2492 -425 894 -941 -2547 322 2427 -277 -789 818 -674 -186 1816 -319 -2720 544 2282 -688
2508 -688 -1678 1360 1491 360 678 -633 -962 2167 1933 -2079 -2266 1653 1492 -274 755 49 -410
2525 -410 2243 2496 -1631 -1691 1853 1435 -585 -148 -23 -400 1728 1919 -977 -203 3082 1031 -2169
2542 -2169 -315 863 8 1056 1016 -1478 -199 2609 896 -1467 366 1726 -92 301 -199 -2166
2558 -2166 -386 2949 631 -2526 180 2144 333 -782 -553 -656 725 1423 -1852 -3153 1161 2618
2574 2618 -922 -1235 848 50 -378 1072 -630 -2083 751 1104 -1647 -1961 511 340 416 1226 -1254
2591 -1254 -2270 1053 1634 -1918 -2264 564 173 -738 -149 -929 -654 2017 1467 -2212 -1749 1514 -87
2608 -87 -1897 -454 101 -32 1016 229 -2876 -969 2553 797 -1594 -617 -770 -952 388 100 -2009
2625b009J712L008k421k763J874J306o18L54n35k059J253K319k058j540L031J255
2641B109k323n07L58n45J036J140k739j217L500R02k820O9J693l19M53K0k688
2658a878o11L825O90l717k09K458p13k79J357j124p88K295k99k874N15J999o95
2675d8N9R33j813r38L038K66l441J290K629j556k163O73L49M12K541j397l009
2692b175J619L038k540j753J682O61r46O31n20k181K079K919j830k192J882kp14
2709c42P30m58j372J575J996l144j418L052J179j433m5j13j173J269J137k623
2725a183q64L528L90l147J54J092j04J237N79k661j179L208l8l124J337J826r02
2742A49j95N59j955L78L090j024k985J266J385j222n85J254p10J2K430j033l337
$$ plain form
2625 -2009 -297 2711 290 -2473 -599 707 89 443 -92 -2151 -898 1421 -637 -2177 854 2109
2641 2109 -214 -721 -363 -908 128 1268 -1471 -2688 812 1714 -1106 -1037 656 337 790 810 -1878
2658 -1878 -2489 1336 2026 -1691 -1900 558 -155 -434 923 -201 -989 1306 1007 -1867 -1352 647 -48
2675 -48 11 944 -869 -1807 1231 1497 -1944 -654 1975 419 -1744 -1071 -722 -310 2231 834 -2175
2692 -2175 -556 2482 -58 -1811 -129 532 -414 217 -303 -2484 -405 2514 684 -1508 374 372 -342
2709 -342 388 -70 -1442 133 2129 -1015 -2433 619 1798 365 320 207 -966 303 1440 -1183
2725 -1183 -2047 1481 1871 -1276 -1122 -30 -134 1103 1682 -979 -2158 1050 1012 -2112 -775 1051 149
2742 149 -46 513 -1442 -1064 2026 1002 -1983 -717 668 -554 -1139 115 -595 -583 1847 814 -2523
2759b523J255K604j225j309J001j133k24K825p73k976K110K550j842k435J209
2774h86P90m04J147j245j792K133K139k821r10K479P51j567J00q58j231J985J874
2791A684k389j143K278N40j375O21k08j083K079N85k876j514L456R62k110K75
2807b18L41l72J060N05k371kL255j082l056R27J870k72j9M79j894O18K595j459
2825I05k663J267J923j055n93M48j410M43K731o10k740J212J518j405j80Q97j483
2842g95R4K385j045k593J815K168j861r85J379n05l85J156j208j813K742J676
2858B225k956j208K055P07q15L62r41j562K324J440l087q74K955j49j184P20n24
2875e12j192K231J026l109n02K463l92j458J032M7k97Q91N07k530K07L006p53
$$ plain form
2759 -2523 -1268 1336 111 -1198 -197 -1330 -1554 1271 498 -2478 -368 2182 340 -2095 -886
2774 -886 -96 -500 647 -598 -2390 -257 1882 -939 -1849 630 1381 -186 -86 -944 -2175 -190 1684
2791 1684 -705 -1848 430 970 -405 216 8 -1075 1004 1589 -1287 -2801 655 1617 -493 -218
2807 -218 123 -249 811 1316 -1055 -1057 2198 1116 -1940 -1013 857 585 566 1045 -849 -231 2364 905
2825 905 -1758 -491 1432 377 -216 232 -1178 -735 1996 1386 -1354 -142 1376 -29 -209 688 -795
2842 -795 -701 1684 639 -1954 -139 2029 168 -817 562 57 -328 828 -380 -2193 549 2225
2858 2225 -731 -1939 116 823 8 370 -571 -2133 191 1631 -1456 -2330 625 476 -708 12 -512
2875 -512 -1704 527 1553 -1556 -2058 405 13 -1445 -413 -366 -663 228 735 -1795 -1588 1418 665
2892F65k882R26J391k90M32l6j804M48K946r80k989Q05K213j303k52N39j044M07
2910h08K426j059k027J592J174j721k05Q27j018J43J993j132j924K194J275j962
2926b32L0O33l32k62J813k021j414K296J917k825r74K222M35m25n9j173j155K894
2944A368P29l121m54K727q0j162P45j70j177K022K27k876J68K467p90j539J007
2961I1L8k90J546j50k810O33K949j126k263Q50R61n56Q39K59k427P01K812j395
2979F62k145J074J289j194J80L46j854J215J975j574j800K074J094j682n33P80
2995i3o14N80J585j934j541K245J176j790l28J236j199M57J196j733j465K526
3011C04J127k185o4J075k18J99P45j622j085K809M81l048j42K234J65r94N20k79
$$ plain form
2892 665 -2217 -1291 100 -190 242 206 -1598 -1150 1796 816 -2173 -1368 845 -458 -710 -171 -1215 -808
2910 -808 1618 559 -1468 124 1298 -423 -628 199 -819 -676 1317 185 -1739 455 1730 -232
2926 -232 -202 431 99 -163 1650 -371 -1785 511 2428 -397 -1371 851 1286 861 802 -371 -1526 1368
2944 1368 2097 -1024 -1478 1249 1169 7 752 582 -595 1427 1654 -1222 -1054 1413 623 -916 91
2961 91 129 -161 1385 1235 -1575 -942 2007 881 -1382 -532 429 -127 712 971 -1456 -755 2057 662
2979 662 -1483 -409 880 -314 -134 212 -1642 -427 1548 -26 -1826 248 1342 -340 -873 -93
2995 -93 -707 -127 1458 -476 -2017 228 1404 -386 -714 522 -677 -220 976 -757 -2222 304
3011 304 1431 -754 -818 257 39 238 983 -639 -1724 1085 1566 -1482 -1624 610 775 -219 301 22
3029B2k36K022p38k471P02K242q78j217R45N9j017J510P23k904J140K217r41j797
3047f17M28L79k34J234l01j764R67K244j660j932J780J229j542N18m05j406J176
3064I4K279k054k041K602Q88j471j5Q5j181P96J920k042j302K012P37j402J34
3081C9M64o89P04J140j936j436K525N14k198J52J727r01K13Q67j409j094K346
3098A028K67k409J57J829n90o37Q61j125q3K253m2l062M78K339r13j541Q37L45
3116hq9J515r72k194J152K231j844r14J519n9j119J182n28j523J347K209j382
3133E23j699R39K54m83J052n91j545J395K216k405j397K120Q19r51l51P51j419
3150g72O20Q84j705n31K352l2j489O42P36j315O28Q98j368o91K088O7k083q6J393
$$ plain form
3029 22 -214 1808 1070 -1401 -699 1543 665 -552 393 452 -565 945 1668 -1236 -96 2121 1180 -617
3047 -617 -189 190 -44 1190 889 -875 92 2336 676 -1256 524 1753 211 729 324 -1082 94
3064 94 2373 319 -1722 880 1768 297 282 367 -814 -18 1902 -140 -1442 570 1307 -95 39
3081 39 503 -186 518 1658 -278 -1714 811 1325 -873 -721 1006 105 318 1185 -224 -1318 1028
3098 1028 1295 -1114 -957 872 282 -355 506 -619 -702 1551 1509 -1553 -1075 1264 351 -1190 -353 -8
3116 -8 -97 1418 446 -1748 -596 1635 -209 -1123 396 337 -782 400 -128 -1651 -304 1905 523
3133 523 -1176 -237 17 -466 586 -5 -1550 -155 2061 -344 -1741 379 1198 247 -104 647 -772
3150 -772 -152 732 -973 -1504 848 816 -673 -31 705 -610 18 916 -452 -1143 945 1012 -1071 -1157 236
3169B36j70K49L85j457k89K526k60k690O67J282m59R7O68j314m90K316l16k234
3187a253Q73J597q19p51M45j105K72K008l41k509J424K074j927j385J325P05o12
3204B1J051j188j259J389J586j926o32J345K24j065Q69o7k004J234K117j416j434
3221a155J267N49r34N91j39j221J796M99k512m16K537L05j969K20R27k00M56M22
3239A023j961m15K299l15j581L43R58o02N63P71k219n35K704M7j920L66N20q23
3257g77L46J254j348j72J730n80j714P10J289j364m4R24o91l23J128q72j626K017
3275a13J787j700j285R71j24J60R52j245j300J678J783j877j389J267L33m58J157
3292E97p85j703J609J032j666k45J393l06o66J439o80j236J465R05j970l90J902
$$ plain form
3169 236 66 315 700 -757 -1046 1480 1220 -1470 -803 479 20 117 785 -529 -1019 1297 981 -1253
3187 -1253 -380 1217 398 -353 92 -1013 -741 1267 926 -1583 -159 1915 -12 -1397 -72 633 21
3204 21 1072 -116 -1375 14 1600 -326 -958 387 611 -454 415 348 -1656 -422 1695 279 -1155
3221 -1155 112 661 -273 318 179 -1042 754 1253 -1259 -1675 862 1167 -802 -582 345 145 601 1023
3239 1023 -938 -1353 946 631 -950 -607 351 -251 312 1083 -1136 -1671 1033 1080 -840 -474 46 -777
3257 -777 -431 823 -525 -697 1033 453 -1261 -551 738 -626 -670 254 -437 -760 368 -504 -2130 -113
3275 -113 1674 -26 -1311 -340 -464 -304 648 -597 -1897 -219 1564 -313 -1702 -435 -102 -560 597
3292 597 -188 -1891 -282 750 -916 -1161 232 -74 -740 699 19 -1217 248 1153 -817 -1207 695
3309F95j43j165L52M31o80R89Q15k228j82K592o06j865M25J076l60L86L02j166
3327c32j38K088p39j899J236Q31j019N30M70j511lJ989n81j564Q07R63q85j12
3345A31J02m48L62J674j597j489J787J409j351j286J342j99m91J199j163j511
3361a529J748J002j118k65P55p99q1J037r21j108J486Q18j716n97J940k44q66
3378d58M80k49p13J637n3j660j17J645l79q20L78k30l87J207N32k054J65J921
3396H45l46j802M14L06P21O59o92j651N71K113o99j658P34R23r09L00L23j064
3414i12J32J595p66q89Q54O35j073K17R74j778N26J644j056j219J133J195j033
3431A79j94L38n4j14P38r73r09K004P44k683Q9J628K23j14N2j059q51J848J027
$$ plain form
3309 695 552 -613 -261 170 -510 479 1294 -934 -1116 1476 870 -995 -570 506 146 532 834 -332
3327 -332 -470 1618 879 -1020 216 1047 28 558 1028 -483 -486 1503 922 -642 165 1128 243 131
3345 131 233 -215 147 1821 224 -1265 522 1931 580 -706 636 437 -54 1145 -18 -1529
3361 -1529 219 1221 103 -162 593 -206 -287 750 -171 -1279 207 1025 -691 -1288 652 408 -458
3378 -458 22 -227 -940 697 644 -1016 -1133 512 133 -687 -309 -539 -926 281 813 -1241 -1076 845
3396 845 499 -1303 -889 -583 138 797 105 -1546 -975 1138 439 -1219 -485 438 -471 -171 152 -912
3414 -912 -780 815 49 -840 14 649 -424 -207 767 -1011 -485 1159 103 -1116 17 1212 179
3431 179 -15 323 269 155 893 -80 -989 1015 1759 -924 -835 793 1016 902 954 -105 -956 892 1919
3450A919j786m53J164l79Q6M58p52q26J737N24j673o34J446l37o94P40j4k43P66
3469A049k00j705N45J763o30r97M12k8o82R96K59j309M75J624j007k205J580K78
3487B18l09N55r1j358P79J488j054j292J468M55j249N56J69j504L93J724p75j108
3505i35J248J76p19l37P09k58r2J068j578j040K017J095j480q76O80k51P92J098
3523A317j790p41J617O05k052j2J475k45j72M99r46m89J322N43j676N66J141p70
3541A92q45O95j99l39J247K05j451J28J191o52q97R88L29k21L57l51j809J110
3559c22K023j020j488Q74L66m95L37j98p81O53J551o39j351N48O49r07M31M24
3577F55j153N59Q49j216p88J669J60j211L01L02k70N42R06j358r99J032P63r74
$$ plain form
3450 1919 133 -320 844 465 551 1009 257 -569 1168 1692 19 -615 831 494 -200 540 526 283 1049
3469 1049 849 -856 -311 1452 822 -175 237 209 -473 523 782 -527 -52 1572 565 -1640 -60 218
3487 218 -91 464 373 -985 -206 1282 228 -1064 404 859 -390 166 335 -1169 -776 948 173 -935
3505 -935 313 489 -230 -567 142 -116 -208 860 -718 -1758 259 1354 -126 -1002 -322 -573 219 1317
3523 1317 -473 -1214 403 1008 -1044 -1056 419 174 2 501 -445 -934 388 931 -745 -179 962 192
3541 192 -653 42 -157 -496 751 956 -495 -367 824 172 -725 263 592 371 728 377 -1432 -322
3559 -322 1701 681 -807 67 433 -62 275 77 -704 -51 1500 861 -490 58 707 -200 231 655
3577 655 -498 61 910 -306 -1094 575 735 -476 -175 127 -143 399 1305 -53 -1052 -20 743 -231
3595b31J63Q20n69q2O00j364J69J364J52j919K52P70m29K62L40n25j58J633n46
3614G02j943M13J652n84l06P90p71m79O37R5r64R81J169j136q70O43m13jJ235
3633H50j9j265K39J166p87j066J098K01q31R89l29r59M45R49p33q75J470L09j191
3652c39K22j67n16J032Q56j246q45J312P79j314M30l8r69N51J093j070p04J425
3670D92j05j344L64O41o42Q02N12j375l59J344K37j470M87M49k05L2N4r82K47
3689h21J709j42j734P03Q20j008k67N85l32L43J055m88j427L68J318o85n75P97
3707B19m87l31J036q8j147Q49P55r34j94P05l07m01N87r8j026J221P95j627l70
3726h43J031J22n94O66j22j051Q81J065j616n85J421M32j084R01m00m21P61N50
$$ plain form
3595 -231 -68 752 183 101 701 -663 -494 870 1022 -897 -645 125 -304 -42 298 -227 -385 1248 702
3614 702 -1241 -828 824 240 -66 724 -47 -526 111 206 -758 223 1392 256 -614 29 -384 -385 850
3633 850 831 -434 -195 971 184 -882 216 417 -414 575 246 -713 -268 681 -52 -927 543 852 -339
3652 -339 -117 -284 -800 232 1088 -158 -1003 309 1088 -226 204 166 -803 -252 841 -229 -933 492
3670 492 387 -957 -593 48 -594 208 720 -655 -1014 330 567 -903 -416 33 -172 -140 -86 -1068 -821
3689 -821 888 746 -988 -285 535 -473 -740 -155 -487 -144 911 423 -1004 -636 682 -3 -578 219
3707 219 -268 -599 437 349 -798 51 806 -128 -322 383 76 -325 262 164 -862 359 1154 -473 -843
3726 -843 188 310 -284 382 260 -791 90 1155 -461 -1046 375 807 -277 624 224 -197 564 1114
3744A114j554r3J441o8j382L66L04l67L36O70r59l15J174pj390N02Q59n18N5J51
3764C19p54K32J258n90j386O40P89j86m32n1o65K10J272n43j118P44Q69r64l29
3783f85P06j61p17J192p14o58J004M30q79l82Q83k60k43P53n73j089R92Q64j157
3802f94l11J140r4m40N20j41o06O95M13j210k68J140J67j041O66k07m77J009L45
3821F06j331k23J141n6m62K54O9m39Q64K17j064M2J104m28j070N93P27q67O55
3840C32K76q46k60J110m07m14L27K82k99k09O05r70L30Q86o36r20J121J040j084
3859B64q46Q88J7j79P15r67n64Q72J007j268m95R92n17J36O02l15j421J023M75
3878D19n56j62R48o35j18P02k66q71Q78N60j383j21J008k3p98K35K05n95R14J21
$$ plain form
3744 1114 -440 -533 908 840 -542 -176 128 -239 97 767 -192 -507 667 660 -730 -228 631 113 168 319
3764 319 -435 -203 1055 465 -921 -281 508 322 -110 -161 -826 -616 656 113 -1005 -261 608 -356 -685
3783 -685 21 -140 -857 335 -379 -1037 -33 397 -482 -864 19 -241 -484 269 -304 -1393 -401 463 -694
3802 -694 -1005 135 41 -399 121 -20 -626 69 482 -728 -996 144 311 -730 -64 -271 -748 261 606
3821 606 -725 -948 193 137 -325 -71 -2 -441 423 640 -424 -382 722 294 -776 -183 544 -323 332
3840 332 608 -238 -498 612 205 -209 118 400 101 -108 497 -473 -143 743 107 -813 308 1348 264
3859 264 -582 306 323 144 859 -108 -672 200 1207 -61 -556 436 -81 55 657 342 -1079 -56 419
3878 419 -137 -299 649 14 -104 598 332 -539 339 899 -484 -605 403 380 -418 -183 22 -573 341 462
3898D62j123J10R07k58p49Q41m9p08Q29R2j012O7J108j06j019M36M98o34L59L2
3918H3r46N36J255o45r30M71N87p78K97J53q89O52R23p31j146R44Q35p74LK04
3938A04p39K69J266q53j163J290Q98j119m53N30k83Q6P56k58n64O39K33j377N19
3957b19P22k36p69R91j17o21N50J00j129L68J005j92o56R4j03J07O47J68j113
3976d03k18J331l01n77k2K05m05Q44J27j164K69J107p87m54O29L3n96Q85K3j014
3996d88j45J182l90n09P99l3k49j79K46j026Q00R46p69j151J177P27j239J28M90
4015C17k93K19M81p84q95R85M54q16K52N53m27r4N16p89m58J396M36j102m13J109
4035F47k30k32K92n95l20J180K82j824N17J163o87o28R60n63m11R16K37q75k14
$$ plain form
3898 462 -661 -551 356 98 -651 190 141 -567 262 354 -658 -591 517 411 -608 -172 326 -308 51 83
3918 83 -863 -327 928 283 -647 -176 411 -367 -70 83 -806 -154 769 38 -1108 -164 671 -103 -100 104
3938 104 -635 -366 900 47 -1116 174 1072 -47 -500 30 -253 -167 589 331 -233 406 639 -738 -219
3957 -219 503 267 -502 489 372 -249 301 401 -728 -360 645 453 -203 -109 -212 -105 542 710 -403
3976 -403 -621 710 409 -168 -190 15 -390 454 581 -583 -314 793 6 -448 181 214 -382 503 526 -488
3996 -488 -633 549 159 -350 449 416 167 -12 234 -792 8 954 185 -966 211 938 -301 -173 317
4015 317 24 243 724 -60 -955 30 484 -332 -80 473 46 -48 468 -321 -779 617 1053 -49 -462 647
4035 647 417 185 477 -118 -438 742 1024 -800 -283 880 193 -435 525 -38 -449 467 704 -171 -385
4054c85R48m02l01O52q69mQ71K18j567M33J433n70j142N75M65p00L04Q2o45P93
4074A89O28j189m20R57Rl44J30N86j124L42Q05o10j043Q96O57o29J80n3o99N20
4094b12J125j176n78J372j44j134K52N13l83K99Q55j012m44Q20J51p27L71K35
4112A83m97J47M71l85o21J048Pp66K63P06o81J10J05P5n18J083l55j329J047N48
4132F41l96p14Q03k54l73R42J1j466N33J155n80n46L75N6j80O60pj757J005J232
4152A140q08n57M20N6k58J55J19q29M02O61m59n72O10o0m20M29M85m19j90P17
4172F22q23o19J329j05p81J47L41m18L30K17o62q9J075J4j434L73O44p26L00L17
4192E2p56J90N99K4q04M65M51n58j93P13o64p0O20l6m68J07M86l21k06M48m8n85
$$ plain form
4054 -385 563 161 -140 512 -357 -361 510 728 -839 -406 1027 457 -685 -110 355 -345 -41 41 -604 189
4074 189 817 -372 -792 165 174 -170 -40 546 -578 -236 569 -41 -1084 -188 469 -160 20 -33 -732 -212
4094 -212 913 -263 -841 531 387 -747 -495 18 -365 -66 789 -223 -667 153 304 -423 -52 183
4112 183 -314 -167 304 -81 -702 346 353 -413 -150 556 -125 -15 90 165 -353 730 375 -954 93 641
4132 641 245 -469 334 80 -293 649 660 -806 -273 882 302 -244 131 187 7 667 660 -1097 -92 1140
4152 1140 332 -225 195 251 -7 148 267 -562 -160 501 42 -530 80 20 -400 29 514 95 -95 622
4172 622 -201 -820 509 404 -377 -230 111 -307 23 240 -422 -511 564 578 -856 -483 161 -565 -265 52
4192 52 -704 -514 85 109 -695 -230 221 -337 -530 183 -481 -551 69 33 -435 -328 158 -163 -369 79 31 -554
4214e54R08q7j362N52R08q37J02O95m98m60J146l67p65M62O82p14k15P20k46m52
4234c82O27j20o55Q33J23o96n87J401mm07m94L77j54P47L0r42j24R13Rj025O66
4255A36j4n17O16O35q17p47R41L58q84K81L30m67R0O61j096L15R64m52j199J069
4275B03K31p13K03K42k54j74N71J14j166P83N73n53k69N58o71k58Q91j16o51M43
4295a3L60m60k48M56j12k62N66m65n01M74N98o94k05Q50m03j75O26q38m75J171
4315B50L09q25n13P90k7l64M52l20k36M50O01j000l1N27j50m52L47K35p05L46
4335c16P95p33j47N31k4q44O79M18p44K84M05p39K77P72m40q97R55J51l41R9O8
4356B09o19Q1J032k69p94M68M93n64j39N03o75N4J011p27m19K94P08q14L24K70
$$ plain form
4214 -554 354 267 -1095 -543 365 -472 -370 325 -173 -633 513 146 -619 -157 525 -189 -404 316 70 -382
4234 -382 245 125 -530 303 426 -270 -857 544 540 133 -361 16 -138 609 639 -303 -427 486 495 -530 136
4255 136 122 -395 221 856 39 -708 233 591 -293 -12 318 -149 -59 602 -494 -179 785 333 -866 203
4275 203 434 -279 -76 166 -88 -262 309 423 -743 40 613 60 -209 349 -322 -580 311 195 -456 -13
4295 -13 347 -113 -361 95 -17 -279 287 -178 -679 -205 393 -301 -506 344 -59 -234 392 -446 -921 250
4315 250 559 -266 -779 11 -16 -380 72 -248 -484 -34 567 -433 -464 63 -87 -539 -192 43 -662 -316
4335 -316 479 -254 -401 130 106 -738 -59 359 -385 -101 304 -435 -158 614 174 -723 232 383 42 141 209
4356 209 -410 -329 703 434 -360 108 601 37 -102 401 -274 -220 791 64 -355 -61 647 -167 157 427
4376D27o61l11J075n71m37P88K20p47l8M95k72n1P96o42p08R81K79j206K32Q15
4396D64r1n64J43j27q8N34N16j073n7P30n13l37R46O5p87P31q2q13L96O28l04
4417C17p66M58K97n97L86k8k99j7Q92m54n84J53O76m58L25N02j022k94J039n88
4437f2o42J002J3o85M00K26n88j67J226n52q37Q81N73r41l3M17k82R2J17l26m49
4458f17J055L2q18K56O11q28j46M07K4p11R92K25r39K29N23r7k13K28j38m70O60
4479B65lq32R5R00k20p08O34l52k29J007k05n29rM08l93j42M35J60l20J29K10
4500C01q01J62J061m98m39N25j09n54M68L18j027L82Q60q34l97Q08L76o65O7L44
4520C48o62N69J62o09m48R00Mm71k9L75l42K64O05n57p35O39L25p18K64N98m39
$$ plain form
4376 427 -234 -545 530 -41 -478 310 530 -217 -255 240 -32 -83 713 71 -637 344 623 -583 -351 464
4396 464 373 -191 -48 -175 -263 271 787 -286 -343 387 -126 -463 483 548 -239 492 410 -403 -7 621 317
4417 317 -449 9 306 -291 95 67 -232 -249 643 189 -395 -242 434 -24 301 803 -219 -513 526 -62
4437 -62 -704 298 311 -374 26 252 -336 -503 723 171 -666 215 788 -153 -186 231 -51 41 158 -168 -617
4458 -617 438 470 -348 -92 519 -309 -455 -48 -24 -735 257 482 -457 -228 295 198 -15 213 75 -395 265
4479 265 262 -570 -475 425 205 -503 131 -221 -450 557 352 -177 -186 222 -171 -313 122 282 -38 91 301
4500 301 -500 -338 723 225 -214 311 202 -352 116 434 -593 -211 649 -185 -582 226 602 -63 4 348
4520 348 -314 255 417 -192 -640 260 264 -207 -236 139 -203 61 666 109 -626 13 338 -380 -116 482 43
4541D3j55M78k89m36O71K81p63j3O72o19j28O27l88k60N74p4o91J79Q22o28p8
4562a75L77k88m24R21k53q69K57P61J99r57N24k84r1N04j16o00K94O76p56o19
4582i19J051N5p75N01l75j24N65N93j019r0M81M46n51L81j83n00J86P44m52q17
4602h02P63M09q42K56J1j61L23N79q28j52Q70m92j66N4K9N6k56O62n74Q2O93P3
4624E87j010J56O39m51k24P12k73p82J056L5r37J81J196r27k31L05j12j0M39j93
4644A56p01O92L35o72k17O60k78j72L84K46o56J52N96n01m75P94k78N4K82l50
4664E1n08L92N84p68j98Q92m10k86O03j88n71J41O49l75m94P03k37l28N68k8m23
4685b31K29P05j062k45R38M3o03n3L04l29K03M47o43l83J076j40q79P28L13p50
$$ plain form
4541 43 -112 366 77 -359 312 593 -170 -183 489 -130 -258 369 -19 -279 295 221 -470 -291 531 -97 -175
4562 -175 202 -86 -510 411 158 -711 -454 307 506 -451 73 -211 -302 202 86 -514 -220 456 -300 -919
4582 -919 132 187 -588 -87 -462 -586 -21 572 -447 -537 -56 390 -161 220 37 -463 -277 467 15 -802
4602 -802 -39 370 -472 -216 -205 -366 -43 536 -292 -444 426 -66 -232 -178 -149 -93 -349 313 -261 -179 514 587
4624 587 -423 -267 372 -79 -303 409 136 -646 410 445 -492 -311 885 -42 -273 32 -80 -90 349 156
4644 156 -545 147 482 -190 -407 253 -25 -197 187 433 -223 -71 525 24 -451 343 65 119 401 51
4664 51 -457 -65 519 -249 -447 445 35 -251 352 164 -407 -266 383 8 -486 217 -20 -348 220 192 -231
4685 -231 -2 703 -359 -604 334 377 -226 -279 25 -304 -101 346 -297 -680 396 256 -623 105 418 -332
4705c32k1N11l46k41M08k4o69O74J05j57l50P04p61k2P36j15o95N06O63n77o22
4726f25O49j54j60P17m16n23M81L22j26p40R61m12m20N14J93p38P10K34o75n7
4746b65K95Q1p4L16j63m39O13L58r72n0R38j17o83K26R0l41K64N44j070K12Q09
4767E72M2j030N98k2n45N04L11o55k16O98K87j096Q08J60n42M95j82l73o6P55
4787E03m36n68L45P27r47L75N91o14l62M65k05m61M26N74p87L03L86o89L62M92
4807D80n34m70L26N38o04k95N29j67k92O92k20k39L10K61r35R1O76m32k48M44
4827h9ok79K93K54n48n6M39n5j39J63J1n34K25N45o31J59N06k69m35L19L08n24
4849c43M50M02p10k57P69j61m26M53j81k12J18L40o49l6R88l28o17K73Q1j04Q6
$$ plain form
4705 -332 -353 158 -188 -429 -21 -45 -714 -40 65 -92 -442 262 -499 -521 215 100 -595 -89 574 -3 -625
4726 -625 24 -130 -290 427 11 -512 -31 291 165 -575 386 -26 -446 68 261 -477 233 467 -208 -265
4746 -265 30 111 37 353 190 -249 364 722 -250 -300 638 521 -162 64 154 -187 77 621 -449 -237 572
4767 572 614 -416 182 160 -385 119 430 -225 -441 257 544 -552 256 416 -126 369 187 -186 -252 503
4787 503 67 -501 -156 571 -376 -1 590 -24 -386 79 -126 -587 -161 413 -374 -71 315 -374 -12 480
4807 480 -54 -524 -198 340 -264 -559 -30 -197 -489 203 -17 -256 54 315 -620 -529 147 -285 -533 -89
4827 -89 -95 -374 -81 173 -375 -431 8 -47 -186 -23 -12 -546 -321 224 -407 -248 258 -11 -446 -127 181 -343
4849 -343 107 509 -201 -458 311 150 -276 177 -4 -216 -98 242 -407 -443 545 217 -400 -127 -46 -150 -64
4870f4N75n20J02M58n04n46N57L72l49l00N84l18k34N44o25k08M96N28q33K18
4890f7M11j19m95N35p5n76O30N75q94r2M06M7n26O27m18l93P02K43q12K56K69
4911B34m45r7N11K81q60L42K53l52l0P60m71l19L97j48l88N22q2n68M10M44k89
4932A05m64K82L35k45J1L6k92K20L17k17p06M63L5k49L74K18o97P1O04J21m60
4953a38L43J31m80k6K07m35J83O95r10k5O89jr28M68M44m97j26Q49o10j92K7O07
4975B75o55M9K73j25m1M50l47k49M65K00o05j69Q00j38k09J43j00r6L8R6k83L85
4997A57K62o05p4K54K24m51N29j27p60N50N22m58k76N65J6m69Q14m19p99L61J048
5018H64n55o53N90j57k62N42j10l88j1O11m59p2J91K19k72J82K28n78m5L94k6
$$ plain form
4870 -64 511 -9 93 551 47 -499 58 430 81 -219 365 47 -187 357 -268 -476 20 548 -285 -67
4890 -67 344 225 -270 265 190 -386 244 819 -75 -167 239 286 -240 387 -31 -424 278 521 -291 -35 234
4911 234 -211 -308 203 484 -376 -34 219 -133 -163 597 126 -193 204 56 -332 190 108 -460 -50 394 105
4932 105 -359 -77 258 13 24 60 -232 -12 305 88 -618 -155 -120 -369 5 223 -474 -403 201 322 -138
4953 -138 205 336 -144 -170 37 -398 -215 480 -430 -455 234 233 -695 -227 217 -280 -406 443 -167 -359 -332 275
4975 275 -380 -331 -58 -183 -224 226 -121 -370 95 295 -310 -479 321 183 -26 117 17 -79 -41 55 -228 157
4997 157 419 -186 -260 -6 218 -233 296 169 -591 -41 481 23 -253 312 328 -141 673 254 -545 -184 864
5018 864 309 -344 246 89 -173 369 259 -129 -140 471 12 -60 131 350 78 260 488 -90 -135 259 233
5039B33p39Q21j80m19L71M26l98l93P67o47j99O36Rp37n2P65l87J1N04o33n6M71
5061A74L1o99K01L82k73q4M05k09j05N30m0q79N38J99k71k59N02l31J93J22p8
5082D9n78O62L03p60l3K16K71m99M26n1m54K00L45l6m08K63j99l03M98L49o07
5103c46K0Q51q09O8K26O6n21J64M62l53J08M91p56j52P20l21j41l9N93m39kQ4
5125b6nm52O54L55o42j40O27l57LM08k60o67R07J66p80J37M26l73j40L76m23Q
5147a98M28J12n58L38K62n47j16N11k32l75M77L05o56J40K73p4n05N76J1l68K76
5168H0Kl79M28K45l05n60N23J39m04K94j14m11K22M37m07n6M17p6l03M46j19n59
5190d60L72L68l34r1P6J72m47L48Lk15M1J30k56q7K78K1k28K58J29m39J73J13
$$ plain form
5039 233 -506 315 135 -284 87 513 115 -278 489 -158 -357 279 288 -449 -501 264 -123 -112 392 -241 -297 174
5061 174 205 -494 -293 89 -184 -268 137 -72 -177 353 313 -566 -28 171 -100 -359 143 -188 5 127 49
5082 49 -529 133 436 -324 -357 -141 130 -369 57 6 -448 -248 97 61 -347 -84 -283 -586 -88 261 -346
5103 -346 -326 525 -284 -216 10 76 -445 -281 181 -172 -64 427 -329 -481 239 -82 -223 -262 331 -108 -110 -26
5125 -26 -31 -483 171 526 -116 -256 371 14 17 425 165 -502 405 571 -209 -72 354 -19 -159 217 -206 -198
5147 -198 230 342 -216 122 384 -163 -279 232 0 -375 102 407 -249 -109 164 90 -415 161 172 -196 80
5168 80 82 -297 131 376 71 -489 34 173 -231 63 -51 -462 -240 197 -210 -266 151 75 -228 218 99 -460
5190 -460 -88 280 -54 -145 -69 103 -344 4 7 -208 -167 -37 -293 -380 -102 -81 -309 -51 78 -361 -188 -75
5212g5r9j06N21J38o87j9K35k05K80J70n42J58M69l79k09K62K00k93K70j61j30
5233b02J13J64j70l96M14L13l43j86L05n9l75Q20l24n73L62O80o03j46M79l62
5253h9M6M63j71n62L38M75n71j12K09J95j16J19L07j010K65N56m91o5N19P5o87
5274c07N06L03p15K53K44l17j94Q15j13n81J62j38k09M96j6j58m36P62j75p68
5294e86N17O01p91K24K78l42j87M69m4o23L75N01n80o2J65J7m4L34m6o08K92M83
5316C43n56L3L06k84Q5K73j83n50P44O6l82J8J83m53J13N31l48l96L88K73n82
5337c78J52J25N0l05N27l26l13L95L48m60k52N02k05j48K51j7m4K1L87r09J30
5358d69P68o0m81J13L18l44J42L75n90J86L11l48k70N74k17k37R1N49m57k69N33
$$ plain form
5212 -75 -174 -280 241 379 -308 -327 -92 -297 -17 153 -389 -231 238 -141 -350 -88 112 -181 89 -72 -202
5233 -202 -89 75 -95 -491 -77 236 -107 -293 12 -47 -422 398 74 -499 -137 543 -60 -206 273 -89
5253 -89 -43 420 249 -313 25 500 -71 -183 26 221 105 224 531 -479 -214 342 -149 -214 305 380 -307
5274 -307 199 502 -213 40 284 -33 -227 588 475 -106 56 -82 -291 205 189 31 -405 357 182 -586
5294 -586 -69 532 -259 -35 243 -99 -286 183 139 -484 -109 392 -188 -250 -85 -68 -112 222 176 -432 -140 343
5316 343 -213 -180 126 -158 -73 200 17 -533 211 277 -105 -87 96 -357 -244 287 -61 -457 -69 204 -378
5337 -378 -226 -101 -51 -356 171 -155 -468 -73 275 -185 -437 65 -140 -288 -37 -54 -98 -77 310 -599 -469
5358 -469 299 239 -242 -129 189 -155 -13 362 -228 -42 269 -79 -349 225 8 -229 -138 411 -46 -315 218
5379B18j61k65K62M72o07J60K38n90J00M98j42p57O42J29n28K02K94k61P9N00
5399D83k97o09M82K66n45K50J11k96LO52p19Q0j60O79p64O8M91j8r5K00p2m69
5421b79L61N13n80K5K90l30k3j5J05l90N30J79p04J72M35m68l1L29Nk59L3J79
5443G7j51n9L99n45j07N50M1o12J94K73l21N3O39m39l15L88J11l60N0L58m54l8
5465b68N75j20n23M25J59p80L96K62j21m07P29l37o31Q57J48r01P25l1j07j51
5485a01M60n14k91P39l07m3q5L77n24j59N84j36m31L77N85p56oM16j81l76N08
5506A36j01j68P8K76l23l09P79m69N5q1R4j31K84M48q34P6M87k19k13L00J00k42
5528B3K62n0m91M01N7k83L5J97J97j80m09M94k41j63L38L2j53L15j47m89K15L12
$$ plain form
5379 218 57 -208 54 526 -81 79 317 -273 -173 325 183 -574 68 197 -331 -129 165 -96 -17 483
5399 483 186 -423 59 325 -220 30 141 -155 -152 500 -219 -139 -299 380 -384 -316 175 157 62 262 190 -279
5421 -279 82 595 15 40 330 0 -23 -38 67 -323 207 386 -318 -146 289 -179 -210 119 124 -135 -102 77
5443 77 -74 -133 266 -279 -386 164 205 -407 -213 60 -261 -208 431 -8 -323 65 176 -184 -134 224 -230 -268
5465 -268 307 187 -336 89 248 -532 -136 126 5 -402 327 -10 -641 216 364 -537 188 157 50 -101
5485 -101 359 -155 -446 293 -14 -57 -142 235 -289 -448 136 0 -431 -54 531 -225 -231 185 4 -372 136
5506 136 35 -133 -55 221 -102 -411 368 -101 -46 -127 -33 -164 120 568 -266 -190 297 78 -135 165 265 23
5528 23 285 235 -256 145 202 -81 -46 151 348 168 -241 253 12 -151 187 219 66 381 234 -255 -40 272
5550B72o90K22M34k1n42J73K17l35L69K23l67r4L33j02m97P48o25o2K80K16k2
5571A30j53L14j61m90L42J12p26N75J22o7l79M39j46l38K29M12m69J84L4K0j56
5592a72K93J8l67K96J20n13J83M24m53j67O19k94k27M21J43p31N3K06j91J58J85
5613DJ7j09M34Jp01M95J35m14q4P10l11l63k50M11k31r0O76m14j82O42l88n8k16
5636b86L64n18N00O21n68k45K98K57l80l2K82m85ML50k54j04M62J08p33L76K74
5657B91o12j80J000o78j3K57j72j24n0L96j46o3O18l50l40M31l9n50K97L71k36
5678A08l44O43k48o71M29M17m32M15Q2m07k89M85n4m43M94K5o01L41L34n27J26
5699a17M93k74k00M3L38n82M76K17p75L86M4K16n98K58J91m37M58n0j0j78R9K86
$$ plain form
5550 272 -418 -196 238 217 -325 -152 65 -270 99 322 -45 -139 194 92 -405 343 -282 -344 -64 152 130
5571 130 -23 291 130 -360 -18 94 -632 -57 65 -2 -381 58 -88 -426 -197 215 -254 -70 -36 -16 -172
5592 -172 121 139 -228 68 188 -325 -142 282 -171 -338 281 -13 -240 181 324 -407 -354 -148 -339 -181 4
5613 4 21 -88 346 347 -354 141 276 -138 -222 488 177 -186 -436 -25 -256 -346 330 -84 -266 376 -12 -70 -286
5636 -286 78 -440 60 681 113 -132 166 423 43 11 293 -192 -188 162 -92 -196 266 374 -359 17 291
5657 291 -321 -501 499 -179 -192 65 -107 -231 -281 115 -31 -94 524 174 -166 265 226 -324 -27 344 108
5678 108 -236 407 159 -512 -83 334 -98 317 399 -8 -297 188 134 -309 185 210 -391 -50 284 -243 -117
5699 -117 376 102 -98 -55 283 -299 177 394 -381 5 49 265 -333 -75 116 -321 137 87 77 -101 -2 284
5721B84o08K74L37n84J76N27n89J23M65j12p64L01J35k33J95J84j94k9L30O1n09
5742b30L12j6k01P8L82k39l73M32r5k04J18M13o28J87J90L7n36N33j2n58N10J38
5764B38n99J16P21l97j13J41q1o8K00J11n03K30K44Q9l92R2M60p38j49P43n78
5785b33j1N68k87n6J44n2l50J85j76K09k58N77m45r5K25L85k72r3J73k74J48J77
5807A89p7j84L26l4l72J11M65n93J15J23J08m48J59J2N9M3K73m85K69j01K24j87
5829eK22Q9o18J48P21q02L84j96K62n80N14qk36k1K49m06M96n2J1m55L28K94p01
5852c62MN86j73l86J95J54l46K21O0j64kN32j67l02K99J54n55kN09n90j08P19
5874B76k94k24N12l68j54K61P1l75K46K63k73k87M70p7k79L58n5l88J51J64k9
$$ plain form
5721 284 -324 -50 287 -297 -121 406 -183 -60 405 293 -471 -170 -35 -268 -73 111 -83 -112 218 279 -230
5742 -230 82 66 -135 -57 325 86 -287 145 50 -154 -36 377 -251 -64 126 163 -373 160 148 -410 100 238
5764 238 -361 -245 476 79 -34 107 26 -42 158 269 -234 -4 240 329 -63 29 489 -249 -398 345 -233
5785 -233 -244 324 37 -19 125 73 -277 -92 -268 -59 -317 260 -185 -280 -55 330 58 -35 138 -136 12 189
5807 189 112 -72 254 220 -152 -41 424 -169 -54 69 177 -271 -112 -100 -41 2 275 -210 59 -42 182 -5
5829 -5 217 306 -312 -164 557 -245 139 -57 205 -375 139 131 -105 -126 123 -283 213 161 172 -283 45 339 -362
5852 -362 -358 228 55 -331 -136 18 -328 -107 -47 -211 -213 319 152 -150 149 303 -252 -254 255 -335 -443 276
5874 276 -18 -242 270 -98 -252 9 80 -295 -49 214 -59 -346 124 47 -232 126 71 -317 -166 -2 -31
5895c1k68L11R2j58j33K80l44J46M70n65j9L37Jm66M22P9q4j94N42k62l12J07
5917d9J49o47M30N47n09%J17J0l78L05K02m02K10K67K06o56K96K03n24N03J14
5938C94n13L6K89l44M2M07J13p76N31j5l88L45J08m05r7K69J71k33O8J95m50L69
5960A16K44R9m99J79R6m69K02K89j42j92l7L9j2L45R3n03J59J03j21J21N04q35
5982b21l94O12q6M4K14M7j90l68N86j19k90J81J48l43K61J42q2l52j6L64p18N01
6004g9J93n02N63k8j49J06M0J09l81J43L61m28k3K73n02J19L46l05J91qJ86l95
6026a70K10L75o41J11J81o3m51M12J77R0l73K64l86r4M34J60m99M89k09n32L53
6047a62L66k10l17L02O5k23K32K56m61K5N2m9k42L33J56m16M24J33l19J74Q7L6
$$ plain form
5895 -31 -299 12 104 -54 -187 93 -251 -105 365 -200 -219 118 119 -347 75 154 70 -124 418 156 -156 -49
5917 -49 100 -547 -117 430 -79 -79 38 48 -330 -25 177 -225 -15 252 458 -198 98 301 -223 280 394
5938 394 -119 -83 206 -138 -96 311 424 -352 179 164 -224 121 229 -176 -273 -4 167 -66 2 197 -253 116
5960 116 360 459 -40 139 235 -234 -32 257 115 -77 -114 -75 -87 258 351 -152 7 110 -11 110 614 -221
5982 -221 -615 -3 -89 -45 169 216 26 -342 244 125 -165 16 164 -179 82 224 142 -210 -226 138 -580 -79
6004 -79 114 -388 175 147 -2 104 144 253 -128 15 376 -52 -75 198 -304 -185 161 -144 47 39 225 -170
6026 -170 40 415 -226 -115 66 3 -448 -36 141 231 -142 122 -264 -358 76 236 -263 226 17 -515 -162
6047 -162 204 -6 -323 -21 44 -179 53 309 -152 -127 -75 -124 -366 -33 123 -293 131 264 -55 119 206 242
6069B42l00K19j42j91K70K93l98k72N36o6k01n8K09k64K51R4l94k34M48k80K65
6090B7K05K14m61l78M86r3k46L94k37q0J91K66n87K94L40l16k93M22n1k16L17
6111A98O5l90j26O50p87L4O37k7l35j38L12l23N1L57k55n7L19l01J61N1l10q0
6133b94L81J92k08m64N45j46p4p8L83n63L60K9k38k19P7K97j83q4J85J52q9J50
6155A11m99K83J82R5m39K67J92k23k26M03k9l40M54K00p69M80J85n57l8K99m7
6176a6j80N36J14m44J93J02l90J08k9K37j77J11l9m55K55O88o42j1M82j82l17
6197e6K70jj63j0L48n48K10K67j22l4j81P8K9j7L98m77k15K22L05m86L7J99j51
6220i8J90K74m98k1Q4M25j43k28L76n57J19L18o25J73M50l35k07L72J97m04l7
$$ plain form
6069 242 -58 161 19 -172 98 391 -7 -279 257 191 -10 -68 141 -123 128 222 -172 -406 42 -238 27
6090 27 232 446 -15 -393 93 0 -246 148 -89 -169 22 288 -299 -5 335 19 -274 148 97 -119 198
6111 198 263 -127 -253 397 -390 -356 281 254 -81 -219 93 -230 -179 178 -77 -134 185 -116 45 96 -214 -294
6133 -294 87 279 71 -393 152 6 -68 -146 237 -326 34 63 -175 -394 -317 -20 -203 -287 -102 50 -39 111
6155 111 -388 -105 77 172 -267 0 192 -31 -257 146 117 -223 231 431 -338 142 327 -230 -268 31 -16
6176 -16 -196 340 454 10 203 305 -85 23 -6 231 54 165 126 -329 -74 614 -28 -39 443 261 -56
6197 -56 214 213 50 40 388 -160 50 317 195 161 -20 58 87 70 468 -9 -224 -2 303 -183 -146 53 -98
6220 -98 92 366 -132 -153 -69 356 213 -15 361 -196 -77 241 -384 -211 239 -96 -303 69 266 -138 -175
6241a75J28J85m1p6K69l15j2K20k00j97L68J44o90O47m52r2J24J5Q6l3K85j14
6263G4j16Q6J36l31K71k24J6J05J94j08k37L18j54m62L71K59m69n8O99k58k79
6284a67K59J15k35J04J05j92k98N52j23k43K36j18k09L43k12J35r3J98j47J5L30
6305C55k23j97PJ29l8L94j24k11o0O5L18k72j16K81j93j63K09k39J42p6L25l83
6327g0J34j3j54P0K82k11j31K99O1j48jL4j26l08K35J94p4K78m75k3j3N25k49
6350A16l54K20N5J7k19M24m19J9M35j99q4K60l20J02K37k22m19K5N16R5o07K41
6372h1J46j64o4M20l19J85J05m44m6L12J34l20K61k01j13j3K09q8Q7n2L13k71
6394dj34L81l90q8M40j79j17J09J73m27J71L98m72j83L44P6l10M29j43m91M15
$$ plain form
6241 -175 -47 138 97 21 290 -25 -37 183 -17 -214 154 298 -392 255 -197 -289 -165 -150 -64 -97 188 74
6263 74 -42 44 180 -151 120 -104 -88 17 211 103 -134 184 30 -432 -61 198 -271 -329 370 112 -167
6284 -167 92 207 -28 76 181 -11 -309 243 120 -123 113 -5 -214 129 -83 52 -41 157 10 25 355
6305 355 132 -65 -58 71 33 427 303 92 32 97 415 143 27 308 115 -48 161 -78 64 -12 313 -70
6327 -70 64 51 -103 -33 249 38 -93 206 267 119 118 152 26 -282 -47 147 73 351 -124 -147 -160 365 116
6350 116 -238 -18 37 54 -165 259 -160 -141 294 95 11 271 -49 53 290 68 -351 -326 190 285 -322 -81
6372 -81 65 -99 -163 257 -62 123 228 -216 -262 50 184 -136 125 -76 -189 -202 7 -81 6 -46 267 -4
6394 -4 -138 243 -147 -235 205 26 -91 18 191 -236 -65 333 -139 -322 22 98 -212 217 74 -417 -2
6415bJ98m17k2L48R4q7O7N8k26j55K80n6kL07l83K02j10n8k48J08M41l79M0rK57
6440B46n90N51L1j88k59K49J9r9J41Q6k36O7L52m21L3K10k40j90M32j1l15k90
6462d22N31l01J89K91m15j81N91k68k27P8L79l38j02L05k17o8J24L25p18L55L33
6483B44o25R9N05r7n99M41R3m44J47M82m21J21o2J94l68M19o3j81n5J40j39r6
6505b65O69m77m39M58L7j98O1N8K2j23K20l1j6j49P1m05N45j64J44l85M03O3m81
6528c82L16K40l83J11K27j09j77j2J51k06K05K38k17p9L35j48k78K66r0k39Q9
6549a42N65m59J91N3m0k93L59j48m95K10M32o93L80J93lk96K74j62J11j06N52
6570D83m21pM43m35l40N28J10l40K00r2j91l7J34N0m21N04P4m04K31K37j60m62
$$ plain form
6415 -2 196 -221 -243 105 199 112 179 237 11 -144 136 80 78 385 2 204 94 36 -212 -104 337 -42 -2 -11 246
6440 246 -344 207 238 50 -209 40 59 -40 101 187 -49 18 370 -51 -18 192 -48 -238 194 183 -132 -422
6462 -422 109 -192 -3 288 -127 -308 283 15 -212 -134 245 -93 -195 110 -107 -175 -51 274 -444 -89 244
6483 244 -381 -282 223 126 -473 -32 61 -383 -236 246 -175 -54 -116 78 -290 129 66 -115 -170 -30 -169 -265
6505 -265 404 -73 -512 -54 -17 -215 -154 -96 -74 -197 23 -8 -24 -173 -102 -507 38 -126 18 -367 36 99 -382
6528 -382 -66 174 -209 -98 129 20 -157 -169 -18 -224 -19 219 2 -77 258 110 -168 98 8 -231 -142
6549 -142 423 -36 155 208 168 -125 234 86 -409 -199 233 -460 -80 113 110 -186 88 -74 37 -69 483
6570 483 62 55 498 63 -277 251 361 21 221 129 -62 -99 35 85 -336 168 242 -162 69 306 146 -316
6592c16L57Q6k41J29J85j07j39RP9n8L4l7l90M66K05n09L61Ll81J16J72R9j83
6615f0R0N8j77k56M25j86L7J59j79l28J53L92k70j94N57o01K6L93J4k4L1j80L4
6638h6O6R0p6k81M37k47j60J53K71n2m39K83K2j27J90j69r9M04l17J28J31j35
6660a3n5J09Q7k78j2L81j25k5r2L28k29l97M94r7j22k97M12l74R4K74O1l83M71
6683B12k29o0O0K79l00l35M55j52J00L28k67j79M9K99l14k07M04j90j90J56K54
6704A73l63L31P4k23k69M61k53o8L93k49k0j0J81N6k87Q5J74j94R6M29m93kR2
6727A14Mo8J42l5l72L87J90j96j36P3J10p41O12j12l90M34K18m85O5L70l83j38
6749c37M94N9o2n9J25m05n8N52l95m53P31l9o55L90N24m66k08N13l68k7M95k07
$$ plain form
6592 -316 41 127 -114 15 200 93 -46 -37 42 -16 18 -19 -409 57 262 -247 114 117 -264 -148 24 123 -60
6615 -60 30 88 -89 -345 80 -106 -69 90 -89 -417 -264 128 -142 -336 221 -380 -354 39 53 29 60 -120 -86
6638 -86 -20 70 -6 -287 150 -97 -257 -104 167 115 -324 -41 -19 -146 44 -125 -224 180 -137 -9 122 -13
6660 -13 -68 41 128 -150 -162 219 94 69 -23 305 76 -321 173 76 -46 -343 69 -305 -211 63 124 -259 212
6683 212 -17 -77 -17 262 -38 -373 82 -70 30 358 91 -88 -39 260 -54 -261 143 -47 -237 -81 173
6704 173 -190 141 215 -8 -277 184 -69 -137 256 7 -13 -23 158 214 -73 12 186 -8 88 517 24 22 114
6727 114 118 50 192 157 -215 172 362 166 30 103 213 -528 84 -28 -418 16 234 -251 -186 184 -199 -337
6749 -337 157 216 154 95 220 -185 -243 309 -86 -539 192 153 -502 -112 412 -54 -262 251 -117 -144 351 144
6771A44k25N6J56r3k02L6K17j30l5J35n00M98j61J86k66J50p6j44O12m41k83J56
6793b10P37l01p36M87J24m04M35J00m01K15k00p6J30K76Q8l6j72J45k00K09J22
6814C32l09K70l56J88o8Q2L4L8j52J61m70M67k56Q7r9K12N05p99J85K41l92J82
6836H3L45o58L86l5J35k42RN38o95J95J20j83P4K57n9k76n9L24m20p5L63j51j43
6859a67L46j20j90J47J01k99K27K64k33m88L78K49l74j03L31k36K81k09J44l43
6879b94N87j27l59P0L55l02m29L79K42k51J7j8K11l50J81J46k22N53k43j50j18
6900a22J66k33P4l3K37k58J53Jj58J98q0j7j58L12k55j62L49j47m5MM38k06Q8
6923A46j78q0k43K82k0q3M9L76m12j72L61L9l60J13J73q0pL33J89m04jL0k40L56
$$ plain form
6771 144 -81 -25 131 38 -164 -128 89 -41 -76 59 -441 57 -104 82 -184 -34 -110 -254 358 -83 -366 -210
6793 -210 527 226 -510 -23 101 -303 132 232 -169 46 -154 -230 -100 176 264 228 56 201 1 210 332
6814 332 23 293 -63 125 57 139 173 211 59 220 -250 217 -39 48 -51 161 666 -133 52 293 -99 83
6836 83 428 -230 156 121 256 14 23 561 -134 61 181 -2 72 329 270 -6 -65 259 -161 -236 127 -24 -167
6859 -167 179 59 -131 16 117 -182 45 309 76 -412 -34 215 -159 -262 69 -167 114 -95 49 -294
6879 -294 293 166 -193 -123 232 -70 -499 -120 122 -129 -112 -130 81 -269 -88 58 -164 389 146 -4 -122
6900 -122 44 -189 -115 -148 89 -169 -16 -15 -173 25 -55 -72 -230 82 -173 -335 14 -133 -178 -174 264 58 146
6923 146 -32 -112 -355 -73 -93 -176 -127 249 -163 -335 26 65 -295 -182 -9 -89 -96 237 426 22 21 51 -189 167
6947A67j75j97J90L13o0j91M70n40K47j86K13j34q1J36j40J74K78j04n00R2J34
6968A06J6j33J90L2o3j02M7l24K39J45l05J44J04k06o1N4K00j82o4L93k21j85
6990a76L42k05j53J20J43l10L63J56m03k89Q48m85p8J81n2j0k3J29k68K56j18
7011c2j47J36J74r7l39K84j41O8m6L11j37m34N42p7k19k2J36j10M5K95k42J86
7033A34o6m7l22M44j13M0m34N27q2l62R6K43o9k14L14l23r2L36M2j35k3M12l69
7056f3k40N86n07l45N88k5r7O6q3j15K31P3l79J99L12j68k93M20K18m73K22j7
7078A10r4j55J33N4j44J67K11k28n9M70m99nk2j30R5O0K86k95j22K17j80J83J69
7101B22l89j04K45L14l57k66O45l36Q0M0J83o70K56N3j65K27J74N7j77l42K79
$$ plain form
6947 167 -8 -205 -15 298 238 47 517 -23 224 38 251 117 36 172 32 206 484 380 -120 -28 106
6968 106 122 -11 179 211 148 46 93 -231 8 153 -152 -8 96 -110 -171 -117 83 -99 -163 230 9 -176
6990 -176 166 -39 -192 -72 71 -239 124 280 -123 -412 436 -49 -127 54 2 -8 -31 98 -170 86 -32
7011 -32 -179 -43 131 34 -305 -21 -162 -94 -140 171 34 -400 142 65 -154 -176 -40 -150 -105 190 -52 134
7033 134 68 21 -301 143 30 70 -364 163 81 -281 -185 58 -11 -225 89 -234 -326 10 52 -83 -106 306 -63
7056 -63 -303 283 -224 -569 19 -6 -103 -37 -120 -235 -4 69 -310 -111 201 33 -260 160 378 -95 127 110
7078 110 16 -139 -6 48 -96 71 282 54 -5 465 -34 -39 -61 -191 -96 -36 250 -45 -167 50 -130 53 222
7101 222 -167 -271 -26 288 -69 -335 310 -26 54 94 277 -393 -137 -84 -249 -22 152 209 32 -310 -31
7122c1kJ3K75m14Q0J12r2j63M46P0l13j40K60j42MJ13nl33M08k16m7J1j56K61
7146ao7L50k06l41L21L68j17l6k67r3j99L76J88l28K63j17l93J60M04r5n15J46
7168a99J59R0j33J25j73n9L33j50k38K81l9j07M02Pn96K55P4N3j64J14j38P0J56
7191A23n8j87L65k03L0l03J99J24j47k00K71k91J96K18k38q8R2J75j74K53J6M0
7213B13l10J99q7k31J08L46m42M3K89k73P8K52P9k59j1N3K4L40j9l79k54L90j41
7236Hk01K29L03l36j79K46n2k57N18k32l70N48k73k73K68R7m44K06L06R7k44L31
7258B96j99l2J7m1j7l51L14m4O1OK81o34k4N31j43O9K5J4j81o0L6R1J61l6n11
7283c71q6L95j1l31K69L29m74K97K37k20k88J52L7KJ90l75M14m28L14l84Q4K80
$$ plain form
7122 -31 -33 -20 255 -159 -79 33 -59 -222 224 294 -19 -159 101 -41 -37 76 71 -262 146 -70 -117 -106 -262 -1
7146 -1 -68 282 76 -265 56 424 307 271 4 -89 -288 88 276 -52 211 94 -299 -139 265 170 -345 -199
7168 -199 -40 50 -83 42 -131 -190 143 -7 -245 36 -3 -110 292 299 -297 -42 32 85 -79 35 -103 -33 123
7191 123 65 -122 243 40 70 -233 -34 90 -57 -257 14 -277 -81 137 -101 -189 -97 78 -96 157 173 213
7213 213 -97 102 15 -216 -108 238 -204 -161 128 -145 -67 185 264 5 -6 47 71 411 392 13 -241 149 8
7236 8 -193 36 339 3 -176 70 18 -239 279 47 -323 225 -48 -321 -53 44 -400 -194 112 209 -35 296
7258 296 97 65 82 41 24 -327 -13 -57 4 10 291 -343 -367 164 21 90 115 129 -52 -112 -76 15 176 140 -371
7283 -371 -457 -62 -73 -404 -135 194 -280 17 254 34 -254 -102 -65 -63 127 -248 166 -262 52 -332 -248 32
7305C2J35k77oL84l00L44k58q1m1L5N4k29L57q9k26K92j97K61l21L03k02j11j1
7328a52K76m0j71P2j39k2M40J78p48L77M1k81L13j53j91J17M51l31p2j40N41m95
7350a29M5R3K65n42M21J6j46o7K55j17k04L69k38J5r6N99j73l97J7Pj53K98J52
7373B90o73L73L32o66O42k63J46m29L00j84R4P4K04p02K49K28j42m45Q62k78j91
7394a79j12K46J52k94J69N5j95J20j79J15P0P8j15j12K71j52p2J06P4l89M44O3
7416A64Q0k12J43k47k0J24q4K2m6K39k41R7k7L50l73RO6k61Q5l03o6L99J68k41
7440a75k28K98Q6J81j33K91k34k80M82k99k74K58L83l16l21K48J56j23J74l64
7460a90K57j35N35m26j41N43m80k85N52N2l85J42l3Q2k00j22L90o8kj25j56N3
$$ plain form
7305 32 167 -110 -116 268 -32 312 54 -27 -68 -33 21 -208 149 60 -166 126 -71 190 -131 172 -30 -141 -152
7328 -152 124 84 -87 -15 -154 -176 264 442 -306 71 112 -169 144 -9 -200 -83 368 37 -35 -175 366 -129
7350 -129 -84 9 274 -268 153 169 23 -44 211 94 -110 259 21 36 -60 539 366 -31 -14 -7 -160 138 290
7373 290 -383 -10 322 -344 298 35 181 -248 52 -132 -38 36 240 -462 -213 15 -127 -572 290 12 -179
7394 -179 -291 -45 107 -187 -18 37 -158 -38 -217 -102 -32 46 -69 -181 90 -62 -134 -28 46 -343 101 164
7416 164 244 32 175 -72 -92 32 -52 -30 -76 163 -78 19 -8 342 -31 -22 44 -217 -132 -435 -501 -102 66 -175
7440 -175 -403 -105 -19 162 29 320 86 -194 288 -11 -285 -27 356 40 -281 -33 123 0 174 -190
7460 -190 67 -68 467 41 -100 443 -37 -322 230 282 -103 39 6 88 -112 -234 156 88 86 -39 -195 -142
7482a42K86j48j8m6J01o6K69l39K4L12j2k70J71j49K69n76N60K14l35r6J06N5
7504A70o8k1j39O4R9j99mN6M09o65J53K4J63j75J79J17m03K53J05k58J62L04l26
7527@k84L70j04q2L30l65j02p8L29J85j35J50k77j61J54J81k56J13J87j85k67
7548b97M01K42m33L4j03J24j44P6J51q2o3L95l21rJ01k50p2M08o0l81P23k59l82
7571b01J3K59q7k23N92l03j16Q1L94q29L29P3j12R2R1L20o94J76L33m33jQ18m52
7594A20j90K01k02j72K51J86l04J06J28m05O7O58n38l0R3qJ95p1J9M0j48J82k50
7617g2J57J3j5k27K21q5P7m63N01L5l29M23J94o92L10M0M0m9qm0m6n4PJ80k28
7642a10K61k43j22K35R6j99m4K58j68J42J79l92r6J94Q1j79k2R0j1r2J95j66L0
$$ plain form
7482 -142 144 -4 -22 -68 33 -33 236 -103 -79 233 221 -49 122 -27 242 -334 226 440 105 9 115 170
7504 170 102 81 -58 6 105 -94 -98 -42 367 -298 -145 -121 42 -133 46 163 -240 13 118 -140 22 326 0
7527 0 -284 86 -18 -100 230 -135 -237 -315 14 199 64 214 -63 -224 -70 111 -145 -32 155 -30 -297
7548 -297 104 346 -87 -53 -156 -32 -176 -100 51 -31 -94 301 -20 -29 72 -178 -250 158 98 -283 440 181 -201
7571 -201 -188 71 -16 -239 353 50 -66 15 409 -420 -91 -18 -130 -38 53 373 -321 -145 188 -245 -246 572 120
7594 120 -70 131 -71 -243 8 194 -110 -4 124 -281 -214 444 -94 -124 -31 -39 156 85 104 144 -4 178 -72
7617 -72 85 98 83 -144 77 -8 69 -394 107 142 -187 236 430 -262 48 88 128 79 71 31 -15 -69 -62 118 -110
7642 -110 151 -92 -214 21 117 -82 -126 132 -36 106 285 -107 -203 -9 72 -107 -129 -39 -50 -142 53 -113 -83
7665h3J97J50n42J97L45j86m09M01M6k79K82J11j62l41M98m21j31L95K39m99J48
7686d4M33o86M43N5m58L13J35J08k54j19q1k7j24J47J78k54L83Q3j05O8M7n75
7708c34J24P21p20J25K81l16L82l69M49k59oJ02j49n25N19r7k5j33J56K60l16
7729a30J66j44p0K47j3R9j85J81j40j66M14l54j01L82j34l89M26K44l47l15L03
7750b6J29k20N7p3M2J78r6O1k89L96j53J38l06M12l98r7N12l33j55M64p5l50J21
7773f1J76k23KK07j77j08N64k30n34L05N16o85K04Q9j70j28L73K75l15M7r9Jm8
7796a9J98J03m02K21j74j9J32j13L38m40L55l29j03N65m40j5N1%Q1j7K55m09J27
7819e4J89j54Q3l72M36l00J31K19j85j3J42K50n09R7J36j06l38M54O4m25O14J51
$$ plain form
7665 -83 114 264 -278 -81 264 78 -331 70 116 -163 119 230 68 -273 225 -196 -327 68 307 -192 -44
7686 -44 389 -297 146 201 -257 56 191 299 45 -74 -155 -182 -306 -159 19 -235 148 231 126 194 241 -334
7708 -334 -210 511 -209 -84 197 -119 263 -106 343 84 78 180 31 -494 25 -72 -97 -230 -74 186 -130
7729 -130 36 -108 -178 69 56 155 -30 151 11 -155 259 -95 -196 186 52 -337 89 333 -14 -329 -26
7750 -26 103 -117 -60 -133 -91 87 -9 52 -237 159 6 144 -162 250 -148 -245 267 -66 -221 243 168 -182 -61
7773 -61 115 -108 -106 101 -76 -184 380 150 -384 -79 437 -248 -44 45 -125 -253 120 395 80 127 28 29 -19
7796 -19 179 282 -120 101 -73 -92 40 -73 265 -175 180 -149 -252 313 -127 -142 -91 -91 -10 -27 228 -181 -54
7819 -54 135 -19 64 -308 128 -172 -41 178 -7 -20 122 372 -137 -40 96 -10 -348 106 170 -255 359 510
7841E10r82K90K53k12M3J32K2q9J30j41m8l4J58k57Q1M86l85J09k18K17j02J34
7863I7J43k04l95M93l45j33K73r0JP8K22m42K74J96l23k84N30n5J22l39J98m85
7885d68R1N12N9l21N4J15M5k43M09j48j10L6Mj13j95M94m86K66J11j97j66K51
7907@k9L9K1K2M1m84O27l07q3Q6r4%j33J54p6p2L14J45k72L27k90m81L82J97l30
7932b96L26l2k46J59K18j88j33J52J12p8j63n0J99J09k35R3q5R9L62m35J90M2
7954A20J21l13JJ66k67J54L67n43j02K95Q2O5j04p2q9L3P7k08NL55J35l48J87
7977A17n1j87K29Q0j63k87M07J42l40j49L50j02k7k40Jq0N51l71N4k02M44k80
7999a04k60O48j75m67J58J83j55O09k49k49m0K05Nm58M40K68m13J53K89k09k59
$$ plain form
7841 510 -472 -182 71 -141 -98 34 56 -33 97 -44 -92 -126 32 -225 -144 342 -43 66 -152 65 -37 97
7863 97 240 36 -359 134 -211 -344 -71 -161 -160 -82 140 -302 -28 168 -155 -439 91 36 158 -181 17 -468
7885 -468 -377 135 194 -127 -73 42 87 -156 253 105 -5 31 35 -78 -273 221 -265 1 112 -85 -251 0
7907 0 -29 10 31 53 94 -390 237 -70 -153 -67 -161 -161 -294 -140 -216 -288 26 171 -101 226 -64 -545 -163 34 -296
7932 -296 30 -2 -248 -89 129 -59 -192 -40 72 -6 -169 -219 -20 89 -146 -53 -138 -39 323 -112 78 120
7954 120 241 -72 -71 95 -172 -18 349 -194 -296 -1 81 146 42 -30 -119 -86 -9 -217 -212 143 278 -70 117
7977 117 66 -121 108 188 25 -262 145 287 -53 -202 148 46 19 -221 -220 -300 251 -120 -66 -268 176 -104
7999 -104 -364 284 109 -358 -200 -17 -172 437 188 -61 -101 104 109 -349 91 359 -54 99 388 179 -80
8020h0J1J25r1N3J81m4r5k5k09nP46l67m65M13k41K63j53J7K1l36L91J59k65p
8044cl5l53O03R9l79k78L58o6q5K31j00J29J6j73m77K81L33j53l51M19K37m35
8066a82J5K97k90R1m4j5Q2q6Q9K50n3o5j93j71K49K83l21j16K79k93K36q7K92
8089B47k40K29r4l76L93J57n02J26K02k71J99J81m12q7M97J30n50j39L00n9k00
8110b69K86J30l19mK92p8r4L24j78k32K63p7o2J3K24j29j35o7K30k68J40K1j69
8133a58L36j22J89k78L52n8l78K26q5j88K12J1l41L59Q3l07J00k3M9m1m6K90k30
8156d8O8pJ16k52M93l08j48J92J77m70o9N26m42K45j12L72n37N5L93j5m01L82
8178B10M8m31K10J41j19Jq3l09K16K96p7k61P8
$$ plain form
8020 -80 -69 56 -35 18 199 155 60 35 -174 -179 567 200 -265 148 -93 170 17 34 55 -281 110 269 4 -3
8044 -3 -38 -391 212 311 -68 -346 12 -54 -139 92 -8 121 137 -36 -513 -232 101 -52 -403 16 253 -182
8066 -182 -167 130 -160 -69 -113 -128 -46 -132 -43 207 154 89 -104 -275 -26 257 -64 -180 99 -194 42 -45 247
8089 247 7 236 142 -234 159 316 -186 -60 142 -129 70 251 -161 -248 249 379 -171 -310 -10 -69 -269
8110 -269 17 147 -172 -176 116 38 -56 268 90 -142 121 44 -18 -5 219 90 -45 -112 118 -150 -10 11 -158
8133 -158 178 56 245 -33 319 261 -117 109 24 -164 48 59 -282 77 160 -147 -47 -70 -21 -62 -108 182 -48
8156 -48 20 13 129 -123 370 62 -86 106 283 -187 -256 270 -172 73 -39 333 -204 -149 244 229 -172 210
8178 210 258 -173 37 178 59 60 -23 -332 -116 180 103 -158 -80
8191h0
$$ Imaginary data points
##PAGE= N=2
##DATA TABLE= (X++(I..I)), XYDATA
0@%%%%%%%%Qj6J6j6K0k8L2m0M8n6P0p9R0j06J25j48J69j94K22k50K86l25L66m10
32b16M60n14N72o37P10p91Q79r75J078j195J324j465J624j800J998k225K486k786
50a473L138l559M069m709N538o658Q266j0778J5297k5965R5766Q6955j53536l2456
64b0105L9539L6231n327n172l0754J2826L4698j3675m2686J8645K2175n456R907
77E0846O142m8780j2821M0376q262m2959L0316M4364k3887l0979P190K462R707
90B3715J3456k9663k7395L8509J6144n1085j4743M4786J5567j0640q99k4762j6965
103b3975M6918K5491o0924m2685L3201L4802P234o014l0224j0490M7057J4286
115C4677n5678j3193M7238K840l1434J187J221q571K5718J5827l1292j046M2538
$$ plain form
0 0 0 0 0 0 0 0 0 0 8 -8 8 -8 12 -16 16 -24 24 -32 38 -41 49 -57 68 -80 89 -105 117 -133 153 -172 194 -216
32 -216 244 -270 302 -335 375 -416 463 -512 566 -629 695 -770 854 -946 1052 -1173 1313 -1473
50 -1473 1665 -1894 2175 -2534 3004 -3654 4612 -6166 9131 -16834 78932 165887 12351 -20105
64 -20105 19434 55665 50338 45166 14412 27238 61936 48261 5575 24220 46395 40939 50846
77 50846 56988 8208 -4613 35763 27501 -15458 14858 59222 35335 4356 11546 14008 23715
90 23715 37171 7508 -19887 18622 34766 -16319 -31062 13724 29291 18651 17752 -7010 -23975
103 -23975 22943 48434 -12490 -55175 -21974 12828 20062 14048 -16176 -26666 20391 34677
115 34677 -21001 -34194 13044 15884 -15550 -14363 -13142 -21713 4005 19832 -11460 -12506 30032
128C0032n558m2997r871Q683J5751L4518n449n7272l028N7182P144l3172Q724
141D687J9541r192o242j1871k5242K2404M7835j9269m0556K6161L3576j7658j6077
154H097J630n444J5251K1208l0659l0249L3997K5887k5449p060K1120R18R37P640
168C7824k9904k2759L8587K6133l6321k4657J7526J8226J9650N462m5074k8577
180b3884M9883L6945m1936l3538J5698J0191L30N628j3127n186L3873Q061m1083
193A855r880K5783n646j5452J0967j755q969J9526K594l3435M896L9461m255k7720
207b030J150N85q368R553l679k1339K2979L9790k5671m4600J4507L1467L577n600
221A2321k3153l0105K3580M4873k0344m3099J4990L2361M260m588j7169k3937
$$ plain form
128 30032 24474 -18523 -28394 -19711 -3960 30558 25109 -32163 -35191 21991 29135 -4037 4687
141 4687 24228 15036 8794 -3077 -28319 -5915 41920 22651 -17905 8256 41832 24174 8097
154 8097 9727 4283 19534 40742 10083 -20166 13831 39718 14269 7209 28329 29247 30184 37824
168 37824 7920 -14839 23748 49881 13560 -11097 6429 24655 44305 49767 4693 -23884
180 -23884 25999 62944 21008 -12530 3168 13359 13689 19317 6190 1004 34877 42938 1855
193 1855 -8025 17758 12112 -3340 7627 5872 -3097 16429 19023 -14412 -9516 29945 25690 -2030
207 -2030 -880 -295 -8663 890 -2789 -24128 -1149 38641 12970 -31630 -17123 14344 17921 12321
221 12321 -10832 -40937 -17357 27516 7172 -35927 -20937 11424 15684 11096 -6073 -30010
233c0010J9475L2436k7360l3708K7597K4609j9730q655J1399L48Q054J0686k3861
246h720j8476K5211R153k4880J85J6552o219K513J6724j5120j4653K8289J0276
259B0835l5651j2472K3642R127l820n793j9191P066M5131K319m9876o575L8199
272A2941M569k0988n982o550L370K6094jk9447Q413L0497r870k0957O057J720
286a34k902J3812r249l0284J5438M0859r801k9890N560J3646L543O280j5810k8804
300b7736J7077L4108j8052k8859J7458J8961m924P96n039j4984J5074J9683k8650
313e087k5104K6079J9586j5105m693N246l353J1337R987k4816j0428L1718L696
326A9063l6146o025K2823O036L205J887j9739k925L3468L261l6475r017J9600
$$ plain form
233 -30010 -10535 21901 -5459 -39167 -11570 13039 -6691 -15346 -3947 -3599 4455 15141 -8720
246 -8720 -27196 -1985 7168 -17712 -17527 -975 -7194 -4681 12043 -3077 -17730 10559 20835
259 20835 -14816 -27288 -3646 5481 1661 -4132 -23323 -16257 28874 31193 -18683 -25258 12941
272 12941 17510 -3478 -9460 -16010 -12640 13454 13453 -15994 -7581 22916 13046 -7911 -1854 -134
286 -134 -3036 10776 1527 -28757 -13319 27540 17739 -12151 -6591 7055 10598 16878 1068 -27736
300 -27736 -10659 23449 5397 -23462 -6004 12957 8033 8829 3790 -11194 3880 23563 -5087
313 -5087 -30191 -4112 15474 369 -4324 922 -2431 8906 18893 -5923 -16351 15367 19063
326 19063 -17083 -23108 -285 5751 8956 10843 -8896 -11821 21647 24908 -11567 -20584 -984
339i84O527L461j485k7515n199M2493J5525l4468j1916J9760K869p458m470j3446
353a6306L580K8060l587l0210R763K9147j1148j8345Q986L502l413O617j0752
366d106k1605J6908K6978j5272j6644J5023Q815m830K646j2810k0103J9932K6729
379B1661k2749k5995J7449J8744k350k043j0152j0869K3236J9238l1527k6567
391c1924K2553J6335j0759k303K165j000J5967O914l0908j1993L2635J0427k6075
404g966o971Q911o98O956O285j6234J63K9391P06l0364l380J1526l272L907P470
419F430j4494l325K5012O25k6726L808K3029j600q060m772j3568L773K4083p372
433F843k7617J5442L1086q005k0087j220M42O737J3801j4656k5140J7929K6431
$$ plain form
339 -984 5543 9004 7519 -19996 -25195 17298 32823 -1645 -13561 6199 9068 1610 -2860 -16306
353 -16306 -12726 15334 11747 -18463 -8700 20447 9299 -9046 -60 3442 29 6646 -4106
366 -4106 -25711 -8803 18175 2903 -13741 1282 10097 5267 7913 -4897 -25000 -5068 21661
379 21661 -1088 -27083 -9634 9110 6760 4717 -5435 -16304 6932 26170 -5357 -31924
391 -31924 -9371 6964 -3795 -6098 -3933 -4933 11034 17948 -12960 -24953 7682 18109 -7966
404 -7966 -14937 -6026 -6724 232 6517 -9717 -9554 19837 20543 -9821 -13201 -1675 -4947 -1040 6430
419 6430 -8064 -11389 13623 14248 -12478 -8670 14359 12759 4699 -73 -13641 -9868 14215 6843
433 6843 -20774 -5332 25754 17749 -2338 -3558 -3116 3621 17422 2766 -22374 -4445 21986
446B1986j6143j8892J1513J0847K869O196j4529k0854J5726J8535k0271j5249
458a8266J7780J0376l327L480q647j3307J6764J6680k2605j6917J8577Q491j2664
471c585l569k017K54K2091J0087k9379j2838K6961M500k4510m141J0252L600P891
485E597j281k1420J308K9747p50k5213K008J3390o244l507o90j3826N134K8344
499A2597k139k4545M010J6352m321n645j804j2287O293K4395q860k9526Q224K5785
513H529q33q956j43m344N877J2838j7330k4705J8720K5874j2110j3682R509M451
527C695j65M792r856j0652J9931J2093k5057j3974J6647Q756j983N038o366p106
541d207J8440R293k7119j3894K1652J0325r086l365n751k805K1082Q994k4988
$$ plain form
446 21986 5843 -13049 -1536 9311 12180 18376 3847 -17007 -1281 17254 -3017 -18266
458 -18266 -486 9890 6563 10043 1396 -11911 4853 21533 -1072 -17989 588 9079 -3585
471 -3585 -7154 -9171 -8917 13174 23261 -6118 -18956 8005 12505 -12005 -16146 -5894 -2294 5597
485 5597 4316 -17104 -15796 13951 13201 -12012 -10004 3386 -2858 -6365 -7055 -20881 -15747 12597
499 12597 10458 -14087 -10077 6275 1954 -3691 -5495 -17782 -11489 12906 4046 -25480 -17256 8529
513 8529 7696 -1260 -1403 -5747 130 12968 -4362 -29067 -10347 15527 3417 -10265 -756 3695
527 3695 3530 8322 -1534 -12186 7745 19838 -5219 -19193 -2546 6210 4227 9265 2899 -4207
541 -4207 14233 23526 -3593 -17487 4165 14490 5404 2039 -3712 -6517 14565 23559 -1429
554a429p060K4782M600j8962o060J002L27J3903L073k0989J366K7935k058k4908
568d478R10J2011j245j26m607j3893P159K2326q828k1876J1444J8420n276n878
582F063l176j2974L475J9050p339k0524J0805J7655n553p004r92n658Q740J6417
596A8985j5479k4477J3844J9283j3311j2051R472Q316N968J946j8125j2234K2187
609D324J3229k3346j1801J5835N977l912K053p048l358J9781Q025k3103r742J5730
623B644K779p448J573m001k829J7895O893k1584l298K1875J502j5985k641J520
637a105J563J1977j835k1453N480K8451k571k1234J256J0611L85R09p279j6193
651a1038R630K4507p073j9934P574J2970m181l79r44j1230M785J5897j2221j9096
$$ plain form
554 -1429 -8489 16293 20893 1931 -4129 -3127 -2800 11103 14176 -6813 -5447 22488 20430 -4478
568 -4478 -3568 8443 7198 7072 2465 -11428 -4269 18057 9229 -12647 -1203 17217 11941 6063
582 6063 2887 -10087 -6612 12438 5099 -15425 -4620 13035 7482 478 -514 -6172 2568 18985
596 18985 3506 -20971 -7127 12156 -1155 -13206 -3734 4582 10550 12496 -5629 -17863 4324
609 4324 17553 -5793 -17594 -1759 4218 306 2359 -4689 -8047 11734 19759 -3344 -13086 2644
623 2644 5423 -2025 -452 -4453 -7282 10613 17506 -4078 -7376 14499 16001 16 -2625 -1105
637 -1105 458 12435 10600 -10853 -5373 23078 20507 -727 529 11140 11525 12434 5155 -11038
651 -11038 -1408 23099 16026 -3908 3666 16636 12455 12076 11132 -98 4687 20584 8363 -10733
665a0733J2302J6105n684l290J934n382M746R667j4908j4948J6809J2904j4779
678D743q845O164K196P394Q728j4922j3902J8200J1985k0963j3113J0964Q182
691F811K572j940j3164j532K3591L719k5770m446J9930p37j2910j69j133l5J3317
706H104K761j6416JJ4934j647q969N08n639j284J5451m54k3854K465K7403R52
721A4316j8867j270P732K230K155q790j3628J1215J8730j2180j5005J2391J0322
734I351n644N94k75j0845N741J3817j2211j6512J2555J4143n141m569j314j975
748b285J1779R427j9042j4166J8004J0875j4860o247O666J213O777Q179j2972
761C348j1109J5548R601j4932p908M676K178M828K863j3382k723K3269M714k4415
$$ plain form
665 -10733 1569 17674 11990 8700 10634 5252 9998 19665 4757 -10191 6618 19522 4743
678 4743 -4102 2062 4258 11652 20380 5458 -8444 9756 21741 778 -12335 -1371 6811
691 6811 9383 7443 -5721 -7253 16338 20057 -5713 -10159 9771 9034 -3876 -4045 -5178 -5213 8104
706 8104 10865 -5551 -5550 9384 7737 -1232 -724 -6363 -7647 7804 7350 -16504 -14039 13364 14316
721 14316 -4551 -5821 1911 4141 6296 -2494 -16122 -4907 13823 1643 -13362 -971 9351
734 9351 3707 4301 4026 -6819 -1078 12739 528 -15984 -3429 10714 5573 1004 -310 -2285
748 -2285 9494 18921 -121 -14287 3717 14592 -268 -6515 151 1364 8141 16320 3348
761 3348 -7761 7787 17388 2456 -5452 -776 1402 6230 9093 -4289 -7012 16257 20971 -3444
775c444n439J7414K567r574l221l835L061J3687l301j7471O232J8391n002j0602
789e37J073l865k606J2322o54j7421L086J7724k847j1743L181L961J438N231r259
804i16j8078Q893J9097q818j4585R796J0548k963k533o527o828J3744J2318j8348
818e200j6502J3358J1704o050j358L07l938Q259Q526j4133j1005J3751O925j0480
832e836k258J599l511P086J0179j0470p210J5106L807j6920l861R331J402R98
846e58j32j1636J422K0970J827k0037n34J4611r22p702l055n992M729J8961j860
861A0092k1708O49J7467J604n586q44m494q1R642n591j5527Q622J7643n662r831
876c605M695Q68k109O381j730j1535O044R173j0793r770R562Q577J343K868r402
$$ plain form
775 -3444 -8883 8531 11098 1524 -1697 -5532 -2471 11216 7915 -9556 -3324 15067 10065 -537
789 -537 536 -3329 -5935 6387 5733 -11688 -8602 9122 6275 -5468 -2287 1674 3112 8343 -916
804 -916 -18994 -10101 8996 178 -14407 -4611 5937 2974 441 -6086 -12914 830 13148 -5200
818 -5200 -21702 -8344 3360 -2690 -4048 -3741 -7679 580 9106 -5027 -16032 -2281 4644 -5836
832 -5836 -8094 -6495 -10006 -2920 7259 -3211 -10421 4685 8492 -8428 -12289 -2958 -1556 -558
846 -558 -690 -12326 -10904 10066 11893 -8144 -8678 5933 5011 -2691 -5746 -11738 -7009 11952 10092
861 10092 -11616 -10967 6500 8104 2518 1674 -2820 -2901 6741 1150 -14377 -5755 11888 6226 -3605
876 -3605 1090 1958 -151 6230 4500 -7035 -991 8182 -2611 -12381 -2819 5758 7101 9969 567
891E67j2224J1650J4795j5018j5055J2277J1351o750n515k007Q13J3743N505j7709
905c577q731J4443K597j1445J700N672m951K659N338q712l556J4714M093j3062
919b818l954K129j184N451K422j2558R9K0135L18k0401q16J5380L072m345o358
934c428j0178K999J6386j637j4491N502J2558m349o341J281l545J823J1456m916
948C120j6948M496J4306m019n910O059K450n14K725r222r250J2841J2151j3649
962a364j0195Q889M745j793M775k153p436Q912P951j4523j1055J0136Q354o76
976D567j779p366m420J5177R384j6258q392J5579L951j3639m114L518J983P801
990E992K475j2351j823J3024j123r365M457M279o908N98K385j0034O79J7094J916
$$ plain form
891 567 -11657 -7 14788 -230 -15285 -3008 8343 1593 -3922 -5929 -5116 8627 14132 -3577
905 -3577 -12308 2135 4732 -6713 -5013 659 -4292 -1633 3705 -5007 -8563 6151 10244 -2818
919 -2818 -6772 -4643 -5827 -376 2046 -10512 -10413 9722 10040 -10361 -11177 4203 7275 2930 -3428
934 -3428 -13606 -10607 5779 4142 -10349 -4847 7711 3362 -2979 -1698 -5243 -3420 8036 3120
948 3120 -13828 -9332 4974 955 -4955 1104 3554 3040 5765 -3457 -12707 134 12285 -1364
962 -1364 -11559 -2670 2075 282 5057 2904 -4532 4380 12331 -2192 -13247 -3111 5243 4567
976 4567 2788 -4578 -8998 6179 15563 -695 -9087 6492 10443 -3196 -7310 -3792 -1809 5992
990 5992 8467 -3884 -5707 7317 6194 -3171 1286 5565 -1343 -745 1640 -8394 -7715 9379 11295
1005A1295j4171j264P431J50k78k664r057M373J4900p308j7832O809J6517k82
1019H619n983k980n458L473J0888p142j4202Q068J1996o748n679L587Q29K680
1033A948P307p147j1804P280Q354r922m532R090J467k830K546m036m561J2239
1047E399O945j5143q551J0264L664m057p8l563r14J3463N287j7872o719J5383
1061C508N684q236m023l370j542J1203L866j2933j088J5018M41j1284M76K911
1075F31k755L609J055r467J476J1862l488r650O842Q014n080j918j245p247L734
1090c627J2537n963j4624O207J2147q72l146l518n153P531J1473j1202j6652Q362
1104f500J4680m787o298J044j49M093O740p600q020R293M725j2207l177R228P22
$$ plain form
1005 11295 -2876 -4140 3291 3441 3163 499 -8558 -4185 10715 3407 -14425 -7616 8901 8619
1019 8619 2636 -344 -5802 -2329 8559 1417 -12785 -4717 7279 531 -5148 -1561 -732 1948
1033 1948 9255 2108 -9696 -2416 5938 -3984 -8516 574 2041 -789 1757 -2279 -6840 5399
1047 5399 12344 -2799 -11350 -1086 2578 -1479 -1557 -5120 -6034 7429 12716 -5156 -11875 3508
1061 3508 9192 956 -3067 -6437 -7979 3224 7090 -5843 -6931 8087 8528 -2756 -2280 631
1075 631 -2124 1485 2540 -6927 -5451 6411 2923 -6727 115 8129 3049 1131 -114 -7361 -3627
1090 -3627 8910 2947 -11677 -5470 6677 5805 2659 -859 -6012 1519 12992 1790 -14862 -6500
1104 -6500 8180 3393 -2905 -1861 -2010 2083 8823 1223 -6797 2496 7221 -4986 -8163 1065 1787
1119A787k518L761l532m073J0311L796j3112l978R963J575m437q27n027o50J5240
1134H279M543j6509n225J3313L376o928k666l126m95R919K435j3376l88J3213
1148F365j82p596K396O89l629L511k47r155L677J2029n154j0770O719Q131k951
1163C833j354l075o399O046J0356r318j2491P965J0494j314j793k674o758O289
1177a93J2055p638j5144N548J0106k797l249p51k190O454Q348q728r490R845N415
1192G591j1414k928P546Q49j742J633l837j376J0997J681j2996j293J0110j292
1206C529n100J54l604L09J2623K158j5171k020J2829K176n804k309m729L42J0999
1221F382K23j3518K98J3976K71o962L62k70o90N935k243j1327L539J1892m335
$$ plain form
1119 1787 -731 3030 -502 -4575 5736 9532 -3580 -7558 2405 3980 -457 -1284 -6311 -6961 8279
1134 8279 12822 -3687 -8912 4401 7777 849 -1817 -4943 -5438 4481 6916 -6460 -6848 6365
1148 6365 6183 -1413 983 1672 -1957 1554 1307 -7848 -4171 7858 2704 -8066 -1347 6784 3833
1163 3833 2479 -596 -6995 -949 9407 89 -12402 -4437 6057 4743 2950 276 -6482 -193
1177 -193 11862 4224 -10920 -5372 4734 1937 -1312 -2063 -4253 2201 10549 1821 -7669 2176 7591
1192 7591 -3823 -6751 795 1644 -98 1535 -2302 -3678 7319 9000 -3996 -5289 4821 3529
1206 3529 -1571 -1417 -5021 -4712 7911 10069 -5102 -7122 5707 7883 2079 -230 -4959 -4617 6382
1221 6382 6605 -6913 -6615 7361 7632 670 1032 762 72 6007 3764 -7563 -4024 7868 3533
1236C533q477O505M669k728N61j644o481N382Q204q358r284P754N809m000N71
1251B016Q00l749N277P457j0269j0915Q827P834m611l363l22j663O943O249j0200
1266C11p504J2179O127j0345n414K904M81L064L430o975k591J1742J862j2813
1280c542j138Q937p13l326M03m744p69R883P78j1384J972J0859j582n576l10l876
1296d128k71R137p16j1906K549J1349j165o509P61o28N20O817k759j1488L345
1311e092J0428n320p203O007M644j453J794l477o507N712P370r496o930R113N599
1326E189n564j966O1j937P843O938j0876q959Q690N170n855j880J29j662Q025
1341C346P076j0450q609R191O694o180k993N13j711M352L256q585k290J2301K331
$$ plain form
1236 3533 -4944 1561 6230 3502 4063 2419 -4062 1320 9524 1166 -8118 -364 5445 1445 2016
1251 2016 2816 -933 4344 11801 1532 -9383 -556 7278 2667 -696 -1018 -2681 4262 10511 311
1266 311 -7193 4986 11113 768 -4646 -1742 -1261 1803 5233 -1742 -4333 7409 9271 -3542
1280 -3542 -4680 4257 3544 218 621 -4123 -4892 4991 5769 -5615 -3643 7216 5634 58 -252 -4128
1296 -4128 -4399 4738 4022 -7884 -5335 6014 4849 -1660 -899 -1527 -1007 5810 3051 -8437 -5092
1311 -5092 5336 16 -7187 -1180 3464 2011 3805 328 -6179 -467 6903 -2593 -9523 -410 5189
1326 5189 -375 -2341 -2280 -4217 3626 10564 -312 -9271 -581 4589 -1266 -3146 -3017 -4679 3346
1341 3346 10422 -28 -8637 554 7248 1068 -1925 -1412 -3123 1229 4485 -4100 -6390 5911 8242
1356H242j0183J49O771k569m452J035k933K381Q528l037j0704M328R852l054m474
1371a20J013k406M11P974m226j2452L383J2677l56n200j81k237J517O731m531
1386A997j0420N234J0248n275o924L511J333r18N337j118p127M319O471q971o824
1401i127P301M081k802R48j989k826P164M730j1116n451J0512L532p242j541K86
1416c540j831N910M447p781l413R340J635o990j403M70k389M626M166q248k148
1431g149J0940J077j0387k14P112J077o97l070p201K265J0376k648j0529N649
1445c399R440l378m585n8k519R37Q326k703r101K327O999k885k360L179j386Q70
1461b96P003m686j0101L702P837m124l371M299N9q80L594l003n106P452N521q789
$$ plain form
1356 8242 -1941 -1792 4979 2410 -2042 -1007 -3940 -1559 6969 3932 -6772 -2444 7408 4354 -120
1371 -120 893 -1513 -1102 6872 2646 -9806 -6423 6254 5898 698 517 -1720 -203 6528 1997
1386 1997 -8423 -3189 7059 1784 -5140 -1629 -296 -1214 4123 3005 -4122 197 6668 -2303 -9127
1401 -9127 -1826 2255 -547 401 -1588 -4414 2750 7480 -3636 -9087 1425 4957 -2285 -3826 -3540
1416 -3540 -5371 539 4986 -2795 -6208 3132 4767 -2223 -3626 -3156 -5545 -919 3247 -5001 -7149
1431 -7149 3791 4868 -5519 -5733 1379 2456 1759 -1311 -8512 -6247 4129 1481 -9048 -3399
1445 -3399 6041 2663 -1922 -1980 -4499 -3562 4764 2061 -7040 -4713 2286 -599 -2959 220 -1166 -296
1461 -296 6707 2021 -8080 -4378 3459 -665 -4036 263 322 -558 3036 33 -5073 2379 7900 -889
1477h89o091O313K747k743J097k867j590Q458M719j0467n190Q538K162m921n29
1492a253p01j564O342K978q918k102R873J118o544J15J148k075L218R62q653J06
1508e950J1496J134q577L15L017j617J671R56o335NQ770k255r343L212P124q54
1524B769q41m19m217J781O440o256q548O970Q441n340m588L028M38O10M281m169
1540C80o043N694L803o709k319L931k21J655M861m796p406P164P479p383o378
1555f288L885K493m15J579m297k847Q619L576r220k092Q446n22n801O66K12j348
1571c354M709J575p443q8Q957J53n910J42j46j261N251o9r100K12J0793m6p538
1588c163J627L809r21J020j723o226K138Q243k684p959L649N043j825M66K51m773
$$ plain form
1477 -889 -6980 -667 2080 -663 434 -2433 -4023 4435 9154 -1313 -6503 2035 4197 -724 -1253
1492 -1253 -1954 -3518 2824 5802 -3116 -5218 4655 5773 -771 -656 492 -1583 1635 2597 -6056 -5950
1508 -5950 5546 6680 -1897 -1582 1435 -182 1489 2445 -3890 -3885 4885 2630 -6713 -3501 3623 2769
1524 2769 1928 1509 -2708 -927 5513 -743 -9291 -2321 6120 780 -3808 -780 -342 268 4549 380
1540 380 -5663 31 3834 -2875 -5194 -1263 -1484 171 5032 236 -7170 -6 7473 90 -6288
1555 -6288 -2403 90 -325 1254 -3043 -5890 2729 6305 -2915 -5007 3439 2917 -2884 -2218 -2006 -3354
1571 -3354 1355 2930 -4513 -4601 4356 4509 -1401 -1259 -1405 -2666 2585 2516 -6584 -6372 4421 4375 -3163
1588 -3163 -1536 2273 1352 2372 649 -5577 -3439 4804 2120 -5839 -2190 2853 1028 1494 1745 -3028
1604c028J722P202m423q193M915N349l462k118J735m51L217L241o556n797Q269
1619A622N272q185l823M344J66L97L769k897l925N456L348o358k135K970j252
1634a231M28L696l958m439Q044M269r291k581Q290J810m288k589k772P75P467
1649C630K55q799J086Q888j846o072K143J494j929L204L80p551l08P980q92l904
1665b241K302J374o80K367j965p682K576R019l265p427L548M011k327M36N57k716
1681b113K649M819o214o395N491M952l609j335J43j450M280M972o452o356O448
1696a70M669n847k221K565j034J372K809m279k716P515K860p201j254M147k170
1711i55j317K141l141r79P560K484q218k007N037L36n55J366l567k199N674L77
$$ plain form
1604 -3028 -1306 5896 1473 -6720 -1805 3544 82 -2036 -301 -752 2465 5706 -850 -6647 1622
1619 1622 6894 -1291 -5114 -770 -604 -207 3562 665 -3260 2196 5544 -814 -2949 21 -1231
1634 -1231 -803 2893 -1065 -5504 2540 6809 -2482 -5063 3227 5037 749 -1840 -4612 -3837 3630
1649 3630 3885 -4914 -3828 5060 3214 -2858 -715 779 -1150 2054 2434 -5117 -5425 2555 1663 -2241
1665 -2241 61 1435 755 3122 1157 -6525 -3949 5070 1805 -5622 -2074 1937 -390 46 603 -2113
1681 -2113 536 5355 -859 -7254 -1763 3189 -420 -1755 -1612 -3062 1218 6190 -262 -6618 -170
1696 -170 4499 -1348 -3569 -1004 -2038 -666 2143 -2136 -4852 2663 5523 -1678 -2932 1215 -955
1711 -955 -2272 -131 -3272 -4251 3309 5793 -2425 -4432 605 941 386 1752 -1815 -4014 1660 2037
1727B037p916J499Q873L14m853o53q57j40M361j524o644L768P336m244o912L573
1743a982L555nK061j537n582J494N606l937m507M253K789j182J564j731n463M350
1759b54P673n132p868L754M514k104k92n12k294L851M297n510l146O469J643o936
1775a847r26L352j040J186L021l901k242O528O05o739m18M917L99l58o00o211
1791d274j241Q787K565o960K69N092j350k956n74k194J130P117n25q217n53N552
1807A668l29p27J805j723m70M123k832q438K692Q778j432m634J201P92o03K493
1823B364j997l953M576M654o407n126M616K324k001K057K67l652K062M561m868
1838e23l741M198R56k488P48m59j695M939L185p117m059P511L444n580k413J782
$$ plain form
1727 2037 -5879 -4380 4493 4807 -46 -699 -1556 -1696 2665 1141 -5503 -1735 5601 1357 -5555 -1982
1743 -1982 1573 1568 3629 2092 -3490 -1996 3610 -327 -4834 -581 2208 1026 2590 859 -4604 -254
1759 -254 7419 2287 -5581 -1827 2687 583 291 -221 -2515 1336 5633 123 -3023 3446 5089 -1847
1775 -1847 -2773 579 -461 725 3746 -155 -2397 4131 4736 -2003 -2421 2496 2895 2537 1937 -4274
1791 -4274 -5515 3272 5837 -1123 -854 4238 2888 -68 -642 -2836 -1706 5411 4886 -3331 -3884 1668
1807 1668 1339 612 2417 694 224 4347 1515 -6923 -4231 4547 3115 -1519 -318 474 -129 2364
1823 2364 367 -3586 990 5644 -763 -5889 -1273 1051 -950 1107 1374 -2278 -216 4345 -523
1838 -523 -4264 -66 890 -1598 -850 -1309 -3004 1935 5120 -1997 -6056 1455 4899 -681 -3094 -1312
1854a312J60J966j6n462N39Q786J359p387j266J505l75J630K676m320k081N445
1870A847K92n339Q25M185K89J59L75m857j585N274k69m879L298N204l143k947
1886a271J332m11N31M473k186o045K336M773l370l523L298K218O56K288m481n318
1902d700N267N733n306m880L581K426j039O40j894k383M500L771n428l369M376
1917A295R87k670Q81j039k596M236M346n419k860M880Q68l460m32j20j020L829
$$ plain form
1854 -1312 -1152 814 798 -4664 -4125 4661 6020 -1367 -2633 -1128 -1503 127 2803 -1517 -3598 1847
1870 1847 2139 -3200 -2375 1810 2099 2258 2633 -2224 -3809 1465 1196 -3683 -385 4819 1676 -1271
1886 -1271 61 -350 181 4654 2468 -3577 -1241 3532 162 -3361 -63 2155 2811 5099 618 -4700
1902 -4700 567 6300 994 -3886 -305 2121 1082 1722 -172 -2555 1945 5716 288 -3081 1295
1917 1295 2282 -388 493 -546 -3142 1094 5440 21 -2839 2041 2909 -551 -983 -1103 -2123 1706
$$ [...]
8191a29
##END NTUPLES=NMR FID
##END=
