##TITLE=1H_TG-2285-2
 CDCl3, 8 sc, 
 23.3.2020
##JCAMPDX= 6.0         $$ Bruker NMR JCAMP-DX V2.0
##DATA TYPE= NMR FID
##DATA CLASS= NTUPLES
##ORIGIN= UXNMR, Bruker Analytische Messtechnik GmbH
##OWNER= root
$$ XWIN-NMR		Version 3.5
$$ Mon Mar 23 14:05:21 2020 Russian Standard Time (UT+4h)  she@DPX200
##.OBSERVE FREQUENCY= 200.1315
##.OBSERVE NUCLEUS= ^1H
##.DELAY= (6, 6)
##.ACQUISITION MODE= SIMULTANEOUS
##.ACQUISITION SCHEME= undefined
##.AVERAGES= 8
##.DIGITISER RES= 18
##SPECTROMETER/DATA SYSTEM= spect
##.PULSE SEQUENCE= zg30
##.SOLVENT NAME= CDCl3
##.SHIFT REFERENCE= (INTERNAL, CDCl3, 0, 15.7039)
##AUDIT TRAIL= $$ (NUMBER, WHEN, WHO, WHERE, WHAT)
$$ ##TITLE= Audit trail, XWIN-NMR		Version 3.5
$$ ##JCAMPDX= 5.01
$$ ##ORIGIN= Bruker BioSpin GmbH
$$ ##OWNER= she
$$ F:/spectra/data/she/nmr/H-F/1/audita.txt
$$ ##AUDIT TRAIL=  $$ (NUMBER, WHEN, WHO, WHERE, WHAT)
(   1,<2020-03-23 14:04:11.71 +0400>,<she>,<DPX200>,
      <created by zg, POWCHK disabled, PULCHK disabled
       configuration hash MD5:
       00 E9 B6 7A A2 85 ED C7 34 08 36 98 17 FE 4E 26
       data hash MD5: 16K
       4E B5 D1 FB C4 7F D5 6C 37 0A 4E 5E 05 02 2E B5>)
$$ ##END=
$$ 
$$ hash MD5
$$ 7A B9 01 D7 CE 9E 27 1B 68 A6 EA 23 33 52 B8 50
##$RELAX= 
##$RELAX= 
##$RELAX= 
##$RELAX= 
##$RELAX= 
##$RELAX= 
$$ Bruker specific parameters
$$ --------------------------
##$DU= <F:/spectra>
##$EXPNO= 1
##$NAME= <H-F>
##$PROCNO= 1
##$TYPE= <nmr>
##$USER= <she>
##$AMP= (0..31)
100 100 100 100 100 100 100 100 100 100 100 100 100 100 100 100 100 100 
100 100 100 100 100 100 100 100 100 100 100 100 100 100 
##$AQSEQ= 0
##$AQ_mod= 1
##$AUNM= <au_zg>
##$AUTOPOS= <>
##$BF1= 200.13
##$BF2= 200.13
##$BF3= 200.13
##$BF4= 200.13
##$BF5= 200.13
##$BF6= 200.13
##$BF7= 200.13
##$BF8= 200.13
##$BYTORDA= 1
##$CFDGTYP= 0
##$CFRGTYP= 5
##$CHEMSTR= <none>
##$CNST= (0..31)
1 1 145 1 1 1 1 1 1 1 1 1 1 1 1 1 1 1 1 1 1 1 1 1 1 1 1 1 1 1 1 1 
##$CPDPRG= <>
##$CPDPRG1= <>
##$CPDPRG2= <>
##$CPDPRG3= <>
##$CPDPRG4= <mlev>
##$CPDPRG5= <mlev>
##$CPDPRG6= <mlev>
##$CPDPRG7= <mlev>
##$CPDPRG8= <mlev>
##$CPDPRGB= <>
##$CPDPRGT= <>
##$D= (0..31)
0 1.2 0 0 0 0 0 0 0 0.06 0 0.03 0 0 0 0 0.0002 0 0 0 0 0 0 0 0 0 0 0 0 
0 0 0 
##$DATE= 1584957850
##$DBL= (0..7)
120 120 120 120 120 120 120 120 
##$DBP= (0..7)
150 150 150 150 150 150 150 150 
##$DBP07= 0
##$DBPNAM0= <>
##$DBPNAM1= <>
##$DBPNAM2= <>
##$DBPNAM3= <>
##$DBPNAM4= <>
##$DBPNAM5= <>
##$DBPNAM6= <>
##$DBPNAM7= <>
##$DBPOAL= (0..7)
0.5 0.5 0.5 0.5 0.5 0.5 0.5 0.5 
##$DBPOFFS= (0..7)
0 0 0 0 0 0 0 0 
##$DE= 6
##$DECBNUC= <off>
##$DECIM= 24
##$DECNUC= <off>
##$DECSTAT= 4
##$DIGMOD= 1
##$DIGTYP= 9
##$DL= (0..7)
0 120 120 120 120 120 120 120 
##$DP= (0..7)
150 150 150 150 150 150 150 150 
##$DP07= 0
##$DPNAME0= <>
##$DPNAME1= <>
##$DPNAME2= <>
##$DPNAME3= <>
##$DPNAME4= <>
##$DPNAME5= <>
##$DPNAME6= <>
##$DPNAME7= <>
##$DPOAL= (0..7)
0.5 0.5 0.5 0.5 0.5 0.5 0.5 0.5 
##$DPOFFS= (0..7)
0 0 0 0 0 0 0 0 
##$DQDMODE= 0
##$DR= 18
##$DS= 0
##$DSLIST= <SSSSSSSSSSSSSSS>
$$ [...]
##$SUBNAM2= <"">
##$SUBNAM3= <"">
##$SUBNAM4= <"">
##$SUBNAM5= <"">
##$SUBNAM6= <"">
##$SUBNAM7= <"">
##$SUBNAM8= <"">
##$SUBNAM9= <"">
##$SW= 24.9337058887773
##$SWIBOX= (0..15)
0 0 2 0 0 0 0 0 0 0 0 0 0 0 0 0 
##$SW_h= 4990.01996007984
##$TD= 16384
##$TD0= 1
##$TE= 0
##$TE2= 300
##$TE3= 300
##$TEG= 300
##$TL= (0..7)
0 120 120 120 120 120 120 120 
##$TP= (0..7)
150 150 150 150 150 150 150 150 
##$TP07= 0
##$TPNAME0= <>
##$TPNAME1= <>
##$TPNAME2= <>
##$TPNAME3= <>
##$TPNAME4= <>
##$TPNAME5= <>
##$TPNAME6= <>
##$TPNAME7= <>
##$TPOAL= (0..7)
0.5 0.5 0.5 0.5 0.5 0.5 0.5 0.5 
##$TPOFFS= (0..7)
0 0 0 0 0 0 0 0 
##$TUNHIN= 0
##$TUNHOUT= 0
##$TUNXOUT= 0
##$USERA1= <user>
##$USERA2= <user>
##$USERA3= <user>
##$USERA4= <user>
##$USERA5= <user>
##$V9= 5
##$VALIST= <valist>
##$VCLIST= <CCCCCCCCCCCCCCC>
##$VD= 0
##$VDLIST= <DDDDDDDDDDDDDDD>
##$VPLIST= <PPPPPPPPPPPPPPP>
##$VTLIST= <TTTTTTTTTTTTTTT>
##$WBST= 1024
##$WBSW= 4
##$XGAIN= (0..3)
0 0 0 0 
##$XL= 0
##$YL= 0
##$YMAX_a= 657747
##$YMIN_a= -289110
##$ZGOPTNS= <>
##$ZL1= 120
##$ZL2= 120
##$ZL3= 120
##$ZL4= 120
##$ABSF1= 10
##$ABSF2= 0
##$ABSG= 5
##$ABSL= 3
##$ALPHA= 0
##$AQORDER= 0
##$ASSFAC= 0
##$ASSFACI= 0
##$ASSFACX= 0
##$ASSWID= 0
##$AUNMP= <proc_1d>
##$AZFE= 0.1
##$AZFW= 0.1
##$BCFW= 1
##$BC_mod= 2
##$BYTORDP= 1
##$COROFFS= 0
##$CY= 11.3945322036743
##$DATMOD= 1
##$DC= 2
##$DFILT= <>
##$DTYPP= 0
##$F1P= 16.9975609425685
##$F2P= -3.02152046262296
##$FCOR= 0.5
##$FTSIZE= 0
##$FT_mod= 4
##$GAMMA= 1
##$GB= 0.15
##$INTBC= 1
##$INTSCL= 1
##$ISEN= 128
##$LB= 0.24
##$LEV0= 0
##$LPBIN= 0
##$MAXI= 10000
##$MC2= 0
##$MEAN= 0
##$ME_mod= 0
##$MI= 1.114404
##$NCOEF= 0
##$NC_proc= 0
##$NLEV= 6
##$NOISF1= 3.799351
##$NOISF2= 2.8
##$NSP= 1
##$NTH_PI= 0
##$NZP= 0
##$OFFSET= 15.70392
##$PC= 1
##$PHC0= -9786.415
##$PHC1= 14.00082
##$PH_mod= 1
##$PKNL= yes
##$PPARMOD= 0
##$PSCAL= 0
##$PSIGN= 0
##$REVERSE= no
##$SF= 200.130013532006
##$SI= 16384
##$SIGF1= 3
##$SIGF2= 2
##$SINO= 400
##$SIOLD= 16384
##$SREGLST= <1H.CDCl3>
##$SSB= 0
##$STSI= 0
##$STSR= 0
##$SW_p= 3612.71676300578
##$SYMM= 0
##$S_DEV= 0
##$TDeff= 0
##$TDoff= 0
##$TI= <>
##$TILT= no
##$TM1= 0
##$TM2= 0
##$TOPLEV= 0
##$USERP1= <user>
##$USERP2= <user>
##$USERP3= <user>
##$USERP4= <user>
##$USERP5= <user>
##$WDW= 1
##$XDIM= 8192
##$YMAX_p= 0
##$YMIN_p= 0
$$ End of Bruker specific parameters
$$ ---------------------------------
##NTUPLES= NMR FID
##VAR_NAME=  TIME,          FID/REAL,        FID/IMAG
##SYMBOL=    X,             R,               I
##VAR_TYPE=  INDEPENDENT,   DEPENDENT,       DEPENDENT
##VAR_FORM=  AFFN,          ASDF,            ASDF
##VAR_DIM=   8192,          8192,            8192
##UNITS=     SECONDS,       ARBITRARY UNITS, ARBITRARY UNITS
##FACTOR=    0.0002004,     1,               1
##FIRST=     0,             0,               0
##LAST=      1.6414764,     0,               0
##MIN=       0,             -289110,         0
##MAX=       1.6414764,     657747,          0
$$ Real data points
##PAGE= N=1
##DATA TABLE= (X++(R..R)), XYDATA
0@%%%%qJ6j6J6k1K9l2M0n5O4p6R6j17J37j62J94k28K66l09L58m15M78n45O19p03
29c74P98r00J013j139J275j423J589j771J967k185K426k689K976l295L649m041
45b124M480m972N527o161O895p749Q759r982J1494j3422J5982j9563K4971l4203
59b0068N4183j73393J81366K67696l38890k60004K4445K10283L7397j00620j08425
70b26030N8400J03625J3853j02882o3941L6812J39275R2538n3384j15422K6207
81i0949O7439q0186j26127P3277J79028L2355j25214o8030Q7657J27176k1210
92E5216j23340r027J25358J9876j40996p8072R6735J32999L0799q6057r7324N2209
104b1624J96393Q1620j80349k31947l743K11752J56563q1350j72915K0418J80722
$$ plain form
0 0 0 0 0 0 -8 8 -8 8 -13 16 -16 24 -31 33 -43 53 -64 73 -89 105 -123 143 -166 192 -223 255 -290 329 -374
29 -374 424 -476 537 -602 673 -750 839 -932 1035 -1150 1276 -1413 1563 -1732 1917 -2124
45 -2124 2356 -2616 2911 -3250 3645 -4104 4655 -5327 6167 -7255 8727 -10836 14135 -20068
59 -20068 34115 -139278 42088 309784 -29106 -289110 -264665 -54382 -16985 -117605 -226030
70 -226030 -167630 -64005 -50152 -153034 -216975 -180163 -40888 51650 -1734 -117156 -90949
81 -90949 -23510 -103696 -229823 -156546 22482 54837 -70377 -138407 -50750 76426 55216
92 55216 -68124 -77151 48207 68083 -72913 -150985 -54250 78749 109548 23491 -73833 -21624
104 -21624 174769 256389 76040 -155907 -159650 52102 208665 127315 -45600 -25182 155540
115A55540L4791j50097n6883J27017R6943o5031j30302n8318O3075R4734m682
126A06787o3965M2392J32896J8910j55295j57746K4009J91038J22575j21203k05912
137f5514o234J56751O7144o3147l1421O5402O1173n4277j48474o9747J09296J17121
149A38073n4077j12916J9819J08828L5905p0683q1482J7404J01484K2093j22577
160A871r7709N7882R0862j3673o3101K317Q3685O3588o5032j31799l071J36300
172F2120M3847j42195j33704N7669J83711R4017j18694j86161J5302K04928R5306
183A76146j36017j53868J1587R9662L4993o6896n9820O4547J27922J7621j07698
194H179p2266L6462O5128Q801n9450n0201M4496P7463l0319r0341K8463J25351
$$ plain form
115 155540 190331 40234 -16649 110368 207311 142280 11978 -46340 16735 111469 106787
126 106787 42822 85214 218110 237020 81725 -76021 -52012 139026 261601 140398 -65514
137 -65514 -71748 85003 152147 89000 57579 122981 184154 129877 -18597 -88344 20952 138073
149 138073 83996 -28920 -9101 99727 135632 64949 -16533 871 102355 124448 1871
160 1871 -95838 -37956 52906 39233 -23868 -21551 62134 125722 60690 -71109 -74180 62120
172 62120 105967 -36228 -169932 -112263 71448 165465 46771 -139390 -124088 80840 176146
183 176146 40129 -113739 -102152 -2490 32503 -34393 -94213 -29666 98256 115877 8179
194 8179 -64087 -27625 37503 46304 -13146 -63347 -18851 58612 28293 -62048 -33585 91766
206I1766M2588p6431o8151Q605L4732j8930o0279J4289J15118N2332j02456r9424
218f6241O0405J38321M6978r7879j40490j2426J40441Q9651j08651j45557M0767
229e4681J78449R0741r9817j51855N202J48315M9435j36690j04781P4023J08465
240A06806j3826p9045j8586O7932P6863j9355r7367l7737O2307M4603m7630o9568
252b4603o038O5589O3628k4700o8049J9421Q1296j6679j09361k8351Q3772N1184
264H7109o5231r7201M520J21699Q5913p2190j17960J2798J04380L1537q1060r7279
276h2965j0783R0718P3163n2470q6900K9579J00226J3119q0906n0761L9893O1592
288D3505l0256j10342k9275J17133R5461o3235j03184J4073J00743N0603o6066
$$ plain form
206 91766 134354 57923 -10228 -1623 33109 14179 -46100 -31811 83307 135639 33183 -66241
218 -66241 -5836 132485 179463 81584 -58906 -71332 69109 158760 50109 -95448 -54681
229 -54681 123768 214509 114692 -37163 -31961 116354 165789 29099 -75682 -1659 106806
240 106806 92980 13935 -4651 63281 140144 120789 23422 -14315 47992 92595 44965 -24603
252 -24603 -30641 34948 98576 73876 5827 25248 106544 89865 -19496 -47847 35925 87109
264 87109 21878 -75323 -70803 50896 136809 64619 -53341 -40543 63837 95374 14314 -82965
276 -82965 -93748 -3030 70133 17663 -69237 -39658 60568 73687 -7219 -57980 -18087 43505
288 43505 13249 -97093 -126368 -9235 86226 22991 -80193 -66120 34623 85226 19160
299A9160j09541j4368J03138N5935q3615q9737M1574J11468M1760o2006p5189
310f1421J9943Q6182j597j08426n1594Q0688Q0994k4253p3026j9328O4898P5178
322F8238j6601p8288j1303N5838k090p2854k8289N8901O9508j603o5337k8347
334e2227P5546P3888n8512j12440K271J02215M7936p3171j08068k629J32332J05688
346A32829o0968j25086k3J03021L9344p9490r4460J0042J03283N0506p6788p3427
358g1217N5642R4851k365p2002l5714L1291M5284j4680p5225l0458O6560O2580
370E4547k2594m3222J7386M9553R461n6980o5697K0783Q3746P116r0349l9207
382g5457P5692P1415k4711o7580q485P4661O0045o1573j23280k0044R5574O6517
$$ plain form
299 19160 -90381 -104749 -1611 54324 -29291 -119028 -77454 34014 75774 13768 -61421
310 -61421 -41478 44704 43107 -65319 -116913 -36225 44769 20516 -52510 -71838 -6940 68238
322 68238 51637 -26651 -37954 17884 15794 -57060 -85349 -26448 43060 41457 -23880 -52227
334 -52227 23319 97207 38695 -73745 -71474 30741 78677 5506 -102562 -105191 27141 132829
346 132829 71861 -53225 -53248 49773 89117 9627 -84833 -74791 28492 78998 2210 -71217
358 -71217 -15575 79276 76911 4909 -30805 486 45770 31090 -44135 -74593 -8033 54547
370 54547 31953 -11269 6117 55670 65131 8151 -57546 -36763 46983 54099 -36250 -75457
382 -75457 235 71650 46939 -20641 -29126 45535 105580 44007 -79273 -99317 -3743 62774
394F2774l2510n8637J869O6760M3548n7352q4425K7434J01096Q082j03063o9287
406i3711M3717Q6005K0776n9075l1170O7986O6954n3069j04626j4338O9869M9072
418D8390k6151o3617j2093O7752N2163m6701o0303L4228P2796l965q0255n9615
430g7371K5924P0984P974o6172j5573Q3060N7456n3682p8908m669N5717L6191
442D0931l8678o9814J768P4904K7034o2319m1492N2477P9157P643q0527p6941
454h5857K1809P6419l990p7356j0712Q1972N5862l8892p2624j4014O4863N8007
466E5487l9334q5375r578O0825K1218m4350l3974L5797Q1205L1607p2195q1733
478h0400K5301P5461p033p1595j9756N5288N3295j7216o2913j3001P4136N8967
$$ plain form
394 62774 30264 -28373 -26504 40256 83804 26452 -57973 -30539 70557 78639 -24424 -93711
406 -93711 -49994 36011 56787 -2288 -33458 34528 101482 48413 -56213 -70551 -682 48390
418 48390 22239 -41378 -53471 14281 66444 19743 -40560 -6332 66464 62499 -17756 -77371
430 -77371 -51447 19537 27511 -38661 -54234 28826 86282 32600 -46308 -50977 4740 40931
442 40931 2253 -67561 -65793 9111 36145 -26174 -67666 -15189 63968 71611 -8916 -85857
454 -85857 -64048 12371 8381 -68975 -79687 2285 58147 19255 -53369 -67383 -2520 55487
466 55487 16153 -69222 -78800 -17975 3243 -41107 -75081 -39284 41921 73528 1333 -80400
478 -80400 -55099 20362 13329 -58266 -78022 -22734 30561 13345 -49568 -62569 11567 70534
490G0534m2285o9908j147M1129P256l9348l4879L1880Q5138K9232p0139n6379
502d8916M3386O1985j8540o6892k1125N3620N4326l4474q4263L518J04452O0574
514A07651n1261o9414R45M7329J6216n2493n9319K9645R3259K3635p1394m9431
526c4632L9567O6112P514n7658m5874L2342N1005l1574p4461L446P9357M4298
538G9442l0113m7465o46M4843J7087n8574n9468L0959O9190n31n9029k9977L8235
551f047O1042N088o1395l6142N1010M7669m7879q3071q197O5017N4275j3616n5485
564b7731q551O0369K8543o0778o0824K5939O1683P189n8008n3084K4050P5241
576A4038K1406n3921k3561N1077L2182m6460o8389r026N6675N2752k2154o4582
$$ plain form
490 70534 28249 -41659 -42806 -1677 5579 -33769 -68648 -36768 48370 77602 7463 -48916
502 -48916 -5530 56455 37915 -28977 -50102 3518 57844 23370 -60893 -57375 47077 107651
514 107651 56390 -13024 -12079 35250 51466 -1027 -60346 -30701 62558 86193 14799 -34632
526 -34632 4935 71047 78561 20903 -24971 7371 58376 26802 -47659 -44213 35144 79442
538 79442 49329 1864 1218 46061 63148 4574 -54894 -23935 45255 44724 -14305 -44282 -6047
551 -6047 54995 60083 -1312 -37454 13556 61225 13346 -69725 -77922 -12905 41370 27754 -27731
564 -27731 -36282 24087 52630 -8148 -68972 -43033 18650 25839 -32169 -85253 -61203 14038
576 14038 35444 -18477 -42038 9039 41221 -5239 -73628 -82654 -25979 26773 4619 -59963
588e9963P29O9898L1720m4526m2495K0405N1283O944o4898n9737L8391Q6058P539
601D1348o3446j5584N8068M4086k8040o1880j4699N4513M1174m2343o0588K1169
613b6222P0620K6195l5642l8594J4335N7882K1664o1580o1090K9742O4933k011
625F0232n2423j2221N4220N8228j3703p1324k4131N7940M1697m1546n3886P742
637A0825M2459J8833k1705k9039J8709N9360J4715n9971n0314J8885M2401J337
649F6495m0742k5673L6286N5766j4080o7019n951O9148L4586n2040o6777n492
661a5493M8146L1041l5874m7516K4596O8018R032n8389l9308K1316M4277K713
673E2559n6612m8383L1636O3103o243n6584q392N2115L6203k9796o1595j4691
$$ plain form
588 -59963 -59234 10664 42384 -2142 -44637 -24232 27051 33995 -30903 -90640 -52249 33809 41348
601 41348 -22098 -37682 20386 64472 36432 -25448 -40147 14366 55540 13197 -47391 -26222
613 -26222 44398 70593 34951 -3643 10692 68574 90238 28658 -32432 -2690 62243 60232
625 60232 7809 -4412 49808 108036 94333 23009 -1122 56818 98515 56969 3083 10825
637 10825 53284 72117 50412 21373 40082 99442 114157 54186 3872 22757 65158 66495
649 66495 25753 80 36366 92132 78052 11033 5082 74230 108816 56776 -10001 -15493
661 -15493 32653 63694 27820 -19696 4900 72918 81950 23561 -15747 5569 49846 52559
673 52559 -4053 -52436 -20800 42303 36060 -20524 -28916 23199 59402 29606 -31989 -46680
685d6680N0100L0092n0368n3994K8412O3358Q083m2596k4791K5974M3094p342
697B3342o1648l0359M2196M0753k2544m3491P37M6876L9908j6106n2829p991N2885
710A1729K0722n3918m7651K4489N6975J4734l9961l3165L4605O3781m386o5720
722a7766k3572M4264L2753k5147m4130p187M5702M8091j2915m8067j034M8232
734C9224K1347l3686m4500k877M2475K8909l5841m6363K9909P0662O386n4144
746B1501k4823L1760K9970k1381n0257r505N0953L3368l4625l9463K0016M7324
758E4838J3058k8692l9221l697L6777J3568m8732m1940L6657O5305L351n5972
770E300l5396L5817N7391j2500p2628k2523N3497K6411m6660m1450K6597N5186
$$ plain form
685 -46680 3420 33512 -16856 -70850 -42438 20920 29003 -13593 -38384 -12410 30684 23342
697 23342 -38306 -68665 -26469 14284 -8260 -51751 -51014 -4138 35770 19664 -33165 -41156 11729
710 11729 32451 -21467 -69118 -44629 12346 27080 -12881 -46046 -11441 52340 47954 -17766
722 -17766 -41338 2926 35679 10532 -33598 -40785 4917 53008 40093 -7974 -9008 39224
734 39224 60571 26885 -17615 -20492 21983 50892 15051 -31312 -1403 69259 75645 21501
746 21501 -3322 28438 58408 37027 -13230 -22735 28218 61586 26961 -12502 7514 54838
758 54838 67896 39204 -17 -3714 33063 46631 -2101 -44041 -7384 57921 61272 5300
770 5300 -30096 5721 63112 50612 -22016 -44539 8958 35369 -11291 -52741 -26144 29042
782B9042J7636l4963m3591M856L9542N130m1816l0540J6278L4385P518l3891l0097
795f0511L6310O4115j0543p6278k7062M8902L3562l3246m6494N581N0674K3451
807H461l5813l2777K8106M3610o512m0529k6676N379K6363J7681k1828k6852K2858
820c8529M3011m947l9882n115M0199K6883l5427o3911k936O7168L6392m3814l7709
833e8617L5243M9455o666m5623k3026K7651M5987l488n9979l6330L6665O0014
845B1286J4767l2889k8470J8611M1222j0847n8923j2517N6742L3621m0659m6820
857d4876J2356M9471K5979k1466k6179J3917K4855k1961m5536m72M3109K6603
869C5800j7722l7560r269M3142M3432k0137n1670m201L9092R676l9862l7649J7686
$$ plain form
782 29042 46678 11715 -31876 -27020 12522 17652 -24164 -54704 -38426 -4041 3477 -30414 -60511
795 -60511 -24201 39914 29371 -46907 -73969 -25067 8495 -24751 -71245 -65664 -14990 8461
807 8461 -27352 -60129 -32023 11587 5075 -35454 -62130 -56751 -30388 -12707 -34535 -61387 -38529
820 -38529 4482 -465 -40347 -45462 -5263 21620 -13807 -77718 -80654 -13486 22906 -20908 -58617
833 -58617 -23374 26081 19415 -26208 -49234 -21583 24404 20916 -39063 -75393 -38728 21286
845 21286 36053 3164 -25306 -6695 34527 23680 -35243 -47760 8982 42603 1944 -44876
857 -44876 -32520 16951 42930 21464 -4715 9202 34057 12096 -33440 -33912 9197 35800
869 35800 18078 -19482 -28751 14391 57823 37686 -13984 -18185 20907 30583 -9279 -46928 -29242
882b9242O0907K5823m8897m9851K6796N8871L731m7467l1951J1905K7601k125
894F101l1580o477M3711L3033k6436m0474j005K9828J8545j6283l5486q426K9082
907e867J1601k9264j2507L9185M2157j0632n1990l5373K6412N2089l456n6850
919c4495k1185M2940L2920k1504l0338J1540M3917K1075l9100n7146j967M6848
931f495K3184k1334k3969M801K4986J4654j8125k1811K2133L7809j7974n8758
943d0899j6924M1935L7089j0706l4372p14M0770J8938l8413l2545K9978M1383
955C5520j3386n1239k7503K5276N1100J9285l2906l1154K0773L5643p176l8806
967a4573j7269K6145L3592j2314n2654j2524N6549M4616k3204l9100L291K3201
$$ plain form
882 -29242 31665 57488 8591 -41260 -14464 44407 48138 671 -31280 -19375 8226 6101
894 6101 -25479 -31956 11755 44788 18352 -22122 -23127 6701 25246 8963 -26523 -34949 -5867
907 -5867 5734 -23530 -36037 3148 45305 34673 -17317 -52690 -26278 25811 22355 -34495
919 -34495 -55680 -12740 20180 -1324 -31662 -20122 23795 44870 5770 -51376 -53343 -6495
931 -6495 16689 -4645 -28614 -23813 1173 15827 -2298 -24109 -1976 35833 17859 -40899
943 -40899 -57823 -15888 21201 10495 -23877 -24591 16179 35117 -3296 -35841 -5863 35520
955 35520 22134 -29105 -56608 -31332 19768 39053 6147 -25007 -4234 31409 24233 -14573
967 -14573 -31842 -5697 27895 15581 -37073 -49597 6952 51568 28364 -10736 -7445 15756
979A5756m58k5288j6209J9389K9066q690l5982m299L5408K7131n218k5513j8258
992a3165J1073K1221j5381l8795N673N1485K1341l9149l9471J5839N5177K2951
1004E8799m4709n2132J2618M3158j532l5799q275L1314L1149k823l4339k2890
1016b5461K4556L7093p483m1360j8191J7577K1818k398j7779M490L5621J3824
1028D2307m0083l4521K4911L7693j0320l9608j3468K6289K9482r973l3878L930
1040a7239M6928K1161l8146m6771j404L7123K8831j8507m6310m313M9714K9476
1052D0543k9035l3077J1908L3219M807l6284l4788J4668M1967M427l2581q394
1064b2620K5609J6605j0866j5637j7J5595L693k8800k7151J9868M0224L335l1094
$$ plain form
979 15756 15298 -9990 -26199 -6810 22256 13566 -22416 -26715 8693 35824 30606 5093 -13165
992 -13165 -2092 19129 3748 -35047 -29374 22111 43452 4303 -35168 -19329 35848 58799
1004 58799 14090 -38042 -25424 17734 16202 -19597 -27872 3442 34591 31768 -2571 -25461
1016 -25461 -905 36188 28705 -12655 -30846 -13269 8549 6151 -11628 -7138 28483 42307
1028 42307 2224 -32297 -7386 30307 19987 -19621 -33089 -6800 22682 12709 -21169 -17239
1040 -17239 29689 50850 12704 -34067 -35471 1652 30483 11976 -34334 -38647 11067 40543
1052 40543 11508 -21569 -9661 23558 28365 -7919 -42707 -28039 13928 18355 -14226 -22620
1064 -22620 2989 19594 8728 -6909 -6926 8669 12362 -16438 -43589 -23721 16503 19838 -11256
1077a1256j5187K1746L2169p93m1600k7064L1384L9725j9248n2066q927M5405
1089e712M4497p016m6451k1135L4633L3479k2383m0960k078K9489J6233j3185
1101e89k2991L600L3258J7189k2968k3170J0713J5131j0805k0693k714K2616K2387
1114B0964j2522l2171O331M4990J5975l8198l5305J2000L4993Q184l4379l1602
1126d0740K3325N2404P078m1627k3372K3870L2780r84l5835k8977J7135L8259
1138B3316j163l2575n483L1563K0487j2989k4315l517K0855R156k6734k3731K0507
1151d623L1268p250k7535m70K8196K2826j3430m0141j3814L3976K7418k5013m0025
1164b8617K117M0054K8240j5654l9237n507M0459K2795l3712m0563N749L1646
$$ plain form
1077 -11256 -26443 -4697 27472 26679 -14921 -41985 -10601 29124 9876 -42190 -51117 -5712
1089 -5712 38785 31769 -14682 -35817 -1184 32295 9912 -31048 -33126 -3637 12596 -589
1101 -589 -23580 -19980 13278 30467 7499 -15671 -4958 10173 -632 -21325 -24039 -1423 20964
1114 20964 8442 -23729 -17398 27592 43567 5369 -29936 -17936 17057 25241 -9138 -40740
1126 -40740 -17415 34989 42067 440 -22932 938 33718 32734 -3101 -32078 -14943 23316
1138 23316 22153 -10422 -15905 15658 36145 23156 -1159 -4676 16179 25335 -1399 -25130 -4623
1151 -4623 26645 19395 -8140 -8610 19586 42412 28982 -11159 -24973 9003 36421 11408 -28617
1164 -28617 -26500 13554 41794 26140 -13097 -18604 21855 44650 10938 -29625 -23876 7770
1176G770J2245j6905k0052P718K9954P694k5512j5227J5640J1021j4215j9572
1188a9441j837J7688J5773j0663k0340J1903L2892r75l7189j8413K0508K7002
1200A6908n679l6753k1216L1283M4138n951m1627j0639L2360K5913j5990m2722
1212b9975j7622L3191L7206j4730m0720q69L5641K1222j4564k4206k816K0945
1224B703Q148k6358k2594J7746K7022j974j6846o38J4871J3012q653k4635k593
1237b0789K5783R204k9206k2798J8553L2511P541k2132j9950J6057L3900l563
1249B5111m3805j9409K7978K8902p676k8406j0102K6701L3948o605l8223j0725
1261b2311K8900J9077j7583k8252n853K2771K1660j0302k1996J0046L0267Q44
$$ plain form
1176 7770 20015 3110 -16942 -9224 20730 28424 2912 -12315 3325 14346 131 -19441
1188 -19441 -21278 -3590 12183 1520 -18820 -6917 25975 25000 -12189 -30602 -10094 16908
1200 16908 11229 -25524 -46740 -15457 28681 22730 -18897 -29536 2824 28737 12747 -29975
1212 -29975 -47597 -14406 22800 8070 -32650 -33519 2122 23344 8780 -15426 -18242 2703
1224 2703 10851 -15507 -38101 -20355 6667 4693 -12153 -12791 2080 15092 6439 -18196 -20789
1237 -20789 4994 14198 -15008 -37806 -19253 13258 20799 -1333 -21283 -5226 28674 25111
1249 25111 -18694 -38103 -10125 18777 11101 -17305 -27407 -706 33242 26637 -11586 -22311
1261 -22311 6589 25666 8083 -20169 -26022 -3251 18409 8107 -13889 -3843 26424 27268
1273B7268k9218j6188J1484J7215j417k1242r832K1987K2941j4210k5631P283
1285i560L0048J0126k3507l2436m070K9173J8879k3267k4942J8756L4438J620
1297B5258k9451k0991J1990K9004K636l4429k1270K0684K4340p598j8378K805
1309a5400K0985J3865j4030k8473l162K4575M778k5853j2405K1811K4338m737
1321F292k5152j2244K3511L0646j1511m1277j1727K8571K0624j5825k8040j564
1333c7696L5351L1767j6901m2592n885L1888J6162j9458k4193L0K3279J5012j5167
1346h403j9469J2112K6838J547j8816r592L388M335m653j0545K175K3679J3207
1359A5803j8960j8756J3546K4900p34k4768j8883J3348L0378p91l7343j7053L4455
$$ plain form
1273 27268 -1950 -18138 -6654 10561 9144 -12098 -21930 57 22998 8788 -16843 -9560
1285 -9560 20488 30614 7107 -25329 -29399 -226 18653 -4614 -29556 -10800 23638 25258
1297 25258 -4193 -25184 -13194 15810 18446 -15983 -37253 -16569 7771 173 -18205 -15400
1309 -15400 5585 19450 5420 -23053 -26215 -1640 3138 -22715 -35120 -13309 11029 6292
1321 6292 -18860 -31104 -7593 23053 11542 -29735 -41462 -12891 7733 -8092 -36132 -37696
1333 -37696 -2345 29422 12521 -30071 -35956 -4068 12094 -7364 -31557 -31527 -8248 6764 -8403
1346 -8403 -27872 -15760 11078 12625 -6191 -15783 -12395 -8060 -12713 -23258 -21083 2596 15803
1359 15803 -3157 -21913 -8367 16533 15799 -8969 -27852 -14504 15874 15083 -22260 -39313 -4858
1372d858L8837n443l2568j5342J8205K4490q311l6493j0279L2785K7425j1679
1384A6769k6826n028K1196K1546o648k6181k787K1744K142k6204j2947J8974K4150
1397A9900L130j6142j0346J3642J4170j6437k6019P659K8419N608k4249k1185
1409b1850O330L0282J8309j7554k5599Q411K3134m241k7805j5203J4380K7171
1421A5765O579k4698j6255K0541K4376j1280k5715j009J8258P994j4924k3113
1433b3481J480K7976J3921j8404j5547J4125J8630l046k2337j7943P141K4446
1445F961N430k3921j1630K1521K0102r434k2333l603K2020J9606j6029l6602m953
1458c2865K9089J6318j4023j0983J0626J6404O79j9788j6753J1107K2596j812
$$ plain form
1372 -4858 33979 28536 -4032 -19374 -1169 23321 15010 -21483 -31762 1023 28448 16769
1384 16769 -10057 -15085 6111 27657 21009 -5172 -7959 13785 15927 -10277 -23224 -4250 19900
1397 19900 23030 6888 -3458 10184 24354 7917 -18102 -10443 17976 23584 -665 -21850
1409 -21850 -15520 14762 33071 15517 -10082 -1671 21463 17222 -10583 -25786 -11406 15765
1421 15765 22344 -2354 -18609 1932 26308 15028 -10687 -11696 6562 14556 -368 -23481
1433 -23481 -22001 5975 19896 1492 -14055 70 18700 15654 -6683 -24626 -17485 6961
1445 6961 12391 -11530 -23160 -1639 18463 9029 -13304 -16907 5113 24719 8690 -27912 -32865
1458 -32865 -3776 12542 -1481 -12464 -1838 14566 15245 -4543 -21296 -10189 12407 10595
1470A0595k2368q241J3524J2918j213j1178j553K1716J6271k2983l4610K877L1269
1483G024J1436j8478j7404Q898K5102N961k3738j3511K0627K0350j3071k5917
1495a2721n514J4952J6526j203j8500n481K4256J9200j4527k5886l144J8946J2810
1508A9714j3291k4206K810L0130J0920k3526j4318J7014J8254o144j8084p355
1520h082Q842R896q808j6604N936K3804J0408j2456j6478l334J2817J2393j0840
1533G494k2798L632K4426K145k3810r942K1152K5097l161k7933j5358J8963J9691
1546A9598j5917k5866M422K5204J1443j1617j8191l641K0991J8220j2725k6506
1558a4585k805J6069P164j0050j2073P289K2210N169k2964j2766K0627J6510j7767
$$ plain form
1470 10595 -11773 -20014 -6490 6428 5215 -5963 -7516 14200 30471 7488 -27122 -24245 7024
1483 7024 18460 -18 -17422 -8524 16578 22539 -1199 -14710 5917 26267 13196 -12721
1495 -12721 -18235 -3283 13243 12040 -6460 -11941 12315 31515 16988 -8898 -12042 6904 19714
1508 19714 6423 -17783 -14973 15157 26077 2551 -11767 5247 23501 17357 -727 -8082
1520 -8082 760 10656 1848 -14756 -8820 14984 25392 12936 -3542 -6876 5941 18334 7494
1533 7494 -15304 -11672 12754 14899 -8911 -18853 2299 27396 24235 -3698 -19056 -93 19598
1546 19598 3681 -22185 -17763 7441 18884 7267 -10924 -14565 6426 24646 11921 -14585
1558 -14585 -17390 -1321 5843 -4207 -16280 -8991 13219 18388 -4576 -17342 3285 19795 2028
1571B028k3868K580K1145J0207j2875j8606O999K6022P718k0034j5904N997J3639
1584E048K847j3969j6009P628K5016M263k2612r163K1373J8411j0436k5147q759
1597b1509J8426J8055j2132k4515N304K6538Q326j4222j1293M685J1751K263j5540
1610c863j3808R859J7791l494j6353j179J6667J5350m821k2701j0238J9993J8112
1623B1315j5653k5743K798K3326J1695j0469j5178L452J9721N266k0723j3814
1635a4007J3730J3806r044j7065k202J6282J9056k088k0795o950J8241J1808j5092
1648E680k0563n04J8945J5484j0340k2892J507K7446J0323j9408j3442J0150J1331
1661A3717p642j9955n575J9871K1871o823k2152k231J5813P846o251r917l454
$$ plain form
1571 2028 -21840 -19260 1885 12092 -783 -19389 -12390 13632 21350 1316 -14588 -8591 5048
1584 5048 7895 -6074 -22083 -14455 10561 14824 -7788 -16951 4422 22833 12397 -12750 -21509
1597 -21509 -3083 14972 2840 -21675 -16371 10167 18493 4271 -7022 -2337 9414 11677 -3863
1610 -3863 -17671 -7812 9979 6485 -9868 -11047 5620 20970 16149 -6552 -16790 3203 21315
1623 21315 5662 -20081 -17283 6043 17738 7269 -7909 -4457 15264 20530 -193 -14007
1635 -14007 -277 13529 4485 -12580 -14782 1500 20556 18468 -2327 -9277 8964 20772 5680
1648 5680 -14883 -15387 3558 19042 8702 -14190 -12683 14763 25086 5678 -7764 2386 13717
1661 13717 6075 -13880 -19455 416 22287 15464 -6688 -8919 6894 14740 8489 -1428 -4882
1674d882Q517O984j2701j7302Q325K4961P856j5845j2563O759J4787l214k3766
1687a2084r103K3124J9613j5267k4006L753K2787J2240q249j7616m962J2873Q269
1700A1372j2179j4090M008J3635O852o383j0399M924J9096J318k6461j5146J8821
1713d632K0168q392k0192l588J6152J3806q409j5501N672K0573J403j9806j6090
1726a8836J377J1427J1939o09r820J368J2492k294j7301m676J7184J5887p422
1739A0716k4853j3286J6884K0699n859j3677R234J8348n897k2812j1385J1201
1751a0687K0192L714j8646j4734J0627J8412j37j2911m551J0890J5024l996k6428
1764a3231j5468J9690K3787p132k0000n94J8154J1019q286j5935n36J3677J789
$$ plain form
1674 -4882 3635 10619 -2082 -19384 -11059 13902 21758 5913 -6650 109 14896 11682 -12084
1687 -12084 -21187 1937 21550 6283 -17723 -13970 8817 21057 12808 -4808 -9770 3103 11372
1700 11372 -807 -14897 -10889 2746 9598 3215 -7184 -2260 16836 18154 -8307 -23453 -4632
1713 -4632 15536 7144 -13048 -16636 -484 13322 4913 -10588 -4916 15657 17060 -2746 -18836
1726 -18836 -17459 -6032 5907 5298 -4522 -3154 9338 7044 -10257 -14933 2251 18138 10716
1739 10716 -14137 -27423 -10539 10160 4301 -9376 -142 18206 12309 -10503 -21888 -10687
1751 -10687 9505 13219 -5427 -20161 -9534 8878 8741 -4170 -8721 2169 17193 13197 -13231
1764 -13231 -28699 -9009 14778 7646 -12354 -12948 5206 16225 7939 -7996 -8532 5145 6934
1777F934j4888n013J2330Q050n547q412j257J0153J3906j535j7877q080R269M733
1791B766q700p561Q624J8810P579j8356k2849P596K6320M759j7941j1738P362
1804c329P620n290j3792J27K2779K0524r857k6639r992J1915J3115N68j1667o842
1818a0760J1321J0169j2106j6313J0215K3994N581j6894j8969o15J4576N638j3466
1831g629p370J5032J3871p145j4764r40J0583Q679m804j5769m250J3102P155j0413
1845d662q369P521J1698K600q922p947O397J2050p851k2705l429K1778J6074p024
1859G209j6851l308J3804J1824j0839j6989O201K0555R46k1985j6436P322K3316
1872D769J5590r470j8643M27J3253m51j4170n219J1437J4113j098j8176j1461
$$ plain form
1777 6934 -7954 -12967 -637 7413 1866 -6546 -7803 2350 16256 14721 -3156 -11236 -1967 2766
1791 2766 -5934 -13495 -4871 13939 21518 3162 -19687 -12091 14229 18988 1047 -10691 -3329
1804 -3329 4291 -999 -14791 -14664 8115 28639 18782 -7857 -17849 -5934 7181 7749 -3918 -10760
1818 -10760 561 10730 -1376 -17689 -7474 16520 22101 5207 -13762 -14377 199 5837 -7629
1831 -7629 -14999 33 13904 6759 -8005 -8945 1638 10317 5513 -10256 -14506 -1404 5751 -4662
1845 -4662 -13031 -5510 6188 8788 -134 -8081 -1684 10366 2515 -20190 -23619 -1841 14233 7209
1859 7209 -9642 -12950 854 12678 1839 -15150 -8949 11606 12552 -9433 -25869 -18547 4769
1872 4769 20359 10889 -7754 -7327 5926 5475 -8695 -13914 -2477 11636 10538 -7638 -19099
1885a9099J3549K0466p80j2720j678O091j163r586p349N565J5234O628j2044r856
1899f742Q333J0931k216r359l276O199Q119n575j6092k156J9908J2499j0714j4005
1913d146L404J5375O138j3924j8618L108K0207M533j5257p962J1831J3662k370
1926A5981j4991q442J1695J7703n432k2546q037J4187J2975k944j0437r44J3639
1939A2407J0159j3155k0929J486J8442O717j0006j1007R36Q858M766o053m582
1952a961R703Q942r623j4914k787R198O653j930p475N84J0786M224j2579q431
1966i610R690J1648l706j4049q451P017J4275m6j4922l464J7319J2028j0767j8335
1980a1373l506J4210J3165q275k0495j953K1400J2144j0339j4865J192J3439R236
$$ plain form
1885 -19099 -5550 14916 14136 1416 -262 5829 4666 -4920 -12269 -6704 8530 15158 3114 -6742
1899 -6742 1591 12522 10306 947 -2329 3870 11989 6414 -9678 -11834 8074 20573 9859 -4146
1913 -4146 -742 14633 20771 6847 -11771 -8663 11544 16077 820 -7142 4689 18351 15981
1926 15981 990 -7452 4243 21946 16514 -6032 -14069 118 13093 10149 -288 -1232 12407
1939 12407 22566 9411 -11518 -10032 8410 15127 5121 -5886 -4950 3908 8674 2621 -1961
1952 -1961 7742 16684 7061 -7853 -10640 -1442 5211 3281 -4194 -3610 7176 11400 -1179 -9610
1966 -9610 80 11728 8022 -6027 -14478 -7461 6814 6768 -8154 -11618 5701 17729 6962 -11373
1980 -11373 -14879 -669 12496 4221 -16274 -18227 3173 15317 4978 -9887 -8695 4744 13980
1993A3980r169j7250p35J5271M921j1036o092Q154J1205J635r835p924N461R955
2007H541m628j1897J002J0428K536o525l902M931R915K190j1191p702Q393Q567
2021A0658p960j2121J659J3952R832o638j5707j261J8762J1400j4727j8808J957
2034i002J5694P414j0347j4344L754J9842Q145j5176j3679O300J2609O89j1328
2047E71r970M369J3712J985j3169m330J1780R910m655j1337n001N646O635l581
2061B565j0077J821J1741J554q907l608P113O893j418j0808p382P012R497n524
2075D72j2569K325J4411P170p205j2594j998J1984P802j0926j3362M702J2460
2088B672j96r437m284Q478J2946n30j5606q572J0737J1033o975j4653q17J3787
$$ plain form
1993 13980 4811 -12439 -13174 2097 7018 -4018 -10110 -1956 9249 10884 1049 -6875 -1414 8541
2007 8541 3913 -7984 -6982 3446 5982 -543 -4445 486 10401 12591 1400 -6302 2091 10658
2021 10658 2698 -9423 -7764 6188 16020 9382 -6325 -7586 11176 22576 7849 -10959 -9002
2034 -9002 6692 14106 3759 -10585 -6831 13011 21156 5980 -7699 -1399 11210 11899 571
2047 571 -9399 -5030 8682 10667 -2502 -6832 4948 14858 10203 -1134 -6135 -489 6146 2565
2061 2565 -7512 -5691 6050 7604 -1303 -4911 2202 9095 7677 -3131 -10513 -3501 5996 472
2075 472 -12097 -9772 4639 11809 4604 -7990 -9988 1996 9798 -1128 -14490 -9788 2672
2088 2672 2476 -6961 -11245 -2767 10179 9649 -5957 -14529 -3792 7241 266 -14387 -15204 -1417
2102a417J1991n400j6610k210J7296J1256j2581j5852J547J2130N120q073j0692
2115a3495L624J6488O351j1531q795L709O823n05o041n086M167Q829q74q565J73
2130d728R199L031n395l096L412L023m081j0598l400J4347J3502o564j5111j42
2144f601J3527P806q238j5015k149J5875J1981j2848j9032J544J9237J2891o114
2157A2864j6654m577J3570R464j1993j5681L652J5715N874q066r659O49J0275
2170E433N011p382n867M697L226n975o226J777N653M479j387m524K185P855k998
2185E957j3587l963J0543R994l227j2863o599J0130J4486l566j4702n78J4031
2198F056N918j1499j5271n87J3126J1351n938j2165K123J1712K133r285o727K986
$$ plain form
2102 -1417 10574 5174 -11436 -13646 3650 14906 2325 -13527 -11980 150 5270 -2803 -13495
2115 -13495 -9871 6617 12968 1437 -7358 -3649 3174 2669 -3372 -8458 -4291 4538 3664 -4901 -4728
2130 -4728 4471 7502 2107 -989 2423 5446 1365 -9233 -12633 1714 15216 8652 -6459 -6601
2144 -6601 6926 14732 6494 -8521 -10670 5205 17186 4338 -14694 -13150 6087 18978 12864
2157 12864 -3790 -8367 5203 14667 2674 -13007 -9355 6360 12234 4168 -5491 -4842 5433
2170 5433 10444 3062 -2805 1892 5118 -857 -7083 -5306 347 4826 3439 -1085 1100 8955 5957
2185 5957 -7630 -11593 -1050 8944 5717 -7146 -13745 -3615 10871 7305 -7397 -7975 6056
2198 6056 11974 475 -14796 -15383 -2257 9094 3156 -9009 -6886 4826 6959 -2326 -9053 -6067
2212f067R407K790j0708j0872O277J3290n11r131r92R571O466p233j3853l012
2226a4578J2959Q781q657j0102N060J0494J568p032o562K505J0554L703j0544
2239a851j0218K410P945K446l190j185M781O709l695j2124k097J1370M338q455
2253b816o005N182O918k145q015k962J1746J2102n828j6059m895Q953P292k524
2267I44q340k257J0901J1084p060j7264l35J6225J0005r258j6680l406J3625J0318
2281H502q002j2412N103J4060K086r083o801Q2M641K436m242l613M391N294k859
2296d17m505J883M373J965k880o196M81P536n18j1823m414J2721J1933l191j1894
2311d946m147P656Q100n836j3029J653J4440M916j1385j1094J906J3679J1037
$$ plain form
2212 -6067 3340 6130 -4578 -15450 -9173 4117 3606 -5525 -6517 3054 9520 2287 -11566 -14578
2226 -14578 -1619 7162 -1495 -11597 -6537 3957 5525 -1507 -8069 -5564 4990 8693 -1851
2239 -1851 -12069 -9659 -1714 732 -2458 -3643 1138 7847 4152 -7972 -10069 1301 5639 -2816
2253 -2816 -8821 -3639 3279 1134 -6881 -9843 1903 14005 8177 -7882 -12777 -3824 3468 944
2267 944 -7396 -9653 1248 12332 5272 -11992 -12327 3898 13903 4645 -12035 -15441 -1816 8502
2281 8502 500 -11912 -6809 7251 9337 254 -6547 -6465 -1824 612 -3630 -7243 -2852 2442 -417
2296 -417 -4922 -3039 1334 3299 419 -5777 -5296 2240 1722 -10101 -14515 -1794 10139 6948 -4946
2311 -4946 -9093 -1437 6663 827 -12202 -10549 3891 8807 -2578 -13672 -11766 1913 12950
2324A2950m573j5154m250J0588N231p657q170K742J0872O270p395j1455L669J1786
2338E454O87q795k603N052J261m885n209K653R782N518p758q260L789Q417r06
2353D197p353n014K474Q210K271q800o054Q518J1171l084j1058l223Q291P684
2367H230n027j3635k602J3442Q433p117p662L559P699O43o858o711K396Q925J115
2382D830q966l773O087O006j253m745j060O798O461p604j5482n06J6138Q928q837
2397C022j1317J160J1610N968p683r492M229R866j034r778m084L381O187L562
2411E597k618l890K311N416k185p258r20N973K893l917p009R73J0270M747r309
2426A074o350Q465Q759o035j1614j058R257P123m932j1217J65J2861P781o681
$$ plain form
2324 12950 8377 -6777 -11027 -439 4792 -2865 -11035 -8293 2579 8849 1454 -10001 -6332 5454
2338 5454 6141 -2654 -5257 -205 1056 -3829 -9038 -6385 3397 8915 1157 -7103 -3314 5103 4197
2353 4197 -3156 -8170 -5696 2514 4785 -4015 -10069 -1551 9620 6536 -4522 -7745 546 8230
2367 8230 3203 -10432 -13034 408 8841 1724 -5938 -2379 5320 5963 -895 -7606 -5210 3715 4830
2382 4830 -4136 -7909 -1822 4184 2931 -1814 -2874 3924 10385 2781 -12701 -13207 2931 11859 3022
2397 3022 -8295 -7135 4475 10443 2760 -6732 -2503 7363 6329 -3449 -7533 -4152 2035 5597
2411 5597 2979 -911 1400 6816 4631 -2627 -3547 2426 5319 1402 -5607 -4634 5636 10383 1074
2426 1074 -5276 3189 11948 5913 -5701 -6759 2498 9621 4689 -6528 -6363 6498 14279 7598
2440G598j0505k753P240Q958k174j3429n404J2163J0498o311j0319J974R544L689
2454A0769p191q012K368P912k993q150J677Q938J800n648k988J471M836K835n660
2469A964p902P89P944K249o466m679L951R281K638j0624q507Q152J0984n373j3237
2484h836j042J0177O107m341q395L87R931N087p202q180P39N049K016k667m387
2499e557m41P157M354o669n560N921P927l376r719l867O191Q201k826r674P25
2514g213J1692M084q762o546K363O148K545m453p272R46P549J740m773k131M954
2529H71N246j216p734n999O229R600l699j1261m78J0247N287n591n889K235P887
2544E735K062r235p545N031Q364j137o341j222M629N073K53o850m328O388O637
$$ plain form
2440 7598 -2907 -5660 1580 10538 8364 -5065 -10469 1694 12192 5881 -4438 -2464 7080 10769
2454 10769 3578 -4434 -2066 5846 2853 -5297 -3620 5318 7118 1470 -1518 -47 4789 7624 1964
2469 1964 -5938 -5149 2795 5044 -1422 -6101 -2150 7131 9769 -855 -9362 -1210 9774 4401 -8836
2484 -8836 -9878 299 6406 2065 -6330 -5943 3988 9075 1873 -6307 -5568 -519 1497 -1170 -5557
2499 -5557 -5998 1159 5513 -1156 -6716 -795 7132 3756 -5963 -9830 -3639 4562 1736 -7938 -7213
2514 -7213 4479 8563 -199 -6745 -4382 1766 4311 -142 -7414 -6468 1081 2821 -1952 -4083 871
2529 871 6117 4901 -2833 -8832 -2603 6997 3298 -7963 -8441 1806 7093 1502 -4387 -2152 5735
2544 5735 7797 -1438 -8983 -3952 4412 3275 -3066 -4288 341 5414 5667 -1183 -5511 877 7514
2559G514n745r324j30Q719N977m031q340m83J0067M547q433o670N023N287k508
2574A470p650k680O797R050p22r411l511O340M802k696n109j783L236L743k737
2589h61p615J433J0584M080o858o817J593M650L14n692l120O567P178n217j0024
2604i805R74J0608N436l868q237l834N312O089m544o954K421Q834J862n856n432
2619f994J523Q487L885q592q521L541Q231n05o338R3N253M626k753p546k50Q553
2635B693L450p725o780K457N864K332k423l388K703O819q96r403l974P987P642
2650G358k742r626n034O328J0215k74q260p45P953J568p843n697K581P462L590
2665F834n279p531K305P414J567m045j308K633J783k166o724l285P755Q808l043
$$ plain form
2559 7514 1769 -7555 -7685 1034 7011 2980 -5360 -5843 4224 8771 338 -6332 -1309 3978 1470
2574 1470 -6180 -8860 -2063 6987 6265 -3146 -6657 -317 4485 1789 -3320 -5103 -1867 1876 -861
2589 -861 -8476 -7043 3541 7621 763 -6054 -4461 189 503 -5189 -8309 -1742 5436 219 -9805
2604 -9805 -8831 1777 7213 3345 -4892 -8726 -3414 2675 -1869 -8823 -6402 2432 4294 -1562 -6994
2619 -6994 -5471 3016 6901 -1691 -10212 -6671 1560 1055 -5283 -5190 63 4689 1936 -5610 -5860 2693
2635 2693 6143 -1582 -8362 -5905 -41 2291 -132 -3520 -817 6002 5106 -4297 -8271 -284 7358
2650 7358 4616 -5010 -10044 -3716 6499 6225 -2035 -2780 5173 6741 -1102 -6799 -4218 3244 6834
2665 6834 1555 -5976 -3671 3743 5310 1265 -43 2590 4373 2207 -4517 -7802 -47 8761 5718
2680E718r453m89O680L996l037n789K23O218Q58q364n107O755Q784o05o212m038
2696c862K461N703J310o921m094N353M421m479n474J103P573N362l916r415j293
2711f168Q712L568o383n586L013N398k63m908l248O004Q543j731r867m134N105
2726a945M855j456m145p26L324L802l295n693L443Q629j81p369o131J804O439
2741A355K194m977m281N847O702l766q172M45P492M369l881q443l368O777P538
2756E831l415n512J216N243J149l692m554R13O373J998p666n275M823O542k80
2771C694l871j363L256L127l067o548M74P861K208o662n362K577O696L683l659
2786C044o500R62P062J88q153l830N480O550r6o244m785N077Q101j197p181j828
$$ plain form
2680 5718 -3735 -4224 2456 6452 3415 -2374 -2151 4067 4925 -3439 -8546 -1791 6993 6388 176 -3862
2696 -3862 -1401 4302 5612 -1309 -5403 -50 4371 -108 -5582 -4479 3094 8456 4540 -4875 -6168
2711 -6168 2544 6112 -271 -5857 -2844 2554 2291 -2617 -5865 139 8682 6951 -2916 -7050 -1945
2726 -1945 2910 1454 -2691 -3417 -93 3709 414 -5279 -1836 6793 6612 -757 -6888 -5084 1355
2741 1355 3549 -1428 -5709 138 6840 3074 -5098 -4653 2839 7208 3327 -5116 -8484 -1707 5831
2756 5831 2416 -3096 -1880 3363 4512 820 -3734 -2821 3552 5550 -2116 -7391 -2568 3974 3694
2771 3694 -177 -1540 1716 4843 1776 -4772 -4298 3563 5771 -891 -6253 -3676 3020 6703 3044
2786 3044 -3456 -2494 4568 4756 -3397 -7227 -1747 4803 4707 -1537 -6322 -1245 6856 5659 -1522 -3350
2802c350M411J320l411k990J256N251L128n216n180L694O797j554n899k291L129
2817i05M276j241o507j447Q078O595n291q221P40O049L735l276o916j278P040
2832A431M194n261m919L782O186P17m509n321R08N830J025n980k113N118L209
2847D297l054l062J596M560J897m414o689J819P140N22o061k974M200N524P11
2862F012n648m384M133P129j563q898k759N738N174j109m926k478N309N709l840
2877C599o751Q85N501O94m430l343J416N090K283m484l801M638M993l084o013
2892b807j014L963L825j842o338q52P546M799n421n490K020N203J261m998n415
2907e560J422P429J648o641l463N356N046j209m497l008K876M474j469p246j97
$$ plain form
2802 -3350 1061 2381 -1030 -4020 -2764 2487 5615 399 -4781 -1087 5710 4156 -1743 -4034 -905
2817 -905 3371 2130 -4377 -5824 2254 8849 3558 -4663 -3923 2126 5861 2585 -4331 -5609 1431
2832 1431 5625 364 -4555 -773 5413 6130 1621 -3700 -2792 3038 4063 -1917 -4030 1088 4297
2847 4297 1243 -1819 -223 4337 6234 1820 -4869 -3050 4090 4612 -1449 -4423 -223 5301 6012
2862 6012 364 -4020 113 7242 5679 -3219 -5978 -240 4934 3825 -1101 -3579 1730 7439 3599
2877 3599 -3152 -2267 3234 3928 -502 -3845 -2429 2661 4944 460 -3341 1297 6290 3206 -2807
2892 -2807 -3821 142 3967 2125 -4213 -5065 2481 7280 1859 -3631 -1611 3592 4853 -145 -5560
2907 -5560 -4138 3291 4939 -1702 -5165 191 5237 4028 -469 -3477 -601 3873 2404 -4842 -5039
2922e039P047L070l744l611P99M502K616m157n818J768O835k94o473j708M793
2937E86M531k35m731k483L888M953l627o598J091N064J892k711l860P82N857L393
2953G792n176n644K552N771o67n308l118L106O046R20o682l085O178M920l535
2968D070n723n18L680K366j909m524J43N994K782m492l700J919L488N15l554m343
2984c806J946O096n42o635j181O630L516l237n385q14M681L507m665o702K382
2999d209O618J473m803k737J926L863J649m643m896K528N814j519n499j591M255
3014a771M380n64m801k255M950L529n219n705K882N401N34l712l000J889N009
3029A547J451n601l130M186L275k100m005j628K885M934M45n162j951M921L948
$$ plain form
2922 -5039 2008 5078 1334 -2277 -1478 3024 5640 1483 -4335 -2567 4268 3974 -2499 -4207 586
2937 586 5117 4882 151 -2332 1556 6509 2882 -3716 -2625 2439 4331 1620 -2240 -1458 4399 7792
2953 7792 2616 -3028 -476 5295 4628 -680 -3798 -692 5354 6274 -408 -3493 2685 7605 4070
2968 4070 -1653 -2171 1509 3875 1966 -2558 -2415 3579 6361 1869 -1831 88 3576 4091 537 -3806
2984 -3806 -1860 4236 3694 -2941 -4122 2508 6024 2787 -2598 -3412 1269 4776 111 -6591 -4209
2999 -4209 2409 3882 -921 -3658 -1732 2131 3780 -863 -5759 -3231 2583 1064 -4435 -6026 -1771
3014 -1771 2609 2045 -2756 -5011 -61 3468 -1751 -7456 -4574 827 1361 -2351 -5351 -3462 1547
3029 1547 2998 -2603 -5733 -1547 1728 -372 -4377 -6005 -3120 1814 2259 -2903 -4854 67 4015
3044D015l809m584Q21L758K321l244m766K069O338K51m956j102M305K150j952
3059A615m671j508L593M689j595n142M88N415J865l131m143n5M801L806m896o992
3075e861J882P160J348m148k485K755M131m46n923l170M818L981k423m284M22
3090b243L223J602j217k553M7M366J471n275m451K072M544P81l348k711K636M986
3106C930l22o461k235N736K814m006m165N48L531K723k681m443K135N281P25n051
3122a941k479J558K072Q30k872k643K898N826r70p016j787N394M442j701n820
3137d209k152M434M413l982n206L053O728J152m406l918J11K768L202k048l253
3152c313Q01L398n70j973n49J654L815N61n172k813M112L028l988l318L910N120
$$ plain form
3044 4015 206 -4378 -3557 201 2522 -722 -5488 -3419 2919 3170 -1786 -2888 1417 3567 1615
3059 1615 -3056 -4564 -971 3718 2123 -3019 -2531 2884 4749 1618 -2525 -2580 2221 6027 1131 -5861
3075 -5861 -3979 3181 4529 381 -2104 651 4782 4336 -1587 -4757 61 4042 1619 -2665 -2243
3090 -2243 980 2582 1365 -1188 -1141 3225 4696 -579 -5030 -2958 1586 2367 -981 -3692 -1056 3930
3106 3930 3608 -2853 -5088 648 3462 -544 -4709 -4161 -630 2093 -588 -5031 -2896 2385 3110 -1941
3122 -1941 -4420 -2862 -790 40 -2832 -5475 -2577 3249 2279 -4737 -6524 -1130 3312 1611 -4209
3137 -4209 -6361 -1927 2486 -1496 -6702 -3649 3079 4231 -175 -4093 -3982 -1214 1988 -60 -3313
3152 -3313 -2512 886 316 -1657 -2206 -552 3263 3824 -1348 -4161 -49 2979 -1009 -4327 -417 4703
3168D703r02m612k683L474N892j142p087j482M742L153j741l500j303K631N801
3183E944j04o081k474M837L510l562m741n60N371M541k961n895J225N346J07m885
3199c82k06L284P59k097k925j066L206L662o50l270m1J735M44j716l011J01N179
3216C006K845n187n970K439O675J070l929k577J524K733j114n252m92N161L037
3231C969k807k584N60J210J775l10l283j088L771J555m351k890K490M609J397
3246D023m001l924K325O389j033p119k068N415L603k841l652j58M102L026k226
3261A861m760K48M541J456k373k981j354K179L606o86l074J293L550r94m444n60
3277b492K538K652j903k520o79M283J337m304k169M210M089j757m721k338J399
$$ plain form
3168 4703 3801 -811 -3494 -20 5872 4730 -2357 -3839 903 4056 2315 -1185 -2488 143 5944
3183 5944 5840 -241 -2715 2122 5632 2070 -2671 -3231 2140 6681 3720 -2175 -950 4396 4503 -382
3199 -382 -588 2696 3455 1358 -1567 -2633 573 4235 3585 315 274 2009 2453 737 -2274 -2173 3006
3216 3006 5851 664 -5306 -2867 3808 4878 949 -1628 -104 2629 1515 -3737 -4229 932 3969
3231 3969 1162 -1422 -862 348 2123 1813 -1470 -2558 1213 2768 -1583 -4473 -1983 2626 4023
3246 4023 22 -3902 -1577 4812 3779 -3340 -5408 7 3610 769 -2883 -3041 1061 4087 1861
3261 1861 -2899 -2651 1890 3346 973 -2008 -3362 -1183 2423 1737 -1337 -44 3506 2512 -1932 -2492
3277 -2492 46 2698 795 -1725 -2404 1879 3216 -1088 -3257 953 5042 3285 -1436 -3774 -2375
3292b375M546J475m393k262L110L456j263l479j548K395M828r82o829k673N622
3307c72M771k627m396M47L543K548k314m388j19L902J123l201j499J352J130R69
3323H69L9k102P91K271j342l085r1L608R25k863k347O37M694K273m267m312L064
3340a238M725j345n017r51L151L073o29l739j623M349L714k802m247k04K788K500
3356B505r41m127j796M739M026k598m571J398L507M87k363k805J103K933l10m019
3372b832O92M328J139l071k639O87K716J675j853m211m47M079K278k888k314N20
3388b141L286K137k360m444N77L780J36l868l05L569J277k043k765K15L593K299
3404B943k712m164J006K317j89j689n96J352K601R12l666l459K938M323r93m611
$$ plain form
3292 -2375 2171 3646 -747 -3009 101 3557 2294 -1185 -2733 -338 4490 3508 -3321 -5994 -372
3307 -372 4399 1772 -2624 -2177 1366 3914 1600 -2788 -2907 995 2118 -1083 -2582 -1230 -100 869
3323 869 908 -1194 -403 1868 526 -2559 -2650 958 1883 -980 -3327 -2690 2004 4277 10 -4302 -1238
3340 -1238 3487 2142 -2875 -3826 -675 2398 1769 -1970 -3593 756 4470 1668 -2579 -2783 5 2505
3356 2505 1564 -2563 -4359 380 4406 1808 -2763 -1365 2142 2629 266 -2539 -1436 1497 1187 -2832
3372 -2832 -2140 2188 3327 256 -2383 -1696 1020 2695 842 -3369 -3816 263 2541 -347 -2661 -2141
3388 -2141 1145 3282 922 -3522 -2945 835 971 -2897 -3202 367 1644 -399 -3164 -2949 644 2943
3404 2943 231 -3933 -2927 -610 -799 -2488 -3084 -1732 869 1781 -1885 -5344 -2406 1917 924 -3687
3420c687j242K990L595j538m746j121O653M057m253n745n7L428K918o16l265j651
3436d280K791K639j474j394J296Q80k20j126j266J019K064q95l519P95M874J222
3452C406l404k618J908L097K62l736l101K756N195m54m481j319K888K335J04k455
3468C83j964K598L678k727n661m9N024M251m15m768l060K081L933n96k903L99
3484B04K102o67k593o71J544K737R26k558j410J525R26k790k515K284L032J696
3500C772k427m710q09N355K802k379l462L52J831J10k036j852J815L858l19m676
3516b775m74L759J583j736l274j214K344L422j062l849m04L474R81k063j366Q51
3532a803K304O45l004l425J709L975m02k710M46K797J112k126m008m79M707M247
$$ plain form
3420 -3687 -4929 -1939 1656 118 -4628 -5749 904 4961 708 -5037 -5094 -1666 1252 636 -2629 -4280
3436 -4280 -1489 1150 -324 -1718 -422 458 238 -888 -2154 -1135 929 34 -3485 -2690 2184 3406
3452 3406 2 -2616 -708 2389 2651 -1085 -4186 -1430 3765 3311 -1170 -2489 399 2734 2838 383
3468 383 -1581 1017 4695 1968 -3693 -3742 1282 5533 5118 350 -2710 -629 3304 2708 -195 204
3484 204 2306 1639 -954 -1625 -81 2656 3582 1024 -386 1139 2065 -725 -3240 -956 2076 3772
3500 3772 1345 -3365 -4174 1181 3983 1604 -1858 -1506 325 435 -1601 -3453 -1638 2220 1901 -2775
3516 -2775 -3249 510 2093 357 -2917 -4131 -1787 1635 573 -3276 -3680 -206 775 -1288 -2654 -1803
3532 -1803 501 1146 -1858 -5283 -3574 401 -1 -2711 -2265 532 1644 -482 -4490 -4969 -262 3985
3548C985k194n165j295J953K465J403m84n88R23r8l384j551L191L298p20k225
3564d86j138J396K046o55k632J62M602J465l976l331J7L085K683o70k172k51K722
3581B867m3k950p10L139J743j664k884j335K980L819r47m764p68L893K420j144
3597C652k873j945J685K151p90k464J582K641l39k653j431J301J827R25k501j902
3613a134K350J652k465k763J016L893J872j344l757k252K193K372r67j281J602
3628I87J236j922k507n08K450L964n29m576k634L248K585j746k619O6K689K484
3644B668j023m458j172L450K249k175j533M54N65Q66j246j155J628K772q80l197
3660b187k17K300J138j361k127p65K651K949j192l247L69K602j14j181j011J026
$$ plain form
3548 3985 1791 -3374 -4669 -2716 -251 1152 668 80 1003 905 -2479 -4030 -839 2459 1739 -486
3564 -486 -1624 -228 1818 1163 -1469 -1307 3295 4760 784 -2547 -2530 555 3238 2568 396 145 2867
3581 2867 2824 -126 -836 2303 4046 2382 -502 -1837 1143 4962 4015 -749 -1517 2376 4796 3652
3597 3652 779 -1166 519 2670 1880 -584 998 3639 3300 647 -784 517 2344 3269 768 -1134
3613 -1134 1216 2868 403 -2360 -1344 2549 4421 3077 -680 -2932 -739 1633 666 -615 987
3628 987 2223 301 -2206 -2714 -264 3700 3171 -1405 -4039 -791 1794 48 -2571 -2505 184 2668
3644 2668 1645 -2813 -3985 -535 1714 -461 -1994 -1540 -975 -109 -1355 -2510 -882 1890 1010 -2187
3660 -2187 -2404 -104 1034 -327 -2454 -3219 -568 2381 1189 -2058 -1689 913 799 -382 -1393 -367
3676c67K132K08l675k312L251M162m47k785j517J816J764m12k903j477L409L011
3692C858j620k874n26J663J627O49j411n50J641j23l353n80L135K611r39k889
3708C19o61J337K589q27k937l08K758J355k236j748k19K022K128j329k231N35
3724E47K582j37l118j313K106K344j56k604k071K178L583j005l794j34K257J192
3740B457j053j762j244J808J851j400j598J153K119q19j990j367Q51K553O03k893
3756g31k192K380K403j271k037J22J483J038o47k489n42K424R11j835j268J659
3772e92J789o74j616j731J236L200j69l633j655K633K397o50j803j301J736K658
3788A825r35l486l81L299L15j602j246R64J882M18j505j785K016K139j108k508
$$ plain form
3676 -367 1765 1973 -1702 -4014 -763 3399 2952 167 -1350 466 2230 1818 -1085 -2562 847 3858
3692 3858 2238 -636 -1162 501 2128 2777 1366 816 2457 2334 -1019 -1599 1536 4147 3208 319
3708 319 -342 995 3584 2757 -180 -488 2270 3625 1389 -359 -578 1444 3572 2243 12 547
3724 547 3129 2992 -126 -1439 667 3011 2855 251 -1820 358 3941 2936 -858 -992 1265 2457
3740 2457 1404 -358 -1602 206 2057 657 -941 212 2331 1512 -478 -1845 -994 1559 2162 -731
3756 -731 -2923 -543 1860 589 -1448 -1326 157 1195 548 -1941 -2483 -59 852 -983 -2251 -592
3772 -592 1197 523 -1093 -2824 -1588 1612 1443 -2190 -3845 -1212 1185 535 -1268 -2569 -833 1825
3788 1825 890 -2596 -2977 322 637 -965 -2211 -1247 635 1053 -452 -2237 -221 1918 810 -1698
3804a698o12J608J440M85k316j281K191K739j477k843M90K616K88j331k289L10
3820a680K624J284j977j590J869J573q97j641m45R07J388l37j474p38K099N91
3836A556j468q98J467J125q9j580k140J050L306J91l761j221K898K916j048k935
3852f31j837K137L581j021l567j024K375J805n99j084j492R33K544j97k938r46
3868a961K152R77q09r45LP53N57j139j152K223J625k241j948Q95K061o77j734
3885a360n92J481K542K34l327j977K074K285K19k093j788J04L146O28k947k115
3901c486K462L366r37k710j118Q23K417p43k326M41K327L80j834r18P85O49O80
3918B58m33j281Q5J255j04j988J02J767J748j01k325j947K029K527j532k862Q93
$$ plain form
3804 -1698 -2310 -702 738 1223 -1093 -2374 -183 2556 1079 -1764 -1274 1342 1630 299 -1990 -1680
3820 -1680 944 2228 251 -1339 530 2103 1206 -435 -880 27 1415 1078 -396 -1134 965 1556
3836 1556 88 -810 657 1782 1693 113 -2027 -977 2329 2520 -1241 -2462 436 3352 2304 -631
3852 -631 -2468 -331 3250 2229 -1338 -2362 13 1818 1219 135 -1357 -424 2120 1923 -1015 -1961
3868 -1961 191 1168 359 -586 -583 170 727 -412 -1564 659 2284 43 -1905 -1010 1051 374 -1360
3885 -1360 -1952 -471 2071 2305 -1022 -2999 -925 1360 1579 -514 -2302 -2198 948 1576 -1371 -3486
3901 -3486 -1024 2342 1405 -1305 -2423 -1600 817 74 -2252 -1811 516 896 -938 -1856 -1071 -422 258
3918 258 -175 -1456 -1371 -116 -220 -2208 -2106 -339 1409 1308 -1017 -2964 -935 1592 60 -2802 -1909
3935a909L187J69k536j090O64J907R64r72j525Q63O67j371n44P47Q70J274P9j894
3953d50j548K322J961j824k474R81K865O02k434k237J061L950Q05l383j545K059
3969G11J842j165j928n29J050K497O93k673j621J745J544j87j217p73J013J988
3985B990o07l129j58K701P20q78l04O58M2j045j709N33K312J098k088j869R75
4002B42J376Op90m69L53J714m5k511k411J892L172N9j739k147R80K052M83l245
4020a028j538L163K775k158l556j07J680K175R7k033j310J681J487j069j652k12
4036a605L57J044P53j280q94J203J125k127l20J431R70j181j465K15J038R10j218
4053a044j626J540L322q60k986q74J476J378N14j302j207Q09J746o58j979j32
$$ plain form
3935 -1909 1278 1447 -1089 -2179 -1515 392 1356 384 -1141 -278 389 -982 -1526 -779 91 1365 1444 -450
3953 -450 -1998 324 2285 461 -2013 -1032 1833 2435 1 -2236 -1175 2775 3580 197 -1348 711
3969 711 2553 1388 -540 -1069 -19 2478 3171 498 -1123 622 2166 1979 762 -11 1002 2990
3985 2990 2383 -746 -904 1797 2517 1639 1335 1993 2035 990 -719 -186 2126 3224 1136 -733 242
4002 242 1618 1624 834 365 718 2432 2387 -124 -2535 -643 2529 2588 849 -1298 -318 1734 2217 -1028
4020 -1028 -2566 597 3372 1214 -2342 -2449 -769 1406 1503 -530 -1840 -159 1328 259 -1393 -1605
4036 -1605 -1248 -204 549 -731 -1625 -422 703 -1424 -1744 -313 657 -524 -1989 -1774 -736 174 -1044
4053 -1044 -2670 -1130 2192 1332 -1654 -2528 -1052 326 840 -462 -1669 -860 886 228 -1751 -1883
4069a883J935K325k02k811k320J909L272q37k164M79J869L15j447q73O50J826
4085B043L45j638j295J011Q95m44j68M18N57P75j69j922j170J893K272j484j381
4102E38l88J082J565k85k230q2K234K49j907p4J231K63j088q92J04O66J360o84
4120A662j560O48P76l04j047m38Q8J507J109k209k363O79L783L06k971q69N94
4137f09J635M2k991j040K701K537j443k623o38J109J200Q13j218j492N88Q94k63
4154g98r51J63R13L82j25j117m28J307J89j727j49K332L9j950j026J169J691M81
4172C95j034k202R39K106k28j561j022J500J095O07j213j390M47K802J96k975
4188a538q08J864J627q01j469q75J826K160j215k026P15J875k04j226o13n9J139
$$ plain form
4069 -1883 52 2377 2175 -636 -2956 -1047 2225 1388 -776 -297 1572 1887 440 -433 217 2043
4085 2043 2388 750 -545 466 1361 917 749 1167 1724 2499 2330 408 -762 1131 3403 1919 538
4102 538 150 1232 2797 2512 282 200 2434 2683 776 702 1933 2196 1108 216 320 986 2346 1662
4120 1662 102 750 1526 1222 175 -263 -175 1332 2441 232 -2131 -1452 2331 2637 -334 -1203 -609
4137 -609 1026 1068 -1923 -2963 -262 2275 832 -1791 -2429 -1320 -120 693 -525 -2017 -1429 -535 -798
4154 -798 -1749 -1586 -673 -291 -416 -1533 -1961 -654 -465 -2192 -2341 -9 30 -1920 -2946 -1777 -86 395
4172 395 -639 -2841 -1902 204 -24 -1585 -2607 -1107 -12 595 -618 -2008 -1561 1241 1437 -1538
4188 -1538 -2346 -482 1145 344 -1125 -2000 -174 1986 771 -1255 -540 1335 1131 -95 -708 -767 372
4205C72J312r76j339N33J385L18j257k29O2J295L00k203m92J687J487j539o78
4222C8N74R02j96j001p03N70J428lk387J23J606Q53j406n90k81R04J512p99k817
4241a673l26K698J222j286j802%J352J713j271k133K03K005K41k028p17R80J014
4258A92M39n04j953Q80J467o21j315J92O17M71j93n72q99J099J407j124j240O14
4276a043J418q91j000m66J129J092Q8j494j030J792J160j231r21M56P30K27n36
4293e20j393M1K079N97j471j052Q09J291L03j317j147M53J911q2j441q83J945
4310A23J031q91j056p49J039J783l45k249l02J426P17m90m22q8Q21O55q39j553
4328a389K60K354k4j465O4L80L7J95o07O4J199R26j953j554J098J375R9j112m69
$$ plain form
4205 372 1684 708 -631 -98 1287 1605 348 119 181 1476 1776 -427 -919 768 2255 716 38
4222 38 612 1514 1318 317 -386 184 1612 1609 -778 -655 951 1804 398 -192 -473 431 1943 1144 -1673
4241 -1673 -1999 699 1921 635 -1167 -1167 185 1898 627 -1506 -1303 702 943 -1085 -1802 -822 192
4258 192 631 127 -1826 -946 521 -100 -1415 -1223 -606 -135 -328 -900 -1799 -700 707 -417 -1657 -1043
4276 -1043 375 -516 -1516 -1982 -853 239 327 -1167 -2197 -405 755 -476 -1397 -941 -211 16 -520
4293 -520 -1913 -1872 207 804 -667 -1719 -910 381 684 -633 -1780 -1327 584 502 -939 -1822 123
4310 123 1154 263 -793 -1542 -503 1280 935 -1314 -1616 -190 527 37 -385 -473 348 1003 164 -1389
4328 -1389 -1129 1225 1201 -264 -200 180 217 412 -195 -131 1068 1994 41 -1513 -415 960 1059 -53 -522
4347e22L35O49M48j151o16J662J309r95j814m35O32J779o9j258o51J520R63j322
4365D64j267N87J072P06q33k023L65J999Q25j436j209R11O50M15n92j199P52J188
4383A375m38j680O4J252N64k75p72m87K0J062p59l00O58J018r86j164l10R93J154
4402I89M80j792q80J248O72j002j214Q51J419L92j053j928j61K137J950j747k072
4419a711O20R71nj76q02J42J607L38k029q12J513N49j8p97L6k25M11K12r48j2
4439a136J788Q8j808m49R78M71J59q42o63L96J604l05j223J35J137M70q22q78
4457i00p05J122J937o79j719k16J327K82k86k8k74P24P9q61q96R99J630p04r26
4476i4n9N18J94L94j090j12J510M39j544j652J058J442P91k01j691p83J890R82
$$ plain form
4347 -522 -187 462 910 -241 -857 805 2114 1119 -695 -1130 -498 1281 1212 -46 -697 823 1786 464
4365 464 -803 -216 856 1562 729 -1294 -929 1070 1895 459 -750 161 811 1226 634 -565 187 1375
4383 1375 937 -743 -679 573 1137 862 90 -397 -377 685 -74 -374 284 1302 316 -848 -1158 -165 989
4402 989 1469 -323 -1203 45 717 -285 -1499 -648 771 1163 110 -1818 -1979 158 2108 361 -1711
4419 -1711 -1091 -120 -125 -301 -1103 -961 646 984 -1045 -1857 -344 205 187 -610 -574 -799 -388 -176 -1124 -1136
4439 -1136 652 740 -1068 -1517 -539 -68 91 -751 -1414 -1018 586 281 -942 -807 330 800 -22 -900
4457 -900 -1605 -483 1454 775 -944 -1160 167 449 163 135 -139 585 664 -197 -1093 -94 1536 832 -94
4476 -94 -153 365 559 953 -137 -249 1261 1700 156 -1496 -438 1004 1795 1594 -97 -880 1010 1992
4494A992j590q47O69R89j60j198p84Q31J616J21j570m75J027J07m64q0Q2L98J00
4513G64p51q61P04J707l38j745k05P54N88k70j056n90R32J471j216j712L34J578
4531H8P58m38j558l96L77J524o11j382P32M66P8k58n85j53R99K53p61j102P31
4550a238P27Mr17N45M43M4k40r61j72J454Q77j687r58R28N05L54n05o35M12J301
4570B81l68j181m84J025Q28k41n69q00M96J443k33j293J5J237Q68j393o94O33
4588d30O75P29r94j335J252J079m67q55Q7P12k3j74m05n18Q13J303o21j147J46
4607a73R40L79n85n65l84J228M59j142r25J114J127n31j212L77L00N28p7j294
4625d36J44Q17O38j310k59N83K15L94Mj029m31J512l4r25r16O47P69r5o67l90
$$ plain form
4494 1992 402 -445 224 1213 1053 -145 -929 -98 1518 1639 69 -406 621 728 264 184 266 664 764
4513 764 13 -848 -144 1563 1225 -520 -725 29 617 347 -709 -1299 -367 1104 -112 -1824 -1490 88
4531 88 846 408 -1150 -1546 -1169 355 -256 -1638 -906 -440 -362 -620 -1205 -1358 -359 -106 -867 -1969 -1238
4550 -1238 -511 -507 -1424 -879 -436 -392 -632 -1593 -1765 -311 566 -1121 -2079 -1151 -646 -292 -797 -1432 -1020 281
4570 281 -87 -1268 -1752 -727 101 -140 -709 -1509 -1013 430 197 -1096 -1081 156 1024 -369 -1063 -430
4588 -430 245 974 -20 -1355 -103 976 509 -346 -259 453 430 256 -149 -667 146 1449 828 -319 -173
4607 -173 767 1146 561 -4 -388 840 1299 157 -768 346 1473 942 -270 107 407 935 858 -436
4625 -436 -292 525 1163 -147 -406 177 392 786 790 -239 -670 842 808 -117 -1033 -386 383 288 -379 -769
4645g69Q47Q80p95j082J24J280l68m47l71J40L00P47p96j241P29R93j18p59k86
4664i92j27Q19L81q16j119R16J676q70j174K3P71M52m61j094K86J041N03j138
4682i23o24R15N33q8k74m34k2M71N85r49l80P07Q70j17j046j26O90J098o02j592
4702a308K19J638M09j658j23O39N67K9m32m72K49J045l24r53j19O72K17L08k42
4721C61r74P76J097l26j227MJ148J79o97l52n5J073J22j077n33Q79R44o79p89
4740a26K36L43K18nn38n20Q31R41p69n75l01Q11P32k57j161n08J582J72j104n90
4760e88P43Q51m20p46k74M85N23m91o50Q7P51J86p01J0J25l47Q00n35m78k3Q97
4781B05r9q30l12L22O65L18j275k06L37J621p67j652M77J249m4m91p9l85M23O72
$$ plain form
4645 -769 78 958 163 -919 -795 485 117 -330 -701 -561 -261 486 -310 -1551 -822 171 53 -706 -992
4664 -992 -1119 -300 81 -735 -1854 -938 738 -132 -1306 -1283 -512 -60 -521 -1615 -1329 -288 215 -923
4682 -923 -1547 -632 -99 -187 -461 -895 -917 -446 139 -810 -1190 -483 387 270 -776 -902 -212 886 284 -1308
4702 -1308 -1089 549 958 -700 -823 -184 383 412 -20 -492 -243 802 478 -475 -594 78 295 603 361
4721 361 -613 163 1260 934 -293 -289 859 1038 341 -11 -66 1007 1129 52 -481 398 1342 663 -126
4740 -126 110 453 671 666 128 -392 439 1380 611 36 -265 546 1278 1021 -140 -648 934 1106 2 -588
4760 -588 155 1006 586 -160 -434 51 574 83 -567 -480 271 457 -244 -234 -109 -456 344 -191 -669 -692 205
4781 205 106 -724 -1036 -714 -49 269 -1006 -1212 -875 746 -21 -1673 -1196 53 9 -482 -561 -946 -523 149
4801A49m95p10O70J05k48p1q9l18P30J047q60j144P48P79k40q25J00O24L80o46
4821c14n52M5J625j3j080k79Q09M6k64k16k18M74Q77j75q56m25Q57N07K39q08
4841B79j183P31J251k99j470m6J665M54j158n32P00J49L70j19o75K51N00l66k59
4860B43L02J12k13O1p5m3M72N21o57j211L48J036m1r28j52M00Q93nj540n97J159
4881H5J529r26p42j80O4L77K12l54n64N18K06j80k41p0n9O23K55o87l86M18M97
4902C95j036J90R64j65o17n13j38J008L37n93q15L89P20J31n88l89j52M90J081
4921F99o44j172m4J452L15o76p96K4P64P04n27r37L44N06j46p13P99N69m35l74
4941b88J99j56M26k36l61L2P13Q5q55l0K0Q0J260J32j504o08J016Q20o73m81J26
$$ plain form
4801 149 -346 -1056 -386 -281 -529 -600 -689 -1007 -277 770 -90 -1234 -486 293 53 -772 -672 -48 332 -314
4821 -314 -866 -821 804 791 -289 -568 241 287 23 -193 -411 63 940 765 -91 -516 341 848 1087 279
4841 279 -904 -173 1078 779 -691 -737 928 1382 224 -308 392 541 911 792 117 368 868 502 243
4860 243 545 657 444 505 430 387 859 1380 723 -488 -140 896 855 -73 -225 175 1068 1063 -477 -1074 85
4881 85 1614 688 -54 -234 -170 207 419 65 -499 19 225 45 -196 -266 -325 298 553 -134 -520 -102 395
4902 395 -641 -451 513 348 -269 -782 -920 88 425 -168 -983 -594 126 257 -331 -720 -872 -382 699
4921 699 55 -1117 -1161 291 606 -70 -866 -842 -78 626 99 -838 -494 12 -134 -847 -48 521 86 -288
4941 -288 -89 -245 181 -55 -416 -384 329 414 -441 -471 -451 -371 889 1021 -483 -1091 -75 745 72 -409 -283
4962b83M88M78j79j051l7R58N34n96p32L38k92M99J51J56m61M80k63m35nP25l13
4983A60Q1n67j42O70N82n27j000R76R65n15r63l76N30P57L31j031j195J229K00
5002A65L68n43k23k22O16L34n61m90O14R25p43n66l1j90P20M79p86k59L91R9m73
5023c76r3R79J24p92l15K46J78K42j53o50J45R21j22o97m64N15O41N01p36j572
5043a478M25J120M33q75l64M85L19o2p27m70O53R34l35p37R4L03K77J37l59k57
5063d84K57M83P3p72K49L39k88k05J99n7K19K19q07j14P72O32r79n29O95J69O98
5084G69l87j044p7J009L32n67l99L63J80L75j78l52r0M11K84m20k22K54nQ5k77
5105D4L15r2O28k85q74N40O50k21o15rK90J33M12o81n53Q30O11l67j365N85L92
$$ plain form
4962 -283 205 683 504 -547 -584 374 908 312 -420 -82 -374 125 276 432 -29 451 188 -247 -252 473 160
4983 160 241 -326 -468 202 784 257 -743 233 1198 683 -280 -656 -126 631 962 -69 -1264 -35 165
5002 165 533 -10 -233 -455 161 495 -66 -556 58 983 240 -326 -357 -547 173 652 -134 -393 -2 97 -376
5023 -376 -469 510 634 -158 -473 -227 -49 193 40 -610 -465 456 334 -363 -827 -312 329 830 94 -1478
5043 -1478 -1053 67 500 -375 -739 -254 65 3 -724 -1194 -541 393 58 -679 -585 -282 -5 132 -227 -484
5063 -484 -227 256 329 -443 -194 145 -143 -348 -149 -206 13 232 -575 -689 83 715 -264 -793 -98 71 769
5084 769 382 -662 -739 270 602 35 -364 -1 179 554 376 24 -66 345 629 209 -13 241 236 321 44
5105 44 359 267 895 610 -264 276 926 705 90 81 371 504 916 235 -318 512 1123 756 -609 -24 368
5126C68K99N01j117n80M84J415m48j167j41O96L03l8q11o2N21M59po83M63j84
5146B71m68k12O61J96Q7j94r27N11L04M70o95m54O55L42J24p92p02K98J265J48
5166H88j239m59P70K80L92m51o13J19J037l06o74m11N54N03M6k37o06P1N09K95
5186D68n13J12J80l55k48M80K84j72l60p2k70O93O26p01p48M75N31L4k94l04n25
5207f79J398M99q17r98L79O59K57l70l43kK63O22r01l18R16M67o66n75k83M92
5227@P15j34n85j76N28O4m84p7O07J86L43n59o54J29R46o0n52M6j7J60L3l65k40
5250a46n8J064j64n55j42l09N55p3om7L45P6l75k62M03L74p19n24K29O71K07k06
5272C38p46j84O90M66p48m07M25J64K41j90p61P6Q63K85n52p39J50O64M2m7o59
$$ plain form
5126 368 667 1168 51 -529 -45 1370 922 -245 -386 310 613 575 -236 -298 223 682 675 -8 455 271
5146 271 -197 -409 252 448 535 341 -586 -75 229 699 4 -450 205 547 671 -121 -823 -525 740 888
5166 888 -351 -810 -40 240 632 181 -432 -313 724 418 -256 -667 -113 390 436 199 -407 -336 173 468
5186 468 -45 67 247 -108 -356 124 408 236 -124 -196 -466 227 853 152 -596 -121 410 444 150 -154 -679
5207 -679 719 1218 401 -597 -218 441 698 328 -15 -17 246 868 -33 -351 565 1032 366 -209 -492 0
5227 0 715 581 -4 -180 348 412 -72 -149 458 644 987 428 -226 -97 849 789 237 283 266 426 459 94 -146
5250 -146 -204 860 696 141 -1 -310 245 172 166 119 464 540 165 -97 306 680 -39 -563 -334 337 544 338
5272 338 -408 -592 98 564 -184 -591 -166 -2 239 49 -712 -636 227 512 -40 -779 -629 35 77 30 -629
5293f29K78Q87j32j102l76J116J02j98L99n08pp2j21j72N63N56n03o82l09P21
5313a89J67j13N74n28k9K54j90k53j25P30K37m14j48k50N06Q4l49m09O77Non13
5335b82l1J77K62O87j053j67P00P31q94j46n23K41O79K54m39o05O07J67m03p17
5355g55Q12M36m84L27l51J49j29K3j03L07L88j64n67l45M43J59N13m08n07J83
5375g3M62k39k41J60p7M18K66o91o39M06Q25l35n93L41K73Q0l10Q9j99j6N68m96
5397b1l00M1L82p3J37j40m14M24M13p21m09P07P85n43n34J2J49J78L74p73l43
5418f69O83N58o25j65J11kJ33j10k7l39O72L82m95m20K36m4k76J63j59K69M37
5439C13l36m80l79J038M24n29o98L16L11K49l44k78L64O20n61k46m7k01K90P22
$$ plain form
5293 -629 -351 536 404 -698 -1074 42 144 -54 345 -163 -170 -242 -363 -535 28 584 81 -601 -910 -189
5313 -189 -22 -135 439 -89 -118 136 -54 -307 -432 298 535 121 -27 -277 229 313 -36 -445 232 237 231 -282
5335 -282 -313 -136 126 813 -240 -407 293 1024 130 -16 -539 -298 381 635 196 -409 198 365 -38 -755
5355 -755 57 493 9 336 -15 134 5 28 -75 232 620 456 -111 -456 -13 146 659 251 -256 -73
5375 -73 389 150 -91 69 -8 410 676 -15 -654 -248 577 242 -351 -10 263 343 33 122 -77 -93 475 -21
5397 -21 -321 -280 102 29 166 26 -388 36 449 -272 -681 26 811 268 -266 -254 -105 73 447 -326 -669
5418 -669 14 572 -53 -218 -107 -109 24 -86 -113 -452 220 602 107 -313 -77 -121 -397 -234 -393 -124 313
5439 313 -23 -503 -882 156 580 51 -647 -331 -20 229 -115 -393 -29 591 30 -216 -263 -464 -174 548
5459E48o5o72k06N37o0k29j09L01J18N8j91j51K36L78o77L7M70L70o90k87K71
5480a3K2Q5K45o01J26M63P8m89K43J80k73M99j5l20m35M57J09m41j21L40J61o6
5502B34k85k50M46N86l21p09J75N00q7n33jL03M1K52k63m38m2O96K03m08p9m92
5524d72N23N53n14l13o8N52l44m08Q64l52j17J95j19m7K85l57m19M25K50j61k24
5545b68k8O6o6K75J15n04j56N20M18n01l48l36P64K79q0o79K4O41J9k31j01o9
5567b46K36L34m85Q8k93L52K6k90L68j57k17M05o1m86K01O39l86m09J88M42j47
5588A02j67j46K36L76P3n23o63R72L45r38N23j80q1K8K83M2l07k37N39l88K7K44
5610A60k14j6K80o43J54M95K20q53j15Q06M1m47l1l5L46J18j41m22j00M16P5O8
$$ plain form
5459 548 483 -189 -395 142 82 -147 -256 45 163 221 30 -121 115 493 -184 -147 323 693 3 -284 -13
5480 -13 9 94 339 -262 -136 327 405 -84 159 339 66 565 550 230 -205 252 361 -80 -201 139 300 234
5502 234 -51 -301 145 731 410 -299 -124 376 289 -244 -245 58 99 351 88 -350 -392 304 507 99 20 -472
5524 -472 51 604 90 -223 -291 261 -83 -491 373 21 -96 99 -20 -67 218 -139 -558 -133 117 -44 -268
5545 -268 -296 -230 -296 -21 94 -410 -566 -46 372 -129 -477 -813 -49 230 150 -529 -505 136 155 -76 -177 -246
5567 -246 -10 324 -161 -73 -366 -14 12 -278 90 -67 -284 121 60 -426 -225 414 28 -381 -193 249 102
5588 102 -65 -211 25 401 474 -49 -712 260 605 -333 190 10 -71 -43 240 282 -25 -262 277 -111 -84 160
5610 160 -54 -70 210 -433 -279 216 436 -417 -532 274 315 -132 -163 -198 148 266 125 -297 -397 19 94 162
5632A62j84l02j99N53N10j110K65L51J23p7k3k10L00o0k23m34N59N28o35l82M48
5653d0J48j89K34Om62J32J42L34p17J03M00j49o9q1j84J52N04l58k69O43j50j80
5675e0m89kN28J13m0k03k68M96j87l80K44K90n7Q5L32r13r6N23L25k02m17L26
5697d2RK21l41L1k85N23q2J72l96L0j32k41L32M24k60K33k22l97M59j55o4lj87
5720c73L40l3K07j80n48M33O87o28%M41k40m6k43j79J02N98K65m03m68M19j80
5741b9j58N42m35q4K08j32J02k19O2J75K62q4k70k31L68q6l49J05R26k32q34j12
5763e05J92O10J3L8m95n1J89Q3k53n6J81L00j27k68r6J67N48k82l36j7N04m0j59
5786A40O1k99m5L84j16o50L84L23k74r9L83l08J04j92L43J39J55k28k71k30M74
$$ plain form
5632 162 -22 -324 -523 30 540 -570 -305 46 169 92 69 -141 159 99 -124 -558 1 529 -106 -488 -40
5653 -40 108 -81 153 159 -303 -171 -29 305 -412 -309 91 -58 -127 -208 -392 -240 264 -94 -363 280 130 -50
5675 -50 -539 -541 -13 100 60 -143 -411 85 -102 -482 -238 52 -5 80 412 -501 -597 -74 251 49 -368 -42
5697 -42 -33 188 -153 -122 -407 116 34 206 -190 -160 -292 -533 -201 223 -37 196 -26 -423 36 -119 -183 -186 -373
5720 -373 -33 -66 141 -39 -587 -154 533 -95 -95 346 106 60 -183 -362 -260 338 603 200 -268 151 -29
5741 -29 -187 355 -80 -164 44 -88 14 -205 -143 32 294 210 -60 -291 77 -9 -358 -253 673 441 -393 -505
5763 -505 -313 297 310 348 -147 -198 -9 74 -179 -235 -54 246 119 -149 -245 -78 470 188 -148 -165 339 299 140
5786 140 201 -98 -143 241 125 -525 -141 182 -92 -191 192 -116 -12 -204 139 278 433 205 -66 -296 178
5807A78K6M1q0m31j7K17O23l75m48M42j6j71L8q6o1N68k92n18P12j98m43J36L14
5830A59k25J52o1k30k98K27J91M83n16m7l3j9M15m2m65J26L38ol46K40J90l93
5852a60k42K96j10L00o5n0l27K75J91j40j70R1n4K83L39k95r7l65N51k87L0j50
5874a56M43j33k20n22J78Q46M4p89N4q3j69M92R9N4j84p5N7k1L3L24J41k49j71
5897gl3rM24j31m50q3N21L26q90L92m70L95P5p5P9n48M11k50K31M32k06j47Q7
5920G4K51l24K41J75m84j78L85j22K60k33j89k43M35R1k96m8K85j68J04P4j57
5941f7K22k24J06k99q8L36M18n99Q3O9r5K44K9m55j47M13J83J43j69k02o1q6L62
5964A16k32L2k26J95k14L66K01m83n5J20J70kL07m19k52K86P00o76j58K10l60
$$ plain form
5807 178 204 245 165 -266 -283 -66 557 182 -266 176 160 -11 27 -59 -120 448 156 -362 350 152 -291 -155 159
5830 159 -66 86 25 -205 -503 -276 -85 398 -118 -165 -198 -217 198 156 -309 -183 155 149 -197 43 233 -160
5852 -160 -402 -106 -216 84 19 -31 -358 -83 108 -32 -202 -111 -165 118 457 162 65 -300 251 -36 -6 -156
5874 -156 287 154 -66 -588 -410 436 480 -309 -255 -338 -507 -15 84 138 -46 -121 -64 -85 -52 272 413 164 -7
5897 -7 -40 -49 375 244 -206 -289 232 558 -332 60 -410 -15 60 -15 64 -484 -73 -323 -92 340 134 -13 74
5920 74 325 1 242 417 -67 -245 140 18 278 45 -144 -387 48 139 -157 -205 80 -88 16 90 -67
5941 -67 155 -69 37 -262 -350 -14 404 -195 -112 -43 -138 106 135 -320 -467 -54 129 272 103 -99 -160 -246 116
5964 116 -116 -84 -310 -115 -329 37 238 -245 -300 -180 -10 -12 295 -124 -376 -90 610 -66 -224 -14 -374
5985c74L67l8N9k23J07M38l41l09L60K03m22L13k10N9J3M07j6o42J01K31l21N02
6007B64K78q35K12j32k20N63J84n10J7L02l4J03J92m84k11j39O77J00l52p8K47
6028A44k22N62m52M7k10K38j48mK08m5j24o4O4j25K31J80j41l00L1K11j70j56
6050b45M65l56M40n50N48m77M41o6l61p4L04K70p0K2q50L9O91p8j25j6j11K34
6072G5N5j05k29j29J90K70r2J17n6k48JK39M7r3J21l2n64M67L21j70m20L42k70
6095a63q9K48M6l48M99J69n27N9l1L55l05M65m61l7j44O39k27m86o0N53M46l76
6117B25l49j66L9P78j36k67m06Q0L64L9L68p69N1K19j72NJ50Pk94K60j05j69J58
6140i0KJ74k65L38j45l77L52l4K55l23M3O3N3K15M1k71r6M0K19l22PmNN33m4m31
$$ plain form
5985 -374 -7 -45 14 -209 -102 336 -5 -314 46 249 -173 140 -70 -11 2 409 393 -249 -148 83 -238 264
6007 264 542 -293 -81 -213 -433 130 314 -196 -179 123 89 192 384 -100 -311 -450 227 327 -25 -103 144
6028 144 -78 484 32 79 -131 107 -41 -45 163 118 -6 -70 -6 -131 100 280 139 -161 -130 81 -89 -245
6050 -245 220 -136 304 -246 302 -175 266 200 -161 -235 69 339 269 291 -559 -520 171 93 -32 -48 -159 75
6072 75 130 25 -204 -333 -143 127 35 152 96 -152 -151 88 135 42 163 131 -433 34 355 185 -235 107 -163
6095 -163 -252 -4 42 -306 193 362 -165 -106 -137 218 -87 378 -83 -120 -264 375 148 -338 -398 155 601 225
6117 225 -124 -290 -251 527 391 124 -282 -202 162 201 569 -200 -149 70 -102 -97 53 60 -234 26 -79 -248 -90
6140 -90 -88 86 -179 159 14 -363 -11 -45 210 -113 -70 -7 46 261 302 31 -65 -25 194 -128 -121 -125 -120 413 369 -62
6166f2R7j66k4N71j10l29j00J78J02l22L57M6j01m37O95r6j89J02k74J9K89J06
6188C52m02j10J49K30k57k5j60Q5J61L65k31jk3k22J04j03M24m85L43l09J51J38
6210A74k38L08l46L76j61j34lQ5J37L3M9j7o71R8O19p9l61K26N7j44M73k15l77
6233a11q3O92j11k19M4k96m06P32K69m88J61m87P2L15J8J00m68L5L69J2Q5n02
6255b67Q5L40P6Q1l08k42K31K20j13J20l27q2K72K66l00j5j39J20L78l43l87N10
6277A76J22Lj05j9p7j15L01J56l80m09L93q8oN56l34K06m88M55m36L83L7k61j64
6300i4L8M04r5l15r2L93m7K7k76o2L15J84k47m6pJ26n27P15l91p0J49N0k2O0k60
6325i0n4K49J91j02j87OL80o19l4N75k86j82L37K15l36%Kl01J96J74l89M06K3
$$ plain form
6166 -62 35 -131 -155 416 306 -23 -123 55 157 -165 192 238 137 -300 395 299 110 212 -62 -43 246 352
6188 352 -50 -160 -11 219 -38 -63 -223 -138 23 388 157 156 133 -89 15 -88 336 -149 194 -115 36 174
6210 174 -64 244 -102 274 113 -21 -24 61 198 231 280 263 -408 -310 309 230 -131 95 152 8 481 266 -111
6233 -111 -194 498 387 168 212 -84 -490 242 511 23 184 -303 -231 84 102 202 -266 -231 138 150 235 -267
6255 -267 -182 158 234 315 7 -235 -4 216 103 223 -104 -186 86 352 52 37 -102 18 396 53 -334 176
6277 176 298 301 196 177 100 -15 286 442 62 -347 46 -42 -48 508 174 380 -108 347 -89 294 331 70 -94
6300 -94 -56 348 253 -62 -154 239 192 219 -57 -119 196 380 133 87 80 206 -321 394 3 -67 82 132 110 170 -90
6325 -90 -144 105 296 194 7 13 393 -226 -260 315 29 -153 184 399 63 63 65 -236 -40 134 -255 151 174
6348A74l24k75M90q3l5n47Q39P7o54L61M0L9Q4j71J9j49j69M80R4l84j06r9M09
6371A10K33m05k12J29J14n2R2k16o8K79N2n2k18K84k00k21N25j75j41k02L42M07
6393D05j42k69k9j17K80k97J91j5kk18K04K71k34j20j59N86k65k17J1J54R0K41
6415C49l89J43p1k6K74M3Kp30M45Mk30N5J95j04J69L49m05K7l05N59m83K72K4
6438A67l05j63%O43n99N4J87k08n5L55l0r7p0K99k13K45k2j65k52K49J13j83J0
6461d0J76k17k00J91L26k85J41j77j58P7p9n2l7O10j00m01j36O65k32N7l21j16
6483c08J20L08k43kJ85k08N0ml1jj86P9Q9M0j51L38qm02J64J49N4P3l84L22k02
6508a59L52l44k51N84l12K7L13J12n04Q1J59o0J10l62J49K33R3K25m99J96J03
$$ plain form
6348 174 -150 -425 65 -18 -53 -600 239 316 -338 23 63 102 186 15 34 -115 -284 196 290 -94 -200 -299 110
6371 110 343 -62 -274 -145 -31 -83 9 -207 -275 4 56 4 -214 70 -130 -351 174 -1 -142 -344 -2 405
6393 405 263 -6 -35 -152 128 -169 22 7 5 -213 -9 262 28 -92 -251 335 70 -147 -136 18 108 349
6415 349 -40 103 32 6 280 323 325 -405 40 44 -186 -131 64 -40 129 478 73 100 -205 354 -129 143 167
6438 167 -138 -301 -301 342 -257 -203 -16 -224 -279 76 46 -51 -121 178 -35 210 188 23 -229 20 133 -50 -40
6461 -40 136 -81 -281 -90 236 -49 92 -85 -243 -166 -245 -297 -334 276 176 -225 -361 304 72 129 -192 -308
6483 -308 -188 120 -123 -125 60 -148 -98 -102 -133 -134 -320 -241 -152 -112 -263 75 67 -335 -171 -22 32 105 -279 43 -159
6508 -159 193 -151 -402 182 -130 -103 210 322 -182 -101 58 -2 108 -254 -105 128 221 446 -53 143 246
6529B46j04m09L09L13n00K64K31m60j74L04L07j49J69k13k03L78n41L40K8Q1K0
6550B37l75M78j28k41J36K29k05O1L9j88l23N90j84J11O1J53m05l2L80O3m13R9
6572A43j52J48k0J47k35O8R0j23P2J9j72K51N2K64n14M1m14Q1k0M92l40N1M25
6595C54m81Q5k86M31k61j58M08j40l11K80L88m60k51M12p6l06M12k01l0M03k26
6616a4m97N65n5k65J17K93j23q2J68k60k5J60K45l94k19K09J06j79L60lp0m41
6638d04L97J64J27j70P2l46L59p0j12k2N9n3j04M16k97j09J92K62k57k05JM25
6660C25m35J19J73Qk46L44k57j41J76J75j31k59L89K5l16J83l1j88K19R4k92J52
6682H6Kl89N12N1k71j34K45j37J42P2N1n21K40L7j5J24N8j9j75M3J41q9kO9nj36
$$ plain form
6529 246 142 -267 42 355 -145 119 350 -110 -284 20 327 178 347 134 -69 309 -232 108 136 217 237
6550 237 -138 340 212 -29 107 336 131 192 231 43 -280 310 126 237 298 451 46 14 394 457 44 143
6572 143 -9 139 119 266 31 99 189 66 138 157 -15 236 288 552 38 79 -335 -254 -274 218 -122 -71 354
6595 354 -127 -42 -328 103 -158 -316 92 -48 -359 -79 309 -151 -402 10 -66 -372 40 -161 -191 212 -14
6616 -14 -511 54 -1 -266 -149 144 21 -61 107 -153 -178 -18 227 -167 -386 -177 -71 -250 110 107 37 -404
6638 -404 -7 157 284 114 186 -160 199 129 17 -5 54 1 -103 313 16 -93 99 361 104 -101 -100 325
6660 325 -110 9 182 190 -56 288 31 -110 66 241 110 -149 240 265 -51 132 101 -87 132 226 -66 86
6682 86 88 -301 211 262 -9 -143 102 -35 107 179 230 -291 -51 -14 -29 95 153 134 -41 2 143 54 52 121 116 -20
6708b0N6J51l44L26j2O9l01M66k88l68M58l05k9J09M6kk25M30l20J28J96k67J80
6731A34j36L21l28P9J82k57J68k99L34k69N8j07J50j01K22j18j38J25j95K1P6
6752g8J13n6J38j68K98n73M37k5l57K1M28l01K33k06j85K90n3J06L94n58L45l00
6774e7k75N25k99PL73l03J05l5k64K65J96j97J05j23Qk25J48K88j14j64R9R5n
6797A53O8j5k75K37k37n4K68k83L84n03J23K88M5j90Q9j64J18k31M78k14Q0j00
6819F5J06j36m9J62K2m15N23j65k86M8J59M3j63m2m8L38j8J33n15j3L28r0J33
6842A20r5L26m74k16L70n8N5Q8m6k07M19l15j16j26J27m2K93J6m48L50K38l43
6864h4j16J33oM6K15j80R3k9J23l68R9L40J7l95j51J89j31M5j1J87m8n4J68k27
$$ plain form
6708 -20 36 187 -157 169 157 226 -75 391 103 -265 193 -112 -141 -32 14 12 -213 217 -103 25 221 -46 134
6731 134 -2 319 -9 70 252 -5 163 -136 198 -71 -13 -120 30 -71 151 33 -105 20 -175 -154 -78
6752 -78 35 -21 117 -51 247 -326 111 86 -271 -250 178 -123 110 -96 -281 9 -44 62 456 -102 243 -57
6774 -57 -332 193 -106 -99 274 -29 76 41 -223 42 238 41 146 23 31 -194 -46 242 128 -36 63 158 153
6797 153 221 206 -69 168 -69 -123 145 -138 246 -257 -134 154 199 9 98 -66 52 -179 299 85 165 65
6819 65 171 35 -14 148 170 -245 278 113 -173 -125 34 77 -86 -128 -176 162 144 277 -238 -251 77 -13 120
6842 120 25 351 -123 -339 31 -27 28 116 70 -137 282 -33 -149 -275 -148 -190 103 119 -329 21 259 -84
6864 -84 -200 -67 -73 -27 188 8 101 72 195 -173 -74 266 283 -112 -263 -74 -205 -160 -171 16 -32 -86 82 -145
6888a45J7l8M4K36j61l50L58n2J34j13j80K71j56L56k25O2l3k28J47l1q1J66J22
6911A20j19p0J04J86n75K64J25k10M85j09j68O8k37J06P7k02j61N21kl14O6m4
6933h9l7J2j9L65m68L91k87k2Q9L21k47J08j39K23j69k08M5K82j79J46P3o7q6
6956C8j89J03k10L19k11r6M56j17J33m39P06o90R0J36J23k69n0M42l24Mk34M07
6978A28r9j4L9j29J27k08J78k30K98J81m11j8J62O4k82j60J41K52R3J1k67K10
7000F6l9r9Q2%l53K66N8p5j7K05j06k57K00j5%j5L72k56k64L97k88N6L3J29L31
7025D11n25K47m50M21k86Q3m86O61k11k44M36k42J11K26J7j18K4n3j97r0O20j47
7047B08k59j32L97K31m63L0p2q6J18L34l68m0Q0L4R3J7J2j42J14k93L89o0J0l25
$$ plain form
6888 -145 -128 -166 -122 114 -47 -397 -39 -91 43 -70 -250 21 -135 221 -4 58 25 -203 -56 -87 -168 -2 120
6911 120 1 -69 35 221 -354 -90 35 -175 310 201 33 101 -136 -30 47 -155 -316 205 203 -111 -45 -89
6933 -89 -126 -114 -133 232 -236 155 -132 -154 -65 256 9 117 -22 201 32 -176 -131 151 -28 118 191 124 38
6956 38 -151 -48 -258 61 -150 -246 210 93 226 -213 493 -197 -107 29 152 -117 -167 275 -49 -45 -279 128
6978 128 29 15 54 -75 52 -156 22 -208 90 271 -140 -158 4 68 -214 -374 -233 19 112 123 -144 66
7000 66 27 -72 10 10 -343 -77 -19 -94 -111 94 -12 -269 -69 -84 -84 -99 273 17 -247 150 -138 -82 -49 80 411
7025 411 -114 133 -317 104 -182 -99 -585 76 -135 -379 57 -185 -74 152 169 51 75 22 -175 -265 355 208
7047 208 -51 -183 214 445 -18 12 -60 -146 -28 306 -62 -102 -22 12 105 122 134 -8 106 -187 202 142 152 -173
7071a73K6L52K3J7k84l4L44N5l80L6L12j01j75M2j26N75n72J13q1J8o9j23J58
7094d7K79r0Lk84j5J47J14q4J55L7l86L73J26l57k18L84m3k9l15K60m6K5K79l13
7118d5k8J05m4J1Q0mj49j26K78j63m4K92k42q5K31k98J50K18Nk53L33j71k25K45
7142G1l3J8J00m15Q4K98k74K21j22n3r2K30p6J69k52k06K44L19k0l22j16L66k19
7165h0J27J59l96K26j02J75j18J02n6J19n9k26m1k5J7K0K33k28L81n3l17OL9j53
7189b50J80k4j60K96j32j01k0M12j02l20J36n9K19M5j65n8K73l25K38o5K2l6j51
7212a47J0L23j34j45J27J63RJ3k22J65l92J64o1N9R4j45p7J41K4Q7j00k95k6L15
7236e0Q9l65K40j03P1J28nr3n6K26k08J20l70M25r9p9j42P9j66M43J0p4Q5m04
$$ plain form
7071 -173 -147 205 228 245 -39 -73 271 326 -54 -18 294 193 18 60 -66 509 -63 50 -31 -13 -82 -205 -47
7094 -47 232 142 145 -139 -154 -7 107 23 178 215 -171 202 328 -29 -247 137 94 65 -250 10 -36 -11 268 -45
7118 -45 -73 32 -12 -1 79 75 -74 -200 78 -85 -129 163 -79 -164 67 -231 -81 137 142 -111 222 51 -174 71
7142 71 38 56 156 -259 -175 123 -151 70 -52 -105 -197 33 -43 126 -126 -332 -88 231 211 -111 -227 139 -80
7165 -80 47 206 -190 36 -66 109 -9 93 37 156 97 -129 -170 -195 -178 -158 75 -153 228 175 -142 -136 -97 -250
7189 -250 -70 -94 -254 42 -90 -191 -211 201 99 -221 -85 -144 75 120 -45 -103 170 -155 83 18 40 4 -147
7212 -147 -137 186 52 -93 34 197 206 219 -3 162 -230 -66 -127 -68 26 -119 -196 -55 -31 56 -44 -339 -365 -50
7236 -50 39 -326 -86 -189 -118 10 5 -88 -144 82 -126 -6 -376 49 -50 -129 -271 -192 -358 85 95 21 106 -298
7260b98L11m5PR1j30m1m3J83o7j02K32j57Oj13J74l62J71j94M42j6O5j82j37J72
7284c3J6o2K10l44J84Q4N2L0j85j44K79j23J6J60j00Q9l27L9L66j16N6l54K49
7307D2k7J59k31LK37r2K38k64j11K87l3j50j83K55j21j62J57J30n7j90NM27j38
7330A81o1N5J6p4l56L86j47J67k75L50j21k29K00n4K31k96K45K3J46m39K00J41
7352B89k81r1m5L23k37j41Q2n0K08rJ14j93o2kL27r9k45K7L3J55J59j64k58N80
7376D20o56K01O6J7J91o0k09R4o1l76M42k24j27K17j27K01r9o9L49j01L8o6q3
7399b2k14Q7k28N9K81ok8J47r1p9M08k90k29L92m37J39J29P5Q1q9q6Q7k95PK66
7424F4j01J41Q4J53l25k79N12l64NK91l85Q6L70o9l3p2J67k19n7k58J33J76Q0
$$ plain form
7260 -298 13 -32 -25 66 -64 -105 -148 35 -32 -134 98 -59 -53 -166 8 -354 -183 -377 65 49 114 -68 -205 -33
7284 -33 -17 -79 131 -213 -29 55 107 137 -48 -192 87 -36 -20 140 40 129 -198 -159 207 91 147 -207 42
7307 42 15 174 -57 -54 183 91 329 65 -46 241 208 58 -125 130 9 -153 4 134 77 -113 -108 319 181
7330 181 120 175 191 117 -239 147 0 167 -108 242 121 -108 92 38 269 -27 218 241 387 -52 148 289
7352 289 8 -83 -128 195 -42 -183 -101 -151 57 48 162 -31 -93 -95 232 133 -112 -85 -52 103 262 98 -160 420
7376 420 -236 -35 31 48 239 179 -30 64 3 -373 69 -155 -282 -65 -192 9 -90 -159 190 89 127 61 -22
7399 -22 -236 -149 -377 -318 -37 -43 -71 76 -15 -94 314 24 -205 187 -250 -111 18 93 174 85 -1 86 -209 -202 64
7424 64 -37 104 188 341 16 -263 249 -115 -110 181 -204 -118 252 183 150 78 245 26 -31 -289 -156 20 100
7447A00J48k41j5J96n2p7l5J2K12j79L05m75P5Q2qr7J73nk63M24P1l08J77j00
7471A20r0k12L97o2k38J89J66k19j28L28k74Q2j44L66j19n7n45K78m0K58K2k04
7493a26J69M7k73K32M5j03J16O2k7k73R1M29n50J38j36r8L22N4j78l8q6J22k61
7516c22J12J99k24J72l06m9L26J00J23k00l41K78J26n4L12l02L7m8J44J06l75
7537a86L89l69L18R8j71j37K34m25k0R4O3q9j80n1K30L47j31Mj43L42R8k06O9
7560A78j24M0o9J01q2Q7k92L19M0k12J29j05m6L19j3q6j83M4J42k00l8o7K38q1
7584C9J05k15M3j04M29p25Q23k62m9k3j08P8J75p9k66R3J59P4k17j46L34N7l19
7607a04J19q8m1p4J86K7J67j40l5J15j13kk82L85q2J1l12M07l02L27M9l45K05
$$ plain form
7447 100 248 7 -8 188 136 59 24 36 248 69 374 -101 -26 56 48 -49 124 119 -144 280 351 43 220 120
7471 120 30 -182 215 153 -85 104 270 51 -77 251 -23 59 -85 281 162 105 -440 -162 -202 56 78 -126
7493 -126 43 90 -183 49 94 -9 107 169 142 -131 -40 389 -161 -23 -159 -257 65 119 -59 -97 -183 -61 -322
7516 -322 -210 -11 -235 -63 -369 -418 -92 8 131 -69 -410 -132 -6 -60 252 -50 -13 -61 83 189 -186
7537 -186 203 -166 152 250 79 -58 176 -249 -269 -175 -112 -201 -381 -432 -202 145 14 18 -125 217 315 109 178
7560 178 54 94 25 126 44 131 -161 158 198 -14 115 10 -36 283 270 184 1 45 187 -13 -51 -118 120 39
7584 39 144 -71 -28 -132 297 -428 395 133 84 61 -47 31 206 127 -139 -46 113 187 -30 -176 158 215 -104
7607 -104 15 -73 -114 -188 -2 25 192 52 17 132 19 17 -265 120 38 49 -263 144 -158 169 218 -127 78
7630G8j75J24M0Nl2j49j27O6L20Q7m29L90o07L43K47m65J33j7J33K6J40J56l01
7653a4l3KJ41k39q1M37l60l8J97j17M0K96k22k30L84k85j73J20R9K68k89K13k35
7676a19K02l55K91k27N3N14m12Jl2L01k58J97r5m0Q4J43l54J58K43n8k31K67k44
7699B9P6m5J27p1j66J73j26r2J03O4p7K39j76R4k14R8o8P0J4j74M8l6M14j95j48
7724c9K44j97L1j44K24r7j69R9J07K4p3J66k26j53L56j62J19j25mk38J54k2k09
7747c34K60j8O4J01j02k10J03o1J48q6M6K80l96K2j9J51q8j75K66l9J0l8k12J89
7771a38Q5k06L46N5m61M19l5o9J2Ml12N44j20j47j09O9j98j77O78j89K62m28J91
7794G6k02J16J98l80K99M3K6n02J97J12K9k95J80J35P6k98L90k7n2j76l8K3j0
$$ plain form
7630 78 -97 27 67 72 40 -109 -236 -170 150 237 -192 198 -409 -66 181 -284 -151 -168 -35 -9 131 287 -14
7653 -14 -47 -45 96 -143 -224 213 -147 -185 12 -105 -65 231 9 -221 163 -122 -295 -175 -76 192 -97 116 -119
7676 -119 83 -272 19 -208 -155 359 -53 -52 -84 217 -41 156 61 21 105 248 -106 52 295 237 6 273 29
7699 29 105 60 187 116 -50 123 -3 -95 8 72 -5 234 58 152 -62 36 -32 38 52 -122 -74 -110 304 109 -39
7724 -39 205 8 39 -105 119 22 -147 -48 59 83 10 176 -50 -203 153 -9 110 -15 -19 -257 -103 -125 -334
7747 -334 -74 -92 -28 73 -29 -239 -136 -197 -49 -135 -89 191 -205 -183 -202 -51 -139 -314 -48 -87 -77 -115 -327 -138
7771 -138 -53 -259 87 142 -319 100 65 -4 8 12 -300 244 124 -23 -132 -63 -261 -438 240 51 313 -115 76
7794 76 -126 -10 188 -192 107 150 176 -326 -129 -17 12 -283 -103 32 108 -190 200 173 121 -55 -93 -70 -80
7817h0K66l06L50j36L14k21j9l3o0NK9n4r4J44J50k25rQ4n7j18R5M6l11L22j04
7842b2J36k93K48P7kK7k96J76j73J56M6j61L20j03j46L96o40J94O7j43M09k26
7864D7O5k15KQ3j00J51k46O4J61K88l22j10j99J91KN1J72N2k83J32J10r6j50l16
7888d66P03n16J32j17M3J86L2K0l26K98K16j90l78L79j46K34l46L40j67K87o9
7909A49l03q5K66P7k33M38k41m5j99J99q9O0k67K73o7K33k59Jj19K87j65L6J03
7932E0o0j72J57L83j90j43k48L3K72j17q1J26jj51j27N10q0m19M25j51p4J06O8
7955A16r2q4L11j21j02o3R3j42J11K44l9L0l79J98k78j9R2l1M04j78J08k43j06
7978a70K12j3k40J53J65l01K23R2k92o9L15L7nq7j01J99O0o9k83K04J74k39j02
$$ plain form
7817 -80 186 -120 230 94 408 187 168 135 75 80 109 55 -39 105 255 30 21 105 48 -70 25 71 -240 82 -22
7842 -22 114 -179 69 146 144 171 -125 51 -122 34 80 -81 239 136 -10 386 -254 -60 7 -136 273 47
7864 47 112 -103 -101 -18 -118 33 -213 -149 12 300 -22 -132 -331 -140 -138 -87 85 137 -146 -14 96 0 -150 -466
7888 -466 237 -279 -147 -264 -221 -35 -3 17 -309 -11 205 15 -363 16 -130 104 -242 98 -69 218 149
7909 149 -154 -239 27 104 -129 309 68 23 -176 23 -66 -6 -273 0 -67 166 -93 -92 -211 76 -89 -53 50
7932 50 -10 -182 -25 358 168 25 -223 -190 82 -35 -116 10 9 -142 -269 241 161 -258 167 16 -58 48 116
7955 116 24 -60 251 130 28 -35 58 -84 27 271 232 262 -117 81 -197 -216 -124 -155 249 71 179 -64 -170
7978 -170 42 29 -211 -58 107 -194 29 121 -171 -240 75 112 107 20 -81 118 178 109 -174 30 204 -35 -137
8001a37k4J30%J78j34j52N1k4P0K42m95J99J83l6j96M4JP9L01m28J75P0r8J69
8025A68m65K91m6N2K44m14K71j24R9k69L27j93j15L45l58K66j18k2q2N4J23m4
8047a0M9o7J63k20K94j45k62O1M7%j86M20j3j59j6J48P3j31K0jr7M4K44l30p3
8072a47J24J70k84K11r6K17p1p0K32o3l10M8P7j0j50L05l15J99k93M58j05k1J93
8095B99n7l9k93J58O5n8p4L2j12j09L88k45J13j17M6p0J95q3po8L97n15J69p3
8119e8J48k04L0K27j0m7l94K37J35J12j17N2l43L86j86lj64L72j95j7o9m7J58
8142CN9k52J70L5n1k56L42K01l61J01L4k46K98j30j21J18j50lj04O3L43k95J40
8165f2J1n2K12l31p6J77J14pq5q6L9K29o2p5k72M02m3K8j33j40N7K13j85K22m18
$$ plain form
8001 -137 -161 -31 -31 147 13 -139 -88 -112 -42 200 -295 -96 87 51 -145 -101 -100 -21 280 -148 27 97 -1 168
8025 168 -297 -6 -52 0 244 -170 101 -23 76 -193 134 -59 -174 171 -187 79 -39 -61 -143 -89 34 -10
8047 -10 39 -28 135 -85 209 64 -198 -137 -90 -90 -276 144 131 -28 -44 104 177 46 66 65 -32 12 256 -74 -147
8072 -147 -23 147 -137 74 -22 195 124 54 286 223 -87 -39 38 28 -122 183 -132 67 -226 232 127 106 299
8095 299 242 203 -90 68 133 75 1 33 -79 -188 200 -45 68 -49 -3 -73 122 39 32 -36 361 -154 15 -58
8119 -58 90 -114 -84 143 133 86 -308 -71 64 176 59 111 -232 154 -32 -35 -199 173 -22 -39 -108 -155 3
8142 3 62 -190 -20 15 -36 -292 50 251 -110 -9 25 -221 77 -53 -174 -56 -206 -209 -313 -250 93 -202 -62
8165 -62 -51 -103 109 -222 -298 -121 -7 -14 -99 -185 -146 83 21 -54 -326 76 33 61 -72 -212 -155 58 -127 95 -323
8190c23L67
$$ plain form
8190 -323 44
8191D4
$$ Imaginary data points
##PAGE= N=2
##DATA TABLE= (X++(I..I)), XYDATA
0@%%%qJ6j5J5k4L2l9N1o0P2r1J15j39J66j99K37k80L29l83M42n13N92o76P71q79
28d68R98j129J273j430J604j796K006k236K489k766L070l405L771m176M624n119
44b690N671o290O985p772Q679r727J0954j2425J4219j6459J9358k3281K8910l7736
58b1604N3680r1533L40767L76437n22729k38261J15147K69336j0517j32295r8785
69C9643R1815R3565j2978j18647k9398P0244J14673J7296j09201j36872K1260
80D1400P3328n1595r4972R3582J58364k1138j64193n8854R8452R3039o4707j36886
92c4180r280J16617N279j37511m6444J31748J13682l4206j16727p0733O8384J42162
104A28791m731k15331j73159R9491K46141R8391j44355j73560M4783J76784Q777
$$ plain form
0 0 0 0 0 -8 8 -7 8 -16 16 -23 28 -32 40 -51 64 -75 91 -108 129 -151 178 -205 237 -276 316 -360 411 -468
28 -468 530 -599 674 -756 848 -948 1058 -1178 1311 -1455 1615 -1790 1981 -2195 2429 -2690
44 -2690 2981 -3309 3676 -4096 4583 -5144 5810 -6615 7604 -8855 10503 -12778 16132 -21604
58 -21604 32076 -59457 281310 657747 135018 -103243 11904 281240 270723 138428 39643
69 39643 131458 225023 212045 93398 64000 134244 248917 266213 157012 20140 41400
80 41400 114728 63133 -31839 61743 220107 198969 34776 -24078 74374 167413 102706 -34180
92 -34180 -43460 73157 78436 -59075 -105519 26229 139911 105705 -11022 -81755 -13371 128791
104 128791 124060 -91271 -264430 -164939 81202 179593 35238 -138322 -93539 83245 92022
115I2022j69411m9219J38358P0915j05020j20460N645J10860R7200j5596p1361
126a6067K5595R0907k9291j60828r0620J06515J93815N8535j62192j72845O3316
137i3160K01185N8001r9543m8908N6316L2517p1853j10151L7J46362J11898p1963
149A10738j11725M2188J15013Q693r3136o2599M3324R0903%j17590o0155R9827
161F5481J06796k4562p0879J1221P1236K1642q5745j07687K8170J34305K1714
172A71692j44089q4939J14648J70314J7651j65583j53445O4465K00103L6599j88242
183C9174j41611O6619J31231K0338p7149m3369O7460R2776l5265j36853n9988
194g6637O6056O7851j5811o4845l2078N0957O5536l7612q3108L1437J08445j875
$$ plain form
115 92022 -77389 -126608 11750 82665 -22355 -142815 -137170 -26310 70890 55294 -16067
126 -16067 9528 100435 71144 -89684 -180304 -73789 120026 178561 16369 -156476 -93160
137 -93160 108025 166026 66483 17575 73891 106408 34555 -75596 -75559 70803 182701 110738
149 110738 -987 41201 156214 164907 71771 9172 52496 143399 143399 25809 -34346 65481
161 65481 172277 147715 76836 88057 159293 180935 95190 -12497 15673 149978 171692
172 171692 27603 -57336 57312 227626 245277 79694 -73751 -9286 190817 227416 39174
183 39174 -102437 -35818 95413 115751 38602 -4767 62693 155469 120204 -16649 -76637
194 -76637 -10581 57270 41459 -23386 -55464 -4507 61029 23417 -59691 -28254 80191 78316
206G8316j16955p0736L0965M9029r414l8828K4780R1382J6338j17170p9559Q4824
218e7028J21324j5612j34152j04380M3151J49444N7748j24629j15603Q4387J73647
229G8297K4749j50955j34218M6564J52442K3951j44579p7447J12800J17755l7372
240A1987q9521J96P6116M7149m9485r4837j4444Q2845M5238n2571n1728K9398
252e9657P8557M2534m2294o8304J7596P1072k2871r8261m126J02199M2649p2473
264a3379o7875M4589J20278M4481j02965j11151L8832J12011O331r7688o7253
275i3789M1210J05940N1482o8274q2317M1515R4374j2311r7034l8328N6652N3548
287E2668l6005q3309P923J24648O8339r3261j04823L6107J01686J2269r1799q8658
$$ plain form
206 78316 -38639 -109375 -78410 -29381 -38795 -77623 -52843 38539 54877 -62293 -141852 -57028
218 -57028 64296 48684 -85468 -189848 -146697 2747 60495 -64134 -179737 -95350 78297
229 78297 103046 -47909 -182127 -135563 16879 40830 -103749 -181196 -68396 49359 11987
240 11987 -77534 -77338 -1222 45927 -3558 -98395 -112839 -29994 15244 -37327 -89055 -59657
252 -59657 18900 61434 19140 -49164 -31568 39504 16633 -81628 -85754 16445 59094 -13379
264 -13379 -81254 -36665 83613 128094 25129 -86022 -47190 64821 71152 -26536 -93789
275 -93789 -52579 53361 104843 36569 -45748 -4233 90141 77830 -19204 -57532 -880 52668
287 52668 16663 -66646 -58723 65925 134264 41003 -63820 -27713 73973 86242 -5557 -94215
299i4215K5305J12273L9357r2514p1733P0019J06543N1r4158o8941L4947P6509
311D3443j3909j00062k2601J02006P2581n0349p8069L025P1009M7750m5102q6227
323e6505o043O2852M015o1263o364P5638N4053k9405o9194j5635O8672M6554p4318
336f943r9592L2052J11589K3549q9323p6631M5269J31695N9642j03589j27503
347i9785K4038J12816J8142r5204o7663M9996J07068K7277q9016o3077O8079Q6151
359G8822l1971r0939k2487M8352L9571k3151n9397k272P9487N4421m2402n4210
371b6176J6053M0019j0669n8984l9649M1466P9375m189q6941j9677Q8838N9063
383G8529n0875p2508O493O7426K8475p7720r7674K5036J21841N4156o0540o3101
$$ plain form
299 -94215 -68910 43363 82720 -9794 -81527 -11508 95035 95086 928 -68013 -33066 43443
311 43443 29534 -70528 -93129 8877 81458 31109 -46960 -43935 27074 74824 29722 -56505
323 -56505 -62548 304 4319 -56944 -63308 12330 66383 36978 -32216 -47851 20821 67375 -6943
336 -6943 -106535 -74483 37106 60655 -28668 -105299 -60030 71665 131307 27718 -99785
347 -99785 -75747 37069 55211 -39993 -107656 -57660 49408 76685 -12331 -75408 -7329 78822
359 78822 46851 -44088 -66575 -18223 21348 -1803 -61200 -63472 16015 70436 28034 -26176
371 -26176 -10123 29896 19227 -39757 -79406 -37940 41435 37246 -49695 -69372 19466 78529
383 78529 27654 -44854 -38361 29065 57540 -20180 -117854 -92818 29023 83179 22639 -40462
395d0462J6052O0881J8212o7061o7479M2419R4025j2772j06595l7268Q1126Q8131
407F9209m096p0720k8553N9537M3768o9890r2840K0589R4836L8369m5528n4484
419c9803Q919O9666L5290n8072n8613L8453O3896k5178q2906k8419N8427P3577
431E5237j333o3695r432P6299L3597p6464p5866K2465O9109K2136m7131n2830
443d7908K2632P8377J6375o7600l2201N9495N8681l0874r0435m9938N1512Q3339
455E1455p087p2389J236Q3952L2710o6696o9732J0062O9070L4904n6939p8297
467f7751J3338P7265J9906m8183k2158M4622N7320r104q6801o6609M6156Q0545
479C8546j4193p2193l822O7387L8529l6523n9010J671O9852L3955o5274p3017
$$ plain form
395 -40462 -24410 36471 54683 -12378 -79857 -37438 56587 43815 -62780 -100048 -18922 69209
407 69209 65113 -5607 -34160 25377 69145 -745 -93585 -72996 21840 60209 14681 -39803
419 -39803 -30884 38782 74072 16000 -42613 -4160 59736 34558 -48348 -76767 -18340 55237
431 55237 53904 -9791 -19223 57076 90673 14209 -61657 -39192 29917 52053 4922 -47908
443 -47908 -25276 53101 69476 1876 -30325 29170 87851 56977 -33458 -83396 -31884 51455
455 51455 44368 -28021 -26785 57167 89877 23181 -46551 -36489 32581 67485 10546 -67751
467 -67751 -54413 22852 42758 -5425 -27583 17039 74359 65255 -21546 -88155 -41999 38546
479 38546 24353 -47840 -51662 15725 54254 17731 -41279 -39608 30244 64199 -1075 -74092
491g4092J6137N5644O660l5371j4463M3114O4252l201q4214m9786N4453N8285
503C7418l2341o5848J50O3540M0351m2136o7111K5396J01544L0005q4329p4371
515f7732K0682N7120Q591m7418l3184M9937Q4535r72q5539l8545N6931N9547j7108
528D6845o6079l0729M4346N0461k8807n8985K5603Q5419K4861n6877n0278J0155
540d065M2386O860n3397l7162N0344O9967j2364o3729j2926N2967M7441j7455
552F8867o6248k4679N3814L9907n3089o5984K6070Q3280L8560l7740n8163j016
564C579N4727J4835o5443m7487M4542O3272q930o1632k9108M5486O9959K367o8338
577A7829k7427M6829K1201n5925n3230K2384O8565L6228l9401o0820J1373O8221
$$ plain form
491 -74092 -57955 -2311 4349 -31022 -45485 -2371 61881 58680 -25534 -75320 -20867 37418
503 37418 5077 -60771 -60621 2919 43270 1134 -65977 -40581 60963 90968 6639 -67732
515 -67732 -47050 10070 18661 -28757 -61941 -12004 72531 71559 -13980 -52525 4406 63953 46845
528 46845 -19234 -49963 -5617 44844 16037 -42948 -17345 68074 92935 36058 -14220 -4065
540 -4065 38321 45181 -8216 -45378 4966 74933 62569 -1160 -14086 38881 86322 68867
552 68867 2619 -22060 31754 71661 18572 -47412 -21342 61938 100498 62758 4595 3579
564 3579 58306 73141 7698 -39789 4753 68025 59095 -2537 -31645 13841 83800 86167 17829
577 17829 -9598 37231 58432 2507 -50723 -28339 40226 76454 37053 -23767 -12394 55827
589E5827J5298o2349m1596K9027M3702j0885o1620l2201N7412P9967j2403p6815
601a6636j4049N8610K6005m9185n8022M460N9249K9976m8558m9636L5346P0807
613D8367L953n5923l5383K2370M6261p19o4936m3767M8575O8922j1787n6041j899
626c2007N5584L5009l8665p1032q939O5388L4268n0674m8115K7018N2464R943
638C0242k9077k2070K1080M3475o805o6575l7485M0150N0224n856l7778j0205
650c0680M1200M3121k5629o3496L224O8473J7931o6913n4798K3571O2391K3563
662D1958l8203l7016L2425N9561j0918o8356k8976L9043M1930j1109n1984k5649
674e7294M9412O0585j6544n9667j278N3898J9079m6779n3954N050N6360K4219
$$ plain form
589 55827 71125 8776 -32820 -3793 39909 29024 -32596 -64797 -7385 72582 60179 -16636
601 -16636 -30685 27925 53930 4745 -53277 -48817 10432 40408 -8150 -57786 -22440 48367
613 48367 52320 -3603 -38986 -16616 29645 28926 -36010 -79777 -31202 37720 25933 -30108 -32007
626 -32007 23577 58586 19921 -51111 -60050 5338 39606 -11068 -59183 -32165 20299 30242
638 30242 1165 -20905 175 43650 36845 -29730 -67215 -27065 23159 17303 -20475 -30680
650 -30680 10520 53641 28012 -35484 -32260 36213 54144 -12769 -67567 -43996 18395 41958
662 41958 3755 -33261 -836 58725 47807 -20549 -49525 -10482 31448 20339 -31645 -57294
674 -57294 -7882 52703 36159 -23508 -24786 29112 48191 1412 -52542 -47492 8868 33087
686C3087m9619m1082M3773O3267r979n5350j9814L1502L0845k1000n6196j3682
698f4248N4642L8822l0918m1310J3969M7683J8695l5406n2155L30N1001J2036
710A3141n5470l4603M3365N6768l022m8466k4679L7052M7570k3424p0578j3695
722g6041N4946K8897l4275l7405J2322N0142L0121l0025n1614L227M7068Q548
734E911m5107l5170J6955M6424J8966l6961l5575L6593O1323j3112o7522j9641
746f6916M0741K6353k6650m0024R037N5099K5109m0947l6666K9624M4268n067
758A3961m2352l0268J0867L8138J0977m1436k3929M9308N7477j6720o3699k1193
770e8869M5861M6354k6439o8294o130O4572K8109m7538l0315M1492N1380m331
$$ plain form
686 33087 -16532 -57614 -13841 49426 39447 -15903 -35717 -4215 26630 5630 -50566 -64248
698 -64248 -9606 29216 -1702 -43012 -29043 18640 37335 1929 -50226 -49896 1105 13141
710 13141 -42329 -76932 -33567 23201 20179 -28287 -52966 -15914 31656 8232 -62346 -76041
722 -76041 -21095 7802 -26473 -63878 -51556 -1414 28707 -1318 -52932 -49705 -2637 5911
734 5911 -39196 -74366 -57411 -10987 7979 -28982 -64557 -27964 33359 20247 -47275 -66916
746 -66916 -26175 178 -26472 -66496 -57459 -2360 22749 -18198 -54864 -25240 19028 13961
758 13961 -28391 -58659 -47792 -9654 1323 -40113 -64042 -14734 42743 26023 -37676 -58869
770 -58869 -13008 33346 6907 -61387 -67517 -2945 25164 -22374 -52689 -11197 40183 35852
782C5852m9382l5826J7247M1810N63m1991j6598L2106L5904j091l3211j6720L6479
795E142M6590k8012p6439j1242O3600L2276l9739l8410K2444N2318J0481m3081
807d072k9507L0705L7090k1164m7297j2088K4052L0783J0015k2459k0986K3700
819a228L5619j5248m3520j737L7941J2491m1843m6397J9713P1443K4871n4779
831b674l7493L8727M2605k3902n1208r801L6963L5071j7509n4986j4377N4978
843c606N5618r522m8882k6465K2244L2767j6726n0983j79O1684K4302m9061l9198
856d8007K9501N2597R251l6938l0868J2816K2725k0406l4523J4769M9636J6271
868C6824l0300l2599N262M3129K6968l4669n2724N073M5213O261l8540k0460L4273
$$ plain form
782 35852 -13530 -49356 -32109 9701 10264 -31727 -48325 -16219 19685 18594 -14617 -31337 5142
795 5142 51732 23720 -52719 -63961 -361 31915 -7824 -46234 -23790 28528 39009 -4072
807 -4072 -33579 -2874 34216 13052 -34245 -46333 -22281 8502 18517 -3942 -24928 -1228
819 -1228 34391 19143 -24377 -26114 11827 24318 -17525 -63922 -44209 27234 52105 -2674
831 -2674 -40167 -1440 41165 17263 -33945 -43746 -6783 28288 10779 -44207 -58584 -3606
843 -3606 52012 42490 -6392 -32857 -10613 22154 5428 -45555 -45734 15950 40252 -8809 -48007
856 -48007 -18506 34091 43342 6404 -24464 -11648 11077 -9329 -43852 -29083 20553 36824
868 36824 6524 -26075 -20813 22316 49284 14615 -38109 -33036 12177 18438 -20102 -40562 -6289
881f289N4219N085n7778m1006L8100N5747j3703n6996k1438K9630L2279k690k5926
894a0766P50M0589J8985l8581m0771J1078L5822R280k3658k9539M024L4615J3610
907B5438k5165q841L6201K5351l0919n3305j4675M0592M6569j3646n5650r055
919c7105N3384K9896l0618l1154J6399L5787Pm7336m2941J9409N7221J7188l2702
932G435k3870J2882K4909N720k2156j9464J8512K6244k4122n0680K494N5407L1448
945D4759k4206l6210M795L6215Q517m1841k7538L3562L6359k4313m8479m824M3475
958B71M5341l3m5133k9082K4993L1944j6103l9389m997L3451K6558j8877m2662
971c3718L070N9533L0553m2196m6664R010K8531k441k3759o431K4192K4449j3118
$$ plain form
881 -6289 47930 53015 -4763 -45769 -7669 48078 34375 -22621 -44059 -14429 17850 15160 -10766
894 -10766 -10016 30573 49558 10977 -29794 -18716 17106 26386 2728 -26811 -22787 11828 25438
907 25438 273 -8568 27633 52984 22065 -31240 -45915 -5323 41246 27600 -28050 -37105
919 -37105 16279 46175 15557 -15597 802 36589 36596 -10740 -53681 -34272 22949 40137 7435
932 7435 -16435 -3553 21356 27076 4920 -14544 3968 30212 6090 -44590 -42096 13311 44759
945 44759 20553 -15657 -10862 25353 33870 -7971 -35509 -1947 34412 10099 -38380 -43204 271
958 271 45612 45579 446 -28636 -3643 28301 12198 -27191 -32188 1263 27821 8944 -33718
971 -33718 -30648 28885 59438 17242 -29422 -20412 8119 5678 -18081 -24512 -320 24129 11011
984A1011l2749L978L8025J6616k2903l0995j0092J6454J9578j2329k7669J4485
996a6590M8264Q137m7514l1386K8557M8754J605n5255m2062K7808N0567l144l7891
1009b0150p33L6183K0286j9258l6355j1784K9653L0714j8619m1902n646L1088
1021f523K4136o231j6736L135K6129J722m2187k6234L3049L7144j8002l9132k42
1034b9972L5350K4581j6420l0608P222L9752N926m8234l7060J9370M5663J8356
1046C3926k7612l8610R390N1276J8743m0735l4001J8856L2005n635l6548j9841
1058c8786K7897M2400k444l6430o958K9498J2534j9867j7722L610J3361K47k2094
1071a4754j3109K7952L7240p326l6489r750K5603K2660j3606l9809j4836L7597
$$ plain form
984 11011 -21738 -17760 20265 36881 13978 -17017 -27109 -10655 8923 -3406 -31075 -16590
996 -16590 31674 39811 -7703 -39089 -10532 38222 39827 -15428 -57490 -29682 20885 17741 -20150
1009 -20150 -20883 15300 35586 16328 -20027 -31811 -2158 28556 9937 -31965 -37611 -6523
1021 -6523 17613 11382 -5354 -2219 23910 25632 -16555 -42789 -9740 27404 9402 -29730 -29972
1034 -29972 5378 29959 13539 -17069 -9847 29905 35831 -12403 -49463 -30093 15570 33926
1046 33926 6314 -32296 -22906 28370 47113 6378 -27623 -8767 23238 17603 -18945 -38786
1058 -38786 -10889 31511 29067 -7363 -14321 15177 27711 7844 -9878 -6268 7093 7340 -14754
1071 -14754 -27863 89 37329 30003 -6486 -16236 9367 32027 18421 -21388 -36224 1373
1083A373L4759k6097m5918Q462N3200K8795k8025m9906j0371L9828K7380l0001
1095C479l9435J1053L7759J1081k0112j8770Q945K8459O328l1148k3896J4729
1107a1528J7901j0656j6757O613K3901J3499j7259k7596R490L9176K057m5595
1119a6754k8296K5276L6541j394l4060j8226L2066M4777q539n0114j7818L2836
1131c705K7536j4111l6939j4772K9091L7053o579l4966j196L2720J2599k3940
1143B791k4974K926K1581O163k3421j5330K6671L0065j3089k8283M033K7757J0041
1156B6931k3589l4423j141L8899K2254k9751l3096J6690M3509J4325k9117l6244
$$ plain form
1083 1373 36132 10035 -35883 -27421 25779 54574 26549 -23357 -33728 6100 33480 3479
1095 3479 -35956 -24903 12856 23937 3825 -14945 -6000 22459 28787 -2361 -26257 -11528
1107 -11528 6373 -4283 -21040 -14427 9474 22973 5714 -21882 -12392 26784 28841 -16754
1119 -16754 -45050 -19774 16767 15373 -18687 -36913 -4847 39930 31391 -18723 -36541 -3705
1131 -3705 23831 9720 -27219 -41991 -12900 24153 17574 -17392 -18588 14132 26731 2791
1143 2791 -22183 -19257 2324 8487 -14934 -30264 -3593 26472 13383 -14900 -10867 16890 26931
1156 26931 3342 -31081 -32222 6677 28931 -820 -33916 -17226 26283 40608 11491 -24753
$$ [...]
8191b05
##END NTUPLES=NMR FID
##END=
