##TITLE=1H_TG-2282
 CDCl3, 8 sc, 
 4.2.2020
##JCAMPDX= 6.0         $$ Bruker NMR JCAMP-DX V2.0
##DATA TYPE= NMR FID
##DATA CLASS= NTUPLES
##ORIGIN= UXNMR, Bruker Analytische Messtechnik GmbH
##OWNER= root
$$ XWIN-NMR		Version 3.5
$$ Tue Feb  4 14:01:11 2020 Russian Standard Time (UT+4h)  she@DPX200
##.OBSERVE FREQUENCY= 200.1315
##.OBSERVE NUCLEUS= ^1H
##.DELAY= (6, 6)
##.ACQUISITION MODE= SIMULTANEOUS
##.ACQUISITION SCHEME= undefined
##.AVERAGES= 8
##.DIGITISER RES= 18
##SPECTROMETER/DATA SYSTEM= spect
##.PULSE SEQUENCE= zg30
##.SOLVENT NAME= CDCl3
##.SHIFT REFERENCE= (INTERNAL, CDCl3, 0, 15.7039)
##AUDIT TRAIL= $$ (NUMBER, WHEN, WHO, WHERE, WHAT)
$$ ##TITLE= Audit trail, XWIN-NMR		Version 3.5
$$ ##JCAMPDX= 5.01
$$ ##ORIGIN= Bruker BioSpin GmbH
$$ ##OWNER= she
$$ F:/spectra/data/she/nmr/H-F/1/audita.txt
$$ ##AUDIT TRAIL=  $$ (NUMBER, WHEN, WHO, WHERE, WHAT)
(   1,<2020-02-04 13:59:51.90 +0400>,<she>,<DPX200>,
      <created by zg, POWCHK disabled, PULCHK disabled
       configuration hash MD5:
       00 E9 B6 7A A2 85 ED C7 34 08 36 98 17 FE 4E 26
       data hash MD5: 16K
       EC 4C 93 15 6D 25 91 42 40 55 AC 0B 70 1F DB F4>)
$$ ##END=
$$ 
$$ hash MD5
$$ 57 C8 35 C2 9B 71 BE E8 BF 9D 6B 66 59 04 9B 24
##$RELAX= 
##$RELAX= 
##$RELAX= 
##$RELAX= 
##$RELAX= 
##$RELAX= 
$$ Bruker specific parameters
$$ --------------------------
##$DU= <F:/spectra>
##$EXPNO= 1
##$NAME= <H-F>
##$PROCNO= 1
##$TYPE= <nmr>
##$USER= <she>
##$AMP= (0..31)
100 100 100 100 100 100 100 100 100 100 100 100 100 100 100 100 100 100 
100 100 100 100 100 100 100 100 100 100 100 100 100 100 
##$AQSEQ= 0
##$AQ_mod= 1
##$AUNM= <au_zg>
##$AUTOPOS= <>
##$BF1= 200.13
##$BF2= 200.13
##$BF3= 200.13
##$BF4= 200.13
##$BF5= 200.13
##$BF6= 200.13
##$BF7= 200.13
##$BF8= 200.13
##$BYTORDA= 1
##$CFDGTYP= 0
##$CFRGTYP= 5
##$CHEMSTR= <none>
##$CNST= (0..31)
1 1 145 1 1 1 1 1 1 1 1 1 1 1 1 1 1 1 1 1 1 1 1 1 1 1 1 1 1 1 1 1 
##$CPDPRG= <>
##$CPDPRG1= <>
##$CPDPRG2= <>
##$CPDPRG3= <>
##$CPDPRG4= <mlev>
##$CPDPRG5= <mlev>
##$CPDPRG6= <mlev>
##$CPDPRG7= <mlev>
##$CPDPRG8= <mlev>
##$CPDPRGB= <>
##$CPDPRGT= <>
##$D= (0..31)
0 1.2 0 0 0 0 0 0 0 0.06 0 0.03 0 0 0 0 0.0002 0 0 0 0 0 0 0 0 0 0 0 0 
0 0 0 
##$DATE= 1580810391
##$DBL= (0..7)
120 120 120 120 120 120 120 120 
##$DBP= (0..7)
150 150 150 150 150 150 150 150 
##$DBP07= 0
##$DBPNAM0= <>
##$DBPNAM1= <>
##$DBPNAM2= <>
##$DBPNAM3= <>
##$DBPNAM4= <>
##$DBPNAM5= <>
##$DBPNAM6= <>
##$DBPNAM7= <>
##$DBPOAL= (0..7)
0.5 0.5 0.5 0.5 0.5 0.5 0.5 0.5 
##$DBPOFFS= (0..7)
0 0 0 0 0 0 0 0 
##$DE= 6
##$DECBNUC= <off>
##$DECIM= 24
##$DECNUC= <off>
##$DECSTAT= 4
##$DIGMOD= 1
##$DIGTYP= 9
##$DL= (0..7)
0 120 120 120 120 120 120 120 
##$DP= (0..7)
150 150 150 150 150 150 150 150 
##$DP07= 0
##$DPNAME0= <>
##$DPNAME1= <>
##$DPNAME2= <>
##$DPNAME3= <>
##$DPNAME4= <>
##$DPNAME5= <>
##$DPNAME6= <>
##$DPNAME7= <>
##$DPOAL= (0..7)
0.5 0.5 0.5 0.5 0.5 0.5 0.5 0.5 
##$DPOFFS= (0..7)
0 0 0 0 0 0 0 0 
##$DQDMODE= 0
##$DR= 18
##$DS= 0
##$DSLIST= <SSSSSSSSSSSSSSS>
$$ [...]
##$SUBNAM2= <"">
##$SUBNAM3= <"">
##$SUBNAM4= <"">
##$SUBNAM5= <"">
##$SUBNAM6= <"">
##$SUBNAM7= <"">
##$SUBNAM8= <"">
##$SUBNAM9= <"">
##$SW= 24.9337058887773
##$SWIBOX= (0..15)
0 0 2 0 0 0 0 0 0 0 0 0 0 0 0 0 
##$SW_h= 4990.01996007984
##$TD= 16384
##$TD0= 1
##$TE= 0
##$TE2= 300
##$TE3= 300
##$TEG= 300
##$TL= (0..7)
0 120 120 120 120 120 120 120 
##$TP= (0..7)
150 150 150 150 150 150 150 150 
##$TP07= 0
##$TPNAME0= <>
##$TPNAME1= <>
##$TPNAME2= <>
##$TPNAME3= <>
##$TPNAME4= <>
##$TPNAME5= <>
##$TPNAME6= <>
##$TPNAME7= <>
##$TPOAL= (0..7)
0.5 0.5 0.5 0.5 0.5 0.5 0.5 0.5 
##$TPOFFS= (0..7)
0 0 0 0 0 0 0 0 
##$TUNHIN= 0
##$TUNHOUT= 0
##$TUNXOUT= 0
##$USERA1= <user>
##$USERA2= <user>
##$USERA3= <user>
##$USERA4= <user>
##$USERA5= <user>
##$V9= 5
##$VALIST= <valist>
##$VCLIST= <CCCCCCCCCCCCCCC>
##$VD= 0
##$VDLIST= <DDDDDDDDDDDDDDD>
##$VPLIST= <PPPPPPPPPPPPPPP>
##$VTLIST= <TTTTTTTTTTTTTTT>
##$WBST= 1024
##$WBSW= 4
##$XGAIN= (0..3)
0 0 0 0 
##$XL= 0
##$YL= 0
##$YMAX_a= 217373
##$YMIN_a= -91894
##$ZGOPTNS= <>
##$ZL1= 120
##$ZL2= 120
##$ZL3= 120
##$ZL4= 120
##$ABSF1= 10
##$ABSF2= 0
##$ABSG= 5
##$ABSL= 3
##$ALPHA= 0
##$AQORDER= 0
##$ASSFAC= 0
##$ASSFACI= 0
##$ASSFACX= 0
##$ASSWID= 0
##$AUNMP= <proc_1d>
##$AZFE= 0.1
##$AZFW= 0.1
##$BCFW= 1
##$BC_mod= 2
##$BYTORDP= 1
##$COROFFS= 0
##$CY= 11.3945322036743
##$DATMOD= 1
##$DC= 2
##$DFILT= <>
##$DTYPP= 0
##$F1P= 16.9975609425685
##$F2P= -3.02152046262296
##$FCOR= 0.5
##$FTSIZE= 0
##$FT_mod= 4
##$GAMMA= 1
##$GB= 0.15
##$INTBC= 1
##$INTSCL= 1
##$ISEN= 128
##$LB= 0.24
##$LEV0= 0
##$LPBIN= 0
##$MAXI= 10000
##$MC2= 0
##$MEAN= 0
##$ME_mod= 0
##$MI= 1.114404
##$NCOEF= 0
##$NC_proc= 0
##$NLEV= 6
##$NOISF1= 3.799351
##$NOISF2= 2.8
##$NSP= 1
##$NTH_PI= 0
##$NZP= 0
##$OFFSET= 15.70392
##$PC= 1
##$PHC0= -9802.614
##$PHC1= 39.80081
##$PH_mod= 1
##$PKNL= yes
##$PPARMOD= 0
##$PSCAL= 0
##$PSIGN= 0
##$REVERSE= no
##$SF= 200.130013532006
##$SI= 16384
##$SIGF1= 3
##$SIGF2= 2
##$SINO= 400
##$SIOLD= 16384
##$SREGLST= <1H.CDCl3>
##$SSB= 0
##$STSI= 0
##$STSR= 0
##$SW_p= 3612.71676300578
##$SYMM= 0
##$S_DEV= 0
##$TDeff= 0
##$TDoff= 0
##$TI= <>
##$TILT= no
##$TM1= 0
##$TM2= 0
##$TOPLEV= 0
##$USERP1= <user>
##$USERP2= <user>
##$USERP3= <user>
##$USERP4= <user>
##$USERP5= <user>
##$WDW= 1
##$XDIM= 8192
##$YMAX_p= 0
##$YMIN_p= 0
$$ End of Bruker specific parameters
$$ ---------------------------------
##NTUPLES= NMR FID
##VAR_NAME=  TIME,          FID/REAL,        FID/IMAG
##SYMBOL=    X,             R,               I
##VAR_TYPE=  INDEPENDENT,   DEPENDENT,       DEPENDENT
##VAR_FORM=  AFFN,          ASDF,            ASDF
##VAR_DIM=   8192,          8192,            8192
##UNITS=     SECONDS,       ARBITRARY UNITS, ARBITRARY UNITS
##FACTOR=    0.0002004,     1,               1
##FIRST=     0,             0,               0
##LAST=      1.6414764,     0,               0
##MIN=       0,             -91894,          0
##MAX=       1.6414764,     217373,          0
$$ Real data points
##PAGE= N=1
##DATA TABLE= (X++(R..R)), XYDATA
$$ [...]
1912H82o21k98L62J41kj6n72M89M97k00o25k79J224j40p11m2L50L81j53m50l32
1933a15L83M57j23m98k58M05N58k67m46R5L57M87q76k89K02O71l90l54j41M95
1953C53k6M8o38k2K56M98j74o95j70N49K89j87q66L43R24j47r28q4N69L23j02
1974A13m76q1ON69j88n52j54P81M13r53o2J45RO09n82m38L49N99k00l51n2n5L32
1997b19L66q75k15N76M61n10l12M09L64lp8o81K99K83J29l06k79N01M92k89n48
2018d35L08j95R75m51n11j29N95L72n80q2M81n3J45m44k28L53L33J78o09j12K43
2039A54P14l36n66K47M2N78n97l23L38J32J50j81m75J71N53N05q14o7l27Q82k23
2060E57n33M4K61K18k44k95L53J39J08l39l52J28J87L46m21J22k64K21L84n69
$$ plain form
1912 882 261 -37 325 466 464 448 -124 365 862 662 37 -242 982 842 131 89 439 820 667 217 -115
1933 -115 268 725 602 104 -154 251 809 542 96 191 548 1035 159 -130 72 743 353 -1 -142 353
1953 353 327 375 -263 -285 -29 469 295 -400 -570 -21 268 81 -785 -442 482 335 -593 -677 -108 215 113
1974 113 -363 -444 -438 131 -57 -609 -763 18 431 -522 -584 -439 -430 179 -403 -841 -492 107 -93 -444 -496 -551 -219
1997 -219 147 -728 -943 -367 94 -416 -728 -319 45 42 -36 -717 -418 -135 -6 -312 -591 -90 402 113 -435
2018 -435 -127 -322 653 202 -309 -438 157 529 -51 -133 348 295 440 -4 -232 121 454 632 23 -89 154
2039 154 868 532 -34 213 255 833 236 -87 251 383 533 352 -123 48 601 1106 292 225 -102 780 557
2060 557 24 68 329 547 303 8 361 500 608 269 -83 45 232 578 157 279 15 236 620 51
2080E1j49L42K54l42m06R1J97J65m6k30rK21P7k10j70J29j37J55l9k65J44K07
2102C0q3m67K89J28j28p6K67k34q2K17k38k89R6M16j01j75J42q7p1O18m71k07
2124e06J79J05J85o71L59k4O1n5K50k70Q1K40l57m0L54J1j68N0N0R6J15j08j02
2147a65L4K37j08k03p9M13J58m48J02M3O5J7l5l3L35l74j2M7M0P3J31j23L74k57
2171B32J43k16k24K51j2J23J44l15K63m1K29k03j21j55J80j74M1K46nj28j51J68
2193B75k66L1N97n57K6K45p2p0K05j89j87J30K64m60j03M61k74p6L7J68R6k36
2215D5q3j56j9M36K68p35J07k37M54M8k60j19n9M70j33k42N9L34k51l12r9K81
2237b03L42j78l68J87K6J93k20j92K11m7J88j94J30k56R2K63j13q4k12J99J80
$$ plain form
2080 51 -98 244 498 156 -250 -159 38 203 157 -73 -82 139 216 6 -164 -35 -172 -17 -56 -321 -177 30
2102 30 -53 -520 -231 -103 -231 -307 -40 -274 -356 -139 -377 -666 -570 -154 -255 -430 -288 -375 -446 172 -299 -506
2124 -506 -327 -222 -37 -708 -349 -373 -312 -367 -117 -387 -306 -66 -423 -463 -109 -98 -266 -216 -166 -70 45 -63 -165
2147 -165 -131 106 -2 -205 -284 129 287 -161 -59 -16 49 66 31 -2 333 -41 -53 -6 34 107 238 115 489 232
2171 232 375 159 -65 186 174 297 441 126 389 348 577 374 253 98 278 104 145 391 386 258 107 275
2193 275 9 40 637 80 106 351 279 209 414 225 38 168 432 -28 -131 330 56 -20 17 185 281 45
2215 45 -38 -194 -213 223 491 -244 -137 -374 80 128 -132 -251 -310 160 27 -215 -156 178 -73 -385 -484 -203
2237 -203 139 -39 -407 -220 -194 -1 -221 -413 -202 -249 -61 -255 -125 -381 -289 -26 -139 -223 -435 -236 -56
2258e6o43J19K44L11rk92m6M89M5n60R3K83L8J47k64j37OK04Nj54j11J23l0L14
2282A19j47r4J03M09l63l34K23M21K13n08l8K49L07j04n98J40p4M71j03j83p2
2303C7K93K11l50k28J37M09L04p03k26L03L26k42p8m26N56J27j24j33k20K30N62
2324G65m36m02J98L36k5j87l93L79K29k67l52J50J30L86m5m67k78K54L47J74p21
2345b25lM87l5k88j17K47n0J22m92J07j07O07k70J72m92K82L84l70o3m20O53m5
2367H4l31p7N8J17K9l7K5j35Q4K37n93J61M09KJ29m41k32J55M95k69l35J37L58
2390C0m0m37M44o45M24L30q8n03L77J81J40n89j46K38J81J9j63%M2J75K76m67
2412b21O8K78K25k21k09q8L73J94l77j95J83L84k67m04L55n9J96Q6m14L37K92
$$ plain form
2258 -56 -699 -580 -336 -25 -34 -326 -372 117 162 -398 -305 -22 16 163 -101 -238 -232 -28 -23 -177 -288 -165 -195 119
2282 119 -28 -122 -19 390 27 -307 -84 337 550 42 4 253 560 456 -142 -2 -76 395 292 109 37
2303 37 330 541 191 -37 100 509 813 110 -116 187 513 271 193 -233 323 450 326 193 -27 203 765
2324 765 329 -73 125 461 436 249 -144 235 464 197 -155 -5 125 511 466 -1 -279 -25 322 496 -225
2345 -225 -228 259 224 -64 -181 66 16 138 -354 -247 -354 253 -17 155 -337 -55 329 -41 -104 -524 129 84
2367 84 -247 -324 -266 -149 -120 -157 -132 -267 -183 54 -539 -378 31 33 162 -279 -511 -356 139 -130 -465 -328 30
2390 30 -10 -447 -3 -648 -224 106 18 -485 -108 73 213 -376 -522 -284 -103 -84 -247 -247 -205 -30 246 -221
2412 -221 -153 125 350 129 -80 -168 205 399 22 -173 10 394 127 -277 78 19 215 301 -113 224 516
2433E16o1j92l78L48P3p7P4n25K06K95J71k76l60N14J66l44J35j25J65q6pO0j81
2456A11M8j21M9j47r1M66j52k11J17k13K29q4k19p4M22J70j37Rj18m4L35n08p2
2479b35K50J61n88M40J8j81J61q4k81L63k40pR9j05l7L5m2K58n38LQ09n21j21
2502c83P1O1o3K1J21M5j9j80J96k63J23J21j40N60n10n4J60k78j46L78J78k23
2524b24R5J81l47K71n2l25K0M25L9k74L30j32K60j14j19k11M96n40J36L81m09
2545a13J12P0j%J54k41L01m20K36M4k16K58j11J72k04L29l20m3R6K8K3J9j33J83
2569B23l1k02L27j30J48k91K54j04J6k70L71j73k97M46K7Q2m46R3L35j83Ok28
2591b7J21q7O7J61k40R4K00r8o1l73J88L04j45j91r9K05L62k28o3j98Q2rn0n5
$$ plain form
2433 516 455 263 -115 233 306 229 303 -222 -16 279 450 174 -186 328 494 150 285 160 325 239 232 292 111
2456 111 159 38 87 -60 -151 315 163 -48 69 -144 85 1 -218 -292 130 300 163 172 54 10 345 -163 -235
2479 -235 15 176 -412 28 46 -135 26 -58 -339 24 -216 -223 -124 -229 -266 -231 -273 -15 -553 -550 259 -262 -383
2502 -383 -312 -251 -314 -293 -172 -127 -146 -326 -130 -393 -270 -149 -289 271 -239 -293 -133 -411 -557 -179 -1 -224
2524 -224 -129 52 -295 -24 -76 -401 -381 44 83 -191 139 7 267 153 34 -177 319 -221 -85 296 -113
2545 -113 -1 69 68 68 222 -19 282 -138 98 142 -74 184 73 245 41 370 50 7 103 131 154 173 40 223
2569 223 192 -10 317 187 335 44 298 194 210 -60 311 138 -159 287 314 396 -50 43 378 195 201 -27
2591 -27 94 7 74 235 -5 89 289 191 130 -243 -55 249 104 -87 -186 19 381 153 90 -108 -26 -35 -85 -140
2615a40k58O32l77n8JK82J9J07m56q0L57K1l15J44M5r6R8k29J50q4J4K31k44j53
2639c89J70L86k35k45j51N14l8k50k35K93Q9RJ00m22J97L54j59o4K1k50L30O8
2661I3l62j05M08j09K8k01J11K46j62J68k70J69J62K5j4l37J28K9L48l17k14M7
2683a29N82l87r7l1K17l56L36j11M0J0L35k63l10K18M31k12j55k01Q2L98k22k06
2705c1k09M86K99n01K08Jk36R2J47k36j99N54k35j55k8J88L21l43j46j02J01K06
2727A82k14j06l6N37k91NR2r7P7k5l6l68M30O3J76n13j58J10K95k75J29k52K89
2750A4o8l2k67L56O8j02M4n45K93L62j32o2j37k00N11j53k12q9J08M39l74J35
2772d3o6m2J37n9J24l18K99j44J42j81j09J73j23J93r9K28j62r7K9l7K05J97l11
$$ plain form
2615 -140 -398 234 -143 -201 -200 82 101 208 -248 -328 29 50 -265 -121 -76 -172 -74 -303 -153 -237 -223 8 -236 -389
2639 -389 -219 167 -68 -313 -464 50 12 -238 -473 -180 -91 -82 18 -404 -207 147 -12 -76 -55 -305 25 93
2661 93 -269 -374 34 -75 -47 -248 -137 109 -53 115 -155 14 176 201 187 -150 -22 7 355 38 -176 -129
2683 -129 453 66 -31 -62 155 -201 135 24 64 74 409 146 -164 54 485 273 118 -83 -1 397 175 -31
2705 -31 -240 246 545 44 252 253 17 109 256 20 -179 375 140 -15 -43 145 466 123 -23 -125 -24 182
2727 182 -32 -138 -174 363 72 77 169 72 149 124 88 -280 150 213 389 -124 -282 -172 123 -152 -23 -275 14
2750 14 -54 -86 -353 3 71 -31 13 -532 -239 123 -9 -71 -208 -408 103 -50 -262 -351 -243 196 -178 -43
2772 -43 -109 -151 -14 -73 51 -267 32 -112 30 -151 -260 -87 -210 -17 -116 112 -50 -147 -118 -155 50 247 -64
2795f4q2R9K77p9k34jpJ11m0N5l03L60O1nk01j14L34k2q8j20J08K28q1kk88K44
2821A46M2J77l71P2J23l25J5K57m18L59K28k56j62J69J61o4M5j76L21p0j57J03
2843B19k03J66J2k28J54N3l3O27q62K73j34j17K89j57jk37M00j87r8j12K32L02
2865C58m27K0K2j33J95L37j56l87j9M22j58l22K13j54K92k14j47K57r3J98k31
2886a27l26M05j34J34O0j33k27L57Mm61K47M7L2j61K78rK15k74k70N24l03J40
2908A8j3p7j29K79j55l49K56K36o8o8l32L39p8k13L06j68J42K98k27lK25k95J83
2931A07m48L99k95M29k90J74J01o4j46Q4J00j71Q4L6j39LL52Q1P4o01L6P4N6K60
2955B96j46k95L38k42J85j16J54O0l62J17K5R0K31k78K7j29L14j18m44L02P2K77
$$ plain form
2795 -64 -146 -47 230 151 -83 -84 -91 20 -20 35 -268 92 153 148 -53 -167 167 145 57 -63 45 273 192 190 -98 146
2821 146 188 365 -6 66 189 -136 -121 136 -282 77 305 49 -113 56 217 153 198 22 343 273 116 219
2843 219 16 182 194 -34 120 173 140 767 -95 178 44 -73 216 59 58 -179 221 34 -64 -176 56 358
2865 358 -69 -49 -27 -160 35 372 216 -171 -190 232 74 -248 -35 -189 103 -111 -258 -1 -94 104 -127
2886 -127 -453 -48 -182 -48 12 -121 -348 9 13 -448 -201 -154 -122 -283 -5 -14 201 -73 -343 181 -122 18
2908 18 5 -72 -201 78 -77 -426 -170 66 -2 -70 -402 -63 -141 -354 -48 -216 -74 224 -3 -6 219 -76 107
2931 107 -341 58 -237 192 -98 76 177 113 -33 51 151 -20 64 100 -39 -36 316 397 471 -130 -94 -20 36 296
2955 296 150 -145 193 -49 136 20 174 234 -128 -11 14 104 335 57 84 -45 269 151 -293 9 81 358
2977C58l88j15K83Q4j81l4L7j59L94j43j23j6J4R4q5O4n56K34L43J92l39l27M09
3000D0J06l37l6J81R3J74m60J84k78R9K45k79pM0J69q3Q8p9Q0K4J61k31k29K22
3024a13K63j77m18J39K59J73j74j7j41L68l32j11J47M2p7K14Ok71L14J1k58K25
3046G2l37L77m0K34k50k73J71N7l61K55K3M19J4p14L4J04M94l90k02K53K5L12
3068B77k47K2k13K80j41pr8j3J93k7L33j47k55L49j55l09o6K07K07m7q2oJ74P3
3092C02j64k78L95n8p3k22N8J10K72k9k34k89M46l2r9J06q8r2p4J85m38K84J34
3115A22k8k08j62L20n9j3j54J85k63L02k3L4m81N11M9k33Q9k75L35J83k60k28
3137b57n8R1N11k08l34L07n1k28J81j06K4J91M2l31K60O5k00K00m15J45K8L19
$$ plain form
2977 358 -30 -145 138 222 41 7 44 -115 279 136 13 -3 11 105 20 84 -472 -238 105 297 -42 -369 40
3000 40 146 -191 -227 -46 47 221 -239 -55 -333 -234 11 -268 -275 -235 -66 -149 -61 -140 -60 -36 125 -106 -335 -113
3024 -113 150 -27 -445 -306 -47 126 -48 -65 -206 162 -170 -281 -134 -92 -169 45 51 -220 94 105 -153 72
3046 72 -265 112 72 306 56 -217 -46 11 -350 -95 -72 347 361 -353 -319 -215 279 -111 -313 -60 -35 277
3068 277 30 52 -161 119 -22 -29 -127 -140 53 26 359 212 -43 306 151 -158 -224 -17 190 143 61 55 229 302
3092 302 138 -140 255 197 124 -98 -40 70 342 313 79 -210 236 204 105 211 123 31 -43 142 -296 -12 122
3115 122 94 -114 -276 44 -15 -28 -182 3 -260 42 19 53 -428 83 132 -101 -12 -287 48 231 -29 -257
3137 -257 -315 -224 287 79 -255 52 1 -227 -46 -152 -128 63 105 -226 34 99 -101 99 -316 -171 -143 176
3159A76j55k79K94j2q7J25k02j00K13J78j86j94Q7K06J83m7n98M01j38O5J39q3
3181a4P2O8m2j54K09r7k1j39L05k42p0K72j47j40K78M4n0k0p8K0j24L07k44m8
3205e5Q8K3J61l57JK15J55j83j59J01K60k93k6N3L4P7m7m9L22k3j66P1l25P6K15
3230A69J56j65k15R3P2PL8n7R4j22j24qJ81N5k18L18k11Q0j99J11P3K34l97J8
3254a7j6k50K52j26J46N2j82O5K08j67k13q1K40k32J65n1K4J52k6J38n6k52J84
3277d3Q1j06l27M29j51j17L9K25p4j96K50j09K22l79MQ1J58j91R9r2J11q2J87
3300A9p6K21q1j27J95k69J38k78K16L49k97J12k75M6l75K15J3J42L53l32k63L74
3322B0L57l53J56l72L6N0J24j46J84k22L31K9l96K70p3l8M57m19R3j34k6M34j30
$$ plain form
3159 176 21 -258 36 24 -63 62 -140 -240 -27 151 -35 -229 -142 64 247 200 -398 3 -135 -70 69 -14
3181 -14 58 126 84 -70 139 42 21 -118 187 -55 -125 147 0 -140 138 182 132 112 34 54 -70 237 -7 -55
3205 -55 33 56 217 -140 -139 76 231 48 -111 -10 250 -43 -69 -16 18 95 48 -1 321 298 132 203 -122 -46 169
3230 169 325 160 -55 38 110 117 155 98 192 70 -54 -62 119 174 -44 274 63 143 -56 55 128 362 -35 -17
3254 -17 -33 -283 -31 -157 -11 41 -141 -76 132 -35 -248 -329 -89 -321 -156 -207 -183 -31 -57 81 25 -227 -43
3277 -43 38 -68 -395 34 -117 -234 -195 30 -44 -240 10 -99 123 -256 -252 -171 -13 -204 -105 -197 -86 -168 19
3300 19 -57 164 83 -44 151 -118 20 -258 -42 307 10 122 -153 -107 -482 -267 -254 -112 241 -91 -354 20
3322 20 377 24 180 -192 -156 -106 18 -128 56 -166 165 194 -202 68 -5 -43 414 -5 88 -46 -72 362 232
3345B32m09K87k44K4R1j21M92j36o4M6j81L62k79nkk31M07Rm4l83L30r1J55P4
3369C19l60Rj50L95l20K17J50k75j94N5J37K02l75K78J1j32L8k45r0R4K72k98
3391b62J81N2O4j73J70q8k12K51j94L45j32L2k90K14L0l48O25l73l27L84M7n2
3413e6n1j34k5J92L0J5k46O2J60K7M5j03J7j56O11o28K6O9N8J91j46N4n65M62
3437i1M03k87j68J87P6J43m13J55J2J96ml69j38L14J45j16n6q8K35j33J75r8j7
3460F3o6J4P5r4N7l3J78o8l12K64M17l81m19L97r0L27R1j68j94J51J30l72m1J56
3484H2l4j0J18n7j13J25J81j95l20N90j64k18j64J07K0M58j99j96nM3k50L12j03
3507Hj05j85J99L55n21K54J01L4l36j03M9M93j27j03N8j88M28n44J0J68J3l6j2
$$ plain form
3345 232 -177 110 -134 -110 -19 -140 352 216 152 198 17 379 100 95 93 -138 269 278 234 -149 181 90 245 319
3369 319 -41 -32 -182 213 -107 110 260 -15 -209 -154 -17 185 -190 88 99 -33 5 -240 -330 -236 36 -262
3391 -262 -81 -29 35 -138 32 -56 -268 -17 -211 134 2 34 -256 -42 -12 -360 265 -108 -435 -51 -4 -56
3413 -56 -107 -241 -266 -74 -44 -29 -275 -213 -53 -26 19 -84 -67 -223 388 -240 -214 -145 -87 104 -42 12 -553 -91
3437 -91 312 25 -143 44 120 263 -150 5 17 213 209 -160 -298 16 161 45 -11 -99 136 3 178 80 63
3460 63 -3 11 86 -8 49 16 194 126 -186 78 495 114 -305 92 2 329 420 252 58 209 339 -33 -74 82
3484 82 48 38 156 99 -14 111 292 97 -223 367 203 -15 -179 -72 -52 406 207 11 6 49 -201 111 8
3507 8 -97 -282 -83 272 -249 5 106 140 -196 -299 -250 243 116 13 71 -117 311 -233 -223 -55 -42 -78 -90
3530i0k2N5k0J61k37J00m4k1K39l86J75N8k49o5Q6j01M13J11l75NL57k49K18n26
3554d07J61J81M7mO9l03N4O2j47L92l94J46J99j70J26Q9J50j49p0l90K32K91l94
3577b29J89j84K70L8j35%P6J37J91m48L2L60j82qj30JK73k65kp4j20N79l03J39
3601B05p4k02K01L66m99J87l06J09m5K21L9j75K27k04K99m10K88k79P4k71L64
3622A15j86K10K20ll25L6J28j04K20l27J98j15j2k07K79k00K10l8j4k71n6M40
3644A98j56j16M1j97K16r1MK53K47j54l28J77k40j34K26K06j27l25M20k79J29
3665c0J03k78J26l9j51J9K85J3k53L55k72K00m8k99J5J49J14n4o4J7JQ0J22k09
3689i8n0K5J93K22j95j71J7J70r3j45nj3N42n02L30j45j45k55L17o0J59k17M36
$$ plain form
3530 -90 -112 -57 -77 84 -153 -53 -97 -118 121 -265 -90 -32 -281 -346 -260 -361 52 163 -212 -207 150 -99 119 -407
3554 -407 -246 -65 -18 -22 47 -256 -202 -140 -287 105 -289 -143 56 -114 12 101 251 102 32 -358 -126 165 -229
3577 -229 -40 -224 46 84 -51 -51 25 162 353 -95 -63 297 115 107 -23 -22 251 -14 -16 -90 -210 369 66 205
3601 205 131 -71 130 496 -3 184 -122 -13 -58 163 202 27 254 50 349 -61 227 -52 22 -249 115
3622 115 -71 139 359 356 31 67 195 91 311 -16 182 67 55 -152 127 -73 137 99 85 -186 -242 198
3644 198 42 -74 -33 -230 -14 -105 -101 152 399 245 -83 94 -146 -280 -54 152 25 -300 120 -159 -30
3665 -30 73 -205 -79 -118 -269 -250 35 48 -205 150 -122 78 30 -269 -254 -105 9 -45 -109 -92 -91 -11 111 -98
3689 -98 -148 -123 70 292 97 -74 -57 113 20 -125 -130 -143 399 -103 227 82 -63 -318 -1 -61 98 -119 317
3712C17k11j91j92L87k05R1j76K83k87J78L67l19J17k2o0K82k90J9n0j80p5K92
3734G5j66K51k44M5L0OJ5Q0%m0J24p1k26J45Q6K6L4j41j45O5K45ll35J87Q2k18
3760i3L08k13K15o6M8l22J2J8K3M99j17l03q4Q3l0J0k15J52J10j06o7P4K9M3L2
3785D0O8r2ok17j27N87l09P4k11J62j40J62q8M7O4J0Ql4p3k62J45K29j72k43M00
3810B2J22p6j34J59k90R3l28L03K04j68m2M07m83K25M0k49J29r5L00j05k13R2
3832h7OK2l9J85R7L9m51K27Q9o4j40oJ59R0k08O4K0Q3N%r4r8J34K2K3J00k48M9
3860b1J54k95J98m9J2J55k71J19l5K48j20m20M27q8J48n2N1j9K09k96k0J30l30
3883a65J29L5k64L84j94J19k65L05m5J4Nj18L34m02L93Q1m78L4L31k42J72l52
$$ plain form
3712 317 106 -85 -277 110 -95 -4 -180 103 -184 -6 361 42 159 137 77 359 69 88 38 -142 -217 75
3734 75 -91 160 -84 -39 -9 -3 12 92 92 52 176 105 -121 24 110 136 170 29 -116 -51 194 191 -144 43 125 -93
3760 -93 215 2 217 151 199 -123 -111 -93 -70 429 312 9 -75 8 -22 -12 -227 -75 35 -71 -138 -64 -35 8 40
3785 40 108 16 10 -207 -334 253 -56 18 -193 -31 -171 -9 -97 -50 14 24 32 -2 -75 -337 -192 37 -135 -378 22
3810 22 144 68 -66 93 -197 -104 -432 -129 75 -93 -135 272 -211 14 54 -195 -66 -161 139 34 -179 -87
3832 -87 -81 -59 -98 87 184 223 -228 -1 88 24 -116 -122 37 127 -81 -17 3 86 91 91 -3 -101 33 55 78 178 -70 -21
3860 -21 133 -162 36 -13 -1 154 -117 2 -33 215 95 -325 102 14 162 110 161 142 351 55 35 165 -165
3883 -165 -36 -1 -265 119 -75 44 -221 84 39 53 58 -60 274 -128 265 346 -132 -98 233 -9 163 -189
3905a89r4M62Rl63n4K58K03m4l49K25k2K0q5k31L43l4P0j19j60%K18j06J10j39
3929g1J25m1P5M6j53n1Q1K28j09l30j2L98l01K22k34P1j04K4N0L34l82J82j61
3952a13N9N0q8J87k48M8J53j75J91j18j69J32K7j38M5K65J45k02J01k11J34o4
3974A1r9J67m68M12n7J34o9J4J20j46n7k6J37m9N15l28j86J71L6m75K89J84j7
3997B13m02K11M4p1j56M23k12j17J57k30L99l4j02l35L87n4j86m4K34k27K70k0
4019A48j76J3N4J85l52J53J86k8k26Q5M69l02k3L2k12p0K93j5j76l5J81j27J74
4042B31l16j39J43q6L46n24O14k68l05M24j12k25J31JL63l59k6J59Qj63J12m8
4064c9J00P1k16O9K19L2m96N9K07m1j02j94K50K73l88M21l10J16rj55J20J14M
$$ plain form
3905 -189 -283 179 188 -175 -229 29 232 188 -161 64 42 62 -23 -254 89 55 125 6 -154 -154 64 -42 68 -71
3929 -71 54 13 88 134 -19 -70 11 239 130 -200 -212 186 -115 107 -127 -56 -160 -136 -86 248 -134 48 -113
3952 -113 -54 -4 -92 95 -153 -105 48 -127 64 -54 -223 -91 -64 -202 -157 108 253 51 152 -59 75 11
3974 11 -88 79 -389 23 -34 100 31 45 165 19 -38 -64 73 24 539 211 25 196 232 -243 46 230 213
3997 213 -189 22 66 -5 -161 262 50 -67 90 -140 259 225 123 -212 175 121 -65 -109 125 -102 168 148
4019 148 -28 -15 39 224 -128 25 211 183 -43 42 511 209 186 218 6 -64 229 214 38 3 184 57 231
4042 231 -85 -224 -81 -167 179 -345 269 1 -304 120 8 -217 -86 -85 278 -81 -107 52 60 -103 9 -39
4064 -39 61 132 -84 -15 204 236 -260 -201 6 -35 -137 -331 -81 192 -196 225 -85 31 22 -133 -13 101 105
4087A05p9k50Q5J75l56L72p6l89M33J04q0n1J62N8k65K21k44J72p5j59n8J42K41
4110A88l86L03M%PK64j50m28K39j02L46n98K69K30l13K0L12r3k78K76L6k10J35
4133G1L83m94M4j63K62L18k11k32j65L16J72l89j60O0M15k04J05r4K93k18O6p3
4155A02J91m98J47K0J78m2j00J21l22K93l7Lj60K06p3J94p4j19l45J20N5l1N4
4178a17K12j23oq6O0kJ63R0n94M83k60Q1K3j0J66k68r7M70K3l39L9J75j54K01
4202A30j94j25K87J1J2k45M9L5K23l73L60l49J44l9j48J0ON13m98N5K7J20O9j04
4226b4J02k11K72J40k63j98L04on6p9P9m9MJ37n3p3P2j30J45n8j18Nl5K05j76
4251f4N5j4J24J36k03j13J97k35K97l13O1J33P6j39k25L10j11p1p3M07n63O33
$$ plain form
4087 105 26 -224 -139 36 -320 52 -24 -413 20 124 44 -7 155 213 -52 169 -75 97 22 -137 -195 -53 188
4110 188 -198 105 109 109 116 380 230 -198 41 -61 285 -313 -44 186 -127 -107 205 112 -166 110 146 -64 71
4133 71 454 -40 4 -159 103 421 210 -22 -187 129 301 -88 -248 -188 227 23 128 34 327 109 175 102
4155 102 293 -205 -58 -38 140 98 -2 119 -203 90 53 56 -104 102 29 223 149 30 -315 -195 -140 -171 -117
4178 -117 95 -28 -34 -120 -60 -62 101 191 -403 80 -180 -99 -76 -86 80 -188 -285 185 208 -131 -92 83 -71 130
4202 130 -64 -189 98 109 121 -124 -75 -40 183 -190 170 -179 -35 -74 -222 -212 -206 307 -191 -136 -109 11 80 -24
4226 -24 78 -133 139 279 16 -182 122 116 60 -19 60 11 15 152 99 26 98 -32 113 55 -63 -58 -93 112 -64
4251 -64 -9 -23 101 237 34 -79 118 -117 180 -133 -72 61 137 -2 -227 83 -28 -99 -172 235 -328 305
4273C05m18R0j08K28J65l29j2L53l62K58n12L77j84p0K07R9j11j15M98l42J23
4294A40r2l7K16k67l13J50J50R9l91M11J79j85l18L3K95j91K8K4J73K7j70j57
4316a96M7K66m31M00k3j0j70M5J75Jk00M7k56N8K12j18J57J53k97O9p1K26K36
4339C20k92Rj13j7K74k10k47J86J38J25j76j36P0p8j34J29K47j22J55j81k00K27
4361b6q4L9J06J16l2j57L68k95P6J80n00K82p4m8K83j23J1l0k3k29P6J83Q4m13
4385b30N85k81l24P0K51J02J83j42k55j41L63j27K4J9j69j5J36k79K05K09k39
4406e5J74J42k19J08pj32j3k97L04p8k1kJ3k8K09j2j14R8j96K82J02k70k13M77
4430B52k08J02l63L20l81J15K87k44j5J12k61K81P0l25J58M7o6j83l3L66j40O4
$$ plain form
4273 305 -113 -23 -131 97 262 -67 -79 274 -88 170 -342 35 -149 -219 -12 87 -24 -139 359 17 140
4294 140 48 11 227 -40 -353 -203 -53 46 -345 66 245 60 -258 -225 70 -121 -93 -69 104 131 -39 -196
4316 -196 -149 117 -314 86 63 53 -117 -72 103 104 -96 -49 -305 -247 -35 -153 4 157 -140 -71 -142 84 320
4339 320 28 37 -76 -93 181 -29 -276 -90 48 173 -3 -139 -69 -147 -281 -152 95 -27 128 -53 -253 -26
4361 -26 -110 -71 35 151 119 -38 330 35 111 291 -209 73 -1 -49 234 111 122 92 69 -160 -84 99 183 -230
4385 -230 355 74 -250 -180 71 173 356 214 -41 -182 181 54 78 97 -72 -87 49 -230 -25 184 -55
4406 -55 119 261 42 150 143 11 -2 -299 5 -73 -94 -96 -83 -111 98 86 -28 70 -126 156 258 -12 -225 252
4430 252 44 146 -217 103 -278 -163 124 -120 -135 -23 -284 -3 67 -258 -100 -53 -119 -302 -335 31 -109 -45
4452d5L1N3q3k92M05J59m88P2J32k3j68J39qkL02j72kj04J23J36j63qo5N7R9m2
4478D3Q4k45jK72P0k25P0J6Nl6j07K9K07j81j0R8k53K7L15j78K88l09P0k24L63
4503A88j1J2j01J40j72j0J8n97Q38m58L09J03r4k74k89K79J9K74k06K67m82L04
4525E7k66J70j19J28O7O3l4j62p6J87R0O7l1j39N4L0j94M45k77J23j97K16k5m28
4549b51K39RK79l57j31j67N73l16j19L97j82K63j51Ro9Q4l19K90k71K62M8j17
4571Cj43j76M51m91L33k21M40k38K17k82J40n3j63J10J27k9k40L03k98L38k65
4592a37L36k47J21j1k40K31k44Q6Q2qJ84n6j02k12J42N97o38L6L4J39j87K45j34
4615A7j28Q2P5j91K82m01J13L41m0j90P7j03P5J05m8n5q8N7K2J3K28j08j9j36
$$ plain form
4452 -45 -14 39 -44 -336 69 228 -260 -188 -56 -79 -247 -108 -116 -118 184 12 10 -94 29 165 2 -6 -71 -14 85 43
4478 43 127 -118 -119 153 223 -2 68 84 89 53 -54 -25 182 1 -9 89 -164 -137 178 0 288 -21 49 -175 188
4503 188 177 189 88 228 56 46 64 -533 305 -153 156 259 165 -109 -398 -119 -100 174 -32 235 -247 57
4525 57 -209 -39 -158 -30 37 100 66 -96 -172 15 105 172 141 2 56 86 -108 337 60 183 -14 202 177 -251
4549 -251 -12 -3 276 -81 -212 -379 194 -122 -241 156 -26 237 86 95 26 110 -209 81 -190 72 120 3
4571 3 -140 -316 135 -356 -23 -244 196 -42 175 -107 33 -20 -183 -73 54 25 -215 88 -210 128 -137
4592 -137 199 -48 73 62 -178 53 -191 -105 -23 -31 153 97 -5 -217 -75 522 -116 -80 -46 93 -94 151 17
4615 17 -111 -29 46 -145 137 -264 -151 190 150 -40 37 -66 9 114 66 11 -77 -20 2 15 243 135 116 -20
4639b0J28j17O1l5q3K04k74K23J8r9q2O4M46j54l32K13j06k12K02l01K54K34j32
4662A00j45JQ7m8l51L23j4K38j65J60l84L40j36j31K75O0o1j61m1J83m0k61j05
4685b76J76j43J17J24o6J81l42J88k18L59j15J88j58k76N88k33J5rj59K75j48
4706F8K7k06J0nk81M20j88L38n21M54l35L52k63K98K13m68J19o5j42o3J84M6q3
4729i1o6J29k20K01q8L99k01n2L6k92J57L0K10k54J07O3kK31m82J62L24l34K49
4752B16k55k02M25k06o6K22q7M5K33j49l57K97j81p5j3L59k40q9L08n7k01q1K4
4775a30K45K67k91p0L04l81OJ23k48K59j40j03o7K40o7m3q0M7J8J51j47N9M5J16
4799A13N1l1l78J66r0R9j16K33J59j13jL5j86J41k9K4k25J44j83L15j78K09k60
$$ plain form
4639 -20 108 -9 52 17 -66 138 -136 87 105 6 -76 -12 434 280 -52 161 55 -157 45 -256 -2 232 100
4662 100 -45 -44 43 -5 -356 -33 -47 191 26 186 -198 142 6 -125 150 210 149 -12 -53 130 90 -171 -276
4685 -276 -100 -243 -126 -2 -68 113 -229 -41 -259 100 -15 173 15 -261 327 94 109 100 -59 216 68
4706 68 95 -111 -101 -106 -387 33 -155 183 -338 116 -219 133 -130 168 381 -87 32 -33 -175 -238 -54 -8 -91
4729 -91 -157 -28 -248 -47 -135 264 63 11 47 -245 -88 -58 152 -102 5 68 66 297 -185 -23 301 -33 216
4752 216 -39 -241 184 -22 -88 134 47 92 325 176 -181 116 -65 -140 -153 206 -34 -123 185 128 -73 -154 -130
4775 -130 115 382 91 21 325 -56 -50 73 -175 84 -56 -159 -226 14 -53 -96 -176 -129 -111 40 -107 -48 -3 113
4799 113 164 133 -245 -79 -169 -70 -186 47 206 93 92 127 -59 82 53 77 -148 -4 -187 128 -50 159 -101
4822a01p8m0J55J67q2l93L26j03J98J27o22L59r3J38j32K47k8k4l9J30j85J51
4844G8k5l86J94J88l24M42j9j42l7J41j79J60j49j1k55L10J46M3k06j31K40l66
4866b88M96k83l8J39J20r3p1J68q2R3k19K56q6k98J95j5J17Jk73K18P3p6m1j40
4890a27%J80o5K4J08j93Q2l51M26j27M2R0J56K2j21m62J86J4K31j55J54k9k64
4913a79n5J55K06j07J29q3n7J40j11q0K99j63Q7r5p0R9k9k8J6j89Q0K53k86P3
4937Ek2j7L02k17Qlk32J39K53k48k58K46J3m4P1j63j9J60K05k87J37k44n2K00
4961f7J92%l8l38K06K6o4Q6RO4k40J01J39K01k0k26p0j98Q4k7L20j29J23m40j3
4986c19J37P6M52k81R2K31k28l81K06l5MJ91k02n7K79m79L68j85J52J27j44J48
$$ plain form
4822 -101 -179 -219 -64 103 21 -372 -46 -149 49 176 -446 -87 -180 -42 -174 73 45 21 -18 112 -73 78
4844 78 53 -333 -139 49 -275 167 148 6 -31 110 -69 91 -58 -69 -324 -14 132 175 -31 -162 78 -288
4866 -288 208 -75 -113 26 146 53 -18 150 68 161 -58 198 112 -186 9 -6 111 112 -161 57 130 54 13 -127
4890 -127 -127 53 -12 12 120 -73 9 -342 84 -43 -1 89 245 267 146 -316 -130 -116 115 -40 114 85 -179
4913 -179 -234 -79 127 20 149 66 9 149 38 -42 257 94 181 86 16 115 86 58 74 -115 -35 218 -68 5
4937 5 -17 -34 268 51 59 56 -176 -37 216 -32 -290 -44 -31 -75 -4 -167 -186 -26 179 -108 29 -215 -267 -67
4961 -67 125 125 87 -251 -45 -19 -83 3 12 76 -164 -63 76 277 257 31 -39 -237 -153 -180 140 11 134 -306 -319
4986 -319 -182 -106 346 65 157 388 160 -221 -15 -50 -46 145 -57 -114 165 -314 54 -131 21 148 4 152
5008A52Q5k66M3r2K66k19J08n2MJ46k66P7M36m98n5M2J1P4R7k34J81j89L0K84
5032A65j67J31m65O10j32k17J20J14k03K65j32O2l29K42k55K24o4Q0Lj01L28j16
5054A63k42K52j28j20J46j13O9J94k22k84M17j61n2O8K05j84O3J76l28K10m0l
5076H6j48M5o4L49m21L65k43k73M57k91NJ00J45r9J45m08J55J96j0j73K95J24
5098C37n52L55j69K15k25P4k19M45l5l24K68k07N9k04j19N60m58j90O00mj85R7
5120A19k56o8J69k31K81l41J88K98m10J04J73R5j52L39m11m8J68K22j67j74J65
5141F3ok58J37K69Oj32J70j46R2l06K47j69K52k88j93M48o5Q5J89n65K85K22l71
5164c4Q7l23j6M32P6m58L23j51j78O0K38j97K18Q1m80J94K15o7p1lp3K68Ml88
$$ plain form
5008 152 237 -29 14 -78 188 -31 77 25 29 175 -91 -14 422 -76 -131 -89 -78 -4 93 -141 40 -149 -119 165
5032 165 -2 129 -336 274 142 -75 45 159 -44 221 89 151 -178 64 -191 33 -31 49 52 -49 279 163
5054 163 -79 173 45 -75 71 -42 27 221 -1 -285 132 -29 -81 -13 192 8 71 247 -81 129 89 86
5076 86 -62 -17 -81 268 -153 212 -31 -304 153 -138 -133 -33 112 13 158 -250 -95 101 91 -82 213 337
5098 337 -215 140 -29 186 -39 35 -184 261 226 -98 170 -37 22 -182 -301 259 -199 -389 211 207 22 119
5120 119 -137 -205 -36 -267 14 -327 -139 159 -251 -147 26 121 -31 308 -103 -151 17 239 72 -102 63
5141 63 57 -201 -64 205 211 79 249 103 195 -111 136 -33 219 -69 -262 186 121 206 395 -170 115 337 -34
5164 -34 53 -270 -286 146 222 -236 87 -64 -242 -182 56 -141 77 158 -322 -128 87 20 -51 -54 -127 141 145 -243
5188b43M61l13K9J59j07L06m27M4j17L09p7K8pR9q3o7J3n7J59k39J74j19o4L05
5212A66k21j2K31r0K44m74QK60k70N07m19M05k43P6j18l2j80M93m23j07o2L48
5234H7J19l45J02J5j31J99o3p4R8J38l37L52k38J75j31p5j07L45k58J02l0J13
5256E6j33K02o2p7m62M52MJ47j78J10j7J23j68j6j80j43J47K1J10q6K12O4p9k24
5280a77L96j02K65j41j86K38l08J60j47K76n17K88j24r0J47k0mN6J00j24R6k42
5302a60Q3L04n8j80k4j57K75M4J64k01j09J42j86M3L04n31J09K16k22K7K27j91
5324h1J07r2q0j68P91l95L6J09O0k60Oj12O0J76k95L79r0k02K40l39K04l32K11
5347f7j0O3p3j35R3J49j4J91l58K80k96R7j9N3J52k24k35L83K1k10R6J27N1j74
$$ plain form
5188 -243 218 -95 -66 93 -14 292 -135 -91 -208 101 24 52 45 144 61 -6 7 -50 109 -130 44 -75 -139 166
5212 166 -55 -67 164 74 318 -156 -148 112 -158 349 -70 335 92 168 50 18 -162 331 -92 -199 -261 87
5234 87 206 -139 -37 -22 -153 46 -17 -91 7 145 -192 160 -78 97 -34 -109 -216 129 -129 -27 -57 56
5256 56 -77 125 63 -14 -476 -24 -20 127 -51 59 42 165 -3 -19 -199 -342 -195 -174 -64 -150 62 126 47 -177
5280 -177 219 117 382 241 55 293 -15 145 -2 274 -243 45 -79 -169 -22 -42 -46 10 110 -14 82 -160
5302 -160 -77 227 169 -11 -35 -192 83 127 291 90 -19 123 -63 -20 284 -247 -138 78 -144 -117 110 -81
5324 -81 26 -66 -146 -314 477 82 118 227 287 27 33 -79 -19 157 -138 241 151 -51 189 -150 54 -278 -67
5347 -67 -77 -14 -87 -222 -129 20 6 197 -161 119 -177 -80 -99 -46 106 -118 -353 30 51 -159 -63 64 115 -59
5371e9K59l34J32n6P2m7J41j30O5o8LJ55l98J86K60j18k36L12Km1J0j19J16k45
5395a38J25j1p3K48J01j62J29k66J5MK19K1l56J80N4l93L65J7k9j36lL19l16K23
5419A37P4k92k45L82j48J08P6k76L87l9n0j9j71M3j45J84K9l00J68j32R9J68j04
5442f6l2J47k10K22Lj64M55m24J72j75j5L2J61n6K51k09j05j15kj9L6oK77j39
5466A9R3j51q3J07J51l94L45J76k89r3L49k39K56Ll39J92j1j45J62j04L7j80J37
5489aJ0Q0j03p0n7J88k86K02k15M59j69J42l46K17J59j71K3O0j7k50K68j72J84
5512A35N2j01q2K32l56K55j46o8J91j47m2q0n7L79O7M5j81n6l1p0J06J17J15l55
5536g8L46m60K66N4j56R5j54K00k33M03r8j67j40J31%M64k14m51R3J39M4Q5l26
$$ plain form
5371 -59 200 -134 -2 -58 14 -33 108 -22 43 -25 -22 133 -265 -79 181 63 -173 139 141 100 110 -9 107 -138
5395 -138 -13 -24 -97 151 252 90 219 -47 -32 -28 191 212 -144 36 90 -303 62 79 50 -86 -89 230 -86 137
5419 137 211 -81 -326 56 -92 16 92 -184 203 164 114 95 -76 -33 -178 6 35 -265 -97 -229 -130 38 -66
5442 -66 -98 49 -161 61 64 -100 355 -69 103 -72 -87 -55 106 50 301 92 -13 -128 -130 -149 -113 -119 158 19
5466 19 112 -39 -122 -15 136 -258 87 263 -26 -119 230 -9 247 250 -89 103 92 -53 109 5 42 -138 -1
5489 -1 9 89 -14 -84 -141 47 -239 -37 -252 207 38 180 -166 51 210 39 62 122 105 -145 123 -49 135
5512 135 187 86 4 236 -120 135 -11 -79 112 -35 -77 -157 -214 165 232 277 96 40 9 -61 45 162 277 -78
5536 -78 268 -192 74 128 -28 67 -87 113 -120 283 185 18 -122 9 9 473 259 -192 -99 40 84 169 -157
5559a57J07P4J00K65l10r0j99K82J77k02K34j9mn15R6J02R1J9k70K57O9J0j66
5582d9k50M15j53O8j59L4j6M69p78N18q4P4k03J79k31K58q1k32M40j53J8j47K43
5605A80k58K92p5j02j12r6J44M95n10p4K39k81Q3o1j51M19R9l03k9j17L59j40
5627AL10M4m65N6MO9j35R1O7k9j55R8K12k44J78k02K00J18k39j80L02k6o3JJ44
5652A57l20J88k2k02O9K28J21j75k97L55k26K3p1OJ2P7j52K23R7n5QL30Ln22K85
5677A40l3j50J29o6J92j4J13m93J09J4K15k21J03l04M22k68j00L96P3M6k70k80
5699b47N11k82k6l5R3j27J0J75k45L00k48N3P3J13m09J94p2r6L06J19l42P3o5
5722a74J29J44l63J76L08j09k29rJn0L68l35N8J21K00l15j03K00K3j20J51k09
$$ plain form
5559 -157 -50 24 124 389 79 -11 -210 72 249 47 281 262 258 -257 -161 -59 32 51 -219 38 107 117 -49
5582 -49 -299 116 -37 31 -128 -94 -110 359 -419 99 15 89 -114 65 -166 92 11 -221 219 66 84 -63 180
5605 180 -78 214 139 37 -75 -171 -27 468 -42 -116 123 -158 -75 -136 -287 132 231 -72 -101 -218 141 1
5627 1 311 355 -110 -54 -50 19 -116 -25 42 13 -142 -44 168 -76 102 -100 100 218 -21 -201 101 75 12 13 157
5652 157 -163 25 3 -199 -130 98 219 44 -253 102 -124 -101 -172 -166 -154 -77 -229 -6 91 36 44 374 377 -145 140
5677 140 107 -43 86 20 212 198 311 -182 -73 -59 156 -65 38 -266 156 -112 -212 184 257 303 33 -247
5699 -247 264 -18 -44 -79 14 -113 -103 72 -173 127 -121 -68 5 118 -291 -97 -169 -265 41 160 -182 -109 -174
5722 -174 -45 99 -264 -88 220 111 -118 -127 -126 -176 192 -143 -85 36 236 -79 -182 18 41 -79 72 -137
5744a37P9Q4j52k07L74k45L08N7j14j93P2L70o39O88l94Q0j01K8k79M45j19K50
5766B55j95k07N7j60K61k42rJ41J05J22m96N18L9j37L2l02J80J64k95J17J56k66
5788a62o5J8M57k56J1n8j09Q6O3L14n75J77M9K13l7Q1m69K54K5r5L01l43L59k26
5812A3K22k25j21J79r6Q7L54p4j98k10J18o2J20q5O3pM4rk34L7j18K18lp0J18
5837F1Kj46J24j70J02K04m27O24k28k16P1K34k15R4k65k22M06J61l94p5L49q3
5859ij2K72k07m3n3lL00j08j41O8mr9NO8j93K66Q1J04j12k14rl2J43J74j24j04
5885A4R4j31J38k25M8o6K63L4L3l89J31J15Nk37J37K48r3J5P4n24L87K05n70K55
5909c9J61j78k6J41Q8j93m3M24k36j70K2J70N6k71K42m6J78k23k49K38q9K65l70
$$ plain form
5744 -137 -58 26 -126 -333 41 -204 104 161 47 -146 -74 296 -343 345 -49 31 -70 -42 -321 124 5 255
5766 255 60 -147 -90 -250 11 -231 -240 -99 6 128 -368 150 189 52 84 -218 -38 126 -169 -52 104 -162
5788 -162 -227 -209 248 -8 3 -55 -164 -78 -15 299 -276 -99 -50 163 126 207 -262 -8 17 -78 223 -120 239 13
5812 13 235 10 -111 68 -28 59 413 339 141 -69 49 -13 107 22 85 78 122 113 -121 -84 -202 16 13 -57 61
5837 61 63 -83 41 -129 -27 177 -250 374 146 -70 1 235 20 114 -151 -373 33 194 -200 -275 74 -9
5859 -9 -21 251 44 1 -52 -55 245 137 -4 64 60 -39 -34 34 -159 107 188 292 180 -34 -43 -75 68 242 118 14
5885 14 108 -23 115 -110 -62 -128 135 169 202 -187 -56 59 64 -173 -36 212 119 134 208 -316 71 276 -294 -39
5909 -39 122 -56 -82 59 147 -46 -89 335 99 -71 -49 121 177 -94 148 102 280 57 -192 46 -43 222 -148
5932a48J7J82Rk36J42j3O6j86J65K22k74Nk28J93Kq1Q7J05J45j43o0R5l41K50
5956b5J21l0j12k14K46k25N1l2J72R2M0k73k2K28O4k13J3K24q0j66J35k54L86
5979A26l35K69k27K30q5M9m5R9M7j14j52J62j91K53K33m35j02o3N2K62j23q4K23
6002D9j20PK53j83Q2P3J15j86lm75N10J6o0J52m64K8N47J23m43m21K21J91k10
6025a98j19K95N7O6J14k87J36n6L42m16J87k49K31k16o4J66j01k1J02j12J42J64
6047A63k2j80l7L89j55j95J68Mk0k32l5J29K8M9qQ1k90K14n2j39n2K24j41J08
6071aL1j01L4J99j27J41j87K84l12p3K11j01k13K46j68P1K31l88L68j42J82J49
6093C34m52K10j95J23j1k48L12Q3j05K9o1Q9r1k93K93J54m35K92k03L75J6j13
$$ plain form
5932 -148 -131 51 60 -176 -34 -47 19 -167 -2 220 -54 -49 -277 -84 -82 -163 -76 29 174 31 -29 66 -275 -25
5956 -25 96 66 -46 -260 -14 -239 -188 -220 -48 44 84 -189 -211 17 81 -132 -119 105 25 -141 -6 -260 126
5979 126 -209 60 -167 63 -22 27 -18 81 128 14 -138 24 -167 86 319 -116 -218 -281 -229 33 -90 -174 49
6002 49 -71 -64 189 6 88 161 276 90 87 -388 122 138 78 230 -234 -206 341 464 21 -400 -179 12 -198
6025 -198 -317 -22 35 101 215 -72 64 8 350 -66 121 -128 103 -113 -177 -11 -112 -133 -31 -143 -1 163
6047 163 141 -39 -76 313 158 -37 131 135 115 -117 -152 -23 5 54 46 127 -163 51 -1 -140 -192 32 -109 -1
6071 -1 30 -71 -37 162 35 176 -11 273 -39 -112 99 -2 -215 31 -137 -66 165 -223 145 3 185 334
6093 334 -118 92 -103 20 9 -239 73 156 51 80 19 108 17 -276 17 171 -264 28 -175 200 216 103
6115A03k84K8R9K17l32K12k9mJ09j74K71l21J99j43P0K61k34l01J35j7R6L38j71
6138A28R9l43j32L14oJ17k62J67P3k74k40K99L31j63j25n9k44M38P9r8%l6k12
6161a49n8O44m71N7K04k36L23m51K97j56j8N4l68N03m5P9j17K20n62N2J71K74
6183B47k39Q5j33J80o4l48O22o38L41K00m72K70k48K28K8j11P6J54m55L38j31
6204g0k95M56l8nK0m9K5k67M4MO2J86k1r4k51L26k35K65K18l58q5j65M42m43K52
6229g6K30k52j26L75l07J67K48m75L82k54J81m8l05K66j06k5J55J47r0j26K07
6250A68p16P08j6j95k21K76k00o2K19K61k07k09K76p9j43J12j38J37j09O4m6K40
6272A20nj06oj44K18j51mJ59L84m00J16k44K5j2J89L8k57R1O8J18R5m00j54M35
$$ plain form
6115 103 -181 -153 -54 163 -169 43 14 10 119 -55 216 -105 94 -49 21 282 48 -253 -118 -135 -39 299 128
6138 128 227 -116 -248 66 60 177 -85 82 155 -119 -359 -60 271 108 -17 -76 -320 118 197 99 99 63 -149
6161 -149 -207 437 -34 23 227 -9 314 -137 160 4 -14 40 -328 175 130 209 92 312 -250 -198 -27 247
6183 247 8 93 -40 140 76 -272 350 -288 53 253 -219 51 -197 31 59 -52 24 178 -277 61 -70
6204 -70 -365 91 53 48 68 19 44 -223 -179 -175 -113 73 52 -42 -293 33 -202 63 281 -77 -162 -327 115 -328 -76
6229 -76 154 -98 -224 151 -156 11 259 -216 166 -88 93 45 -260 6 -100 -125 30 177 87 -39 168
6250 168 -548 160 144 -51 -272 4 -196 -258 -39 222 15 -194 82 3 -140 -28 -166 -29 -138 -74 -120 120
6272 120 115 9 3 -141 77 -74 -78 81 465 65 181 -63 -38 -50 139 177 -80 11 79 197 292 -108 -262 173
6296A73o7o4o4J54j90J22J64k83K88l75K55j95l4P7j5K32m62J85j82K54l4K15
6318A54r2R6P5o3p6N7k13j1K36l14K11o7k61K85q5M5K09l4L6j21Mk27K01j61n1
6343a67K03J74l9k23J23L7m2j48J99j37M1L8k28J00O6P7l09M61l15J84QQ6j89
6366@r7p2J64R2j21Mj04k04K13K74n07L76Q5j15J57o09L87k9K69r2j0R2k11k9
6390h7O7k37K78r4J05j12N2J06j66m0L28j96k68M92o39N01l29K40m0q8qP4o6K31
6414A04R6p1k57R3J23l0j28J73J03N9j46j62k3l6l7J13o2j36J81J10j38L0k34
6437b75L87k38q0J48r7K49j73J49L6l63J04J37L40k07k62l8R0L8P7J32o6k04L
6460a13J14L25k30J03k22j94K24K61j73OL4m9p1rj81L44k29J60qL5j27j29P3k1
$$ plain form
6296 173 106 42 -22 132 -58 64 228 -55 233 -142 113 -82 -116 -39 -54 178 -284 -99 -281 -27 -61 154
6318 154 62 158 233 170 94 151 -62 -73 163 -151 60 -7 -268 17 -68 -23 186 152 188 67 71 -156 45 -116 -167
6343 -167 36 210 171 -52 71 108 66 -82 117 -20 21 59 -169 -69 -3 74 -235 226 -89 95 103 189 0
6366 0 -97 -169 -5 87 -34 -30 -134 -338 -125 149 -358 18 103 -12 145 -464 -77 -106 163 71 61 153 -58 -87
6390 -87 -20 -257 21 -73 32 -80 -28 78 -88 -128 200 4 -264 228 -411 90 -239 1 -39 -127 -135 -61 -127 104
6414 104 200 129 -128 -35 88 58 -70 103 206 265 119 -43 -66 -102 -139 -26 -88 -224 -43 67 -71 -41 -275
6437 -275 112 -126 -206 -58 -155 94 -79 70 106 -257 -153 -16 324 117 -145 -183 -93 -55 22 154 88 -116 -113
6460 -113 1 326 96 199 -23 -217 7 268 95 101 135 86 15 6 -175 169 -60 100 92 127 0 -129 -56 -77
6484g7P7l8Q5J3J54l33J47r0K85m48J49J72l35J59J36j83J48M5k27p1O5K40J13
6507A86k77j09L19r5N7j90k51O18l75J67j87J40j13p1R2l4J60k28K58p7j29K11
6529G2M1k48J46l9j1R8j61J78k53K79k29K21m1k38Q8J16J40q4k61K90j56J44k17
6552a25K23k54j26J05K25k19n5K17m9J22j38j5J21j55J34K30r5l34R9l7L48k96
6574g4J87J08m55K63j78J21J46j55K6N5J02k42J05k18M54k58j57K61j63j87K25
6595c4mL27l99K21j18O6r3k0J62k52L62j89J77j16J25j41p0k27K02j73L2M4K54
6618A36k96M07k82J87j14J59L4n31N06m44K01J30m0l5j05Q6K09k5l69K96J46m78
6640b22P8K63j84JK28mk46K29k66P0N9k36MJ12J32K7L8j13j2M1Q3k9Q4J03m09
$$ plain form
6484 -77 0 -38 47 60 214 -119 28 -62 223 -225 -76 96 -239 -80 56 -127 21 66 -161 -232 -167 73 186
6507 186 -91 -200 119 24 81 -109 -360 258 -117 50 -137 3 -110 -181 -89 -123 37 -191 67 -10 -139 72
6529 72 113 -135 11 -28 -39 59 -102 76 -177 102 -127 94 53 -185 -97 19 159 75 -186 104 -52 92 -125
6552 -125 98 -156 -282 -177 48 -171 -226 -9 -58 64 -74 -89 32 -123 11 241 146 -188 -89 -126 222 -74
6574 -74 113 221 -234 29 -149 -28 118 -37 -11 44 146 -96 9 -209 245 -13 -170 91 -72 -259 -34
6595 -34 -38 289 -110 111 -7 59 -34 -54 108 -144 218 29 206 90 215 74 4 -223 -21 -194 -162 -118 136
6618 136 -160 247 -35 152 38 197 231 -300 206 -238 -37 93 53 18 -87 -1 208 183 -186 110 256 -222
6640 -222 -144 119 -65 -64 164 160 -86 143 -123 -53 6 -230 -226 -114 18 45 83 -30 -42 -1 82 53 137 240 -169
6665a69q4M14j93L04k22k6j78K90lN4j85lJ16k45N78j34j10o38N46j25J74j95
6687c4L41k47j50J13o0pnJ20Qjj87q7J50L34k82n4J77m19J30Q8j65K76o2J72n21
6712c72L68N0j3L8k9K09k95J29m04L91j27L8J53k66L61l50j59K66rl0K7k51J88
6735h7K1R6J04k5k3j21N1K6j22J29m07M02rP4r8J58L4k27K12k36q7K87l91J07
6759a32K5J24j87P9J64j44j72J58J40L66n69L01j35R2M1j15J01j45q1p2Q7j40
6781b14K99k31J19m0o8L58m4k38K02l60K16j09Q2m9Q5j30R2K78l29k35L03q4J57
6804F0j10l8J19J29j06mj44J33j15j57K94P0l09K98Jj94P4p4L4O1L35j60k72J23
6828D8O9K8k05j47K79k09K21j0l53L81J04k31j75J30%J29j66O8j03K44O0k10M5
$$ plain form
6665 -169 -253 161 -32 272 50 24 -154 136 133 187 2 -1 115 -130 448 314 204 -434 112 -13 161 -34
6687 -34 307 60 -90 23 -37 -44 -49 71 79 78 -109 -196 -46 288 6 -48 129 -290 -160 -72 -237 39 -23 149 -372
6712 -372 -4 46 33 71 42 251 -44 85 -319 72 -55 -17 136 -130 231 -119 -278 -12 -21 -51 -24 -275 -87
6735 -87 -66 30 134 109 86 -35 16 42 -80 49 -358 44 35 109 11 169 203 -24 188 -48 -135 152 -239 -132
6759 -132 -107 17 -170 -91 73 -71 -243 -85 55 421 -148 153 18 110 151 36 137 -8 -89 -161 -74 -214
6781 -214 85 -146 -27 -67 -135 223 179 -59 143 -217 -1 -110 -28 -77 8 -122 -30 248 -81 -316 -13 -97 60
6804 60 -50 -88 31 160 54 50 -94 39 -76 -233 61 131 -178 120 121 -73 1 -73 -39 22 357 197 -75 48
6828 48 117 145 -60 -207 72 -137 84 74 -279 102 206 -25 -200 -70 -70 59 -107 -39 -142 102 162 -48 -3
6851cj03J27j32J41j5m1J59l5k21n6J85k1J6r1J19k01K91j61r1K50q2pk1J40l08
6876a61J41J7k2J92o9j93r0M93m32J40Mk9J66K2l14J45L7j37J61j74l8J4J27k5
6900b5N2k30Q6L4l8j64K04P8Q1k57j07K51j16j01M47k28J08l02O7K75k04n1R9
6923d1Q3l74Q3K65k13O5J13J57m04J23K67j00O7N8l28K2K53j16o6J79j29K81j04
6946A41K54l78r3O3l0Q0j88J64j37R4r9L8J8K52j45J18j73O4M4k00J79J1J05k95
6970a13j95N20k70L15k06j64K33L2j25k12n7L65N9l58L22K33m69N0M4k40K48J22
6992A34k08O0j41M10l91R8n2K4n0O8K6J13k46J80N4r4K3j4L20m78N0j04J60j50
7016b08J33k33K10J31j90J98j99q7K95j3Ok52K88M1k75J09P1m03J48L46l21K72
$$ plain form
6851 -3 -106 21 -111 30 15 -26 133 98 -123 -179 6 -15 1 -90 29 -172 119 -42 -133 117 35 28 7 147 -161
6876 -161 -20 -3 -25 167 98 -95 -185 308 -124 16 20 -9 157 179 -135 10 47 -90 71 -103 -141 -127 0 -25
6900 -25 27 -203 -117 -83 -121 -285 -81 -3 78 -179 -286 -35 -151 -252 195 -33 75 -227 -160 115 -89 -140 -41
6923 -41 42 -332 -249 16 -197 -132 -19 138 -266 -143 124 24 91 149 -179 -157 96 -20 -86 93 -36 245 141
6946 141 395 17 -76 -13 -43 37 -151 13 -124 -30 -129 -91 -73 179 34 152 -21 43 87 -113 66 77 182 -113
6970 -113 -308 212 -58 257 51 -113 120 152 27 -185 -242 123 182 -176 146 379 -90 -40 4 -236 12 134
6992 134 -74 -14 -155 255 -136 -38 -90 -66 -116 -48 -22 91 -155 25 79 -15 8 -6 314 -164 -114 -218 -58 -208
7016 -208 -75 -308 -98 33 -157 41 -158 -245 50 37 43 -209 79 120 -155 -46 25 -378 -230 116 -205 67
7038F7K9j39R5j07N9K10j29O5k34N6N8k13L11o9j29K11k88K03m0k53K22l1lj33
7062a82m0L25L3k89J20R5J7k71j66L91J29j32J69r1j42p4M1kk09L68j50J51k18
7085a27N9J9K64l83J94K60m55n5L6j35O30j54k03k02L05j06J71l67K89j16k4L22
7107B22k35J72J26l80j05J22J6n9L47n1l14J62k32J69O5J50l56L93j1l13J82j21
7129e1J55J11p0l85L90p6k21M4M28m90L00j82k13K18K45j20k50L37n2m27K36L1
7151d2J38j57OJ19l06K85p9J90j32k11K77k94K10NK62k32J3k81M58j84%J1R0j84
7175c8J55m3J4j87L53l73N3k86N38j87j02j10K56m24M73j62J9Op0N3K32K1k14
7198b3J34j91OK74l06M68n52J82L1K49l13J15j99l1K52l62k9L07N2o4L0o4J84
$$ plain form
7038 67 96 -43 52 -55 4 214 85 150 -84 -28 30 -183 128 59 -70 141 -147 56 16 -237 -15 -46 -49 -182
7062 -182 -222 103 136 -153 -33 62 79 -192 -358 33 162 30 199 108 -34 -108 -67 -69 -278 90 -60 91 -127
7085 -127 -68 -49 215 -168 26 286 -169 -224 -188 -323 307 153 -50 -252 53 -53 118 -249 40 -76 -100 222
7107 222 -13 159 285 -95 -200 -78 -62 -121 226 175 -139 23 -209 -40 25 175 -181 212 201 -112 70 -51
7129 -51 104 215 145 -240 150 74 -147 -103 325 -165 135 -47 -260 -42 203 83 -167 170 118 -309 -73 -42
7151 -42 96 -61 -55 64 -242 43 -36 154 22 -189 88 -206 4 9 271 39 52 -229 229 45 45 56 146 -38
7175 -38 117 74 88 -99 254 -119 -66 -352 186 -1 -103 -213 43 -381 92 -70 -51 -45 -115 -62 170 191 -23
7198 -23 111 -80 -74 200 -106 362 -190 -8 23 272 -41 74 -125 -156 96 -266 -295 12 64 0 30 -34 150
7221A50j07j98R9j18P9L67k77J98k3k55PJ33m7J26j87K48j39n9K4j59L61k61j75
7244b13L9K00m5j80K88j63J77m4q3n0L11l71K4N0P1N7j4j95L16j63J8l6J04j58
7268f0l3Jn5Q8L11L5k52r0J52q7O4j10k3J51l59K75k33L18l2j05K38l14Q4m0j3
7293h9J97k22J34O2j99J56j65J93k03J23N2k87K48R8o3n3K07l34L9P2J36k69k5
7316a92J43m2l1J24MR0K1k10k1l1O2nn5J48j02M00m25N5O4R5j6l78K85n9J5j1
7342g2R4j20j88L56l59N77l89j93J16K43R4O5m01J55k06J53J09l01K02p1k4K57
7364I7O5M0j36r6r5L42Oj30L5r1O9J15m3n1k60J30j13J9J32k91K96M9j12M0j19
7389a02J57j25K41P2k33L47l58p5N1J93j37J17j05m2M4q1K01o0j06k59Q4K21j75
$$ plain form
7221 150 43 -155 -56 -174 -95 272 -5 193 170 -85 -78 55 8 134 -53 195 56 -3 21 -138 223 -38 -213
7244 -213 -174 26 -19 -199 89 -74 103 59 -24 -74 237 -134 -110 -60 11 68 54 -141 175 12 30 -6 98 -60
7268 -60 -93 -92 -147 -59 252 287 35 -55 97 10 74 -36 -59 92 -267 8 -225 93 61 -44 194 -120 -36 -76 -89
7293 -89 108 -114 20 82 -117 39 -126 67 -136 -13 39 -248 0 98 35 -18 189 -145 -106 -34 102 -167 -192
7316 -192 -49 -91 -122 2 6 96 117 -93 -114 -145 -83 -88 -143 5 -97 303 -122 -67 -3 92 76 -302 -17 -76 -61 -72
7342 -72 22 -98 -286 70 -289 288 -101 -294 -178 65 159 224 -177 -22 -228 -75 34 -267 -65 -136 -160 97
7364 97 162 202 66 -30 -125 217 223 93 128 37 106 221 178 127 -133 -3 -116 -97 35 -256 40 89 -23 17 -102
7389 -102 55 -70 171 243 10 357 -1 -76 -25 168 31 148 43 1 45 -36 165 105 -1 -260 -176 45 -130
7412a30K63J68j7j11p0qM9k57L2j47L99k9Kl47P42o61O9n2K8J85J3N4p7pm49L47
7438a1K63m01J54o7o3nj67O09n22L4o2J90J21j41l1NN7P8J38j59j2o1J51j9L6
7463A15K4l93k36L88K43j8k10L01k34K89j85J7r7O1o1j51J59l2pL0k58J81O7j99
7487b06L44k1m13L11kM7r6pm2l4J82m8K30l09J22Pk27M48j25l9j45N9K05q5k88
7512a32M1O0J59j65m21N59k63K91j88J14M9k18K71l04k9J85K6K44k77rP6L14k18
7535A65J67m27L09j84j18j00K64k00K87K6j00m1J46m33N76m30k1K12k73R6K61
7556A82j31L7o8l55O05k08k24J2J04j29L68k42N2K1K6p4Q2Rp8k9O9NM4K2q0R4
7582A14o4j15K8j66J16p8L1J29J27J12L0l10N7L18n82N2K19J1q9J58l6K9l48L58
$$ plain form
7412 -130 133 301 284 173 103 95 144 -113 -81 -228 171 142 144 -203 539 -122 -53 -105 -77 108 121 175 98 91 -358 -11
7438 -11 252 -149 5 -62 -125 -130 -297 312 -210 -176 -238 -48 73 -68 -99 -94 -37 41 179 20 8 -53 98 79 115
7463 115 139 -254 -490 -102 141 123 -87 214 -20 269 84 101 4 65 4 -147 12 -20 -27 3 -255 -74 -7 -206
7487 -206 138 117 -296 15 13 60 -36 -43 -85 -119 63 15 245 -64 58 65 -162 286 161 122 -23 36 241 156 -132
7512 -132 -91 -31 128 -37 -458 101 -162 129 -59 55 104 -114 157 -147 -176 9 35 279 2 -7 69 383 165
7535 165 332 -95 214 30 -88 -188 76 -124 163 189 89 48 194 -239 337 -93 -114 98 -175 -79 182
7556 182 51 88 20 -335 270 62 -162 -150 -46 -175 193 -49 3 24 50 -24 58 67 -11 -40 29 34 78 100 20 114
7582 114 50 -65 -37 -203 -87 -165 -134 -5 122 234 264 -46 11 329 -253 -201 18 29 -60 98 62 91 -257 101
7606A01J98l56l4J0kJ73N4j55r5L47k39J83l02L7J61J38l4k79K59l98K72Q5j06
7629A8m6J71l5o9k39K35L7j51K69k65K61l50j62O14m63K08J58k04P8M6n9N4k3
7652H3J76m62J63n9k7K67J05k51j64K48J14l97L00mj07R7l99L65J29j64k0J15
7674A08J20j53j66k1J35J60j59o8J97p0K19l53l7J25j74J56J1J04k25J22M6p3
7696Dj16J01l1j96L69J3q5l33J83J77k98L78N6P5k56k9k14L67k88P6j61L94l16
7719a30K15R1kp9J18o3k29J67r3J41k98J64nk39J18J29M1k33K46O3l3p6M95o15
7743a07J24L1J1k00K07j16j59J61q5J07j04J26j87M14k74K90l20K55n01L95j29
7764f1M9J98r7l79M77k41P1l6O9r8j10Q0K66k0k2J47J12l15l03L57k15N1K16P
$$ plain form
7606 101 299 -57 -91 -81 -83 90 144 -11 -106 241 2 185 -117 -80 81 219 185 -94 165 -233 39 124 18
7629 18 -28 143 108 39 -200 35 72 -79 190 -75 186 -164 -326 288 -175 33 191 -13 65 111 52 106 83
7652 83 259 -203 -40 -99 -126 141 246 -5 -169 79 193 -204 96 92 -15 82 -317 48 177 13 -7 108
7674 108 228 75 -91 -112 23 183 24 -44 153 83 302 -51 -88 37 -137 19 30 134 -91 31 77 4
7696 4 -112 -11 -42 -238 131 144 59 -274 -91 86 -212 166 222 297 41 12 -202 165 -123 -47 -208 186 -130
7719 -130 85 176 174 95 213 150 -79 88 -5 136 -162 2 -3 -242 -124 5 46 -187 59 122 89 13 508 -107
7743 -107 17 48 59 -141 66 -50 -209 -48 -133 -26 -130 -4 -191 223 -51 239 -81 174 -327 68 -61
7764 -61 -12 186 89 -290 187 -54 17 -19 50 -48 -158 -78 188 168 146 293 405 90 -213 144 -71 -20 196 203
7788B03k49j18J46J96m82K81rL6pk05P0RJ62l10Q7L32j21j72K82l3l08L43Jj02
7812C2nn0m0J32k0N4j30R3qq7m2J8M7J05mj30r0K47k64K19j27K1J25k58L21l6
7838A23k27pr4K61J07l51K53J26k96pJ03N8m8r0K33k28JL27l21k83L23M4j03P3
7862b3J34p0J11j77K8j89K33J34l64J94k31K10J59o7o2j15j0M07m25N1L24q1l68
7885a97K82J08k89M9L3k08N5K61n5k3r6j22r0K90J00k7k9KK68j53j68j6L0m4M9
7910A0j58K34k18j2Q2P6k36R2K12j67K38j75J15r5J3q0J16l78K99k17L76l74K26
7933b1j35L57j76j53L15k87j62M61k63K45p9j6j2m39M4J08K03n7L4L99l95J38
7955A09K14n37J67K42r8k61M43j13k83J19j3j4k88L55K34l09J10j62%J80J44j40
$$ plain form
7788 203 -46 -164 -18 178 -304 -23 -32 4 -3 -208 -138 -129 33 -277 -190 142 21 -151 131 98 -210 133 134 32
7812 32 27 -23 -63 69 49 103 -27 66 58 -29 -71 -53 -6 99 95 -35 -125 122 -142 77 -50 -29 96 -162 159 123
7838 123 -104 -111 -205 56 163 -188 65 191 -105 -112 -9 49 1 -89 144 -84 -83 244 -77 -360 -37 7 -96 -23
7862 -23 111 41 152 -25 3 -186 47 181 -183 11 -220 -10 149 82 20 -95 -105 302 -123 -72 252 171 -197
7885 -197 85 193 -96 -47 -14 -222 -167 94 39 16 -80 -202 -292 -2 98 71 42 44 312 159 -9 -25 5 -39 10
7910 10 -148 86 -132 -144 -62 14 -222 -130 82 -85 153 -22 93 -2 11 -69 47 -331 -32 -249 127 -247 -21
7933 -21 -156 201 25 -128 187 -100 -262 199 -64 181 102 86 74 -365 -321 -213 -10 -67 -33 366 -29 109
7955 109 323 -214 -47 195 97 -164 279 166 -117 2 -11 -25 -313 42 276 -33 77 -85 -85 95 239 99
7977I9k94L07j91n7K06j5J95l40j4L53q10L93K61m3k72J88j27j21J94J56K03l75
7999a04J45K72l77j42J65j11R9j30J47R3K03k22N5l03J85k01N0N6M27k64r1J55
8021A07J91m73L10l94J44J81o1n7j43L10l83N03j81J72O0l41M3l75L13J56Oj19
8043c1k90L40j51j51J07J90J70m14N3Q8j77J79M6J59j23K66k20M49o87K21J99
8064B23Ol48L77l55K44n9L7l60NN4K97J37j66J58l47J91k97N6J72j02q4J59j85
8087a87J12j72L20p1J54k68j34J42L1K52P8k95k35J36K13J1j01k42J45L53m20
8108a78O7j49l2L99j33mQk0M8J37l83J21J03mj02K16K77l82J29l31J06N2m4p9
8132a78J42j18j61M18l4l50L21q1k0j49K71j74k02L46j33K69j83J1J16j33J00
$$ plain form
7977 99 -195 112 -79 -136 70 55 250 -90 -104 249 -561 -168 93 50 -222 -34 -161 -282 -88 68 271 -104
7999 -104 41 313 -64 -206 -41 -152 -53 -183 -36 57 260 38 93 -210 -25 -226 -176 -120 307 43 -48 107
8021 107 298 -175 135 -259 -115 66 5 -52 -195 115 -268 235 54 226 286 -55 -12 -387 -74 82 88 -31
8043 -31 -321 19 -132 -283 -176 14 184 -230 -177 -89 -266 -87 -41 118 -5 261 41 490 -197 24 223
8064 223 229 -119 258 -97 147 88 125 -235 -230 -176 121 258 92 250 -97 94 -203 -147 25 -77 -161 -2 -187
8087 -187 -75 -247 73 2 156 -112 -246 -104 -73 179 257 -38 -273 -137 76 87 -14 -256 -111 242 -178
8108 -178 -111 -260 -292 107 -26 -30 -22 -42 6 143 -240 -119 -16 -20 -122 94 371 -11 118 -213 -107 -55 -99 -178
8132 -178 -36 -154 -315 103 69 -281 40 -41 -61 -210 61 -113 -315 31 -102 167 -16 -5 111 -22 78
8153G8j93O1l8K91nk54J4j27K84q3j18r1O2J32j30J48lj0m4L7J48m14K30j8p6
8178a19J82j95Q4Q8J39m78L66K4J2J38J9l10j11
$$ plain form
8153 78 -115 -54 -92 199 194 -60 -46 -173 111 28 -90 -181 -119 13 -117 31 28 18 -26 11 159 -255 -25 -43 -119
8178 -119 63 -132 -48 40 179 -299 67 91 103 241 260 -50 -161
8191a61
$$ Imaginary data points
##PAGE= N=2
##DATA TABLE= (X++(I..I)), XYDATA
0@%%%%%%%qJ6j6J6k4L2m0M8n6P2q6J00j18J36j58J83k09K42k79L18l60M09m65
30b47N25n90O61p40Q26r19J022j138J265j402J553j719J903k107K335k591K876
47A513l198L569l998M503n108N842o758P944r546J1838j5417K1842l6946J36005
61A12085J05288k14007j4912J02208K6164j11745j5146N6926J3776l9347K5172
72D6462K7338k9976l8447L0127J5092m4092l3178M2252L5246k6449l4569K4175
84A3981K8714k0803l9294N559K9030j218k8399p70L1844J4769k6551k3374J0542
97e970J8091n353j4624j142R147P820L863l213r583q164L162J3567L227j9983
111i155j4562K5197L1058k3197m2603J5537M3260j4797m4260J2507L9097j2204
$$ plain form
0 0 0 0 0 0 0 0 0 -8 8 -8 8 -16 16 -24 24 -32 40 -46 54 -64 72 -86 97 -112 130 -149 169 -191 218 -247
30 -247 278 -312 349 -391 435 -484 538 -600 665 -737 816 -903 1000 -1107 1228 -1363 1513
47 1513 -1685 1884 -2114 2389 -2719 3123 -3635 4309 -5237 6601 -8816 13026 -23920 112085
61 112085 217373 3366 -11546 90662 116826 5081 -10065 46861 60637 21290 46462
72 46462 73800 43824 5377 35504 50596 6504 -26674 15578 50824 24375 -10194 13981
84 13981 42695 21892 -17402 -11843 17187 15969 -12430 -13200 18644 33413 6862 -16512 -5970
97 -5970 12121 6768 -7856 -8998 149 7969 11832 8619 -964 -9128 -5966 7601 10828 -9155
111 -9155 -23717 1480 32538 9341 -33262 -17725 25535 10738 -33522 -21015 18082 5878
123E878k8511J9162K0065l1961k0450L6075J8837m1251j7706M5134K2419m1746
135a4055k2420L5471J6087l3798j2741L1064J1689k3373m666K3186M854k0620
147i322n428J3800M286j0150Q8J3802L637j1181j09J6332o12k4572m763K7937
161A3745J1863k5222j2793K5551J9636j8560k1689N910J4721r16r162q92N022
174G214L843J528L94n682q431o74Q939L258j0739o941J2142J3707q422j8246K917
189e193J6683m670k0141L358K2027j4j9497K816K0253m547k2060J506J7788k172
203F137j2244M797J1924l528p765N732M744j0560q555J1432J3165j0474j4199
216i394J0834J9764p827k2337J027J8511k95j6635R5J5013J183j0901J032R066
$$ plain form
123 5878 -22633 -3471 16594 -15367 -35817 258 19095 -22156 -39862 5272 27691 -14055
135 -14055 -36475 -1004 15083 -18715 -31456 -392 11297 -12076 -16742 6444 11298 -9322
147 -9322 -14750 -950 3336 -6814 -6726 7076 10713 -468 -577 15755 15143 -9429 -14192 13745
161 13745 25608 386 -12407 13144 32780 14220 -7469 -1559 13162 12246 3084 2192 7214
174 7214 11057 12585 12979 7297 -1134 -1808 7131 10389 -350 -7291 4851 18558 10136 -8110 -5193
189 -5193 11490 6820 -13321 -9963 12064 12050 -7447 -4631 15622 11075 -10985 -9479 8309 6137
203 6137 -6107 -1310 10614 7086 -679 5053 9797 -763 -9318 2114 15279 4805 -9394
216 -9394 1440 21204 13377 -8960 -7933 10578 10283 -6352 -6257 8756 9939 -962 70 9136
230I136o095j3629M319J3373l753j3725M766J4966l356j4336J221Q957n172r299
244a2627O267J0023n877r020O920J1151n606j5046M3J3623K435j1344k868J1181
258g45M687p659k526M959k221o680M501P681l755p278M253J0784k270j1539j713
273i521R740K364q869k338R397K798q190r25Q362l37j0340j446R186L430p430
288d119m167O491N745m528m855K323K304m858O48Q469j205j0752J281J4328J039
303H144j5689n613J4215Q104r279q093O650Q134l368n778L238K265m899j63Q426
318F294P22r902k63J1573J472j1510l168R799L637p945k881Q349L881p840m471
333b253O902M658p152n999O561O548n010m326M096J845m302r75M410j521o421
$$ plain form
230 9136 3041 -10588 -6269 7104 3351 -10374 -5608 9358 6002 -8334 -7113 1844 -3328 -12627
244 -12627 -6360 3663 -2214 -11234 -4314 6837 1231 -13815 -13772 -149 2286 -9058 -11926 -745
258 -745 3942 -3717 -6243 -1284 -3505 -10185 -5684 1997 -1758 -9036 -4783 6001 3731 -7808 -9521
273 -9521 219 2583 -6286 -8624 773 3571 -4619 -5544 2818 2481 -7859 -9305 -119 3311 -4119
288 -4119 -8286 -1795 3950 -578 -5433 -3110 -806 -5664 -5016 3453 2248 -8504 -7223 7105 8144
303 8144 -7545 -13158 1057 9161 -118 -8211 -1561 6573 3205 -2573 665 2930 -1969 -2132 6294
318 6294 7016 -2886 -3149 8424 9896 -1614 -4782 5017 8654 709 -2172 6177 10058 2218 -2253
333 -2253 4649 9307 2155 -3844 2717 9265 4255 -71 4025 5870 1568 593 5003 3482 -2939
348b939J053R096J895r668n267R002P877r007j0773N207J1144j943r113N46O039
363C149L70l263r70o84j864J193N022j93o969j853Q846M621r953q908Q365J0321
379G230p091j0646M953J0850k358r362k20O944R90n769j746L563J838j347n67
394b738O23j802o35M805L37p807k288J0467N533j0012q607Q629J0882n103j2509
409a0225M61J1972L528q763n508N848N555k261l446m98J08J561M066o54o470r38
425e664P626L566o973o177N373Q197k389q796L58R076J655q167k569O444L074
440D634m397k251K555K277o92p04N46o84m05J627J711k516l234K980O307k336
456E418p872J096Q647R79q736l046P593M219m876m156K422L086n88j062k28j548
$$ plain form
348 -2939 -1886 7210 9105 -563 -5830 3172 11049 2042 -8731 -3524 7620 5677 -3436 -2890 3149
363 3149 3519 256 -714 -1398 -3262 -2069 2953 2760 -4209 -6062 2784 7405 -2548 -11456 -3091 7230
379 7230 139 -10507 -5554 5296 2938 -6424 -6644 300 1290 -4479 -6225 -2662 -824 -2171 -2738
394 -2738 -2115 -3917 -4552 253 590 -7217 -9505 962 6495 -3517 -12124 -3495 7387 2284 -10225
409 -10225 -9764 2208 5736 -3027 -8535 -2687 2868 607 -2839 -3337 -3229 -1668 2398 1744 -4726 -5664
425 -5664 1962 5528 -1445 -7622 -2249 5948 3559 -5237 -4879 4197 5852 -2315 -4884 1560 4634
440 4634 237 -2014 541 2818 2126 1422 1968 1284 879 2506 4217 1701 -1533 1447 7754 5418
456 5418 -2454 -1358 7289 8268 -468 -3514 4079 8298 3422 -734 1688 4774 4186 3124 2896 1348
472A348j830L182M147l676p341L392R291j605j0750p80Q910J862p160k875M620
487G35K981k698k137O45O88n49k77Q28j695j309L287K287l882l685L893M922l704
504C30o625K492O319O7n958k512N043N039k891o960N36O067J573m216k770K319
520b147K893O15j879k856l61L159K217k241m351N39N813J999n778n206N177O432
536D025m385p100L182P179j664n992J086M367q08l131J097J713q28j630K809R01
552H21l290o28M373J319n652j296O377K757o375k487O241L412n131k874L176L294
568D037k121j330R17J379q32k53K045o61k781J52L553N08l932Q6L872M61l035
585B065q17J378J41p83Q9R1K00L04J48O2J9r43r79P69N19m14j029O84J697l85
$$ plain form
472 1348 -482 2700 6847 3171 -4170 -778 8513 6908 -3842 -4622 4288 6150 -1010 -3885 735
487 735 3716 1018 -1119 -474 214 -335 -612 216 -1479 -2788 499 2786 -1096 -4781 -888 4034 330
504 330 -6295 -3803 2516 2583 -3375 -5887 -844 4195 1304 -5656 -5120 947 2520 -1696 -4466 -2147
520 -2147 746 1361 -518 -3374 -3735 -576 1641 -600 -4951 -4412 1401 3400 -2378 -7584 -2407 4025
536 4025 -360 -7460 -4278 2901 1237 -4755 -3669 698 -110 -3241 -2144 -431 -1259 -2889 -80 821
552 821 -2469 -3097 1276 2595 -3057 -4353 2024 4781 -1594 -4081 2160 5572 441 -2433 743 4037
568 4037 1916 586 1503 2882 2050 1797 3842 3181 400 552 4105 4613 681 767 4639 5100 2065
585 2065 1248 2626 2767 1984 2073 2164 2364 2668 2816 2878 2897 1954 975 1744 2263 1849 820 1504 3201 2816
605B816j508o17J371J016k685j037L172J306l223j018L471R84l847j007L602r9
621B697l278M76L269l53k818N1K833o50l563O72L665r92m343J211M364q03n843
638c405J257M518j716m421J692M060k179l348J681K765k000l684K165K833j847
653a629k771K051K241j872k287J869J273k803n09L436J98k811k48L137K25k609
669c109q99J572R69N55j342o15J695J598r38j749m3J632L48j114n75J899J345
686A229l22j311K99M03p55n2O41p97m25K431K010k883k498K898K817l486l970
703c771K965M679j483m098J070M415k29m356L94K229j522q01K826P45l683L85
719b35N391q47o047m40O173M87m983j123M545J929k736k155J195J385r84n94L65
$$ plain form
605 2816 1308 691 2062 3078 393 -644 2528 3834 611 -407 3064 4048 201 -806 2796 2697
621 2697 -581 -105 3164 2811 -7 44 2877 2227 -1336 -664 3001 2009 -2334 -1123 3241 2438 -3405
638 -3405 -2148 2370 654 -3767 -2075 1985 -194 -3542 -1861 904 -1096 -4780 -2615 218 -1629
653 -1629 -4400 -2349 -108 -1980 -4267 -2398 -1125 -3928 -4437 -1001 -803 -3614 -3862 -725 -500 -3109
669 -3109 -4008 -2436 -1467 -912 -2254 -2869 -1174 424 -514 -2263 -2306 -674 -326 -1440 -2015 -116 1229
686 1229 907 -404 -105 298 -457 -509 132 -665 -1090 1341 3351 468 -2030 868 3685 199 -3771
703 -3771 -806 3873 2390 -1708 -638 3777 3548 -808 -414 1815 293 -508 2318 3063 -620 -235
719 -235 5156 4309 -1738 -2178 3995 4482 -501 -1624 2921 4850 2114 -41 1154 2539 1555 961 1326
736A326n09j8J571J177l291j613K995J564l004k594J989L200o45l174p37K178
752D15J397j609k462n09K480J199j349k136k34K092J395k463k647J975K483p51
768g24j914k07K12P55J288j382l237J587M220n63m782r2M922R15m452j804K853
785b405K116j530j154Q61P11k02P53k01k246j046L667K154l844k303M237L104
801B672l189m132K301K806m33k538l74K175J514p95j117k81K95M34J010j412k035
818c099K000L752m30m411O8L801P99l207j652J530K716L39j442j725R38K363L94
835B734k989j475K181K333p76k090j71K338J257j664k172K73J825J277q08k373
851c00J3L981P31l977k657L487K263k216k408J703J660M66j254j392J03O22R10
$$ plain form
736 1326 817 799 2370 3547 256 -1357 1638 3202 198 -2396 -407 2793 2148 -1026 -1763 415
752 415 1812 203 -2259 -2768 -288 911 -438 -2574 -2808 -716 679 -1784 -4431 -2456 27 -724
768 -724 -2638 -2845 -2633 -1878 -590 -1972 -5209 -3622 598 35 -4747 -4839 83 998 -3454 -5258 -2405
785 -2405 -289 -1819 -2973 -2112 -1401 -1603 -850 -1051 -3297 -4343 -676 1478 -2366 -4669 -432 2672
801 2672 -517 -4649 -2348 458 25 -2513 -2887 -712 802 7 -1110 -1391 -1096 -662 348 -1064 -3099
818 -3099 -1099 2653 2223 -2188 -2120 1681 2480 -727 -2379 -849 1867 2206 764 -961 -23 2340 2734
835 2734 -255 -1730 451 2784 2008 -82 -253 2085 3342 1678 -494 -221 1604 2881 2073 -300
851 -300 -287 3694 4425 448 -2209 1278 3541 1325 -1083 620 2280 2746 1492 100 203 825 1735
868A735p83j610k07K206K030k234k944J174L304q67l728m34L604J182k246j241
884a059J184R21n7j713j050Q29J341M10p56j335J19J716N07k262j975K048K107
901I75r68j946q8J975O21j068j698J9J901M54k056n33J853P38q82o86m15K15K23
920a366Q74r47j156J095J926o46k082m68J937J209j656j431J078K359p81j647
936a702L8J583k05m52j91N8J92Q10J05r76k74O27O55j00j357J72J671J248j634
955B68j133R20J236l78j580K18J176N76j19o35QP91J34n36n40K31J06N47O78q41
975A127o36J088L72n06j639J152J077l94j389L18J405Q4r16m71N75K64q68k33
993D10O77K24j77L79J66p75p65Q78M94j485l05J261O34p19l93LK22j69j087R4
$$ plain form
868 1735 952 -658 -865 1341 3371 1137 -1807 -633 2671 1804 -1924 -2358 1246 2428 182 -1059
884 -1059 125 1046 989 -724 -1774 -945 396 806 50 -1285 -1166 550 1057 -1205 -3180 -1132 975
901 975 7 -1939 -2027 -52 569 -499 -2197 -2178 -277 177 -1879 -2412 -559 179 -703 -1389 -1804 -1589 -1366
920 -1366 -492 -1439 -2595 -1500 426 -220 -2302 -2770 -833 376 -1280 -2711 -1633 726 -55 -1702
936 -1702 -1664 -81 -286 -738 -929 -871 -679 131 236 -740 -1014 -387 268 168 -1189 -1017 654 1902 268
955 268 -865 55 1291 913 -667 -449 727 1303 1184 549 557 1348 1482 946 406 637 743 1290 1968 1127
975 1127 491 1579 1951 1445 -194 958 2035 1641 252 570 1975 2059 1143 672 1247 1511 643 410
993 410 1087 1311 1134 1513 1679 904 139 1017 1511 26 -279 982 1616 897 504 507 729 560 -527 -433
1013d33Q31q8o82M24K40k33l08J72m1o04oJ06J41j76K61m09M3M21l91k44j51K85
1035h42l19q9R18k86o06k1Q59l53p03k2M54N62o52q57O36R16n48p47L18L89J3
1056i80J44M9n18k43Q16N66j219l33N94J053j15j474P12P82M79j334k56P68P55
1075B46k59p10rM07M33K09m79p69Q63Q21j99j131N55M15P42j79r36l20J501K72
1095A473q96j115J310J257o53r54k28J027N98p51r55L01J226K96p89o57PP25K32
1114A454oj641M15J650M24j757r45J603J132o60j493l04J215Q73j278r00O01Q86
1132A269O2o87r65L72Q88O56j009j692J136K097r69j977j43J414O70m79j577K14
1150g20J686%j059j520O05J415K70j257j098Q00J576j85k041m55J385J173r40
$$ plain form
1013 -433 398 310 -372 52 292 59 -249 -77 -118 -722 -728 -622 -481 -657 -396 -805 -762 -341 -732 -976 -1127 -842
1035 -842 -1161 -1250 -332 -618 -1224 -1245 -386 -739 -1442 -1464 -1010 -448 -1100 -1957 -1321 -405 -953 -1700 -1382 -993 -980
1056 -980 -836 -787 -1305 -1548 -732 -166 -1385 -1718 -1124 -71 -186 -1660 -948 -166 313 -1021 -1277 -509 246
1075 246 -13 -723 -732 -325 108 317 -162 -931 -68 753 554 -577 -22 393 1135 956 20 -300 1201 1473
1095 1473 577 -538 772 2029 1376 422 194 1221 1819 1068 113 414 1640 1936 1147 490 497 1222 1454
1114 1454 1448 -193 222 1872 2296 539 -406 1197 2329 1669 176 -128 1087 1960 682 -218 383 1269
1132 1269 1331 644 -321 51 939 1595 586 -1106 30 2127 1158 -819 -962 452 1122 643 -934 -720
1150 -720 966 966 -93 -1613 -1008 407 677 -580 -1678 -878 698 513 -1528 -1983 -598 575 -365
1167c65j078m10J113J863j561j740K27K231n0k055m95J217R88k57r59n94Q65J399
1185C39p42j117j67J180P42o97j156RJ377R62j222j972J324J515K61k021o46J942
1203h9J168j011j572K84J692K26r99m68O4R73R02n72j447Q7J704O27j726q52J133
1222A24J427n28j159r07J561J073m62j805L37J804J28j205m99J70J166L30r32
1239F23o84O5J741j94j597n01J368J091q17q49r04J830J170j505p87lJ594j16
1257A525r78r90O85J641o50j212l28R45N19r04j73k81K25J087j68j241o36J770
1275H36N96j768j016R65J288n42j034n67J053Q23m10j393R1P95N79p56p18j7M54
1294g41Q98m89j257N6J531qj107l76L29J290l73j074o5R64M06q48m93L90L12l4
$$ plain form
1167 -365 -1443 -1853 -740 1123 -438 -2178 -1951 280 230 -1825 -2320 -1103 -115 -372 -1331 -1925 -1060 339
1185 339 -403 -1520 -1687 -507 235 -462 -1618 -1609 -232 730 -492 -2464 -1140 375 636 -1385 -2031 -89
1203 -89 1079 68 -1504 -1220 472 698 -301 -769 -705 268 1170 598 -849 -762 942 1569 -157 -1009 124
1222 124 1551 1023 -136 -1043 518 1591 1129 -676 -339 1465 1593 388 -111 59 1225 1555 623
1239 623 -61 4 1745 1551 -46 -547 821 1912 1095 246 -658 1172 2342 837 50 47 1641 1525
1257 1525 547 -443 242 1883 1233 21 -307 638 1157 253 80 -201 24 1111 943 -298 -934 836
1275 836 1432 -336 -1352 -387 901 359 -675 -1242 -189 634 224 -1169 -1078 -283 296 -460 -1178 -1195 -741
1294 -741 157 -332 -1589 -1533 -2 -10 -1117 -1493 -1164 126 -247 -1321 -1386 -422 -16 -864 -1357 -967 -655 -689
1314f89J47q99K50Q56J84n18j006P92P95k1p34l34J73R82P3j117Q8J187L67r96
1334d20l92L32P08j07l93l92L95N11K2n86J38K85K68pm08m06P26M63m1p52L39
1355B83O26J91p30j32J11L51J03l65M2M59L36n83m0K51j81l69N97l15l35L85N42
1376A227l22n41K16N21n18k52M7M64j76P0j01J17N1k79k71K65L77m25j61j30M17
1397E96k22j09K8j82K32K50o06J75J26m30j35N09l97o3K91k24j30o1L31k73J11
1418a83K03o11qN28k33o19M70J13o3k72j49L89J23n37K32j63K59K97m66j08j96
1439i94O07k68J83l76k8M60kl45l39Q28n0n42kK7O62k47J7m7J41J55K61l95l90
1462f84J94M23Q0l67j46M83Q66n45q61j94J061M65j055O2L30L03M58o18r91Q24
$$ plain form
1314 -689 -542 -1441 -1191 -335 -151 -669 -1675 -883 -88 -109 -843 -1177 -1004 -22 51 -1066 -978 209 576 -420
1334 -420 -812 -480 228 121 -272 -664 -269 242 264 -322 -184 101 369 362 -46 -452 274 737 696 -56 283
1355 283 909 1100 370 238 349 700 803 438 480 939 1275 692 652 903 722 353 950 635 300 685 1227
1376 1227 905 364 580 1101 583 331 378 842 666 736 635 752 803 524 253 518 895 470 309 179 596
1397 596 374 265 293 111 343 593 -13 162 288 -142 -277 232 -165 -228 63 -161 -291 -352 -21 -294 -183
1418 -183 20 -591 -599 -71 -304 -923 -453 -340 -403 -675 -824 -435 -312 -849 -617 -780 -521 -224 -690 -798 -994
1439 -994 -387 -655 -472 -848 -876 -416 -418 -763 -1102 -274 -324 -866 -868 -841 -179 -426 -409 -456 -315 -160 101 -294 -684
1462 -684 -490 -67 13 -354 -500 -17 849 304 -557 -751 310 775 -280 -218 112 415 873 255 -736 88
1482H8J147n21q87J61O86L45j17p94r2P66L98m96q72L95Q20P7m59n95Q3J054J71
1503A358j128m21P36O80m51o15Q0L29O83l30r60K4P56N03o12p67K96Q83j63n23
1523C58p91N54Q56k48q94J71P34k33p1j079J42Q43L01n85q70K14J072L2r48l79
1543h21N23Q21l35j061m09J207N33l38j132M61N54N9m46r04J09J054O22j411j88
1562a102N07O00j40n21o15L81R85n0j309j09J164M51r19l71k19J021N60q48p49
1581a283K42J285m41n70l36O67N23l8o24j85K71R68n65j099P23P72l2k30p97O44
1601a05P75J03r52r69J369N11k95q61K61O05M51j16r44K00J23J007r09n28L26
1620E2J053j2m40p90M8J009J12p92k74R09K94m33n42J45K33M76n53o26J64P26
$$ plain form
1482 88 1235 714 -173 -12 674 1019 902 108 16 782 1180 684 -188 207 1027 1104 645 50 133 1187 1358
1503 1358 230 -191 545 1225 774 159 239 568 1251 921 -39 -15 741 1244 632 -135 161 1044 881 358
1523 358 -433 121 977 729 -165 6 740 507 436 -643 -501 342 643 58 -812 -598 474 506 -442 -821
1543 -821 -298 523 188 -873 -1282 -75 458 120 -1012 -551 3 62 -384 -1288 -1179 -125 497 -914 -1102
1562 -1102 -595 5 -135 -656 -1271 -890 95 45 -1264 -1373 -209 242 -677 -1048 -1267 -246 314 -534 -1283
1581 -1283 -1041 244 -197 -767 -1103 -436 87 49 -575 -760 -489 479 -86 -1185 -462 310 278 48 -749 -105
1601 -105 670 773 -179 -1148 221 732 437 -424 -163 442 893 777 -167 33 156 1163 254 -274 52
1620 52 1105 1093 653 -137 -89 920 1032 240 -34 875 1169 736 194 339 572 1048 495 -131 33 759
1640G59K57p29j66K25N75j79m29o64M24P00k37p53k5J032Pm70n68J68P09J8n69
1661H5m15L35L41J00n18l27J52K98J24n80n35R46N76p99m78J30N18N03o11m29
1681e84n1Q77j12q90j17M86L07j87o46n3L79P22k9r20R6J43N60p67j95K88L90
1702c03K94m78k49O1M88l39k23K66L28l89O89o63J03J62L68n62k91M16M67j20
1722B5k04l23L91L02k89k53L3J47K99j40L24j85J39j36j59K45o51Q42k7k93K6
1743A13L78l07J12m5J54j81J60M02n00N2M0N7o1O8K92p13M01K1k33M05j27j01
1765C87j63L65L6n71M21j09K4JM0O1k71k24j04N97j23mk84M51j08m38M53K18p61
1788a06J73J57q7k01J92j1K88l95l6k8k37K19K20k51k51J53L12l13j34m8N5K13
$$ plain form
1640 759 1016 287 121 346 921 742 313 -351 73 773 536 -217 -242 790 797 327 -241 -73 636 654 85
1661 85 -330 5 346 446 -72 -399 -247 51 175 -405 -940 6 582 -217 -695 -565 -47 456 -155 -584
1681 -584 -635 242 130 -760 -877 -391 -84 -271 -917 -970 -591 131 102 -818 -722 -579 -19 -786 -981 -693 -303
1702 -303 -9 -487 -736 -675 -187 -526 -749 -483 -155 -544 145 -518 -415 -253 115 -447 -738 -322 145 25
1722 25 -179 -502 -111 191 -98 -351 -318 -171 128 -12 312 127 266 130 -29 216 -435 407 380 87 113
1743 113 491 184 296 251 405 224 384 786 286 338 378 435 374 442 734 21 422 443 210 615 488 387
1765 387 224 589 625 54 475 366 390 391 431 492 221 -3 -107 490 367 363 79 530 422 -16 437 655 -106
1788 -106 67 224 137 -64 128 117 405 10 -26 -54 -291 -72 148 -103 -354 -201 111 -202 -336 -384 -329 -116
1810a16k08j34JJ75O0l70M03k83j6L64j21n39q5P14l18l28N71j54j78J25Q0k51
1832f08k08L84K9k93J12L04K55k75p1k86M40M03p45l4M33K66j27m34mK68J83r4
1854a02j16l01O28K46m51o4r2L77K34k01q60N03O12k6p45L02M26j87K7l36L81
1875B55K6K88j86k09j66N72o3j15l69L95L96j21m13l90L36O16k81l99n4M42j6
1896E44j72j61j73M75K96n73o38N58L19O1j83n22M62K70j47k82m36P47j5j66l84
1917a20J67K54K31m81n84K86L38P3l00l50M11M57j40n53p5L53R8K4p33K93M04
1938E3J22m18m04L31K31J22l47o99R84M59o38l46k36L23L46q4n00J21K19K99p
1959f9p60R1M19K17j5o86Q8Q80j30n24l4K08N73l78m11J33K23L89l47p30N87M11
$$ plain form
1810 -116 -324 -458 -457 -282 -222 -592 -189 -472 -488 -124 -245 -784 -869 -155 -473 -801 -230 -384 -562 -437 -357 -608
1832 -608 -816 -432 -403 -696 -584 -280 -25 -300 -371 -657 -217 186 -559 -593 -160 106 -21 -455 -459 -191 -8 -102
1854 -102 -218 -519 109 355 -96 -160 -252 125 359 158 -702 -199 413 387 -358 -56 370 183 210 -126 255
1875 255 281 569 383 174 8 580 517 402 33 428 824 703 290 -100 236 852 571 172 118 560 544
1896 544 372 211 38 513 809 236 -402 156 475 536 353 -169 293 563 416 134 -302 445 430 264 -120
1917 -120 47 301 532 51 -533 -247 91 164 -136 -486 -75 382 242 -311 -386 -33 65 89 -644 -351 53
1938 53 175 -243 -647 -316 -85 37 -310 -1009 -25 434 -204 -550 -786 -463 -117 -201 -701 -580 -361 -62 -69
1959 -69 -829 -738 -319 -102 -117 -803 -715 165 35 -489 -523 -315 258 -120 -531 -398 -175 214 -133 -863 -276 135
1981A35k6j74o09L94P90m34m09n6M38K57M9m77j19M41J99j50m83J11N76J80m91
2002A42p05P47M87k87n74J44K80L26l8n10k7L31J58j32m1k57J39O52l44n01J46
2023A36N32m4p15J5J29M75j85J1l39j1L52K02k35o10O27L40j59p18K09L90l8m46
2045h2m77K07N43L61q00M4L02Q3J96n08r3R2L35Ol94J1K83L6l89J52k83J41K70
2068C6l72k74Q9M23k92J57k49N9K35J40o47oP10k46q4j57j04M27r3K25m94K94
2090b23K06j56l9J8j73L90Qn12Q6L80o8m34J28L16J55r7m99J39K17J66q8k73Q5
2113b68P1K11k2l13J44J21J88l04J60rJ94o4j67R8J30l6lJ71j14L9K3M3k20K09
2137B82K41l08l8j24J44j04O6M70m67Qm2O8j06J97K07l31J04l0j4J94O0l12L3
$$ plain form
1981 135 109 -65 -674 -280 510 76 -333 -389 49 306 355 -122 -241 200 399 249 -234 -123 453 633 142
2002 142 -563 184 671 384 -190 -46 234 560 522 12 -15 316 474 342 301 44 183 835 491 -10 136
2023 136 668 624 -91 -76 53 528 343 354 15 4 356 558 323 -287 340 680 521 -197 12 402 364 -82
2045 -82 -559 -352 191 552 -248 -204 98 181 377 -131 -224 -132 203 209 -185 -174 109 145 -244 -92 -375 -234 36
2068 36 -336 -610 -521 -98 -390 -233 -482 -423 -188 -48 -695 -701 9 -237 -321 -478 -582 -155 -248 -23 -517 -223
2090 -223 -17 -173 -212 -194 -367 23 31 -481 -395 -15 -83 -517 -389 -73 82 -15 -514 -375 -158 8 -80 -353 -268
2113 -268 -197 14 -8 -321 -177 -56 132 -172 -12 -21 173 109 -58 40 170 134 131 302 188 227 250 293 73 282
2137 282 523 215 177 53 197 93 159 629 162 170 128 196 90 287 494 163 267 237 223 417 477 165 198
2160A98K51q2j9m7p3n3K4J40q2j93J83k1L5j27O6K34l97J99j41jm1J32q3J77p3
2185B06j97r0L3q8Q7l51J61M9J06J06o9k97L44J29k77j05J36RJ75l09k39o0N25
2208a6j1o10J22N83k25R6l60J2o0M34q5k57J38L77k65l52K50k32K15L07k65k26
2230d30K50J28k98P9j88K65J40j04k88M7L08L17m17j08J37L71j85r6k2L34n9K6
2252B07m4n31K47N53k50l93K10M09j39K4l54K9N02j85j83M3J02K0J23l79j35L90
2274B66L08o2l24l51O87J02l70k30l0M56K4l2m06P2M12q5j75k73M6K22n3k65l1
2297i2M10jj11m12O47j35n9j43k10kM70J5n07o4K76P9J08k40p30Q65K79m74n06
2320e37K09L83J64k59m51K48L71j2m48j98M64k04L26l33k60J26J18L75l25j3J65
$$ plain form
2160 198 449 367 348 301 228 175 199 339 257 64 247 226 261 134 200 434 37 236 95 94 53 185 102 279 206
2185 206 9 -81 -48 -136 -49 -400 -239 -190 -84 22 -47 -344 0 129 -148 -253 -117 -108 67 -242 -481 -541 -16
2208 -16 -27 -637 -515 68 -157 -61 -421 -409 -469 -35 -120 -377 -239 138 -127 -479 -229 -461 -246 61 -204 -430
2230 -430 -180 -52 -350 -271 -459 -194 -54 -158 -446 -399 -91 226 -191 -299 -162 209 24 -72 -94 240 181 207
2252 207 163 -368 -121 432 182 -211 -1 408 269 293 -61 -32 470 285 102 145 247 267 390 11 -124 266
2274 266 574 512 188 -163 524 626 256 26 -4 452 476 444 38 110 522 437 262 -11 35 257 204 -61 -92
2297 -92 318 317 206 -206 441 306 247 104 -106 -108 362 377 -130 -194 82 161 269 29 -701 164 443 -31 -537
2320 -537 -328 55 219 -40 -491 -243 128 116 -332 -530 -66 -270 56 -277 -537 -411 -293 82 -243 -256 -91
2341i1K40l80l34J35N83j58l13k69N07K82j64k05p07O11J96J41n51J92K59J47
2361A21O5p24J58K30J91l32r4L45K73%l17k34M4M60j05l05j62L20L20Jo22J91
2383a76O83J2m00p8k36N83j0k47l69K25M42k53j44j44J65O22m33J32l02J27j78
2404B1k2p5P5K38J79n12k6J94L33j02q8j66K40K15n22%l6K17J14p2j25j66N01
2427D15l0k31k71L52k42L88l66j3K37k00K87l17l60M88P7n1j83j82O09J85p73
2448a81pL3j57M49k91O0J79Q0m82mJ34K26N4j34k97K3L95j32n7j09J6J79j29j16
2472b68j53L31j14k6pn8j02L8J81m14L60N0J2k50r7J12M12k91j9K37j15%J5J53
2496a3J11j46J50j76r0k53J74K06k58K71j19N1j00M7J27O5r5K26j5m9l5J82l8
$$ plain form
2341 -91 149 -231 -565 -430 153 -5 -318 -587 -80 202 38 -167 -874 -263 -67 74 -477 -285 -26 121
2361 121 186 -538 -380 -150 41 -291 -385 -40 233 233 -84 -318 -274 186 81 -224 -386 -66 254 255 -367 -176
2383 -176 507 519 119 41 -195 388 378 131 -238 -13 429 176 32 -112 53 675 242 374 72 199 21
2404 21 -1 -76 -1 237 416 -96 -122 72 405 303 215 49 289 504 -18 -18 -54 163 277 205 80 -86 415
2427 415 385 154 -117 235 -7 381 15 2 239 39 326 9 -351 137 214 163 -20 -202 407 592 -181
2448 -181 -188 -155 -312 137 -154 -94 85 165 -317 -321 -187 39 93 -41 -338 -315 80 -52 -109 -218 -202 -23 -152 -268
2472 -268 -421 -90 -204 -230 -237 -295 -397 -359 -178 -592 -232 -182 -170 -420 -517 -405 7 -284 -303 -66 -181 -181 -166 -13
2496 -13 98 -48 102 -74 -164 -417 -243 -37 -295 -24 -143 -92 -192 -145 -18 47 -48 178 163 114 79 261 223
2519B23l53J98J46m6J57k99J96l1j17R5J37l49J8M45m44J07J34n1l3p1J58m2R4
2542B72j48l4K95j71j11j11L0N04l71j11M00k83j82P1l2R1j52L60m81K23M1K9
2564A29J62k01K57k26j9J00j64J75K46m55l01K23J59j41j63L18m42L34K70n01
2584b40l2n4N17m08l8P5O5j4m6r1R1j18K10j49KR3k19J03L52l34k14L55L3k57
2608c18m70O16r9J85k27q3L61q6J24j75k59K52L53l31K02k14j1J86j58j90J94
2629a48J81j37R1M0j70K52J90j28k20O7J05K09j51j28N9p5p7J22j5q6J44R9l26
2652a02K66L9K70o06K27j24O11m17r5j71M61k35rN5k16Q4L15l40K49J61o7J07
2674D63m16j99L58J31J97q14K01L96r1l06J70l07O02l2j61j39J3J54j70m7m47
$$ plain form
2519 223 -130 68 214 168 325 26 222 191 74 169 306 -43 -25 420 -24 83 217 166 133 62 220 178 272
2542 272 124 90 385 214 103 -8 22 526 155 44 444 161 -21 50 18 109 -43 317 -164 59 100 129
2564 129 291 90 347 121 102 202 38 213 459 4 -297 -74 85 -56 -219 99 -343 -9 261 -240
2584 -240 -272 -326 191 -217 -255 -180 -115 -129 -175 -266 -175 -293 -83 -232 -230 -137 -356 -253 99 -235 -449 -94 -61 -318
2608 -318 -788 -172 -271 -86 -313 -396 -35 -121 3 -172 -431 -179 174 -157 45 -169 -180 6 -152 -342 -148
2629 -148 33 -104 -13 27 -143 109 299 171 -49 18 123 332 181 53 112 37 -40 82 67 -19 125 224 -102
2652 -102 164 203 473 -133 94 -30 581 164 69 -102 359 124 115 170 -46 38 353 13 262 423 356 463
2674 463 47 -152 206 337 534 -280 -79 317 226 -80 90 -217 385 353 192 53 66 220 50 3 -444
2695d44M78J97J46l40j90j12L96k22J7m35M40j8j39k48J68M55k83N0j74K3M12
2716A77l79J4j51L02J40j32j3j70J26Kj05l5K47j04j0j53k16L59L13l27j12j95
2738d22J60R0J15k19J45J27K68n15j21K55J84J29k4k15j61K06k38K11k76K28K90
2759B17n88K70k4J23L07l79k60O54j12l31PN5K64j70J8p8JR9R8q1r2L8L30Q6l22
2784A30l19P6L68K39n61n8K85k03L49k4j98K43J46m15j16J45O3Q6p3J92l59K36
2806B32lj05j66K21l7J05K0k45K83P0m09r9l22O17PO9k7j34J20k26K8k66L40k35
2830a62L43m29P6r0M63L5k36r9J82J02j96k02J33J71j56k27J48o3L47j64P9m72
2852d17L48R1kk53M06l04j34M0K46k12j18K08j76J06J74mMl49J25K9K61O7m54
$$ plain form
2695 -444 34 231 377 37 -153 -265 131 -91 -74 -509 -69 -87 -226 -474 -306 149 -134 -84 -258 -235 177
2716 177 -202 -188 -339 -37 103 -29 -42 -212 -86 -84 -189 -224 23 -81 -91 -244 -460 -101 212 -115 -227 -422
2738 -422 -262 -172 -57 -276 -131 -4 264 -251 -372 -117 67 196 172 -43 -204 2 -236 -25 -301 -73 217
2759 217 -371 -101 -125 -2 305 -74 -334 320 208 -123 -116 -61 203 33 51 -27 -26 73 171 90 -2 36 366 452 130
2784 130 -189 -113 255 494 -67 -125 160 -43 306 282 84 327 473 58 -58 87 150 236 163 355 -4 232
2806 232 229 124 -42 179 142 247 267 22 305 375 -34 -133 -455 162 169 238 211 77 197 -29 -1 -267 73 -162
2830 -162 181 -248 -172 -262 201 236 0 -99 83 185 -11 -213 -80 91 -65 -292 -144 -207 140 -24 55 -417
2852 -417 -69 22 20 -233 173 -131 -265 -225 21 -191 -309 -101 -277 -171 3 -1 3 -346 -221 -192 69 136 -318
2875c18K68J1p9Q4NJ03p6L1j1k4k07M41k71J6l4M0l7Q1M3k75K52k6J32n10M27
2900F6j4j09n6J05K72j62j49J41l52L05q2M6j45L06K25l56J59j68k9J72O8n1J17
2923C09K11m00J5j05k25K57O5OR6n2k11j2R4k6J84r1q3m4J75R0O1j27k91J39N1
2948H6n7j35J05m4L38k57J8m31M22J92o5k88J24K50rm44J05K59k53j16K26l09
2970b83K98K7l46L53k25J53J36m2j11j00K2j06J07Op8K37j65K36j06j05K15j81
2992e8j84K25oJ00p4k42j03K20L8r9QJ06j4Q2k71%J59J23j61j21L13J95k26l14
3016c04J52J32o3K8J88j31j62J76K21o72N28j9O3n8L6k75K89J37j28l04p3O52
3038D13m06j52K38k20K42O2l15J13J77om3k61L17J31P6k44l53J63J73K91m86j22
$$ plain form
2875 -318 -50 -39 -118 -34 -29 74 -2 29 18 -6 -213 228 -43 -27 -61 -21 -58 23 66 -209 43 17 149 -361 66
2900 66 52 -57 -113 -8 264 102 -47 94 -258 47 -35 11 -134 172 397 41 200 32 3 175 243 192 309
2923 309 520 120 135 30 -195 62 127 133 229 177 -34 -46 48 22 206 115 32 -12 163 253 314 187 -104 35 86
2948 86 29 -106 -1 -45 293 36 54 -377 45 237 172 -116 8 258 249 -195 -90 169 -84 -200 26 -283
2970 -283 15 42 -304 49 -176 -23 113 71 -40 -140 -118 -224 -117 -111 -189 48 -117 119 13 -92 123 -58
2992 -58 -242 -17 -23 77 3 -239 -342 -122 -84 -183 -175 -69 -83 -1 -272 -272 -113 10 -151 -272 41 236 10 -304
3016 -304 -152 -20 -83 -55 133 2 -160 16 237 -435 93 74 137 79 115 -160 129 266 138 -166 -239 413
3038 413 7 -145 93 -127 115 177 -138 -25 152 146 103 -158 159 290 366 122 -231 -68 105 396 -90 -212
3060b12M99j7j0k50K42k64J85j85L01n4k5j54j69J77k67J85k8J36k23L5J53L83
3082D38k44j97M71o22Q0J34j19n3p5L38k29r9L65r8l4l49K65K37l4l11K04J46
3104B14p4k13n60L90M65k29k35l14M28m7M4j83J20N9j3j14Q2j97L59K25m32qr8
3127c31K41L9p1k88J2J12L73k63r9J37K68k25j69N8J50r0j8q2J39K25k19J61k08
3150a48k3K09j4j4k26K03k29L97k52j39M19j17j33l0Q7J54J34m16J63L0J47J86
3172C88n34k5L62k44N19l50k58K46j02j75M20l12K86J55k00k81K43K3M0q5m6J25
3194A95k22K29j39K22m41M33q8o0m06N39k28l7o1J63M0l08M2P0k51K89J65P7m34
3217b11m2L38lm9k1k70N2jM7k19L05K1Q6k00L8P9o5O4j82J52K08m19J75l4P6J95
$$ plain form
3060 -212 287 270 260 10 252 -12 173 -12 289 235 210 56 -113 64 -203 -18 -46 90 -133 -98 55 438
3082 438 194 -3 468 -154 -74 60 -59 -112 -187 151 -78 -177 188 90 56 -293 -28 209 175 -136 68 214
3104 214 140 -73 -633 -243 222 -7 -242 -556 -128 -175 -131 -314 -194 -135 -148 -262 -180 -377 -18 207 -225 -233 -331
3127 -331 -90 -51 -122 -410 -398 -286 87 -176 -275 -138 130 -95 -264 -206 -56 -146 -164 -246 -107 118 -101 60 -148
3150 -148 -171 38 24 10 -216 -13 -242 155 -97 -236 183 66 -67 -97 -10 144 278 -138 25 55 202 388
3172 388 -146 -171 191 -53 466 116 -142 104 2 -173 247 -65 221 376 176 -105 138 161 201 116 70 195
3194 195 -27 202 63 285 -156 277 189 129 -277 262 34 -3 -64 99 139 -169 -127 -57 -308 -19 146 223 -211
3217 -211 -253 85 82 33 12 -258 -206 -207 -160 -379 -74 -53 33 -167 -129 -50 -115 -51 -233 -81 127 -292 -117 -151 -75 120
3243A20k03J99k06p7K14j95L77j39j98J8p2j4k7J33P0J2J7k45K88q6k18L16n3
3266C1l5j32J08j76o6M21k54r7J66J79k43K63k86l7Q8L02k15k89L58L9q5o3K76
3289B53n23N13k5k56J51K79k89j54K86k88j63K62J54k59j6J97J53j36R6k65K04
3310A74k34K24K0j16j35L77q9j41j15J05k05M56k11n3L01j97l42N05m36n4K9J19
3332a8o7n8K86L1k22kl0M4K78k66L10m43n4j0j32K0K12j00J83k3K43k67J27k5
3356A7M5j23R0Pp1k27M29k06q5KJ13OJ3Q6l7l0n0P9k10K69l39K5L81l14NP6k06
3383b55J88m8j71L39l11J27L52n38M4K5J46J59j99L40l30J84j97o3J34J25q7k08
3405b44L69p3n8k59k4K93O6j03N2m76O98l30O8K6j62J48j05K07j82J22J78j66
$$ plain form
3243 120 -83 116 -90 -167 47 -148 229 90 -108 -90 -162 -176 -203 -70 0 12 29 -216 72 -14 -232 84 31
3266 31 -4 -136 -28 -204 -270 151 -103 -200 -34 145 -98 165 -121 -158 -70 232 17 -272 86 125 40 -23 253
3289 253 -270 243 218 -38 113 392 103 -51 235 -53 -216 46 200 -59 -75 122 275 139 235 -30 174
3310 174 -60 164 184 68 -67 310 221 80 -35 70 -135 321 110 57 358 161 -181 324 -112 -166 -137 -18
3332 -18 -85 -143 143 174 -48 -50 -80 -36 242 -24 286 -157 -211 -221 -353 -333 -121 -221 -38 -61 182 -85 42 17
3356 17 62 -61 29 36 -35 -262 167 -39 -124 -122 -9 -3 10 96 59 29 -21 58 -152 117 -222 -197 184 -130 -125 -49 -255
3383 -255 -67 -115 -286 53 -258 -131 221 -317 -273 -248 -102 57 -142 198 -132 52 -145 -208 -74 51 -36 -244
3405 -244 125 52 -6 -265 -289 4 70 -33 19 -457 241 -89 -21 5 -157 -9 -114 93 -89 33 211 45
3427D5M6j60K81k3l71K09p4J10M47m79L8rk33J89MJ33m4k05J48K41j92j28K21
3450A94J28k90L8L74k63k60Nj96L75N3n8K36m66K09J37o9M7m39J59J1J59j22l4
3473g2K34J22j89o02N55J26p4k67n1K20l4m5p1j38NK49%O4q3k69L61k47q5J16
3497a75M6K24l90K83K05l46L35l66j99N88l74J14Q1j89K60r0k76n4K84J34l35
3518b40L29j54r3K69mj16m20M04J05j41j1l36K9K93j4k01k4L78M2l12M5J29L13
3541B70j25j02j99K29O2j05J40k78m6L36k45j17J31K60J12k28j81j0j96J51J64
3562B3j71k10M94j83K42l37J87Q5k72J41j90K11J63l39K23o5K48o9m43M57l39
3583a44K04J47K1j89j60M08j31O1n56L53P6j10k04M21k45J08K67l24K4j29K78
$$ plain form
3427 45 91 -69 212 189 -182 27 -47 63 510 31 69 60 -173 16 20 153 109 -96 52 293 101 -27 194
3450 194 322 32 70 444 181 -79 -74 -270 105 158 100 336 -130 79 216 147 194 -245 -86 -75 84 -38 -72
3473 -72 162 284 95 -507 48 174 100 -167 -218 2 -32 -77 -148 -286 -281 -32 -32 32 -51 -320 41 -206 -291 -175
3497 -175 -129 95 -295 -12 193 -153 182 -184 -383 205 -169 -55 26 -163 97 7 -269 -323 -39 95 -240
3518 -240 89 -65 -158 111 107 -9 -429 -25 80 -61 -72 -408 -379 -86 -100 -301 -325 53 95 -217 -172 -43 270
3541 270 145 43 -156 73 135 30 170 -108 -154 182 -63 -180 -49 211 323 95 -86 -96 -292 -141 23
3562 23 -148 -358 136 -47 195 -142 45 130 -142 -1 -191 20 183 -156 67 2 250 181 -262 195 -144
3583 -144 60 207 228 39 -121 287 156 217 -339 14 90 -20 -224 197 -48 60 327 3 27 -102 176
3604A76l21M12l40j99R4L69n44K41j06K25K01l62K88k4o1k19K64j83J26k91k0
3625b74K16o6k13J51NO0J38lnk37Q2O7L7k73Q1L45n02M56K2q7K2r9o8O2J61j2
3651F6j61k64K29OJ99m5m5K21l09K22l47L0M65j62m2L0m3j48r4L81N2k97RO4k3
3676fM01k62j32j31mk35M78m3j85J32j30L99n4k31j26K74k96K90k57J90q0J11
3698A03pO9k55jK01Q5m8j00n1RK91k45j3l5J0K01k63J16J30k61K11L2j40K24m06
3723a43J56j6Q5O1j01p1R2m3J9M0l15L10R6PJ26m05L61j98j70L2kJ46R6j76O5
3748E2k33o1J08K02k70J27J70l6k03R2J64k85J42m9K68l53Qk41J30L52l20L06
3770G0m10N23j23q4J77L7j52q5j51K48k16N0J55k14j90L90K22j22m73r1L97J77
$$ plain form
3604 176 -145 267 -73 -272 -178 191 -353 -112 -218 7 208 -154 134 110 49 -170 94 -89 37 -254 -274
3625 -274 -58 -124 -337 -186 -181 -121 17 14 9 -228 -146 -79 -42 -315 -234 111 -391 65 87 0 22 -77 -145 -83 78 66
3651 66 -95 -359 -130 -124 75 30 -15 206 -103 119 -228 -198 267 105 63 93 50 -98 -192 189 241 -56 -47 17 -6
3676 -6 395 133 1 -130 -134 -369 109 66 -119 13 -117 282 228 -3 -129 145 -151 139 -118 72 -8 103
3698 103 96 165 -90 -91 110 195 147 47 -4 5 296 51 38 3 13 214 -49 67 197 -64 147 179 39 263 -143
3723 -143 13 -3 82 143 42 -29 63 20 39 79 -236 74 170 177 303 -102 259 61 -109 -77 -79 67 163 -13 52
3748 52 -181 -242 -134 68 -202 -75 95 59 -144 -52 112 -173 -31 -80 188 -165 -157 -398 -268 84 -236 70
3770 70 -340 183 60 -24 153 190 38 -47 -198 50 -166 -116 39 -175 -365 25 247 125 -348 -439 -42 135
3792A35M5m18K86r8J58q3J33k70Q1L2j29J92M5k59jJ68j0K9k16J01k10M7J58m3
3816a27L21n6P1l18M9K71k83N3K44j77O5Jj59K7K24j55jj46K13K1N2m70N51j59
3840A12p3k80M01l4J65k89m5k1J20N8j52%j83L4K70j10Q2J49j46n04L13L46l85
3863a72J96O9j81K52Q4p6k15Q0P8j9K58k91j54K13j3j38k35J21J68R6j99K92m34
3886b20J37K19n8j50J58j11j97K05j18J07j2J00l57j5L87J5j71Q4L7l00P1K17
3908B8r6l1n9M05m88R6L7L8J59l52K50m0j29N3o3K84k20N4k44L50l5M1m9m6q6
3933a43J31J64m53K62j12K29J42j66p4L31r8M5l95j41L66l02K16M0k2k19K45m3
3955CQ7J28JJ35m34M59l76M00l29p5n5P6J2k62L88j11k22K63Mk11J05M4n6o4J64
$$ plain form
3792 135 180 -238 48 -50 108 25 158 -112 -31 1 -128 64 109 -150 -151 17 7 36 -180 -79 -289 -242 -84 -127
3816 -127 194 138 209 -109 -60 211 -72 -19 225 48 113 114 -45 -18 206 51 50 -96 117 138 190 -280 271 112
3840 112 39 -241 160 126 291 2 -43 -64 56 114 -38 -38 -221 -187 83 -27 55 204 58 -446 -133 213 -172
3863 -172 24 93 -88 164 248 172 -43 37 115 96 354 63 -91 122 109 -29 -264 -143 25 121 -78 214 -220
3886 -220 -83 136 78 -72 86 -25 -222 -17 -135 -28 -40 60 -297 -312 75 90 -81 3 40 -260 -189 28
3908 28 -68 -99 -158 247 -241 -145 -108 -70 89 -263 -13 -53 -182 -129 -192 92 -128 -74 -318 32 -3 38 -11 -57 -143
3933 -143 -12 152 -301 -39 -151 78 220 54 -20 311 213 258 -137 -278 88 -214 2 42 20 -199 46 3
3955 3 90 218 219 354 -80 379 3 403 74 -1 -56 20 32 -230 158 47 -175 88 92 -119 -14 30 -26 -90 74
3980G4k99K47m8P1p1l74N76j01O1M3j15k40L1R1n2P1L8P0k19R7J21o1K77m09l8
4005a59k53M58r6j87K57J67k74q9J72l7m1L78l98L69l57j91Q8K23r5r8K16j22
4027f9K08k01r1J23kj01J46q1K63p23L62J83k41K70J63j74p3J21r2k14K49K60
4049B86k66j88l8J78J61k38K54J12k90Q0K25n06M44l64L7N0R0k4j08J11j46q6
4071b26J58K21l70N61l24J61m12J17j83L09j7O3j28L1P9k89L28%J8l3rL4m6j50
4095a07K44l20K83K5J64l59l2j36J29K11j35l9J80j86J53k3l61L62J64n6j91J65
4117A35j29j7%j12L57l10P6k43M65k52R3K0n4l32L32J61l82J21j64J99jm8rL44
4141B50j87N3l11jRL47k83O3r0J17O5j28K52j23R1j87J81m42K35l9K89ok64N45
$$ plain form
3980 74 -225 22 -26 45 -26 -400 176 75 136 179 64 -176 -145 -54 -106 -35 3 73 -146 -49 72 11 288 -121 -159
4005 -159 -412 46 -50 -237 20 187 -87 -176 -4 -41 -82 296 -102 267 -90 -281 -193 30 -65 -163 53 -69
4027 -69 139 -62 -153 -30 -32 -133 13 -68 195 -528 -166 17 -224 46 209 35 -38 83 -9 -223 26 286
4049 286 20 -168 -206 -28 133 -105 149 261 -29 51 276 -230 214 -150 -113 -63 27 3 -105 6 -140 -226
4071 -226 -68 153 -217 344 20 181 -231 -114 -297 12 -5 58 -70 -39 40 -249 79 79 97 64 55 89 43 -107
4095 -107 137 -183 100 125 289 -70 -102 -238 -109 102 -33 -72 108 -78 75 52 -309 53 217 161 -30 135
4117 135 6 -11 -11 -123 234 -76 0 -243 222 -30 63 83 29 -303 29 190 -192 -71 -235 -36 -37 -85 -94 250
4141 250 63 116 -195 -196 -187 160 -123 -60 -150 -33 32 -96 156 33 124 -63 118 -324 -89 -128 161 155 -109 436
4165D36m95M10m92J28N6R9r9k56p4J63Q1J8Q2k90J42o7L13M9J94m97J6O9K7K7
4189D0M8j47p5P4J66o8L08k67Rl88K26K30l71K06k7J63m8j99m2N57l19O5O2k39
4213c6l22L36k4Pk3M2O0L8l1J00k47K5R6%lJ16o2j91J22P3K47m28P8m1L28n31
4239b71K32k1Q1J28l10J72J52l43j6L72j54K23k85J53j28Q4o9k00J22K58k56J16
4261D0J7Ll12J33J50j16J18J59k11j36L53j53q5j65K57m3K3M1N5k40k8M0R5Lk02
4286b04K28j8q8O4j11NK15m45L18K71n71N03l81P9K00L0j38K7r5J43j82L28Q9
4309B67l28J66n35M63j86J09M3k27N02k63K5k0j42q4J75N7N1o4J97j69n0j40J3
4332a40M42l75J11Jpj06K96j64q4P0P6k49J39j17J01M7r0J60J48j39j16J2k23
$$ plain form
4165 436 -59 351 -141 -13 43 142 43 -213 -287 -124 -43 -25 57 -233 -91 -158 155 204 398 -99 -83 -14 13 40
4189 40 88 -59 -134 -60 106 38 346 79 88 -300 -74 156 -215 -9 -36 127 79 -120 -162 395 76 141 203 -36
4213 -36 -358 -22 -46 -39 -62 -20 40 78 47 147 -100 -75 21 21 18 134 72 -119 3 76 323 -105 -27 -68 260 -271
4239 -271 -39 -60 21 149 -161 11 163 -180 -196 176 22 245 -40 113 -15 69 0 -200 -78 180 -76 40
4261 40 57 60 -252 -119 31 -85 33 192 -19 -155 198 45 -40 -205 52 9 32 73 128 -112 -140 -100 -5 -2 -204
4286 -204 24 6 -82 -18 -129 -124 91 -354 -36 235 -336 167 -214 -135 65 95 -43 -16 -111 32 -150 178 267
4309 267 -61 105 -430 33 -153 -44 -1 -228 274 11 36 16 -126 -210 -35 22 73 9 206 37 -13 -153 -140
4332 -140 302 -73 38 39 32 -74 222 58 -26 44 120 -129 10 -107 -6 41 -49 111 259 120 4 16 -207
4355b07J46o0K27p8O3O9J48m22J54k40M19q6j45R9j66O7Pl5k24J79k2K76k97L01
4379A73Oj12j06J77k33k9j45J17J2R2K04l55L25r9m8jp1JK69k50K89q9m16K48
4403d1j47L45k42%jj48J64PK1On6L9J1R5K6Mr7j13R3J38l7l02K35j67j2K04o1
4430c6Q9r1r7l2J31J9N0m3P7nJ4l7Q3j19K07j62j65J69n6Jj70K75j65J15l14Q3
4456a79J87J66k3o0j42O1k19p4N62k50J17k41K99k58J08J43O5j20M0r9k13o7K21
4479B4L02l83K97l40J12R2k55K08O4j92j68J10L02M8j71J74k40j29R3J88k45r8
4501b07L10r1p3l05M11k8j21j17J85l8K76j95p7n9J24j61QK91J5J11k00k11J76
4524B4j91J61j39J58j69L31m04M82m47R6J8K46j76M0J43m78L59l86K13L59O7l84
$$ plain form
4355 -207 -61 -121 106 28 91 160 308 -114 40 -200 219 133 -12 87 -79 -12 -5 -40 -264 -85 -107 169 -128 173
4379 173 179 67 -39 138 -95 -124 -269 -152 -140 -48 156 -199 126 27 -21 -22 -93 -92 177 -73 216 127 -289 -41
4403 -41 -188 157 -85 -85 -86 -234 -70 -63 -42 -36 -92 -53 -42 53 79 83 -14 -127 -34 104 67 -235 0 -167 -179 25 -36
4430 -36 53 -38 -135 -167 -36 -17 33 -10 67 62 76 39 122 3 210 48 -117 52 -4 -3 -173 102 -63 52 -262 -179
4456 -179 8 174 151 91 -51 10 -209 -283 279 29 146 -95 204 -54 54 197 262 142 182 83 -130 -197 24
4479 24 326 -57 240 -100 12 104 -151 57 121 -71 -239 -129 173 221 50 224 -16 -145 -52 136 -109 -207
4501 -207 103 12 -61 -366 45 17 -104 -221 -36 -74 202 7 -70 -129 -5 -166 -158 133 148 259 59 -152 24
4524 24 -167 -6 -145 13 -156 175 -229 253 -194 -98 -80 166 -10 30 173 -305 54 -332 -119 240 307 -77
4546g7L7m0L0K78k10o8L14r8j22N7l3l69M85j61p5l1l5j29L81j07N8m11J44L05
4570A23j30K01k10j7J15o9j17J85r1j23J21n8K70l17J42J9qO3k29J53m3J28K5
4593A33j76J34l33L76l37j8K09j7k08L63k04j11J73o4J43j9K56k81j25K14K6k16
4615h2J41Q0k1j03j96N07j12j30o5mj50L4J42r2J77j98j33K93J26j73J00j56m9
4638f4K80m60J24K69r0j37L42k81p8L49m51L4K60k88K50j34J38j14k58K94j68
4659a83K93m64N06K1k6p8j40J32j8j51J97J51j69j16L3K17k64P1q2J15Rj3k44
4682b03L27q6K8L9j35j09J19j49kO3K13l95L08k31J73N1J75l10L18j42k3j6j53
4705a40J87p0j27k7M99k93K18l49j09J45J86j8L7k84Q3j67K38l3j11J9J24O4l7
$$ plain form
4546 -77 -40 -80 -50 228 18 -50 264 166 44 101 68 -301 184 23 -52 -83 -118 -247 134 27 85 -326 -182 123
4570 123 -7 194 -16 -33 82 13 -104 81 -10 -133 -12 -70 200 -117 25 44 36 99 -130 23 -20 108 133
4593 133 -43 91 -242 134 -203 -221 -12 -29 -237 126 -78 -189 -16 -80 63 44 300 19 -106 108 134 -82
4615 -82 59 139 118 15 -181 326 214 84 19 15 -135 -101 41 -51 126 -72 -205 88 214 41 141 -15 -64
4638 -64 216 -244 -120 149 59 -78 264 -17 -95 254 -197 -163 97 -191 59 -75 63 -51 -309 -15 -183
4659 -183 110 -354 152 173 147 69 -71 61 43 -108 89 240 71 -45 -12 205 -59 12 -70 45 54 41 -203
4682 -203 124 38 66 105 -30 -139 -20 -169 -171 -108 105 -290 18 -213 -40 11 186 -124 194 52 29 13 -140
4705 -140 47 -23 -150 -177 322 29 247 -102 -211 -66 120 102 139 -145 -62 -229 9 -24 -135 -116 8 72 35
4728C5J01j9j34M42m69m7K09l6o7j59M92l38P0M0r1J90l85J76M3l36K82p2L04
4751B31n0q1O8p0k30O8JR0j2j02J44p2j59J89K0J35o5p0q2k48M96k37J08%n3J13
4777A32j24k46K61r2J02k46J05L22k20k08J7L02m4P8l81k9kM52m10J63J67J58
4799B57l74K38j56j39J92j35K76l12J39nR5N7K9p5k61K32R0k02j8l6J03l0k6P7
4823A6P8k74P4J62k36L15n8k4J46l73L2j44K17k8R4j42j19P0R9P7o0k1J5j66M26
4848A76n6l77K88K14k0k89M7j65J56K70l90J80q7R0P4L3j78j11K62j2k35L6L4
4871f0K22o5k89O4P1j9K20l57L38j51k02K53J36J4j31J67j3k33j25L85m07RjJ76
4895BK65%l51K38j31R6R9K0m56L7M15l57K59M3J14k64j20J56k13L5K58L3l57q8
$$ plain form
4728 35 136 117 -17 425 -44 -91 118 82 15 -144 348 10 80 120 29 219 -166 10 53 -283 -1 -73 231
4751 231 181 100 168 98 -132 -64 -63 27 15 -87 57 -15 -174 15 35 170 105 35 -47 -295 201 -36 72 72 19 132
4777 132 8 -238 23 -69 33 -213 -108 214 -6 -214 -197 105 61 139 -242 -271 -273 179 -231 -68 99 257
4799 257 -117 121 -35 -174 18 -117 159 -153 -14 -19 76 133 162 87 -174 58 148 -54 -72 -108 -5 -35 -61 16
4823 16 94 -180 -106 56 -180 135 77 53 199 -174 -142 -286 -69 -97 -3 -145 -264 -194 -95 -18 -78 -99 -84 -250 176
4848 176 120 -257 31 245 225 -64 -17 -182 -26 244 -146 34 -53 37 111 144 -34 -145 117 105 -130 -94 -60
4871 -60 162 97 -192 -128 -57 -76 144 -213 125 -26 -228 25 161 175 44 211 198 -35 -160 225 -182 -173 -174 2
4895 2 267 267 -84 154 23 119 218 238 -218 -181 234 -123 136 179 293 29 -91 65 -148 -113 145 178 -179 -267
4919b67K29J79k49K17O2j72L51l80L6K71k91k46K70n4J01j01J16o4K44j03o4k46
4941a61J9J43j13J56oj80K89j30O1k75K22j1J68J78n46J99k27K61K5qj57K96l07
4964a04J4O6j20L07k1m89N32j14r7P7J3j07L2O6L47m04q9R5Q2J82n73L60j40J61
4988G6k34O3J60n5N6q4k40J48K53k09J30M0j76L35m40L58j37K5k14M27j61j35
5010a4M5k45M24l55K00m8l2r4j38L42n4J67k27J10k24K69n71K61J79J92l29r9
5032b41K91m5K4k09M08m23J19J19kP1k66L25k64j32M42k70J50j98R7k6N7k09L83
5055B01k15j88L22k37n3k5Q2p7L76k54j56j4L77j31k4n3N2l80J66L15j12%j5P3
5079C0K51m37N2j53k4L37L0M56o56k11L47q7K38k56J16l2l4j49R8Q8p6K36J12
$$ plain form
4919 -267 -38 141 -108 109 171 -1 350 -30 6 277 -14 -260 10 -44 57 -44 72 8 252 149 85 -161
4941 -161 -142 1 -112 44 38 -142 147 17 78 -197 25 14 182 360 -186 13 -214 47 72 64 -93 203 -104
4964 -104 -90 -24 -144 163 142 -347 185 71 -26 51 64 -43 -11 55 402 -2 -91 4 86 268 -305 55 -85 76
4988 76 -158 -95 65 10 66 -18 -258 -110 143 -66 64 104 -72 263 -177 181 44 69 -145 282 121 -14
5010 -14 31 -214 210 -145 55 7 -25 -119 -257 85 31 198 -29 81 -143 126 -445 -184 -5 187 -142 -241
5032 -241 50 5 29 -180 228 -195 -76 43 41 112 -154 171 -93 -225 217 -53 97 -101 -4 -30 27 -182 201
5055 201 -14 -202 120 -117 -170 -195 -113 -190 186 -68 -224 -238 139 8 -16 -69 -17 -397 -231 84 -28 -28 -43 30
5079 30 281 -156 -104 -257 -281 56 86 542 -114 -325 22 -65 173 -83 33 1 -33 -182 -84 4 -72 164 276
5102B76n2k14L5N5L3n0k53M26K0l43R8j85L97l16J28J05n41M88M1J14l15J63j10
5125@j44l0M44l15K84q9k63N04m63j88Q1K05J81O2k20j96J86Jk57K09q9K78l08
5148a27m5K82k84J9K63R3r7j48ok12L87k00M1L23k40l7o7L72k03l03m0L76L1J23
5172C01l7j40l63N8J22J53r5O1M6o7O2n2J42n09J68J40QJ9q5J33J33k86J84o9
5196B7m5N3RJ4l6J69l09K74l17J3L3L05j71j05P1J50n5L4j71j46p6J78k08J58
5220a51K71k53l0K87m4m77N68L1j48J42O9jn20K74P4J71j62j39O2j52L8L84m13
5243a19K45j53J86o8J35k9l13m1Q6J26J3m22L95q9M5m1J19P1J62o29K97J00Or9
5267a7R4j04P7J01j09j23O4q8L13m21J86q1O4J99k54L10M6Rm37M47q2j2l40k7
$$ plain form
5102 276 224 10 45 100 133 83 -170 256 276 -67 31 -154 243 -73 55 160 -381 107 148 262 -53 110 0
5125 0 -144 -174 270 -45 239 150 -113 391 -72 -260 -179 26 207 269 49 -147 39 40 -217 -8 -97 181 -127
5148 -127 -172 110 -174 -155 108 201 104 -44 -50 -262 125 -75 -34 289 49 12 -55 317 114 -189 -229 147 178 301
5172 301 264 124 -239 -181 -59 94 -1 60 106 39 101 49 191 -318 -150 -10 -2 17 -68 65 198 -88 96 27
5196 27 -18 35 44 58 22 191 -118 156 -161 -148 -115 190 19 -86 -15 135 80 114 -57 -203 -279 -101 -309 -151
5220 -151 120 -133 -163 124 80 -397 171 202 54 196 265 264 -256 18 92 263 101 -38 24 -128 -90 294 -119
5243 -119 126 -27 159 91 226 197 -116 -157 -71 55 68 -354 41 -48 -3 -44 75 146 308 -321 -24 76 82 -17
5267 -17 77 -27 50 151 42 -81 -17 -105 208 -213 -27 -108 -44 155 -99 211 257 266 -171 276 194 182 -158 -185
5291a85j5O0M8Q6r5L17m72J52k5N9J52j48J5j0K02o3j65Q9j00Q5J44k58L25m81
5315b83J9J24K51l88N91k00j54L6j27K4k44L3L20j3j7j69J65j75J87j69K47j15
5337e7j17J73k49J05L83k34r4l4PP7l01L47N9Rj41N6k30K30l39J81R2R4k26L38
5361A29l83J29J17J59k20r2O6o9J93l48L07Q4J20j6j17R3m6j73r1N23o17L46j91
5384i7K14N5l08K43k5J64n58L37l89L47n2J12k71P1M05m5l4mk52J20J10k67J65
5407D1k7K5j2q3o6k7K40r3R6n6j00m6N5j83L12k38J39K8L9J07q3q4l06J98n2J13
5433f3K67l03J80m9J23Lj84j59N5j24J82j79L06o5r9mj08O7O7K42k5k10J14J19
5457A53n1N7l88L14l7m7M4R7k09j17K45m2M4RJ49k77q3J71MKPK36k65j95O9K97
$$ plain form
5291 -185 -200 -140 -92 -6 -101 216 -256 -104 -129 -70 82 -66 -51 -61 141 78 -87 2 -98 -13 131 -127 198 -283
5315 -283 -264 -140 111 -277 314 114 -40 -4 -131 -107 -351 -318 2 -11 -28 -197 -32 -207 -20 -189 58 -57
5337 -57 -174 -1 -250 -145 238 4 -90 -124 -117 -40 -341 6 65 74 -67 -11 -241 -11 -350 -169 -77 17 -209 129
5361 129 -254 -125 -8 151 -69 -161 -95 -164 29 -319 -12 72 192 176 59 152 106 -67 -158 365 -252 94 -97
5384 -97 117 172 -136 107 82 246 -312 25 -364 -17 -69 43 -228 -157 248 203 169 165 -87 33 143 -124 41
5407 41 14 39 27 -56 -122 -149 91 -2 94 38 -62 -108 -53 -236 76 -162 -23 5 44 151 68 -16 -322 -124 -176 -63
5433 -63 204 -99 81 32 155 158 -26 -185 -130 -254 -72 -251 55 -10 -109 -113 -221 -154 -87 155 130 -80 34 153
5457 153 102 159 -229 85 48 1 45 142 -67 -184 61 19 63 72 221 -56 -139 32 36 38 45 281 16 -179 -110 187
5483A87n7l47O7K52j72J97l01K57K21n02K47J82M3m27J50R9n6J16k14K68k08j88
5505a86Q8O0m9n1j6K01k63K3K84j35P2j32J41J17l10L99k14K66l92j04J11K43
5527A53k22K3J34K0Q2j56j24j40NL34J37j75j3k73L13l20p2r7M24k6P7J56pj87
5551D6P2l44M65l14L33k49j71J30p8J87k14J68o0J39k05K19n01N45j58J89p9l59
5573b39K42J37j86J8j13R5J81k86K60o7m7k22L23o4k88K9M40k35j98J99j09R3
5595c7J40k23j30K40k9j35J25J97j84K76j60l43J91K73r4k50L75l66k11M44L06
5616D05l72l58K28P0O6k30L07N1K3m0m05K39K6NP5N5o9n3k22Q5P4j50J04L97j22
5641A89k07L1p5r5K91j89m8k01N16O9p2j17K6p5j86j62M62k93J00k32K48j54J29
$$ plain form
5483 187 130 -217 -150 102 -70 127 -174 83 304 -198 49 231 274 -153 -3 96 40 156 -58 210 2 -186
5505 -186 -98 -38 -87 -138 -154 47 -216 -193 91 -44 28 -104 37 154 -156 243 29 295 -97 -201 -90 153
5527 153 -69 -46 88 108 190 34 -90 -230 -225 109 246 71 58 -215 98 -222 -294 -391 33 7 84 240 233 46
5551 46 118 -226 239 -75 258 9 -162 -32 -110 77 -137 31 -29 110 -95 124 -377 168 10 199 120 -239
5573 -239 3 140 -46 -28 -141 -46 135 -151 109 42 -5 -227 96 32 -256 -227 213 -22 -220 -21 -130 -37
5595 -37 103 -120 -250 -10 -39 -174 -49 148 -36 240 80 -263 -72 201 107 -143 232 -134 -345 99 405
5616 405 33 -325 -97 -27 39 -191 116 167 190 150 -255 -16 10 15 90 145 76 23 -199 -114 -40 -190 -86 311 189
5641 189 -18 13 -62 -157 134 -55 -103 -304 212 281 209 92 118 43 -143 -305 157 -136 -36 -268 -20 -174 -45
5664d5J58k50R9J14K0k83O6J68J19K8l12J52k12J32j73J76m1k29M81j72n6J0R2
5687D2j86J09j44K62P1j69j31M11k17K1j42N5J39l30L29j4k44J9L46k43j82L32
5709A34l41K97np0O0o6k67L94R3m72K99J0l0n3J02Q0j68J9J27j92K60k51R2q6
5733c4P7o2Q5J02j57k32K58J30q5pp2O0O6j2j59Lk09K08L12k71q4K8L45k23k14
5758a47J84M8j69K10l48K27K96l12k3J05j12k6R0l01L60J20k55pR1j08J98k50
5780a29rJ17j9M6j3PJ21J49k62P9l0k89K10N5k6J94l45j7K69lk3L61m01j18j58
5805b34J42J16L1j36L5n8n8K68k48K10j13J35l26K96l9Q1k95K0k0L43l24MM02
5828B32k52p0mK05j91J45j23J6j36J26n4L34o8n04M26o4J97k13M5k2l9J47j93
$$ plain form
5664 -45 113 -137 -38 76 96 -187 -121 47 166 194 -118 34 -178 -46 -219 -43 -84 -313 168 -4 -60 -50 42
5687 42 -144 -35 -179 83 154 -15 -146 265 48 69 -73 -18 121 -209 120 106 -138 -119 227 -16 -198 134
5709 134 -207 90 85 15 75 9 -258 136 229 -243 56 66 36 -17 85 165 -3 16 143 -49 211 -40 52 -34
5733 -34 43 -19 66 168 11 -221 37 167 82 75 3 63 129 117 -42 -39 -248 -40 272 1 -83 -55 290 67 -147
5758 -147 37 85 -84 126 -222 5 301 -11 -34 71 -41 -67 23 -278 82 202 -53 -60 31 -77 121 -129
5780 -129 -138 -21 -40 6 -7 0 121 270 8 87 57 -232 -22 33 7 201 -144 -161 108 105 82 443 42 -76 -234
5805 -234 -92 24 55 -81 -46 -104 -162 106 -142 68 -45 90 -236 60 21 102 -193 -173 -193 150 -174 -170 232
5828 232 -20 -90 -94 111 -80 65 -58 -42 -178 -52 -106 228 160 -344 82 18 215 2 47 25 -14 133 -60
5851f0m0NJ83j1K50j76j31JL0j72J42L07j92k88r4J47k9j8J98R6P7k17J9J17j13
5876C1M0j22J81j35j99L42l3l77R2mJ72Rk77M8Q9Q0L82l69K30j53j55K58k30K05
5900A05j01J53k17j29L21j1k26R9Q7j02J68j55mj04K21l14J92L20k00J8q1j7m04
5923c81J82K62M2k17J99k54K37o5o1p8J12O0j78K84k20j74L23Q6j50J45j58Kk9
5946c1L13n5j38j40j18K13J74k36lJ79k81p6J64n5mK67l83L46k14M8K95m91K23
$$ plain form
5851 -60 -100 -95 88 77 327 151 20 21 51 -121 21 328 136 -152 -246 -99 -128 -146 52 148 225 8 27 144 31
5876 31 71 -51 130 -5 -204 138 105 -272 -180 -184 -12 -3 -280 -232 -143 -63 319 -50 180 27 -128 130 -100 105
5900 105 4 157 -60 -189 132 121 -105 -6 81 -21 147 -8 -12 -116 105 -209 -17 303 103 121 40 23 -381
5923 -381 -199 63 105 -112 87 -167 70 5 -56 -134 -22 38 -140 144 -76 -250 73 159 9 154 -4 -2 -31
5946 -31 282 227 89 -51 -169 44 218 -18 -21 158 -123 -199 -35 -90 -94 173 -210 136 -78 -30 265 -226 -3
$$ [...]
8191d
##END NTUPLES=NMR FID
##END=
