##TITLE=1H_TG-2282-1
 CDCl3, 8 sc, 
 6.2.2020
##JCAMPDX= 6.0         $$ Bruker NMR JCAMP-DX V2.0
##DATA TYPE= NMR FID
##DATA CLASS= NTUPLES
##ORIGIN= UXNMR, Bruker Analytische Messtechnik GmbH
##OWNER= root
$$ XWIN-NMR		Version 3.5
$$ Thu Feb  6 13:53:32 2020 Russian Standard Time (UT+4h)  she@DPX200
##.OBSERVE FREQUENCY= 200.1315
##.OBSERVE NUCLEUS= ^1H
##.DELAY= (6, 6)
##.ACQUISITION MODE= SIMULTANEOUS
##.ACQUISITION SCHEME= undefined
##.AVERAGES= 8
##.DIGITISER RES= 18
##SPECTROMETER/DATA SYSTEM= spect
##.PULSE SEQUENCE= zg30
##.SOLVENT NAME= CDCl3
##.SHIFT REFERENCE= (INTERNAL, CDCl3, 0, 15.7039)
##AUDIT TRAIL= $$ (NUMBER, WHEN, WHO, WHERE, WHAT)
$$ ##TITLE= Audit trail, XWIN-NMR		Version 3.5
$$ ##JCAMPDX= 5.01
$$ ##ORIGIN= Bruker BioSpin GmbH
$$ ##OWNER= she
$$ F:/spectra/data/she/nmr/H-F/1/audita.txt
$$ ##AUDIT TRAIL=  $$ (NUMBER, WHEN, WHO, WHERE, WHAT)
(   1,<2020-02-06 13:52:36.23 +0400>,<she>,<DPX200>,
      <created by zg, POWCHK disabled, PULCHK disabled
       configuration hash MD5:
       00 E9 B6 7A A2 85 ED C7 34 08 36 98 17 FE 4E 26
       data hash MD5: 16K
       73 CB 43 03 BC F9 61 51 74 A5 D3 04 7D C6 84 F5>)
$$ ##END=
$$ 
$$ hash MD5
$$ A2 40 3F EE 24 DA 85 7C A9 0A 89 0E 62 40 67 88
##$RELAX= 
##$RELAX= 
##$RELAX= 
##$RELAX= 
##$RELAX= 
##$RELAX= 
$$ Bruker specific parameters
$$ --------------------------
##$DU= <F:/spectra>
##$EXPNO= 1
##$NAME= <H-F>
##$PROCNO= 1
##$TYPE= <nmr>
##$USER= <she>
##$AMP= (0..31)
100 100 100 100 100 100 100 100 100 100 100 100 100 100 100 100 100 100 
100 100 100 100 100 100 100 100 100 100 100 100 100 100 
##$AQSEQ= 0
##$AQ_mod= 1
##$AUNM= <au_zg>
##$AUTOPOS= <>
##$BF1= 200.13
##$BF2= 200.13
##$BF3= 200.13
##$BF4= 200.13
##$BF5= 200.13
##$BF6= 200.13
##$BF7= 200.13
##$BF8= 200.13
##$BYTORDA= 1
##$CFDGTYP= 0
##$CFRGTYP= 5
##$CHEMSTR= <none>
##$CNST= (0..31)
1 1 145 1 1 1 1 1 1 1 1 1 1 1 1 1 1 1 1 1 1 1 1 1 1 1 1 1 1 1 1 1 
##$CPDPRG= <>
##$CPDPRG1= <>
##$CPDPRG2= <>
##$CPDPRG3= <>
##$CPDPRG4= <mlev>
##$CPDPRG5= <mlev>
##$CPDPRG6= <mlev>
##$CPDPRG7= <mlev>
##$CPDPRG8= <mlev>
##$CPDPRGB= <>
##$CPDPRGT= <>
##$D= (0..31)
0 1.2 0 0 0 0 0 0 0 0.06 0 0.03 0 0 0 0 0.0002 0 0 0 0 0 0 0 0 0 0 0 0 
0 0 0 
##$DATE= 1580982755
##$DBL= (0..7)
120 120 120 120 120 120 120 120 
##$DBP= (0..7)
150 150 150 150 150 150 150 150 
##$DBP07= 0
##$DBPNAM0= <>
##$DBPNAM1= <>
##$DBPNAM2= <>
##$DBPNAM3= <>
##$DBPNAM4= <>
##$DBPNAM5= <>
##$DBPNAM6= <>
##$DBPNAM7= <>
##$DBPOAL= (0..7)
0.5 0.5 0.5 0.5 0.5 0.5 0.5 0.5 
##$DBPOFFS= (0..7)
0 0 0 0 0 0 0 0 
##$DE= 6
##$DECBNUC= <off>
##$DECIM= 24
##$DECNUC= <off>
##$DECSTAT= 4
##$DIGMOD= 1
##$DIGTYP= 9
##$DL= (0..7)
0 120 120 120 120 120 120 120 
##$DP= (0..7)
150 150 150 150 150 150 150 150 
##$DP07= 0
##$DPNAME0= <>
##$DPNAME1= <>
##$DPNAME2= <>
##$DPNAME3= <>
##$DPNAME4= <>
##$DPNAME5= <>
##$DPNAME6= <>
##$DPNAME7= <>
##$DPOAL= (0..7)
0.5 0.5 0.5 0.5 0.5 0.5 0.5 0.5 
##$DPOFFS= (0..7)
0 0 0 0 0 0 0 0 
##$DQDMODE= 0
##$DR= 18
##$DS= 0
##$DSLIST= <SSSSSSSSSSSSSSS>
$$ [...]
##$SUBNAM2= <"">
##$SUBNAM3= <"">
##$SUBNAM4= <"">
##$SUBNAM5= <"">
##$SUBNAM6= <"">
##$SUBNAM7= <"">
##$SUBNAM8= <"">
##$SUBNAM9= <"">
##$SW= 24.9337058887773
##$SWIBOX= (0..15)
0 0 2 0 0 0 0 0 0 0 0 0 0 0 0 0 
##$SW_h= 4990.01996007984
##$TD= 16384
##$TD0= 1
##$TE= 0
##$TE2= 300
##$TE3= 300
##$TEG= 300
##$TL= (0..7)
0 120 120 120 120 120 120 120 
##$TP= (0..7)
150 150 150 150 150 150 150 150 
##$TP07= 0
##$TPNAME0= <>
##$TPNAME1= <>
##$TPNAME2= <>
##$TPNAME3= <>
##$TPNAME4= <>
##$TPNAME5= <>
##$TPNAME6= <>
##$TPNAME7= <>
##$TPOAL= (0..7)
0.5 0.5 0.5 0.5 0.5 0.5 0.5 0.5 
##$TPOFFS= (0..7)
0 0 0 0 0 0 0 0 
##$TUNHIN= 0
##$TUNHOUT= 0
##$TUNXOUT= 0
##$USERA1= <user>
##$USERA2= <user>
##$USERA3= <user>
##$USERA4= <user>
##$USERA5= <user>
##$V9= 5
##$VALIST= <valist>
##$VCLIST= <CCCCCCCCCCCCCCC>
##$VD= 0
##$VDLIST= <DDDDDDDDDDDDDDD>
##$VPLIST= <PPPPPPPPPPPPPPP>
##$VTLIST= <TTTTTTTTTTTTTTT>
##$WBST= 1024
##$WBSW= 4
##$XGAIN= (0..3)
0 0 0 0 
##$XL= 0
##$YL= 0
##$YMAX_a= 104652
##$YMIN_a= -31289
##$ZGOPTNS= <>
##$ZL1= 120
##$ZL2= 120
##$ZL3= 120
##$ZL4= 120
##$ABSF1= 10
##$ABSF2= 0
##$ABSG= 5
##$ABSL= 3
##$ALPHA= 0
##$AQORDER= 0
##$ASSFAC= 0
##$ASSFACI= 0
##$ASSFACX= 0
##$ASSWID= 0
##$AUNMP= <proc_1d>
##$AZFE= 0.1
##$AZFW= 0.1
##$BCFW= 1
##$BC_mod= 2
##$BYTORDP= 1
##$COROFFS= 0
##$CY= 11.3945322036743
##$DATMOD= 1
##$DC= 2
##$DFILT= <>
##$DTYPP= 0
##$F1P= 16.9975609425685
##$F2P= -3.02152046262296
##$FCOR= 0.5
##$FTSIZE= 0
##$FT_mod= 4
##$GAMMA= 1
##$GB= 0.15
##$INTBC= 1
##$INTSCL= 1
##$ISEN= 128
##$LB= 0.24
##$LEV0= 0
##$LPBIN= 0
##$MAXI= 10000
##$MC2= 0
##$MEAN= 0
##$ME_mod= 0
##$MI= 1.114404
##$NCOEF= 0
##$NC_proc= 0
##$NLEV= 6
##$NOISF1= 3.799351
##$NOISF2= 2.8
##$NSP= 1
##$NTH_PI= 0
##$NZP= 0
##$OFFSET= 15.70392
##$PC= 1
##$PHC0= -9788.056
##$PHC1= 14.40081
##$PH_mod= 1
##$PKNL= yes
##$PPARMOD= 0
##$PSCAL= 0
##$PSIGN= 0
##$REVERSE= no
##$SF= 200.130013532006
##$SI= 16384
##$SIGF1= 3
##$SIGF2= 2
##$SINO= 400
##$SIOLD= 16384
##$SREGLST= <1H.CDCl3>
##$SSB= 0
##$STSI= 0
##$STSR= 0
##$SW_p= 3612.71676300578
##$SYMM= 0
##$S_DEV= 0
##$TDeff= 0
##$TDoff= 0
##$TI= <>
##$TILT= no
##$TM1= 0
##$TM2= 0
##$TOPLEV= 0
##$USERP1= <user>
##$USERP2= <user>
##$USERP3= <user>
##$USERP4= <user>
##$USERP5= <user>
##$WDW= 1
##$XDIM= 8192
##$YMAX_p= 0
##$YMIN_p= 0
$$ End of Bruker specific parameters
$$ ---------------------------------
##NTUPLES= NMR FID
##VAR_NAME=  TIME,          FID/REAL,        FID/IMAG
##SYMBOL=    X,             R,               I
##VAR_TYPE=  INDEPENDENT,   DEPENDENT,       DEPENDENT
##VAR_FORM=  AFFN,          ASDF,            ASDF
##VAR_DIM=   8192,          8192,            8192
##UNITS=     SECONDS,       ARBITRARY UNITS, ARBITRARY UNITS
##FACTOR=    0.0002004,     1,               1
##FIRST=     0,             0,               0
##LAST=      1.6414764,     0,               0
##MIN=       0,             -31289,          0
##MAX=       1.6414764,     104652,          0
$$ Real data points
##PAGE= N=1
##DATA TABLE= (X++(R..R)), XYDATA
$$ [...]
$$ plain form
1950 160 -36 -118 -276 -205 -207 -131 125 -359 35 -400 -225 -194 -158 -149 -392 -101 -456 -386 -348 -405 -211 -577 -176 -678
1974 -678 -609 -429 -347 -614 -417 -407 -567 -289 -248 -572 -227 -248 -313 -282 -289 -535 -289 -389 -170 -85 -308 15 -210
1997 -210 18 -138 -78 -189 -531 144 -85 15 80 -3 -194 -237 31 -206 -237 80 -186 -122 113 117 -173 135 46
2020 46 -59 256 198 386 282 349 396 254 136 448 244 209 255 199 273 303 171 242 198 237 263 241 275 383 249
2045 249 373 -15 379 205 205 465 -29 344 122 419 212 378 188 175 459 60 325 88 -175 119 163
2066 163 281 138 158 205 194 -214 -66 -44 -133 225 42 98 -5 136 -99 75 -148 -47 -237 -426 -58 -202
2088 -202 -307 -412 -178 -436 -232 -326 -442 -296 -226 -166 -337 -69 -540 -489 -261 -291 -315 -290 -206 -287 -138 -203 -349
2111 -349 -469 -240 -6 73 -455 -155 -3 -255 -154 -320 -137 -402 -464 -15 -3 -97 -66 -198 -105 -247 -36 -442
$$ packed form
1950A60j96q2j58P1kP6K56m84L94m35J75L1L6Rk43K91l55P0L8n7J94l66M01n02
1974f78O9J80Q2k67J97J0j60K78M1l24L45k1o5L1pk46K46j00K19Q5k23L23k25
1997b10K28j56O0j11l42O75k29J00O5q3j91m3K68k37l1L17k66O4K35Mk90L08q9
2020D6j05L15n8J88j04O7M7j42j18L12k04l5M6n6P4L0j32P1m4L9K6k2L4J08j34
2045B49J24l88L94j74%K60m94L73k22K97k07J66j90j3K84l99K65k37k63K94M4
2066A63J18j43K0M7j1m08J48K2q9L58j83N6j03J41k35J74k23J01j90j89L68j44
2088b02j05j05K34k58K04r4j16J46P0O0j71K68m71N1K28l0k4K5Q4q1J49o5j46
2111c49j20K29K34P9n28L00J52k52J01j66J83k65o2M49J2r4L1j32R3j42K11m06
$$ plain form
2133 -442 115 240 -3 101 65 -157 -206 155 98 106 -169 -53 296 -4 59 -10 187 116 -33 145 371 414 156
2156 156 435 -105 338 349 303 100 96 166 373 342 54 277 253 796 397 47 120 195 342 139 5 254 55
2179 55 363 520 381 56 98 353 267 221 235 -136 337 242 -1 176 109 247 221 89 284 38 31 -101 276
2202 276 -44 -64 -179 78 -126 31 73 -308 38 130 -325 -495 -37 -161 -127 -177 -92 3 -340 -253 -171 -408 -385
2225 -385 -44 333 -696 -288 -84 -67 -431 -416 -418 -574 -218 -494 6 -367 -315 -16 -223 -192 -244 -315 -181 -319
2247 -319 -3 -365 -452 -141 -307 -257 -245 31 104 -132 -19 -127 -28 182 -93 -51 199 -203 51 -10 35 -107 -25
2270 -25 -359 -63 241 68 150 17 217 -112 329 -145 219 264 -57 78 195 381 255 308 380 411 68 445
2292 445 178 293 -16 135 88 179 287 298 336 348 310 306 25 87 361 244 328 -68 485 515 167 183 243 331 94
$$ packed form
2133d42N57J25k43J04l6k22m9L61n7Qk75J16L49l00O3o9J97p1j49J78K26M3k58
2156A56K79n40M43J1m6k03mP0K07l1k88K23k4N43l99l50P3P5J47k03j34K49j99
2179E5L08J57j39l25M2K55q6m6J4l71M73r5k43J77o7J38k6j32J95k46pj32L77
2202B76l20k0j15K57k04J57M2l81L46R2m55j70M58j24L4n0Q5R5l43Q7Q2k37K3
2225c85L41L77j029M08K04J7l64J5kj56L56k76N00l73N2K99k07L1n2p1J34j38
2247c19L16l62q7L11j66N0J2K76P3k36J13j08R9K10k75M2K50m02K54o1M5j42Q2
2270b5l34K96L04j73Q2j33K00l29M41m74L64M5l21J35J17J86j26N3P2L1l43L77
2292D45k67J15l09J51m7R1J08J1L8J2l8mk81O2K74j17Q4l96N53L0l48J6O0Q8k37
$$ plain form
2317 94 133 258 378 274 120 175 73 81 291 156 115 171 118 356 68 -10 -176 90 -277 -150 -18 12 -324
2340 -324 -295 64 -404 -221 -24 -14 -230 -432 -105 -6 91 -213 49 -360 -252 -170 2 -27 -140 -327 -473 -361
2362 -361 -3 130 -123 -317 -392 -424 -151 -295 -200 -78 -404 88 -251 -266 -456 -184 -596 -44 -269 -34 18 -289
2384 -289 140 -52 -64 -79 -60 -247 197 -46 -118 -204 14 -120 -70 105 -30 118 243 131 0 -43 179 223 -183
2407 -183 149 211 265 41 144 -123 324 -32 -40 215 96 358 109 40 139 69 96 44 291 314 288 -9 225 226
2431 226 291 -17 105 317 116 437 281 193 68 88 393 176 62 -2 26 181 162 146 246 -62 152 37
2453 37 192 191 101 266 -80 -37 4 -275 146 -34 -35 -310 -305 -24 506 -222 4 -133 -374 -59 233 -162 38
2476 38 -189 30 129 -402 -240 -193 -94 -204 -262 -486 -398 -287 -367 -77 -70 -427 -211 -510 -301 -242 -191 -124 -357 -90
$$ packed form
2317I4L9J25J20j04j54N5j02QK10j35m1N6n3K38k88p8j66K66l67J27J32L0l36
2340c24K9L59m68J83J97J0k16k02L27R9R7l04K62m09J08Q2J72k9j13j87j46J12
2362c61L58J33k53j94p5l2K73j44R5J22l26M92l39j5j90K72m12N52k25K35N2l07
2384b89M29j92j2j5J9j87M44k43p2q6K18j34N0J75j35J48J25j12j31m3K22M4m06
2407a83L32O2N4k24J03k67M47l56qK55j19K62k49o9R9p0K7n2K47K3k6k97K34J
2431B26O5l08J22K12k01L21j56q8j25K0L05k17j14o4K8J55j9j6J00l08K14j15
2453C7J55jr0J65l46M3M1k79M21j80jk75NK81N30p28K26j37k41L15K92l95K00
2476C8k27K19R9n31J62M7R9j10n8k24Q8J11q0K90Pl57K16k99K09N9N1O7k33K67
$$ plain form
2500 -90 -413 -258 -295 -513 -21 -112 84 -46 -431 -400 -163 -142 -87 5 -178 -38 -393 -39 -262 60 16 168 -35
2523 -35 42 43 -151 84 60 67 -8 221 22 17 240 -229 176 303 82 428 455 358 140 121 373 382 41 35 390 287
2549 287 158 333 380 317 86 341 212 446 -182 305 375 461 31 -8 193 286 0 306 60 186 69 371
2571 371 13 131 -87 93 374 223 179 275 56 -161 -29 156 257 208 -12 238 243 -31 305 149 52 17
2593 17 8 -33 298 182 -252 -161 -423 -174 95 -2 -72 -92 -109 -336 -138 -172 -117 -244 -391 13 -23 123 71 -487
2617 -487 18 -221 -343 -198 -185 -147 -128 -129 -29 98 20 -322 -208 -291 -313 -139 -30 -60 -10 -33 -241 19 76 194
2641 194 -502 -201 329 -249 6 85 -444 -356 253 -173 -138 -155 26 -327 121 87 -12 -52 -69 301 -206 253 247
2664 247 -212 285 -28 15 62 82 329 88 39 199 9 46 48 30 308 -146 121 19 60 45 359 95 -152
$$ packed form
2500i0l23J55l7k18M92r1J96j30l85L1K37K1N5R2j83J40l55L54k23L22m4J52k03
2523c5P7Jj94K35k4Pp5K29j99nK23m69M05J27k21L46K7r7k18j9K52Rl41oL55j03
2549B87j29J75M7o3k31K55j29K34o28M87P0Q6m30l9K01R3k86L06k46J26j17L02
2571C71l58J18k18J80K81j51m4R6k19k17J32J85J01m9k20K50Nk74L36j56r7l5
2593A7rm1L31j16m34R1k62K49K69r7p0k0j7k27J98l4N5j27j47M04l6J46n2n58
2617d87N05k39j22J45J3L8J9jJ00J27p8l42J14q3k2J74J09l0N0k3k08K60N7J18
2641A94o96L01N30n78K55P9n29Q8O09m26L5j7J81l53M48l4r9m0j7L70n07M59o
2664B47m59M97l13M3M7K0K47k41m9J60j90L7Kj8K78m54K67j02M1j5L14k64k47
$$ plain form
2687 -152 14 332 323 350 329 212 105 -74 -13 112 43 218 -195 55 114 -96 30 270 122 168 86 103 -143
2710 -143 54 253 281 -62 257 306 363 147 -119 252 295 -205 -1 73 -176 160 -66 -71 3 -262 4 -38 31
2733 31 -71 -446 57 172 -173 -42 -52 -69 -87 -173 32 7 -249 -127 -198 -157 -144 -277 51 -379 -167 -108 -112 -319
2757 -319 -117 -176 -95 -49 -135 62 38 -150 -60 -473 -230 0 -262 -121 -396 -136 -113 -179 190 -200 -58 -88 11
2780 11 -342 -241 138 -151 84 87 95 158 62 -24 -143 -28 235 369 269 -173 122 56 6 247 240 224 38 2 -84
2805 -84 1 133 271 57 49 391 264 78 221 -8 109 -139 250 343 347 172 62 143 -250 29 -129 45 233
2828 233 -20 -18 8 99 -78 241 177 53 119 95 382 187 94 280 9 133 99 214 25 113 12 196 -53
2851 -53 -44 -387 50 51 24 -231 -74 -119 -169 -34 -54 -570 -10 -374 -84 44 -100 94 45 -180 -140 -110 -296 52
$$ packed form
2687a52J66L18rK7k1j17j07j79O1J25o9J75m13K50N9k10J26K40j48M6q2J7k46
2710a43J97J99K8l43L19M9N7k16k66L71M3n00K04P4k49L36k26nP4k65K66m2O9
2733C1j02l75N03J15l45J31j0j7j8q6K05k5k56J22p1M1J3j33L28m30K12N9mk07
2757c19K02n9Q1M6q6J97k4j88R0m13K43K30k62J41k75K60K3o6L69l90J42l0R9
2780A1l53J01L79k89K35LQO3r6q6j19J15K63J34j00m42K95o6n0K41pj6j86l6q6
2805h4Q5J32J38k14qL42j27j86J43k29J17k48L89R3Mj75j10Q1l93K79j58J74J88
2828B33k53KK6R1j77L19o4j24O6k4K87j95r3J86k71J24l4J15j89Q8j01J84k49
2851e3Rl43M37Jk7k55J57m5n0J35k0n16N60l64K90J28j44J94m9k25M0L0j86L48
$$ plain form
2875 52 -190 -147 -76 -97 -29 -133 -226 -37 -43 -236 57 -166 -397 -216 -48 -268 -170 -154 -192 -54 -115 -277 -315 13
2899 13 -76 106 177 -300 -115 38 -1 -35 -170 -107 -197 56 21 49 171 38 -171 57 17 47 15 465 -223 101
2923 101 -46 -52 139 -104 239 164 43 242 108 174 486 73 416 78 365 -219 -16 156 151 -278 -64 81
2945 81 297 135 293 56 176 404 168 -83 93 -44 208 38 210 97 317 189 110 113 -33 221 209 251
2967 251 -62 -174 -273 183 86 6 -239 68 109 230 -154 -31 44 -3 298 125 -244 -432 -96 -76 235 -67
2989 -67 88 -26 -124 -156 -180 252 46 -231 -205 -44 -407 -275 103 -261 -65 -121 52 -278 -39 -134 0 65 -267
3012 -267 -225 -101 -57 8 7 5 -59 -258 -284 236 -4 162 -8 -25 -317 132 10 147 -109 -180 -118 201 -78 -94
3036 -94 -6 -48 -282 100 61 -144 23 -31 20 -72 -150 73 12 40 -81 133 -35 160 -73 43 -3 52 186 180 267
$$ packed form
2875E2k42M3P1k1O8j04r3J89oj93K93k23k31J81J68k20R8J6l8J38o1j62l8L28
2899A3q9J82P1m77J85J53l9l4j35O3r0K53l5K8J22j33k09K28m0L0l2M50o88L24
2923A01j47oJ91k43L43p5j21J99j34O6L12m13L43l38K87n84K03J72nm29K14J45
2945H1K16j62J58k37J20K28k36k51J76j37K52j70J72j13K20j28p9Lj46K54j2M2
2967B51l13j12r9M56r7q0k45L07M1J21l84J23P5m7L01j73l69j88L36K0L11l02
2989f7J55j14r8l2k4M32k06k77K6J61l63J32L78l64J96n6J73l30K39r5J34O5l32
3012b67M2J24M4O5jko4j99k6N20k40J66j70j7k92M49j22J37k56p1O2L19k79j6
3036i4Q8m2k34L82l9k05J67n4N1r2p8K23o1K8j21K14j68J95k33J16m6N5J34oQ7
$$ plain form
3061 267 341 290 279 31 95 282 -21 -162 98 95 -100 -2 15 -31 264 118 133 -48 56 -30 -71 205 254 191 142
3086 142 -170 1 -165 121 224 -7 324 99 62 3 -62 -83 65 -39 42 81 308 -32 -69 -84 -18 -191 79
3109 79 139 -147 -240 -32 49 58 9 -103 -56 27 60 -104 -40 -61 107 -282 -28 -138 -56 -248 242 42 -74 -159 -79
3134 -79 -395 -147 -4 -76 -188 55 -41 -75 -88 -193 -253 -86 -410 -141 -96 -460 -86 -43 -72 -436 -34 -316 64
3157 64 -57 -235 -273 -243 -127 -39 46 165 126 -19 -153 -128 -166 -292 -83 234 41 134 22 -16 250 -56 -115 176
3181 176 192 284 131 126 33 26 134 -136 69 67 260 25 170 229 -305 37 -358 4 -60 -89 52 152 197 131 106
3206 106 205 153 268 241 -100 209 -217 298 308 243 243 210 228 -4 -158 96 119 -19 -161 40 -208 -126 4 198
3230 198 175 -145 160 50 239 12 -75 107 193 14 -139 -96 -351 -5 -53 62 -154 32 -121 -54 -266 -53
$$ packed form
3061B67P4n1j1k48O4J87l03j41K60lj95R8J7m6K95j46J5j81J04q6m1K76M9o3m9
3086A42l12J71j66K86J03k31L31k25l7n9o5k1J48j04Q1L9K27l40l7j5O6j73K70
3109G9O0k86r3K08Q1Rm9j12M7Q3L3j64O4k1J68l89K54j10Q2j92M90k00j16q5Q0
3134g9l16K48J43p2j12K43r6l4j3j05o0J67l24K69M5l64L74M3k9l64M02k82L80
3157F4j21j78l8L0J16Q8Q5J19l9j45j34K5l8j26K09L17j93R3j12l8K66l06n9K91
3181A76J6R2j53nr3pJ08k70K05kJ93k35J45N9n34L42l95L62o4k9J41J00M5o6k5
3206A06R9n2J15k7l41L09m26N15J0o5%l3J8k32j54K54K3j38j42K01k48Q2J30J94
3230A98k3l20L05j10J89k27q7J82Q6j79j53M3k55L46m8J15k16J86j53O7k12K13
$$ plain form
3252 -53 -254 186 230 293 39 4 119 92 -70 -354 -74 53 -226 -210 -25 -203 -168 -358 -184 59 -111 -344
3274 -344 -278 -109 -178 -38 -193 -76 -222 -274 165 -36 4 -326 0 -149 -73 -197 -210 -9 198 95 153 134 -97
3297 -97 16 -230 377 -175 -49 184 -403 104 -43 17 -37 -123 72 -13 -114 -16 31 191 180 239 -115 162 48
3320 48 235 60 -142 -90 108 264 128 149 -88 -5 -46 -174 201 324 -10 -31 -34 123 380 77 149 48 167
3343 167 341 -11 -151 113 81 308 -111 220 -1 178 12 -29 90 -199 194 -155 -245 63 -66 233 -61
3364 -61 171 -327 410 -56 120 44 83 255 95 339 189 -106 35 -292 -289 -70 -98 -201 -302 -45 -281 -171
3386 -171 -316 137 116 -153 52 -242 -156 191 -36 -355 -201 -115 -145 55 105 -69 -277 -50 59 -164 11 -73
3408 -73 75 -361 -191 286 -111 -162 -209 -2 -251 -37 -11 -240 -84 125 -252 -41 73 -134 -185 -154 -219 -16
$$ packed form
3252e3k01M40M4O3k54l5J15k7j62k84K80J27k79J6J85j78L5j90J74K43j70k33
3274c44O6J69o9J40j55J17j46n2M39k01M0l30L26j49P6j24j3K01K07j03N8j9k31
3297i7J13k46O07n52J26K33n87N07j47O0n4q6J95q5j01R8M7J60j1N9l54K77j14
3320D8J87j75k02N2J98J56j36K1k37Q3m1j28L75J23l34k1lJ57K57l03P2j01J19
3343A67J74l52j40K64l2K27m19L31k21J79j66m1J19k89L93l49r0L08j29K99k94
3364f1K32m98P37m66J76p6L9J72j60K44j50k95J41l27LK19k8j03j01K57k36J10
3386a71j45M53k1k69K05k94Q6L47k27l19J54Q6l0K00N0j74k08K27J09k23J75q4
3408g3J48m36J70M77l97n1m7K07k49K14K6k29J56K09l77K11J14k07n1L1o5K03
$$ plain form
3430 -16 -150 142 159 259 254 -257 149 80 180 77 -194 -176 104 27 15 134 324 190 63 87 100 204 -84
3453 -84 58 -63 170 179 -22 -114 179 425 -21 -36 74 -20 205 -42 -197 253 108 10 -100 90 227 209 139
3476 139 264 457 289 -180 129 205 -18 -55 55 199 96 85 -138 -5 -12 -115 177 -12 -74 140 112 -146
3498 -146 -19 37 -196 -28 -63 88 41 -1 -10 -178 36 18 -221 -172 80 144 -157 -211 283 -121 -115 59 -248 42
3522 42 -149 -455 -56 -318 -161 -241 305 -152 -130 -206 -220 41 92 -18 35 29 -77 112 -64 342 -188 -314 -80
3545 -80 81 53 -124 -112 27 -19 -63 -233 -190 -206 -84 -224 -248 106 -231 224 90 -170 3 139 31 80 29
3568 29 -19 29 -7 341 -47 88 -137 32 -208 33 211 219 -18 -69 -55 122 -119 3 -85 277 -33 -59 249
3591 249 53 -89 121 -181 -31 -69 109 -10 -76 58 68 273 -173 -57 116 -29 -72 65 25 60 -22 184
$$ packed form
3430a6j34K92J7J00nn11M06o9J00j03k71J8K80p7j2J19J90j34j27K4J3J04k88
3453h4J42j21K33Rk01r2K93K46m46j5J10r4K25k47j55M50j45r8j10J90J37j8p0
3476A39J25J93j68m69L09P6k23l7J10J44j03j1k23J33pj03K92j89o2K14k8k58
3498a46J27N6k33J68l5J51m7m2rj68K14j8k39M9K52O4l01n4M94m04OJ74l07K90
3522D2j91l06L99k62J57q0N46m57K2p6j4K61N1j10N3oj06J89j76M06n30j26K34
3545h0J61k8j77J2J39m6m4j70M3j6J22j40k4L54l37M55j34k60J73J36j08M9n1
3568B9m8M8l6L48l88J35k25J69k40K41J78Qk37n1J4J77k41J22q8L62l10k6L08
3591B49j96j42K10l02J50l8J78j19o6J34J0K05m46J16J73j45m3J37m0L5q2K06
$$ plain form
3613 184 131 228 247 159 -43 -24 228 -33 -173 112 -150 172 56 -53 -114 -239 54 65 170 -37 -150 7
3635 7 141 103 47 237 159 -360 -185 240 -168 -184 189 -22 189 166 -168 -372 148 81 2 -294 -166 -34 -297
3658 -297 -219 -319 92 -131 -95 116 -324 -32 215 76 96 -19 -216 -183 -20 -169 73 201 -59 -62 -233 -54
3680 -54 -168 -236 -41 -85 -42 261 76 276 18 -249 183 156 -80 240 171 27 56 244 -24 50 90 127 91 -143
3704 -143 -86 93 -25 -304 8 34 273 -214 -46 154 -56 233 256 169 203 -419 -241 -58 46 114 27 -8 -176
3727 -176 -10 -83 147 47 -6 94 81 112 186 -284 -121 88 306 116 -123 102 -33 -33 -149 -84 38 102 114
3750 114 -71 -72 -94 -131 -94 -258 104 -30 -199 130 194 -104 50 -200 -156 -256 -111 -142 51 83 -25 -172 -73
3773 -73 165 -82 -63 10 200 -117 -9 -186 -18 -177 49 38 -191 -121 135 11 54 -91 -140 134 -110 -164 276
$$ packed form
3613A84n3R7J9q8k02J9K52k61j40K85k62L22j16j09o1j25K93J1J05k07j13J57
3635GJ34l8n6J90p8n19J75M25m08j6L73k11K11k3l34k04N20o7p9k96J28J32k63
3658b97P8j00M11k23L6K11m40K92K47j39K0j15j97L3J63j49K42J28k60lj71J79
3680e4j14o8J95m4M3L03j85K00k58k67M32k7k36L20o9j44K9J88k68P4M0L7l6k34
3704a43N7J79j18k79L12K6K39m87J68K00k10K89K3q7L4o22J78J83J04O8q7l5j68
3727a76J66p3K30j00n3J00j3L1P4m70J63K09K18j90k39K25j35%j16O5J22O4J2
3750A14j85jk2l7L7j64L62j34j69L29O4k98J54k50M4j00J45l1J93L2j08j47R9
3773g3K38k47J9P3J90l17J08j77J68j59K26j1k29P0K56j24M3j45m9K74k44n4M40
$$ plain form
3796 276 43 -77 49 -132 -281 -82 -135 12 117 -21 -180 -136 49 -111 -224 39 119 23 196 3 -98
3817 -98 293 -126 67 309 52 91 109 -67 -3 -122 -30 132 -50 -11 -86 176 10 -183 -141 53 219 114 80
3840 80 249 163 -166 -19 117 150 -94 -75 322 196 -225 12 -236 118 -49 -208 176 123 21 28 178 249 -168
3863 -168 -204 -159 263 -93 65 84 -46 9 -42 -288 93 -219 -34 -54 83 169 46 -269 89 -1 207 -217 85
3886 85 186 -159 -98 19 99 57 81 105 -60 -247 133 -183 257 81 112 62 198 37 -110 -131 -342 -201 -145
3909 -145 26 -273 -29 -204 -119 184 -273 -144 -91 -6 -260 -130 270 180 -102 -278 158 75 136 4 -216 -233
3931 -233 -276 45 -165 -390 -304 -150 121 -167 156 73 98 -49 133 128 152 -198 -122 91 -35 -60 149 -25 -185
3954 -185 167 -63 94 -321 43 128 94 54 -138 115 -191 -33 242 93 -106 -106 93 265 257 9 70 120 157
$$ packed form
3796B76k33j20J26j81j49J99n3J47J05j38j59M4J85j60j13K63Q0r6J73j93j01
3817i8L91m19J93K42k57L9J8j76O4j19R2J62j82L9p5K62j66j93M2J94J66j05l4
3840H0J69q6l29J47J36L3k44J9L97j26m21K37k48L54j67j59L84n3j02PJ50P1m17
3863a68l6M5M22l56J58J9j30N5n1k46L81l12J85k0J37Q6j23l15L58r0K08m24L02
3886H5J01l45O1J17Q0m2K4K4j65j87L80l16M40j76L1n0J36j61j47k1k11J41N6
3909a45J71k99K44j75Q5L03m57J29N3Q5k54J30M00r0k82j76M36q3O1j32k20j7
3931b33m3L21k10k25Q6J54K71k88L23q3K5j47J82nK4l50P6K13j26k5K09j74j60
3954a85L52k30J57m15L64Q5l4m0j92K53l06J58K75j49j99%J99J72qk48O1N0L7
$$ plain form
3977 157 224 -4 38 162 -35 -122 144 140 451 156 -117 287 -8 141 58 1 36 26 5 -241 -68 -292 147
4000 147 329 -138 -22 243 -81 19 -17 -172 15 -52 -38 -168 4 29 -20 32 -212 232 -181 245 -91 -62
4022 -62 -127 -79 3 -117 -353 -175 -413 -66 -162 -129 -89 -218 125 -60 -123 32 -135 130 99 -83 82 -348 14
4045 14 31 -132 87 -238 -240 229 -345 -26 -80 -85 15 -40 -141 -219 -8 -201 98 -132 -4 76 -196 -60 -64 227
4069 227 175 55 -127 -1 92 362 21 -61 35 97 30 85 206 182 135 -77 8 166 188 -3 347 80 5 222
4093 222 70 49 204 124 -52 -5 -32 161 190 -102 -9 -45 403 -95 -31 14 -19 -21 3 35 258 -62 103 209 295
4118 295 -50 136 175 51 -31 182 49 252 -146 -255 21 18 111 -62 -122 -170 -115 -173 25 254 138 107 -81
4141 -81 240 81 62 -192 -160 225 -93 -30 -90 -252 46 12 -48 142 197 48 -248 326 -221 1 21 121 10
$$ packed form
3977A57O7k28M2J24j97q7K66mL11k95k73M04k95J49q3n7L5j0k1k46J73k24M39
4000A47J82m67J16K65l24J00l6j55J87o7J4j30J72K5m9N2k44M44m13M26l36K9
4022f2o5M8Q2j20k36J78k38L47r6L3M0j29L43j85o3J55j67K65l1j82J65m30L62
4045A4J7j63K19l25kM69n74L19n4nJ00n5j01p8K11j93K99k30J28Q0k72J36mK91
4069B27n2j20j82J26R3K70l41q2R6O2o7N5J21k4m7k12Q5J58K2j91L50k67p5K17
4093B22j52k1J55q0j76M7k7J93K9k92R3l6M48m98O4M5l3kK4L2K23l20J65J06Q6
4118B95l45J86L9j24q2K13j33K03l98j09K76lR3j73o0m8N5n8J98K29j16l1j88
4141h1L21j59j9k54L2L85l18O3o0j62K98l4o0J90N5j49k96N74n47K22K0J00j11
$$ plain form
4164 10 -269 -126 203 72 35 -19 17 16 -212 250 -266 94 103 118 -94 34 21 -173 37 -441 -43 143 -228
4187 -228 -160 80 17 2 -60 74 -32 -180 47 71 14 111 425 43 -240 -97 102 277 119 -43 -36 127 -245
4210 -245 155 -69 -93 35 19 91 -6 99 -188 -163 -1 22 26 -217 247 -59 161 60 106 -84 -119 -110 27 -68
4234 -68 -217 77 -84 83 137 3 72 176 -104 191 -171 12 -122 32 96 28 165 259 -25 308 -14 0
4256 0 127 -91 107 -234 78 70 -142 74 -310 41 -33 -169 45 126 -195 382 107 -89 -94 2 19 89 184 29
4280 29 -77 52 -11 119 -162 -146 366 -355 -240 28 -143 -149 -345 -117 -50 -34 -161 -114 -185 330 -94 -83 -3 -79
4304 -79 28 -186 -77 115 -21 32 -132 -142 -18 310 312 -65 -26 87 180 -55 -21 -13 296 135 -36 123 76 -56
4328 -56 78 58 -144 -78 33 154 47 13 141 -22 -90 -110 -213 169 77 251 26 148 196 102 11 -11 -4 206
$$ packed form
4164A0k79J43L29j31l7n4L6jk28M62n16L60RJ5k12J28j3j94K10m78L98J86l71
4187b28O8K40o3j5o2J34j06j48K27K4n7R7L14l82k83J43J99J75j58j62PJ63l72
4210b45M00k24k4J28j6P2r7J05k87K5J62K3Mk43M64l06K20j01M6j90l5RJ37r5
4234f8j49K94j61J67N4j34O9J04k80K95l62J83j34J54O4o8J37R4k84L33l22J4
4256@J27k18J98l41L12qk12K16l84L51p4j36K14Q1l21N77k75j96nR6J7P0R5j55
4280B9j06J29o3J30k81J6N12p21J15K68j71oj96K28O7J6j27M7p1N15m24J1Q0p6
4304g9J07k14J09J92j36N3j64j0J24L28Kl77L9J13R3k35L4QL09j61j71J59m7j32
4328e6J34k0k02O6J11J21j07l4J28j63o8k0j03L82r2J74k25J22M8r4r1k2PK10
$$ plain form
4352 206 76 213 -270 109 -137 -136 134 -18 181 -190 114 289 3 116 145 260 -12 113 107 -166 -49 -68
4374 -68 25 -122 196 195 -174 128 -89 203 139 95 -155 136 69 79 -113 -235 365 243 35 -27 268 -69 -249
4397 -249 -109 131 -255 396 86 -233 -82 -138 29 -65 -311 -95 32 -166 92 63 -95 58 36 -126 231
4418 231 -177 -300 -32 43 -303 -247 183 -103 -206 -135 -49 -242 76 -202 -122 42 179 225 134 148 -338 59 -18
4441 -18 -416 289 71 110 87 -5 107 221 -112 -21 -210 -108 -181 37 84 28 -62 202 -162 126 21 121 -137
4464 -137 371 162 -57 145 -106 9 14 33 153 -219 -31 -136 -43 44 -16 303 177 158 -32 -212 177 425
4486 425 -1 -69 -33 31 117 65 202 85 68 194 177 77 132 19 -92 -117 66 358 126 541 124 -93 271
4509 271 23 88 142 -111 43 181 204 -93 376 139 -92 68 -144 180 105 -261 66 -98 -106 348 -43 89
$$ packed form
4352B06j30J37m83L79k46JK70j52J99l71L04J75k86J13K9J15k72J25ok73J17j9
4374f8R3j47L18jl69L02k17K92o4m4k50K91o7J0j92j22O00j22k08o2K95l37j80
4397b49J40K40l86O51l10l19J51n6J67r4k46K16J27j98K58k9j58J53k2j62L57
4418B31m08j23K68P5l46N6M30k86j03P1Q6j93L18k78Q0J64J37M6r1J4m86L97p7
4441a8l98P05k18L9k3r2J12J14l33R1j89J02p3K18M7n6r0K64l64K88j05J00k58
4464a37N08k09k19K02k51J15NJ9J20l72J88j05R3Q7o0L19j26j9j90j80L89K48
4486D25m26o8L6O4Q6n2J37j17j7J26j7j00N5j13j11k5J83K92k32M15m17k17L64
4509B71k48O5N4k53J54J38K3k97M69k37k31J60k12L24p5l66L27j64qM54l91J32
$$ plain form
4531 89 63 -332 -105 67 4 0 88 270 -364 -85 247 93 26 -142 174 -297 -9 240 35 -252 -49 -16 181
4554 181 244 -50 31 61 74 209 42 -225 -12 29 -154 111 -265 -103 -98 224 52 79 12 84 -7 116 -36 -43
4578 -43 -67 116 253 -104 31 -58 217 149 92 131 139 -90 245 72 222 296 237 -118 -165 -78 -284 329 -130 32
4602 32 163 104 -80 -48 24 -104 72 -69 94 142 -210 -56 15 -38 -245 135 33 -129 148 18 -159 46
4624 46 30 -70 32 122 51 47 36 -293 -95 209 196 129 238 -41 -63 161 14 -47 159 -83 -7 26 -70 -80 158
4649 158 123 78 -8 -262 42 -36 -66 208 -129 114 55 34 94 -70 224 252 53 228 1 51 -1 137 70 61 -181
4674 -181 -119 -10 105 -12 59 6 -182 228 -78 -103 161 193 38 260 -321 47 -11 -164 -130 -110 -83 -413 -117
4697 -117 -338 289 16 21 -14 -42 -74 -116 -103 -221 -94 -86 -174 -115 -65 -87 122 -123 -54 -67 250 90 -33 65 87 -157
$$ packed form
4531H9k6l95K27J72o3mQ8J82o34K79L32j54o7j68L16m71K88K49k05k87K03L3J97
4554A81O3k94Q1L0J3J35j67k67K13M1j83K65l76J62NL22j72K7o7P2r1J23j52p
4578d3k4J83J37l57J35q9K75o8n7L9Qk29L35j73J50P4n9l55m7Q7k06O13m59J62
4602C2J31n9j84L2P2j28J76j41J63M8l52J54P1n3k07L80j02j62K77j30j77K05
4624D6j6j00J02R0p1mj1l29J98L04j3o7J09k79k2K24j47o1K06k42P6L3r6j0K38
4649A58l5m5q6k54L04p8l0K74l37K43n9k1O0j64K94K8j99J75k27N0n2J38o7rk42
4674a81O2J09J15j17P1n3j88M10l06k5K64L2j55K22n81L68n8j53L4K0K7l30K96
4697a17k21O27k73Nl5k8l2m2J3j18J27Qq8N9N0k2K09k45O9j3L17j60j23R8K2k44
$$ plain form
4723 -157 -161 75 -150 110 -334 61 -18 -190 -15 -120 189 29 43 198 26 8 59 -44 -115 -150 51 -203 -107
4746 -107 -24 -74 116 -204 64 -70 135 140 -13 162 -52 20 -202 -41 178 -62 60 -12 -140 103 80 -29
4768 -29 289 -177 -51 -222 337 -317 -116 -48 44 262 -118 41 122 -226 30 70 -127 162 -159 240 26 266
4790 266 -146 -281 -55 211 78 -97 -312 -240 193 -131 132 -122 26 -300 8 -153 -50 186 65 5 -82
4811 -82 82 36 -166 -258 -45 -201 -127 72 -265 -124 -195 -41 40 -380 -1 -322 -31 193 -36 49 -237 -61
4833 -61 234 63 44 192 -102 -39 251 105 -39 79 -166 141 118 88 229 -102 103 -199 -55 -198 -43 40
4855 40 12 -68 62 318 65 171 197 -49 141 115 188 137 16 57 -219 78 -119 -82 300 155 116 -76 96
4878 96 132 131 49 70 -23 -75 82 146 348 148 9 119 -18 -40 130 -111 53 -304 -47 250 120 12 68 94
$$ packed form
4723a57mK36k25K60m44L95p9j72J75j05L09j60J4J55j72j8N1j03p1l5K01k54R6
4746a07Q3n0J90l20K68j34K05Nj53J75k14P2k22J61K19k40J22p2j28K43k3j09
4768b9L18m66J26j71N59o54K01O8R2K18l80J59Q1l48K56M0j97K89l21L99k14K40
4790B66m12j35K26K66j33j75k15P2M33l24K63k54J48l26L08j61J03K36j21o0q7
4811h2J64m6k02r2K13j56P4J99l37J41p1J54Q1m20L79l21K91K24k29Q5k86J76
4833f1K95j71j9J48k94O3K90j46j44J18k45L07k3l0J41l31K05l02J44j43J55Q3
4855D0k8q0J30K56k53J06K6k46J90k6P3n1j21M1k76K97j97L7L82j45l9j92J72
4878I6L6jq2K1r3n2J57O4K02k00j39J10j37k2J70k41J64l57K57K97j30j08N6K6
$$ plain form
4902 94 -275 116 198 -54 -46 252 98 -84 79 56 180 134 -62 54 71 168 20 61 -99 123 -63 -30 -7 185
4926 185 35 -27 -217 103 127 63 257 48 137 -175 -44 -177 233 53 -165 -108 -177 25 -103 -94 21 -22 218
4949 218 386 -22 -134 -53 287 -111 25 -92 104 16 17 72 -56 105 201 243 10 145 67 30 -177 190 -39
4972 -39 333 -88 103 -30 217 -120 215 207 77 1 86 -121 82 -116 283 104 67 193 228 -30 -243 104
4994 104 161 91 -15 -107 225 -46 178 -200 269 -25 253 -132 131 -112 254 164 171 -37 -28 44 -126 153 306
5017 306 -148 -115 -126 -122 24 4 -66 -296 19 -275 117 -192 -58 -4 196 -2 -114 151 32 -285 49 -68
5039 -68 197 51 -77 -238 -391 120 167 -74 -212 208 -171 33 -43 -72 -32 -27 214 -29 52 206 176 -59 8
5062 8 -134 -39 127 172 -85 172 -41 -9 204 -7 -30 -298 -70 15 168 126 -72 -56 -37 -15 83 181 -43 167
$$ packed form
4902I4l69L91Q2k52QK98j54j82J63k3J24m6j96J16J7R7j48M1j60K22j86L3K3J92
4926A85j50o2j90L20K4o4J94k09Q9l12J31j33M10j80k18N7o9K02j28RJ15m3K40
4949B18J68m08j12Q1L40l98J36j17J96q8JN5j28J61R6M2k33J35p8l7k07L67k29
4972c9L72m21J91j33K47l37L35qj30p6Q5k07K03j98L99j79l7J26L5k58k13L47
4994A04N7p0j06r2L32k71K24l78M69k94K78l85K63k43L66r0Pk08RP2j70K79J53
5017C06m54L3j1MJ46k0p0k30L15k94L92l09J34N4K00j98j12K65j19l17L34j17
5039f8K65j46j28j61j53N11M7k41j38M20l79K04p6k9M0NK41k43Q1J54l0k35O7
5062Hj42R5J66M5k57K57k13L2K13k11k3k68K28Q5J53m2j98J6J9K2R8R8k24K10
$$ plain form
5086 167 193 -58 0 -145 99 132 -129 45 -74 68 -14 33 -39 -109 -89 -186 -124 -183 171 75 380 -10 196 156
5110 156 -158 110 -169 -77 174 -56 -141 119 -112 0 -114 54 -107 176 32 157 0 140 -31 70 -157
5131 -157 118 271 -54 -23 -267 141 -151 -62 -83 -187 -174 35 61 -22 131 -81 151 246 -39 -89 290 348 209
5154 209 -149 -72 133 82 7 -77 -217 322 -67 -110 379 -29 257 169 78 -9 -211 -193 102 2 86 230 -99
5177 -99 81 -20 -169 87 -113 6 55 -121 20 -8 133 87 118 144 78 -265 -294 -174 210 210 -61 -170 -107 -233
5201 -233 -158 -79 -170 -357 302 33 -134 -198 -115 -120 -125 117 -291 167 -208 151 109 42 175 -25 169 392 -154 16
5225 16 -81 39 17 44 178 -107 112 -142 -33 -105 -238 88 -75 10 -113 -254 -53 212 217 313 -1 -91 -179 61
5249 61 288 144 -96 -88 -12 6 289 95 201 -95 128 -38 -182 107 11 151 109 -8 181 -185 -32 2 55
$$ packed form
5086A67K6k51N8j45K44L3k61J74j19J42q2M7p2p0K0r7O2n9L54r6L05l90K06m0
5110A56l14K68k79R2K51k30q5K60k31J12j14J68j61K83j44J25j57J40j71J01k27
5131a57K75J53l25L1k44M08k92Q9k1j04J3K09K6q3J53k12K32R5k85n0L79N8j39
5154B09l58P7K05n1p5q4j40N39l89m3M89m08K86q8r1q7k02J8K95j00Q4J44l29
5177i9J80j01j49K56k00J19M9j76J41k8J41m6L1K6o6l43k9J20L84%k71j09O3j26
5201b33P5P9r1j87O59k69j67o4Q3nnK42m08M58l75L59m2o7J33k00J94K23n46J70
5225A6r7J20k2K7J34k85K19k54J09p2j33L26j63Q5j23j41K01K65NR6l14r0q8K40
5249F1K27j44k40QP6J8K83j94J06k96K23j66j44K89r6J40m2j17J89l66J53L4N3
$$ plain form
5272 55 212 168 -167 34 -81 -92 284 -135 -411 -60 -34 -164 -23 -137 -72 -375 416 61 92 -250 -44 -274
5294 -274 -63 -70 -22 330 -128 -162 26 161 186 195 3 -81 -50 31 266 12 161 -22 129 -193 49 -229 -131 -37
5318 -37 -48 415 228 -247 -121 220 -155 -152 -109 117 -179 -85 -101 17 -62 83 -34 -49 -12 -55 93 -10 37 -120
5342 -120 -182 -6 -53 96 -281 -6 -58 -83 383 279 -131 242 -462 -55 -192 -237 -157 69 -191 7 54 -63
5364 -63 82 -52 -142 -41 31 -63 -127 -196 -113 15 29 71 -184 33 -116 290 136 140 -10 168 34 192 -47 -64
5388 -64 117 -79 -67 -187 181 -73 -4 293 -31 86 -91 -81 -58 -112 -117 -114 -41 -174 -104 -14 257 17 122 -196
5412 -196 56 463 -76 -24 98 -247 12 25 -48 37 -82 -18 -86 51 87 19 200 46 123 -182 -1 -5 131 -169
5436 -169 87 -56 -220 -5 203 5 86 -185 -172 284 -265 -39 -376 3 -247 -47 -145 -380 -1 -135 -371
$$ packed form
5272E5J57m4l35K01j15j1L76m19k76L51K6j30J41j14O5l03P91l55L1l42K06k30
5294b74K11pM8L52m58l4J88J35K5Rj92q4L1Q1K35k54J49j83J51l22K42k78R8R4
5318c7j1M63j87m75J26L41l75LM3K26k96R4j6J18p9J45j17j5L7m3J48j03M7j57
5342a20o2J76m7J49l77K75n2k5M66j04m10L73p04M07j37m5Q0K26k60J98M7j17
5364f3J45j34r0J01P2r4o4o9Q3J28J4M2k55K17j49M06j54Mj50J78j34J58k39j7
5388f4J81j96J2j20L68k54O9K97l24J17j77J0K3n4nLP3j33P0R0K71k40J05l18
5412a96K52M07n39N2J22l45K59J3p3Q5j19O4o8J37L6o8J81j54P7l05J81mJ36l00
5436a69K56j43j64K15K08j98Q1k71J3M56n49K26l37L79k50K00r8k35L79j34k36
$$ plain form
5457 -371 -12 265 397 -206 -45 -28 81 144 -82 -152 -92 87 89 -105 299 -143 -33 13 120 155 122 -22 -120
5480 -120 20 292 118 -17 174 -57 35 25 -136 304 -116 37 -12 -174 -90 -233 275 -21 174 44 -30 41
5502 41 -15 -34 114 229 -23 -68 130 27 104 5 -364 7 -80 -167 142 109 14 -50 119 310 211 30 -187 22
5526 22 278 -215 -8 60 -159 -53 75 -157 131 -152 -93 -304 101 -242 -267 -158 -50 -40 319 -187 50 171
5548 171 -110 26 8 243 -127 -75 -9 -75 -10 -478 73 48 -21 80 -4 -204 -198 -34 220 -22 44 129 -11 -183
5572 -183 -36 205 -89 -126 -25 53 1 -122 -249 -222 -47 147 274 -254 -21 132 -100 58 -61 90 -44
5593 -44 -108 -38 -42 -147 -154 222 -135 65 242 -110 -289 -47 143 -67 89 31 -36 -240 19 -65 -62 -138 -136 104 135
5618 135 -106 -56 -325 -292 210 -71 215 -24 -22 25 -74 -124 64 24 -68 -182 8 134 1 -59 4 -136 71 205
$$ packed form
5457c71L59K77J32o03J61J7J09O3k26p0O0J79Kj94M04m42J10M6J07L5l3j44r8
5480a20J40K72j74j35J91k31R2j0j61M40m20J53m9j62Q4j43N08k96J95j30p4P1
5502D1n6j9J48J15k52m5J98j03P7r9l69L71q7q7L09l3r5o4J69J91r9j81k17K09
5526B2K56m93K07O8k19J06J28k32K88k83N9k11M05l43k5J09J08J0L59n06K37J21
5548A71k81J36j8K35l70N2O6o6O5m68N51k5o9J01q4k00OJ64K54k42O6Q5j40j72
5572a83J47K41k94l7J01P8n2j23j27K7J75J94J27n28K33J53k32J58j19J51j34
5593d4o4P0mj05pL76l57K00J77l52j79K42J90k10J56n8o7k04K59q4Lp6KK40L1
5618A35k41N0k69L3N02k81K86k39KM7r9n0J88m0r2j14J90J26j33o0O3j40K07J34
$$ plain form
5642 205 -51 -150 137 109 118 78 270 70 -134 -200 50 365 80 -134 63 110 -234 -121 138 286 -101 204
5664 204 -248 -73 123 248 -283 38 28 -242 0 146 343 -113 -78 -58 115 254 216 -161 327 36 -228
5685 -228 69 -257 -132 -113 -38 -364 58 -229 -9 120 73 82 -15 14 101 -50 138 54 -261 215 44 27 -63 100
5709 100 22 -50 -139 -60 -144 -93 161 -157 114 6 -286 -54 179 -281 -319 33 -126 101 234 116 -28 -82 -164
5732 -164 -96 68 -8 97 217 -133 -405 166 120 -94 -70 -55 124 -294 57 167 77 -46 243 -304 -75 14
5754 14 10 46 -98 180 -184 -85 -198 120 48 -151 79 167 -60 149 42 215 -36 -114 -30 -87 49 -16 238 22
5778 22 326 -114 44 -119 -239 212 -299 54 120 -41 -174 31 -62 -163 377 23 35 -65 -301 -154 -215 -62
5800 -62 135 272 -60 10 130 -143 -162 30 -55 -28 165 2 -217 -39 56 114 14 184 -8 -146 -336 35
$$ packed form
5642B05k56r9K87k8Rm0J92k00k04o6K50L15k85k14J97M7l44J13K59J48l87L05
5664B04m52J75J96J25n31L21j0k70K42J46J97m56L5K0J73J39l8l77M88k91k64
5685b28K97l26J25J9P5l26M22k87K20J29m7Rr7K9Q7j51J88q4l15M76j71j7r0J63
5709A00p8p2q9P9q4N1K54l18K71j08k92K32K33m60l8L52j59K27J33j18j44n4q2
5732a64O8J64p6J05J20l50k72N71m6k14K4J5J79m18L51J10r0j23K89n47K29Q9
5754A4mL6j44K78l64R9j13L18p2j99K30Q8k27K09j07J73k51p8Q4n7J36o5K54k16
5778B2L04m40J58j63j20M51n11L53O6j61j33K05r3j01N40l54J2j00k36J47o1J53
5800f2J97J37l32P0J20k73j9J92q5K7J93j63k19J78R5N8j00J70j92j38j90L71
$$ plain form
5822 35 -18 -71 33 -73 -87 -239 -147 -165 -211 -118 508 164 -63 -177 -234 45 -236 -4 242 -159 -25 23 4 -69
5846 -69 68 252 -142 35 4 115 136 111 201 -36 -414 -56 186 299 -73 -9 -8 -193 -138 -357 -127 -203 -267 -155
5870 -155 107 61 223 51 178 69 -254 -123 -163 -236 -58 -215 -8 127 -69 344 150 11 -154 7 51
5891 51 -41 -61 182 2 -96 88 200 225 160 185 -4 104 -52 -89 51 101 19 209 145 24 -251 -66 -155 -88
5915 -88 246 21 -51 -281 311 -22 -47 -167 -112 -20 205 315 64 -47 7 3 -109 108 128 101 154 -20 -136 -45
5939 -45 -24 -6 191 141 -99 -58 38 -236 149 -1 41 23 -95 -80 -36 4 105 -95 -18 28 -217 -31 142 26
5963 26 -185 -41 259 -124 -142 144 142 37 -52 -60 -28 -63 -5 18 -142 -187 201 80 -90 78 75 -60 278 -39 -184
5988 -184 -104 -47 9 64 -206 240 -102 13 259 19 -51 41 -140 123 -103 33 -9 -229 -138 -12 90 -93 225
$$ packed form
5822C5n3n3J04j06j4j52R2j8m6R3O26l44k27j14n7K79k81K32K46m01J34M8j9p3
5846f9J37J84l94J77l1J11K1k5R0k37l78L58K42J13l72O4Jj85N5k19K30p6o4J12
5870a55K62m6J62j72J27j09l23J31m0p3J78j57K07J35j96M13j94j39j65J61M4
5891E1r2k0K43j80r8J84J12K5o5K5j89J08j56l7J40N0q2J90o4j21k75J85q9O7
5915h8L34k25p2k30N92l33k5j20N5R2K25J10k51j11N4mj12K17K0k7N3j74j16R1
5939d5K1J8J97n0k40M1R6k74L85j50M2j8j18J5M4M0J01k00P7M6k45J86J73j16
5963B6k11J44L00l83j8K86kj05q9qL2l5N8K3j60m5L88j21j70J68lj35L38l17j45
5988a84Q0N7N6N5k70M46l42J15K46k40p0R2j81K63k26J36m2k20R1J26J02j83L18
$$ plain form
6011 225 -48 51 -35 -2 -204 -37 140 75 85 98 161 148 -262 -103 -97 -5 -96 82 144 202 93 20 348 7 87
6036 87 16 104 23 14 -77 159 11 -8 -20 139 69 12 3 -28 -29 132 -75 -109 -136 -25 -77 -140 145 -54 -97 -93 7 -160
6064 -160 -3 -82 -108 59 44 559 26 34 -77 276 70 -33 -28 -270 -193 -56 -42 -66 -235 7 152 -180 164
6087 164 -68 226 25 -103 -97 -56 -44 180 -46 -1 46 72 271 -123 60 -31 -70 144 -218 182 -119 -107 -161 32
6111 32 -44 31 288 -42 89 146 81 63 -82 0 33 2 139 -328 -94 318 -70 -13 -27 120 90 204 86 43
6135 43 -43 -16 81 96 6 11 91 50 214 184 -117 22 -48 -104 -68 -129 8 37 -200 -83 108 -196 -6 -146 245
6160 245 13 -28 74 -10 -257 242 -344 -162 -78 -228 117 -54 153 116 80 -247 -20 -15 143 -43 -88 22 80
6183 80 169 -81 -5 -117 15 232 201 -156 -37 -4 140 159 168 -138 -144 -152 -127 -54 119 -78 -155 166 155 61 -1 -186
$$ packed form
6011B25k73R9q6L3k02J67J77o5J0J3O3j3m10J59OR2r1J78O2N8j09p3L28l41Q0
6036H7p1Q8q1rr1K36j48j9j2J59p0n7rl1jJ61k07l4k7J11n2o3K85j99m3MJ00j67
6064a60J57p9k6J67j5N15n33Qj11L53k06j03Nk42P7J37J4k4j69K42J45l32L44
6087A64k32K94k01j28OM1J2K24k26M5M7K6J99l94J83r1l9K14l62M00l01J2n4J93
6111C2p6P5K57l30J31N7o5j8j45Q2L3l1J37m67K34M12l88N7j4J47l0J14j18m3
6135D3q6K7R7J5r0NQ0m1J64l0l01J39p0n6L6o1J37K9k37J17J91l04J90j40L91
6160B45k32m1J02q4k47M99n86J82Q4j50L45j71K07l7l6l27K27NJ58j86m5J10N8
6183H0Q9k50P6j12J32K17l1l57J19L3J44J9Rl06oqK5P3J73j97p7L21j1r4o2j85
$$ plain form
6209 -186 -85 130 122 -69 -43 -53 -131 -95 -102 -11 -128 -6 112 -178 -38 208 -100 166 317 -80 42 132 -104
6232 -104 54 -151 32 -20 56 389 203 -20 140 -24 120 -372 -78 -163 -104 24 143 -45 -196 -300 161
6253 161 97 -124 184 200 -52 -219 -31 345 148 30 -124 87 -39 213 118 42 415 -14 -135 41 328
6274 328 88 -19 186 45 12 39 -46 104 -47 44 -76 -60 63 -138 90 -44 103 74 -281 -326 300 2
6296 2 7 -52 76 60 -83 219 465 80 186 29 275 119 -85 -112 -52 32 165 223 108 -183 -54 -63 46 301
6320 301 462 -115 -35 -281 -179 356 -296 148 217 -59 -21 -229 469 -1 18 69 -346 -51 -241 -149 -72 138
6342 138 350 -210 -14 213 36 -14 -66 222 240 33 204 -22 252 -162 -5 170 199 30 -55 -202 -195 31
6364 31 -39 148 -95 71 67 -59 -291 -45 34 -130 -52 43 -5 101 199 -252 129 417 195 100 -332 78 -309
$$ packed form
6209a86J01K15qj91K6j0p8L6pR1j17J22J18k90J40K46l08K66J51l97J22R0k36
6232a04J58k05J83n2P6L33j86k23J60j64J44m92K94q5N9J28J19j88j51j04M61
6253A61o4k21L08J6k52j67J88L76j97j18j54K11j26K52r5p6L73m29j21J76K87
6274C28k40j07K05j41l3K7q5J50j51R1j20J6J23k01K28j34J47k9l55m5O26k98
6296BNn9J28j6j43L02K46l85J06j57K46j56k04k7O0Q4J33N8j15k91J29rJ09K55
6320C01J61n77Q0k46J02N35o52M44O9k76L8k08O98m70J9N1m15K95j90R2P7K10
6342A38K12n60J96K27j77n0n2K88J8k07J71k26K74m14J57J75K9j69q5j47PK26
6364C1p0J87k43J66mj26k32K46P9j64P8R5m8J06R8m51L81K88k22r5m32M10l87
$$ plain form
6387 -309 -15 -60 239 82 101 27 -283 65 -15 -28 73 223 138 -192 29 -13 -225 -179 4 -33 -293 -130 -243
6410 -243 125 103 122 -6 -358 32 -178 168 73 91 78 25 48 110 56 440 40 143 105 7 -37 196 -206 -95
6434 -95 147 -40 98 290 20 -167 209 -64 115 120 -200 106 -48 -1 -99 11 110 -92 129 -131 -11 -9 231
6457 231 -336 -135 121 -86 352 -60 -153 184 -326 100 -325 -166 85 -46 -19 53 84 42 59 84 137 -196 366
6480 366 70 176 71 -77 -96 10 -109 65 115 -66 168 -220 357 103 -203 -32 99 43 180 133 -76
6501 -76 -283 -112 -137 102 48 -177 -70 -246 24 31 -56 190 120 -47 -83 -13 -97 263 -131 6 -121 -62 -20 -81
6525 -81 -99 -71 43 248 43 -173 163 108 347 -117 48 60 169 69 322 -46 -58 80 206 -53 -94 -19 -45
6548 -45 -23 -101 70 -261 278 7 -213 -98 -96 97 -340 -294 133 78 8 -413 289 359 73 52 -176 -227 -17 189
$$ packed form
6387c09K94m5K99j57J9p4l10L48q0j3J01J50q5l30K21m2k12M6J83l7k60J63j13
6410b43L68k2J9j28l52L90k10L46r5J8j3n3K3O2n4L84m00J03l8r8m4K33m02J11
6434i5K42j87J38J92k70j87L76k73J79Nl20L06j54M7r8J10R9k02K21k60J20KK40
6457B31n67K01K56k07M38m12r3L37n10M26m25J59K51j31K7P2L1m2J7K5N3l33N62
6480C66k96J06j05j48j9J06j19J74N0j81K34l88N77k54l06J71J31n6J37m7k09
6501g6k07J71k5K39n4k25J07j76K70Pq7K46p0j67l6P0q4L60l94J37j27N9M2o1
6525h1j8K8J14K05k05k16L36n5K39m64J65J2J09j00K53l68j2J38J26k59m1P5k6
6548d5K2p8J71l31N39k71k20J15KJ93m37M6M27n5p0m21P02P0k86k1k28n1K10K06
$$ plain form
6572 189 64 -16 -58 -97 -205 -91 -318 -85 -145 -170 -38 -148 166 195 -239 157 -111 -171 -121 203 153 179 257 -116
6596 -116 -202 20 -319 -152 192 45 -126 114 186 -99 131 76 -36 86 119 -144 -39 -159 174 220 125 24
6618 24 226 130 86 169 -98 36 10 -159 -146 26 100 -80 7 137 -102 25 304 -284 300 -40 -68 132 -55
6641 -55 -247 9 334 236 -49 189 122 -3 174 -197 -136 124 231 -10 -307 -149 70 80 -244 31 46 5
6663 5 10 101 188 -293 -151 6 -165 38 5 -96 -250 -97 -93 240 165 75 193 -7 -44 187 100 -122 -43 85 80
6688 80 172 -42 160 -165 -88 -130 126 -35 -15 -322 -133 56 113 223 -136 187 11 -305 116 207 -158 27
6710 27 13 -52 -192 -477 78 275 221 111 -98 -101 -222 61 -153 -160 123 114 35 -321 109 -48 -168 182 -166 -153
6734 -153 -9 212 -124 -322 214 45 -288 -93 0 15 89 -90 -111 -96 -8 -93 -63 -156 111 113 -61 -123 -73 154
$$ packed form
6572A89j25q0m2l9j08J14k27K33o0k5J32j10L14K9m34L96k68o0N0L24n0K6P8l73
6596a16q6K22l39J67L44j47j71K40P2k85K30n5j12J22L3k63J05j20L33M6r5j01
6618B4K02r6m4Q3k67J34k6j69J3J72P4j80Q7J30k39J27K79n88N84l40k8K00j87
6641e5j92K56L25r8k85K38o7j25J77l71O1K60J07k41k97J58K19J0l24K75J5m1
6663ENR1Q7m81J42J57j71K03l3j01j54J53ML33p5r0J18k00l7K31q7k22P9J28n
6688H0R2k14K02l25P7m2K56j61K0l07J89J89N7J10l59L23j76l16M21R1l65J85
6710B7j4o5j40k85N55J97n4j10k09lj21K83k14pK83rp9l56M30j57j20L50l48J3
6734a53J44K21l36j98N36j69l33J95R3J5P4j79k1J5Q8q5L0r3K67Kj74o2N0K27
$$ plain form
6758 154 -190 104 -82 -198 215 -16 195 16 -85 -95 120 79 270 207 45 -147 227 24 -31 -47 -70 -33
6780 -33 26 -117 -78 26 13 114 -86 9 -51 -328 -84 325 -178 164 -52 154 274 118 -157 -66 353 73
6802 73 -31 -40 194 -10 -53 245 -95 -224 -200 93 150 80 184 231 208 -184 -39 5 -29 129 80 127 -10 162
6826 162 147 41 156 3 -135 -151 -60 -17 -230 -76 48 -231 22 -149 55 -11 132 -103 162 -87 87 -57
6848 -57 151 -59 108 114 -150 97 22 40 -201 -275 25 -109 -120 40 -263 27 -29 -206 62 -83 94 131 -125
6871 -125 64 55 -161 326 -107 -117 3 6 174 181 -56 -497 -11 -38 -84 -8 116 76 4 13 -65 -75 -130 188 -345 -63
6897 -63 9 -58 -120 115 -105 -53 -87 -32 -320 -290 98 68 -106 -444 -81 -9 83 258 92 -27 129 212 35 37 118
6922 118 11 -42 -131 -281 333 -100 157 -214 38 1 59 -80 88 -21 61 -20 -145 34 -39 -36 -34 283 95 -358
$$ packed form
6758A54l44K94j86j16M13k31K11j79j01j0K15m1J91o3j62j92L74k03n5j6k3L7
6780c3N9j43L9J04j3J01k00R5o0k77K44M09n03L42k16K06J20j56k75R1M19k80
6802G3j04rK34k04m3K98l40j29K4K93N7p0J04M7k3l92J45M4l4J58m9M7j37J72
6826A62j5j06J15j53j38j6R1M3k13J54J24k79K53j71K04o6J43k35K65k49J74j44
6848e7K08k10J67Ok64K47p5J8k41p4L00j34j1J60l03K90n6j77K68j45J77L7k56
6871a25J89rk16M87m33j0J20LJ68Pk37m41M86k7m6P6J24m0p2Rp8j0n5L18n33K82
6897f3P2o7o2K35k20N2l4N5k88L0L88l0j74l38L63P2R2J75j66j19J56Q3j77KQ1
6922A18j07n3q9j50O14m33K57l71K52l7N8j39J68j09Q2q1j25J79p3LKL17j88m53
$$ plain form
6946 -358 -170 -215 -169 28 79 217 -93 -28 -188 -12 11 -237 -128 -82 188 135 22 74 -345 16 31 34 64 -216
6970 -216 20 -79 -300 216 -2 268 64 -9 -240 312 -171 24 -44 -34 -44 23 129 211 159 352 228 -482 -129
6993 -129 -135 -147 217 60 9 31 179 -9 -289 -355 257 -52 16 -18 -103 -77 160 262 -8 -61 33 45 -164 -71 -141
7018 -141 -191 44 167 -334 -136 92 129 87 -4 199 52 318 -231 -22 -355 232 -50 95 -129 -34 126 285
7040 285 165 338 13 -128 158 247 -66 131 -86 -300 -340 109 17 -157 88 121 116 -80 32 -57 -237 198
7062 198 -27 149 168 -32 44 -148 -173 112 -18 111 85 127 230 7 168 75 146 210 -201 3 42 -77 42
7085 42 133 -109 136 -52 -159 -46 -242 106 81 -6 -180 -69 -152 -50 -121 42 175 -196 138 45 75 72 2 75
7109 75 -134 123 268 -183 155 13 -112 12 -379 -115 416 98 102 92 14 26 -230 181 12 97 -69 -21 26
$$ packed form
6946c58J88m5M6J97N1J38l10O5j60J76K3k48J09M6K70n3j13N2m19L61J5LL0k80
6970b16K36r9k21N16k18K70k04p3k31N52m83J95o8J0j0O7J06Q2n2J93j24p10L53
6993a29oj2L64j57n1K2J48j88k80o6O12l09O8l4q5K6K37J02k70n3R4J2k09R3p0
7018a41n0K35J23n01J98K28L7m2r1K03j47K66n49K09l33N87k82J45k24R5J60J59
7040B85j20J73l25j41K86Q9l13J97k17k14m0M49r2j74K45L3nj96J12q9j80M35
7062A98k25J76J9k00P6j92k5K85j30J29k6M2J03k23J61r3P1O4m11K04L9j19J19
7085D2R1k42K45j88j07J13j96L48k5q7j74J11q3J02p1J63J33l71L34r3L0lp0P3
7109G5k09K57J45m51L38j42j25J24l91K64N31l18Mj0p8J2k56M11j69Q5j66M8M7
$$ plain form
7132 26 289 144 -119 -235 17 144 -28 117 -58 -32 29 -162 62 -21 23 137 18 -105 -120 71 20 96 26
7155 26 238 -114 -105 -200 -5 112 -102 -175 99 56 8 -385 74 -63 98 68 281 -1 -69 44 -171 143 257
7178 257 -220 -246 115 209 -126 -137 -203 -24 110 -174 228 -130 75 -197 175 220 114 -13 61 -78 -173 148
7200 148 -71 151 -36 15 19 -177 53 -46 -200 3 139 -1 -13 -55 133 -121 -91 49 77 27 77 229 -29
7223 -29 -66 -73 -12 164 -8 -169 229 -35 -32 319 81 -205 -52 -14 69 -337 182 100 -21 -136 32 -17 -26 -261
7247 -261 48 180 3 -1 -133 -198 78 247 -189 51 156 -26 14 150 -118 -169 -262 -103 -104 21 167 -244 -114
7270 -114 -58 -30 74 -11 168 -100 191 110 46 -76 184 -53 76 -120 -173 -267 63 194 -58 -173 -172 -144 63
7293 63 -84 -33 31 -14 78 47 -36 -36 -2 133 24 62 -30 -263 -113 -23 -60 75 90 -207 30 73 48 114 -1 36
$$ packed form
7132B6K63j45k63j16K52J27j72J45j75K6O1j91K24q3M4J14j19j23j5J91n1P6p0
7155B6K12l52Rr5J95J17k14p3K74m3m8l93M59j37J61l0K13k82o8J13k15L14J14
7178B57m77k6L61R4l35j1o6J79J34k84M02l58K05k72L72M5j06j27P4j39r5L21
7200A48k19K22j87N1Mj96K30r9j54K03J36j40j2m2J88k54L0J40K8n0N0J52k58
7223b9l7pO1J76j72j61L98k64LL51k38k86J53L8Q3m06N19q2j21j15J68m9rk35
7247b61L09J32j77mj32o5K76J69m36K40J05j82M0J36k68n1r3J59jJ25J46m11J30
7270a14N6K8J04q5J79k68K91q1o4j22K60k37J29j96n3r4L30J31k52j15JK8K07
7293F3j47N1O4m5R2l1q3%L4J35j09L8r2k33J50R0l7J35J5k97K37M3k5O6j15L7
$$ plain form
7319 36 -11 -53 -87 16 -99 124 218 79 128 -108 83 147 -64 127 -61 111 158 138 -52 -7 52 22 134 92
7343 92 235 -111 149 -45 -71 -34 151 -139 -1 57 205 -338 -157 -172 157 -47 -255 117 13 0 -34 18 68
7366 68 30 161 -54 -54 165 293 108 159 -9 2 -122 -205 -217 -30 66 158 -36 -86 150 29 -38 101 79 243
7390 243 206 45 -2 -55 -57 -146 46 89 73 -195 -81 -195 124 424 -12 -66 -68 -127 1 139 81 -87 -42 196 -24
7415 -24 357 244 -34 36 57 31 -103 -219 -245 -95 373 -214 48 312 44 -15 -62 106 -291 23 -239 -193 -28
7438 -28 191 180 -224 -30 -215 135 -31 219 6 -32 -246 205 218 -61 -145 -64 -193 8 140 -35 -131 -88 263
7461 263 -41 -169 -330 -9 -19 -52 -180 45 -102 269 -80 96 47 -114 -99 44 31 230 62 200 -136 -166
7483 -166 -115 -296 24 -363 93 2 -2 -50 139 -131 -56 -5 118 -39 339 13 -334 99 -26 -162 15 368
$$ packed form
7319C6m7m2l4J03j15K23R4j39M9k36J91O4k11J91j88J72M7k0j90M5N9l0J12m2
7343I2J43l46K60j94k6L7J85k90J38N8J48n43J81j5L29k04k08L72j04j3l4N2N0
7366F8l8J31k15%K19J28j85N1j68J1j24q3j2J87R6R2j94n0K36j21o7J39k2J64
7390B43l7j61m7n3kq9J92M3j6k68J14j14L19L00m36n4kn9J28J38n8j68M5K38k20
7415b4L81j13k78P0K1k6j34j16k6J50M68n87K62K64k68n9m7J68l97L14k62M6J65
7438b8K19j1m04J94j85L50j66K50k13l8k14M51J3k79q4Q1j29K01J32j75r6M3L51
7461B63l04j28j61L21j0l3j28K25j47L71l49J76m9j61J5J43j3J99j68J38l36l0
7483a66N1j81L20l87M56r1mm8J89k70P5N1J23j57L78l26l47M33j25j36J77L53
$$ plain form
7505 368 173 -94 -91 9 -104 185 49 -360 -104 4 -149 136 -108 141 53 189 54 -194 -59 -69 -24 67
7527 67 186 -210 -4 -30 -302 -279 -185 -57 -104 -10 -159 83 -193 105 -13 -244 5 256 26 -195 -156 -87 -20
7550 -20 -39 -2 -134 -20 63 -181 -17 -68 79 53 -85 8 -209 -74 120 82 120 -157 185 -220 -20 268 11
7573 11 -191 192 20 4 -320 -244 137 -11 -143 168 204 -74 240 -134 143 132 14 -230 -19 -33 56 -365
7595 -365 -178 110 -77 -161 -133 157 -230 2 71 3 -104 421 -15 12 -63 242 -100 0 -58 -241 -73 -178
7617 -178 69 -163 127 -23 -18 -160 -243 166 145 -89 32 -156 -110 115 109 -385 -66 397 30 134 222 9 -52
7640 -52 173 -70 -98 321 -200 -48 97 -164 88 -87 -203 222 38 -77 -55 -63 51 0 -294 -38 -368 -249
7662 -249 -17 -261 -84 65 -148 23 116 -431 -87 368 -167 -163 219 179 -1 262 -99 -70 74 350 299 -94
$$ packed form
7505C68j95k67LJ00j13K89j36m09K56J08j53K85k44K49q8J36j35k48J35j0M5R1
7527F7J19l96K06k6k72K3R4J28m7R4j49K42k76K98j18k31K49K51k30k21L9O9O7
7550b0j9L7j32J14Q3k44J64n1J47k6j38R3k17J35J94l8L8k77L42m05K00K88k57
7573A1k02L83j72j6l24P6L81j48j32L11L6k78L14l74K77j1j18k44K11j4Q9m21
7595c65J87K88j87q4K8K90l87K32O9o8j07N25m36K7p5L05l42J00n8j83J68j05
7617a78K47k32K90j50Nj42q3M09k1k34J21j88M6K25om94L19M63l67J04Q8k13o1
7640e2K25k43k8M19n21J52J45k61K52j75j16M25j84j15K2qJ14n1k94K56l30J19
7662b49K32k44J77J49k13J71R3n47L44M55n35ML82m0j80K63l61K9J44K76n1l93
$$ plain form
7684 -94 132 -57 -38 -71 116 -70 -275 92 38 -39 39 -144 19 -168 -24 -61 17 110 36 -300 -63 230 172 188
7708 188 148 -112 -245 -346 -169 254 131 -162 -2 -144 146 89 -23 -342 74 -184 54 134 -142 150 95
7729 95 167 -37 -53 3 -55 -347 -137 187 297 -64 -91 28 -92 82 -29 -51 -39 -271 268 -310 -23 -74 124
7752 124 -8 -383 96 89 -58 154 153 -227 3 -195 -71 127 -63 89 36 -54 80 44 -1 -22 -31 62 6 -97
7776 -97 -122 -187 -5 17 -40 64 -206 -45 194 -61 -169 -92 -6 -90 -64 -77 -199 105 331 -78 -180 129 -4
7799 -4 -157 -96 -233 30 215 11 -66 -30 -50 -148 -215 92 -72 -285 -171 -16 -30 179 230 23 210 -41 111
7822 111 218 208 264 -7 108 -209 1 -105 -310 -130 78 -114 57 -105 -144 -34 -173 -144 -196 -102 7 200
7844 200 128 -62 38 -167 97 -97 59 -89 -259 -77 -17 187 -84 189 -142 3 89 163 264 -1 259
$$ packed form
7684i4K26j89J9l3J87j86k05L67n4p7P8j83J63j87J44l7P8R3p4l36K37K93n8J6
7708A88m0k60j33j01J77M23j23k93J60j42K90n7j12l19M16k58K38Q0k76K92n5
7729I5P2k04j6N6n8k92K10L24J10l61k7J19j20J74j11k2J2k32N39n78K87n1J98
7752A24j32l75M79pj47K12jl80K30j98J24J98j90J52n3r0J34l6m5k1rR3n6j03
7776i7k5o5J82K2n7J04k70J61K39k55j08P7Q6q4K6j3j22L04K26m09j02L09j33
7799dj53O1j37K63J85k04p7L6k0r8o7L07j64k13J14J55j4K09N1k07J87k51J52
7822A11J07j0N6k71J15l17K10j06k05J80K08j92J71j62l9J10j39K9n2R4J09J93
7844B00p2j90J00k05K64j94J56j48j70J82O0K04k71K73l31J45Q6P4J01k65K60
$$ plain form
7865 259 -210 65 32 187 340 149 -75 88 -99 -146 408 216 109 -48 70 -8 -211 116 163 -27 -83 160
7887 160 -104 -56 64 241 172 52 -91 136 -92 30 -36 248 -107 -59 -20 -4 83 -89 -108 -303 -100 252 174
7910 174 -183 -177 186 -261 38 263 -224 -246 118 -105 -128 1 49 101 12 18 112 130 -58 29 42 -346 325 60
7934 60 52 -220 -133 156 -137 202 91 59 -116 -13 18 22 395 -156 85 72 126 7 -105 29 27 328 -312 294
7958 294 231 27 -251 30 -34 233 -95 -172 150 -27 132 233 159 -63 116 -214 33 51 -19 -17 -201 -44 329
7981 329 -384 -121 -142 -136 -76 5 100 79 213 8 125 261 -48 -46 -147 439 21 77 -111 181 80 119 -84 -59
8005 -59 4 -179 -188 206 167 23 -168 -167 57 307 117 48 -3 227 -74 114 185 219 -128 297 342 145 -8 80
8029 80 -35 -138 147 110 -112 209 -118 164 65 -166 -40 -34 -65 70 -37 -77 82 -73 103 208 -329 366
$$ packed form
7865B59m69K75l3J55J53j91k24J63j87m7N54j92j07j57J18p8k03L27M7j90n6K43
7887A60k64M8J20J77o9j20j43K27k28J22o6K84l55M8L9J6Q7j72j9j95K03L52p8
7910A74l57OL63m47K99K25m87k2L64k23k3J29M8N2q9OR4J8j88Q7J3l88O71k65
7934F0qk72Q7K89k93L39j11l2j75J03L1ML73n51K41j3N4j19j12J34kL01o40O06
7958B94o3k04k78K81o4K67l28p7L22j77J59J01p4k22J79l30K47J8p0Kj84J57L73
7981C29p13K63k1OO0Q1R5k1J34k05J17J36l09Kj01N86m18N6j88K92j01L9k03K5
8005e9O3j83rL94l9j44j91JK24K50j90o9n1K30l01J88P1L4l47M25M5j97j53Q8
8029H0j15j03K85l7k22L21l27K82r9k31J26Ol1J35j07m0J59j55J76J05n37O95
$$ plain form
8051 366 -110 -131 229 -30 164 83 28 -163 -56 -121 -61 -157 48 -55 -64 -92 241 -16 -3 103 -295 5 122
8074 122 224 65 98 102 105 0 264 -126 -109 -22 7 -14 -179 220 49 -74 352 336 -176 -24 120 46 -146 97
8098 97 36 54 -124 -2 141 72 -249 -3 -223 8 -364 -77 179 49 -94 -22 -142 211 -52 53 -344 138
8120 138 125 180 -15 196 -165 -236 -78 96 -193 -128 -72 -113 265 -49 226 -185 47 -9 -3 -205 -232 -58 142
8143 142 -216 -45 169 119 -236 318 51 153 -115 -51 -84 -60 115 21 110 -48 -147 -108 -343 34 23 -170 -294
8166 -294 -234 -309 -42 117 -198 184 306 50 120 83 67 116 46 -66 -127 13 -16 19 71 134 205 -41 -131 -230 57
$$ packed form
8051C66m76k1L60k59J94q1n5j91J07o5O0r6K05j03rk8L33k57J3J06l98L00J17
8074A22J02j59L3MLj05K64l90J7Q7K9k1j65L99j71j23M26j6n12J52J44p4j92K43
8098I7o1J8j78J22J43o9l21K46k20K31l72K87K56j30j43P2j20L53k63J05l97M82
8120A38j3N5j95K11l61p1J58J74k89O5N6m1L78l14K75m11K32n6Ok02k7J74K00
8143A42l58J71K14n0l55N54k67J02k68O4l3K4J75r4Q9j58r9L9k35L77j1j93j24
8166b94O0p5K67J59l15L82J22k56P0l7j6M9p0j12o1J40k9L5N2O3P1k46r0r9K87
8191E7
$$ Imaginary data points
##PAGE= N=2
##DATA TABLE= (X++(I..I)), XYDATA
$$ plain form
0 0 0 0 0 0 0 0 0 0 0 0 8 -8 8 -8 11 -16 16 -20 24 -28 32 -40 44 -51 59 -68 76 -88 100 -112 124 -141 157
33 157 -178 197 -221 245 -273 302 -335 371 -412 456 -504 558 -620 688 -766 857 -962 1088
51 1088 -1237 1419 -1652 1958 -2377 2995 -3992 5893 -10817 51727 104652 27097 8278 25843
65 25843 55362 43074 24318 14437 30919 46112 50384 40271 37302 33480 24618 9095 7019
78 7019 19923 33718 24789 8787 12403 32347 34899 14185 -7458 -9340 3948 16394 14586
91 14586 6646 6247 12048 13881 11452 6156 -1605 -6592 -3902 3754 12907 17171 11811 2920 4308
106 4308 11224 10752 2084 -4640 -1809 9050 17384 15396 11157 12766 9856 3400 3780 9655 9455 4026
122 4026 3842 10233 19579 22748 13910 318 -2110 8696 16732 10146 -991 1334 16306 22961
$$ packed form
0@%%%%%%%%%%Qj6J6j6J9k7L2l6M4n2O0p2Q4r5J10j27J44j64J88k12K36k65K98
33A57l35L75m18M66n18N75o37P06p83Q68r60J062j178J308j454J623j819K050
51A088k325K656l071L610m335N372o987R885j6710O2544N2925p7555j8819J7565
65B5843K9519j2288j8756r881J6482J5193M272j0113k969l822q862j5523k076
78G019J2904J3795q929j6002L616J9944K552k0714k1643j882J3288J2446j808
91A4586p940l99N801J833k429n296p761m987K690P656R153M264n360q891J388
106D308O916m72q668o724K831J0859Q334j988m239J609k910o456L80N875k00n429
122D026j84O391R346L169q838j3592k428J0806Q036o586j1137K325J4972O655
$$ plain form
136 22961 12846 3231 3913 6018 4362 2791 3786 6711 9657 7748 2710 3973 9480 6592 -4892
151 -4892 -11076 -3685 7832 10491 457 -7623 -1586 7080 3830 -6162 -10079 -7293 -2492 2015 2023
166 2023 261 700 136 -2063 -2715 -547 -32 -1639 -2769 505 6910 11118 6865 352 741 4738
182 4738 6349 4736 4800 5364 7926 10593 11755 11484 9058 4536 3107 7256 11224 9916 7638 6921
198 6921 8472 12170 12966 6328 558 3389 8356 7651 5037 5069 7158 8066 5550 2315 3005 4916 2128
215 2128 -1251 542 5400 7095 4966 498 -1883 2516 6440 2374 -4517 -4005 2843 6714 3834
230 3834 -757 -1163 2648 3571 -930 -2343 -601 710 1217 1396 1494 2666 4108 1257 -2999 -2376 2502
247 2502 2864 -122 -1783 88 4269 5695 1364 -2491 -1551 371 768 918 1284 242 1140 2842 2557
$$ packed form
136B2961j0115r615O82K105j656j571R95K925K946j909n038J263N507k888j1484
151d892o184P391J1517K659j0034q080O037Q666l250r992l917K786M801M507Q
166B023j762M39n64k199o52K168N15j607j130L274O405M208m253o513L89L997
182D738J611j613O4N64K562K667J162k71k426m522j429M149L968j308k278p17
198F921J551L698P96o638n770K831M967p05k614L2K089R08k516l235O90J911k788
215B128l379J793M858J695k129m468k381M399L924m066o891N12O848L871k880
230C834m591m06L811R23m501j413J742J311N07J79R8J172J442k851m256O23M878
247B502L62k986j661J871M181J426m331l855R40J922L97J50L66j042Q98J702k85
$$ plain form
264 2557 1014 365 -1250 -2182 -289 1728 2390 1123 617 342 1271 1355 -1093 -2274 -885 -707 -553 1379
282 1379 2837 1446 -809 -1936 -859 251 528 -2219 -2742 534 3194 2971 678 -1703 -1959 1238
298 1238 1671 -950 -1910 1485 3272 2068 1299 1725 2042 1846 197 -774 1380 3815 3438 1627 1501
315 1501 3019 4593 3806 351 -734 2120 5246 3543 1675 2082 3949 4694 3471 1163 1368 2538
331 2538 2935 2503 2784 3318 3184 3483 2533 1562 1983 3449 1988 647 1324 3224 3172 2392 1257 1068 1834
350 1834 2029 1387 1065 888 648 1240 2814 1688 108 -126 381 606 651 661 -637 -770 551 1228 104
369 104 -493 -879 -790 -106 -816 -1556 -399 -26 -1511 -1862 -1080 -49 -973 -2074 -2801 -2360 -288 -78 -1795
388 -1795 -3027 -2198 -1127 -684 -1908 -3035 -2456 -636 -1148 -2537 -2305 -1030 -1177 -2024 -2080 -2083 -1107 -585 -1461
$$ packed form
264B557j543o49j615r32J893K017O62j267n06k75R29Q4k448j181J389J78J54J932
282A379J458j391k255j127J077J110K77k747n23L276K660k23k293k381k56L197
298A238M33k621r60L395J787j204p69M26L17j96j649r71K154K435l77j811j26
315A501J518J574p87l455j085K854L126j703j868M07J867P45j223k308K05J170
331B538L97m32K81N34j34K99r50r71M21J466j461j341O77J900n2p80j135j89P66
350A834J95o42l22j77k40N92J574j126j580k34N07K25M5J0j298j33J321O77j124
369A04n97l86Q9O84p10p40J157L73j485l51P82J031r24j101p27M41K072K10j717
388a795j232Q29J071M43j224j127N79J820n12j389K32J275j47q47n6lR76N22q76
$$ plain form
407 -1461 -2324 -1422 -37 -327 -1760 -2102 -1479 167 515 -1236 -1570 -295 122 -188 -437 -381 -145 585 800
426 800 -44 234 682 485 666 824 519 916 1420 1273 426 1352 1624 1257 1026 939 1350 1317 1557 1775 1303
447 1303 1294 1330 1535 1863 1463 996 1340 1988 1863 1356 1181 1080 1519 2140 1979 812 1420 1965 1967 1421 1315
468 1315 1550 1734 1999 864 933 1729 2053 932 1159 1308 1565 1493 1361 547 315 1551 1926 984 274 880
488 880 1184 997 827 -184 328 967 236 -438 -113 148 -218 -114 -400 -452 -249 -156 -898 -1239 -928 -955 -738
509 -738 -961 -1311 -1320 -1007 -1101 -1559 -1396 -1224 -1850 -1682 -1419 -1274 -1578 -1611 -1699 -2040 -1654 -1870 -2266 -1604 -1673 -1804
531 -1804 -1971 -1632 -1844 -1827 -1424 -1622 -1924 -1088 -1127 -1406 -1536 -1046 -1112 -790 -1001 -1382 -1108 -487 -508 -815 -492
552 -492 -102 -447 -136 -202 -599 -55 372 192 -152 342 801 317 219 542 65 640 665 304 607 623 911 519
$$ packed form
407a461q63R02J385k90j433l42O23J646L48j751l34J275M17l10k49N6K36P30K15
426H00q44K78M48j97J81J58l05L97N04j47q47R26K72l67k31q7M11l3K40K18m72
447A303rL6K05L28m00m67L44O48j25n07j75j01M39O21j61j167O08N45Kn46j06
468A315K35J84K65j135O9P96L24j121K27J49K57p2j32q14k32J236L75r42p10O06
488H80L04j87j70j011N12O39p31o74L25K61l66J04k86n2K03R3p42l41L11k7K17
509g38k23l50rL13r4m58J63J72o26J68K63J45l04l3q8l41L86k16l96O62o9j31
531a804j67L39k12J7M03j98l02Q36l9k79j30M90o6L22k11l81K74O21k1l07L23
552d92L90l45L11o6l97N44M27j80l44M94M59m84r8L23m77N75K5l61L03J6K88l92
$$ plain form
574 519 711 496 451 926 1014 390 723 1144 1221 833 628 675 810 1234 946 787 655 789 456 523 685 717
596 717 724 918 255 225 1015 660 522 452 492 479 558 511 466 41 333 69 271 281 247 -143 143 182 -293 -243 -24
621 -24 -283 -246 -107 -476 -498 -527 -638 -733 -579 -898 -980 -808 -1033 -1026 -1280 -549 -758 -1298 -1201 -1168 -1282 -1318 -1391 -1224
645 -1224 -1400 -1346 -1462 -1578 -1699 -1941 -1558 -1630 -1992 -2046 -1346 -1397 -1619 -1796 -1216 -1893 -1431 -1463 -1416 -1592 -1492 -1226
667 -1226 -1488 -1169 -1374 -1182 -830 -1018 -1103 -748 -527 -657 -744 -462 -579 -584 -509 -419 -335 -382 44 -97 96 156 77
690 77 193 226 198 94 364 407 471 705 976 832 840 708 644 864 709 979 1130 618 1076 1013 1489 939 892 775
714 775 1000 868 1186 1286 1063 1020 1207 1031 916 1095 879 1152 1209 1150 975 802 1070 1043 590 731 802 588
736 588 770 562 646 548 527 548 406 738 526 -195 168 354 -68 237 -110 -187 -62 -53 -361 -662 -271 -268 -505
$$ packed form
574E19J92k15m5M75Q8o24L33M21P7l88k05M7J35M24k88j59j32J34l33O7J62L2
596G17PJ94o63l0P90l55j38p0M0j3P9m7m5m25K92k64K02J0l4l90K86L9m75N0K19
621b4k59L7J39l69k2k9j11r5J54l19q2J72k25Pk54P31k09n40R7L3j14l6p3J67
645a224j76N4j16j16j21k42L83p2l62n4P00n1k22j77N80o77M62l2M7j76J00K66
667a226k62L19k05J92L52j88q5L55K21j30q7K82j17nP5R0Q4m7M26j41J93O0p9
690G7J16L3k8j04K70M3O4K34K71j44Qj32o4K20j55K70J51n12M58o3M76n50m7j17
714G75K25j32L18J00k23m3J87j76j15J79k16K73N7n9j75j73K68k7m53J41P1k14
736E88J82k08Q4r8k1K1j42L32k12p21L63J86m22L05l47p7J25Rl08l01L91Lk37
$$ plain form
759 -505 -401 -307 -521 -410 -434 -654 -571 -710 -730 -604 -651 -923 -935 -1093 -927 -964 -1237 -955 -1355 -883 -1078 -1173 -1062
782 -1062 -889 -1134 -1114 -766 -1094 -1145 -1054 -1033 -1194 -917 -825 -670 -926 -876 -1059 -653 -816 -855 -607 -851 -430 -642
804 -642 -676 -459 -47 -459 -408 -773 -9 54 -47 -145 -241 99 170 102 -231 -60 269 522 12 179 608 548 506
827 506 440 773 497 693 680 946 588 644 913 1029 759 996 570 1033 839 981 1121 989 1163 888 1105
848 1105 587 963 798 890 935 1067 709 973 808 879 1022 708 1136 776 578 928 813 725 563 287 267 300
870 300 254 576 431 383 226 196 27 -48 -17 53 -5 -186 -21 -302 -85 72 -162 -325 19 -381 -483 -555 -264
893 -264 -567 -379 -771 -703 -781 -920 -800 -714 -683 -679 -714 -617 -714 -694 -840 -708 -914 -695 -893 -816 -1008 -958 -1073 -924
917 -924 -726 -869 -774 -660 -678 -819 -1025 -608 -928 -656 -748 -661 -645 -598 -380 -632 -494 -227 -505 -680 -226 -236 67
$$ packed form
759e05J04R4k14J11k4k20Q3j39k0J26m7k72j2j58J66l7k73K82m00M72j95r5J11
782a062J73k45K0L48l28n1R1K1j61K77R2J55k56N0j83M06j63l9K48k44M21k12
804f42l4K17M12m12N1l65P64O3j01r8r6L40P1o8l33J71L29K53n10J67M29o0m2
827E06o6L33k76J96j3K66l58N6K69J16k70K37m26M63j94J42J40j32J74k75K17
848A105n18L76j65R2M5J32l58K64j65P1J43l14M28l60j98L50j15q8j62k76k0L3
870C00m6L22j45m8j57l0j69p5L1P0n8j81J65k81K17J57k34j63L44m00j02p2K91
893b64l03J88l92O8p8j39J20Q6L1Ml5R7r7K0j46J32k06K19j98P7j92N0j15J49
917i24J98j43R5J14j8j41k06M17l20K72r2Q7J6M7K18k52J38K67k78j75M54j0L03
$$ plain form
940 67 -377 -219 -185 -62 -259 -49 37 -119 128 211 327 562 -9 595 478 412 309 479 600 527 371 276 683
963 683 628 680 736 638 692 836 835 630 1272 613 758 998 855 863 769 699 1055 975 762 518 569 655 713 670 593 747
989 747 792 693 634 617 605 663 364 499 653 420 600 130 330 194 256 143 110 116 115 312 112 131 22 64 -425
1014 -425 -46 -54 -362 -202 -488 -397 -193 -419 -444 -558 -489 -562 -595 -532 -727 -729 -445 -379 -427 -671 -994 -784 -731 -954
1038 -954 -702 -605 -1030 -490 -853 -771 -465 -582 -711 -901 -694 -756 -767 -579 -688 -315 -433 -995 -767 -521 -602 -277
1060 -277 -475 -339 -865 -439 -556 -321 -226 -145 -160 -436 0 -55 -110 -94 -83 171 297 -50 269 327 503 214 343
1083 343 407 508 533 581 544 188 460 394 651 289 572 502 319 958 702 613 709 828 432 668 596 517 725
1106 725 788 655 736 718 773 664 714 852 750 720 473 664 504 497 400 387 476 498 564 666 579 349 426 506 94
$$ packed form
940F7m44J58L4J23j97K10Q6j56K47Q3J16K35n71O04j17o6j03J70J21p3j56r5M07
963F83n5N2N6r8N4J44jk05O42o59J45K40j43Qr4p0L56q0k13k44N1Q6N8m3p7J54
989G47M5r9n9j7j2N8k99J35J54k33J80m70K00j36O2j13l3OjJ97k00J9j09M2m89
1014d25L79ql08J60k86R1K04k26k5j14O9p3l3O3j95kK84O6m8k44l23K10N3k23
1038i54K52R7m25N40l63Q2L06j17j29j90K07o2j1J88j09L73j18n62K28K46q1L25
1060b77j98J36n26M26j17K35R5Q1j5k76M36n5n5J6J1K54J26l47L19N8J76k89J29
1083C43O4J01K5M8l7l56K72o6K57l62K83p0j83O39k56q9R6J19l96K36p2p9K08
1106G25O3j33Q1j8N5j09N0J38j02l0k47J91j60pr7j3Q9K2O6J02q7k30P7Q0m12
$$ plain form
1131 94 124 320 256 125 236 -16 55 21 -10 133 -92 -80 -252 -98 -227 -509 -257 -293 -71 -283 -332 -515 -461
1154 -461 -508 -794 -649 -759 -499 -522 -739 -630 -747 -543 -650 -611 -623 -716 -790 -654 -831 -415 -713 -762 -510 -658
1176 -658 -515 -720 -321 -846 -775 -440 -887 -494 -471 -337 -449 -452 -650 -533 -357 -563 -497 -363 -150 -527 -77 -278
1198 -278 -237 -84 41 -541 -118 35 -50 154 22 -107 340 -47 286 41 199 158 174 221 303 226 284 411 601
1221 601 265 346 537 276 631 432 475 752 600 400 349 591 607 746 580 367 691 754 679 818 528 528 827
1244 827 798 615 233 366 393 517 281 324 642 644 579 535 388 -18 334 388 368 291 203 379 129 155 48 88
1268 88 286 -120 -128 -9 82 -93 -156 -270 -232 -230 -318 -233 -360 -169 -196 -294 -346 -349 -641 -583 -456 -647 -492 -489 -551 -433
1294 -433 -479 -495 -301 -815 -387 -362 -675 -487 -484 -470 -492 -718 -908 -501 -451 -580 -608 -377 -280 -351 -19 -422 -326 -314
$$ packed form
1131I4L0J96o4j31J11k52P1l4l1J43k25J2j72J54j29k82K52l6K22k12m9j83N4
1154d61m7k86J45j10K60k3k17J09j17K04j07L9j2r3p4J36j77M16k98m9K52j48
1176f58J43k05L99n25P1L35m47L93K3J34j12lj98J17J76k06O6J34K13l77M50k01
1198b78M1J53J25n82M23J53q5K04j32j29M47l87L33k45J58m1J6M7Q2p7N8J27J90
1221F01l36Q1J91k61L55j99M3K77j52k00n1K42J6J39j66k13L24O3p5J39k90%K99
1244H27k9j83l82J33K7J24k36M3L18Ko5m4j47m06L52N4k0p7q8J76k50K6j07M0
1268H8J98m06qJ19R1j75o3j14L8Kq8Q5j27J91k7r8n2lk92N8J27j91J55Lo2J18
1294d33m6j6J94n14M28K5l13J88LJ4k2k26j90M07N0j29k8K31R7p1L32m03R6J2
$$ plain form
1318 -314 -142 -170 -487 -604 -407 -162 -73 -240 -11 175 143 -13 -132 -75 26 -28 -114 10 18 127 83 319 479
1341 479 244 149 146 348 528 449 319 596 509 504 492 468 271 461 611 641 586 266 325 639 330 627 745 367
1365 367 773 640 412 562 617 726 426 395 389 318 375 541 790 217 707 212 462 138 525 203 152 156 -74
1388 -74 201 522 114 199 187 -52 111 147 58 26 36 -72 175 -145 -179 -213 -279 43 -171 20 -528 -8 -241
1411 -241 -188 -331 -426 -402 -298 -339 -312 -398 -545 -644 -442 -647 -583 -605 -563 -542 -248 -369 -551 -620 -695 -394 -745 -391
1435 -391 -342 -732 -462 -205 -292 -462 -135 -399 -429 -522 -534 -217 -349 -282 -151 -348 -388 -204 -310 -184 -183 -335 -68
1458 -68 38 -222 155 -189 114 160 231 328 66 76 16 196 329 248 123 263 217 88 297 761 348 351 458
1481 458 455 490 544 181 398 391 579 502 347 719 327 735 351 614 413 350 485 367 444 731 386 684 673
$$ packed form
1318c14J72k8l17j17J97K45Q9j67K29J86l2j56j19N7J01n4q6J24QJ09m4K36J60
1341D79k35r5lK02J80p9j30K77q7nj2k4j97J90J50L0n5l20N9L14l09K97J18l78
1365C67M06j33k28J50N5J09l00l1op1N7J66K49n73M90m95K50l24L87l22n1Mk30
1388g4K75L21m08Q5j2k39J63L6q9l2J0j08K47l20l4l4o6L22k14J91n48N20k33
1411b41N3j43r5K4J04m1K7q6j47r9K02k05O4k2M2K1K94j21j82o9p5L01l51L54
1435c91M9l90K70K57q7j70L27k64l0r3j2L17j32O7J31j97m0J84j06J26Jj52K67
1458f8J06k60L77l44L03M6P1R7k62J0o0J80J33q1j25J40m6j29K09M64m13LJ07
1481D58lL5N4l63K17pJ88p7j55L72l92M08l84K63k01o3J35j18P7K87l45K98j1
$$ plain form
1504 673 310 509 492 590 499 447 18 240 378 463 154 287 293 -18 361 194 -51 47 220 200 46 -157 74
1527 74 1 213 208 98 -229 0 -311 87 -305 -404 -369 -185 -103 -315 -378 -179 -103 -567 -708 -429 -261 -343 -179
1550 -179 -350 -126 2 -422 -542 -126 -672 -389 -524 -569 -433 -289 -549 -586 -486 -594 -335 -523 -399 -609 -302
1571 -302 -407 -467 -173 -251 -282 -318 -322 -341 -176 -415 -106 -334 -189 -179 -185 -81 -57 -186 -108 4 118 72 119 46 -33
1596 -33 151 139 -143 202 138 156 214 91 176 85 101 378 415 338 183 400 219 609 434 -34 432 338 495 669
1620 669 562 472 550 464 562 601 616 676 263 408 539 318 346 372 558 28 658 419 510 307 232 -24 263 239
1644 239 284 262 177 280 450 -166 -207 -275 89 103 409 201 -23 251 25 -62 -14 -165 -115 -364 -322 -215 -479
1667 -479 -174 157 73 -272 -478 -145 -335 -584 -384 -366 -550 -406 -467 -492 23 -220 -399 -507 -513 -479 -481 -582 -390
$$ packed form
1504F73l63J99j7R8r1n2m29K22J38Q5l09J33Ol11L79j67k45R8J73k0j54k03K31
1527G4p3K12nj10l27K29l11L98l92r9L5J84Q2k12o3J99P6m64j41K79J68q2J64
1550a79j71K24J28m24j20M16n46K83j35m5J36J44k60l7J00j08K59j88J24k10L07
1571c02j05o0K94p8l1l6mj9J65k39L09k28J45J0oJ04K4j29P8J12J14m6M7p3p9
1596c3J84j2k82L45o4J8N8j23Q5r1J6K77L7p7j55K17j81L90j75m68M66r4J57J74
1620F69j07r0P8q6R8L9J5O0m13J45J31k21K8K6J86n30O30k39R1k03p5k56K87k4
1644B39M5k2q5J03J70o16m1o8L64J4L06k08k24K74k26q7M8j51N0k49M2J07k64
1667d79L05L31q4l45k06L33j90k49K00J8j84J44o1k5N15k43j79j08oL4kj01J92
$$ plain form
1690 -390 -426 -614 -171 -254 -390 -553 -520 -455 -359 -283 -117 -290 -290 -560 -94 -348 -145 20 -162 -363 -83 -9 -229
1713 -229 -107 -149 -259 -343 99 98 -34 -126 -85 -141 272 88 34 71 79 202 -15 170 473 -50 126 445 -28 420
1737 420 534 243 526 307 359 336 568 491 135 453 198 634 250 301 549 250 158 390 473 392 412 199 409
1760 409 296 236 411 417 216 145 438 228 109 359 442 215 180 467 194 57 67 77 280 9 146 82 -219
1783 -219 138 -181 209 -8 -54 89 -152 -285 -204 -235 -182 15 -186 -359 -92 -504 -367 -185 -318 -246 -321 -173
1805 -173 -201 -238 -557 -194 58 -529 -306 -471 -428 -184 -198 -707 -393 -336 -439 -463 -181 -278 -396 -5 -398 -593
1827 -593 -410 -504 -243 -118 -57 -208 -331 106 -332 -85 -23 -104 45 -200 -253 -15 -159 -38 118 -251 119 -109
1849 -109 -116 166 143 -84 -15 59 288 139 -131 68 -177 242 191 207 294 277 165 268 281 344 188 92 122 171 350
$$ packed form
1690c90l6j88M43q3j36j63L3O5R6P6J66j73%k70M66k54K03J65j82k01K80P4k20
1713b29J22m2j10q4M42jj32r2M1n6M13j84n4L7QJ23k17J85L03n23J76L19m73M48
1737D20J14k91K83k19N2k3K32p7l56L18k55M36l84N1K48k99r2K32Q3q1K0k13K10
1760D09j13o0J75Ok01p1K93k10j19K50Q3k27l5K87k73j37J0J0K03k71J37o4l01
1783b19L57l19L90k17m6J43k41j33Q1l1N3J97k01j73K67m12J37J82j33P2p5J48
1805a73k8l7l19L63K52n87K23j65M3K44j4n09L14N7j03k4K82r7j18L91l93j95
1827e93J83r4K61J25O1j51j23M37m38K47O2q1J49k45n3K38j44J21J56l69L70k28
1849a09pK82k3k27O9P4K29j49k70J99k45M19n1J6Q7j7j12J03J3O3j56r6L0M9J79
$$ plain form
1874 350 432 248 367 375 130 506 309 296 412 292 198 165 430 149 276 221 226 149 311 536 318 401 228 18
1898 18 291 81 507 172 319 289 18 281 -132 31 19 112 -114 -226 143 -2 -292 208 -48 -180 -131 -146
1920 -146 -98 -299 -404 -95 -287 -201 -343 -417 -181 -190 -156 -293 -452 -462 -375 -416 -38 -431 -22 -395 -402 -317 -542 -327
1944 -327 -613 -447 -116 -81 -247 -323 -337 -505 -171 -275 -605 -196 1 -95 -137 -20 -376 -327 -369 -171 -186 -99 -152
1967 -152 -205 -17 -101 -243 -46 -62 -197 -34 -11 239 169 67 -230 -20 9 184 206 80 278 162 194 388 425
1990 425 249 125 362 7 351 56 117 285 -259 388 387 296 326 171 235 -66 433 439 689 355 255 547 282
2013 282 123 344 187 326 270 66 214 451 230 306 172 124 154 630 97 40 267 122 675 245 108 -239
2035 -239 220 5 186 353 78 -15 184 146 -197 -194 52 204 10 -30 -136 -4 -313 105 -306 -444 -349 -5
$$ packed form
1874C50Q2j84J19Qk45L76j97j3J16j20r4l3K65k81J27n5Np7J62K25k18Q3j73k10
1898A8K73k10M26l35J47l0k71K63m13J63j2R3k26j12L69j45k90N00k56j32M9j5
1920a46M8k01j05L09j92Q6j42p4K36rL4j37j59j0Q7m1L78l93M09l73pQ5k25K15
1944c27k86J66L31L5j66p6j4j68L34j04l30M09J97r6m2J17l56M9m2J98j5Q7n3
1967a52n3J88q4j42J97j6j35J63K3K50p0j02k97K10K9J75K2j26J98j16L2J94L7
1990D25j76j24K37l55L44k95O1J68n44O47jr1L0j55O4l01M99OK50l34j00K92k65
2013B82j59K21j57J39n6k04J48K37k21P6j34m8L0M76n33n7K27j45N53m30j37l47
2035b39M59k15J81J67k75r3J99l8l43LK46J52j94m0j06J32l09M18m11j38R5L44
$$ plain form
2057 -5 -467 -446 -89 -202 -273 -285 -372 -237 -244 -179 -434 -179 -425 -180 150 -343 -418 -325 54 -545 -377 -135 -255 -272
2081 -272 -274 -12 -2 -216 -376 -155 73 -14 -138 -228 -406 -154 47 -148 -265 -113 -53 -103 -274 -125 42 151
2103 151 -380 -234 -308 -20 8 375 86 -144 85 62 217 35 69 174 -45 163 162 107 410 -181 210 291 5
2126 5 25 105 297 491 425 223 235 314 289 412 394 65 421 616 436 389 285 413 268 277 251 264 192 413 194
2151 194 359 131 350 541 59 433 469 470 94 345 43 0 121 -118 301 251 365 193 76 187 239 47
2173 47 91 -192 -269 26 -328 -17 -93 51 69 -328 -231 -164 -260 3 -152 -286 -84 -188 -165 -228 -497 -510 -155 -129
2197 -129 -177 -472 -217 -440 -390 -97 -322 -330 -72 -302 -231 -169 -113 -64 -246 -243 -278 -94 -39 -347 -173 -204 -148 -169 -314
2222 -314 -215 -241 59 -101 -202 51 -115 -111 -317 -241 10 218 -79 222 128 420 -6 106 -163 66 99 54 -109
$$ packed form
2057em62K1L57j13p1j2q7J35pO5k55K55k46K45L30m93p5R3L79n99J68K42j20j7
2081b72kK62J0k14j60K21K28q7j24r0j78K52K01j95j17J52O0n0j71J49J67J09
2103A51n31J46p4K88K8L67k89k30K29k3J55j82L4J05k19K08jn5L03n91L91Q1k86
2126EK0Q0J92J94o6k02J2P9k5J23j8l29L56J95j80m7j04J28j45Rk6J3p2K21k19
2151A94J65k28K19J91m82L74L6Jl76K51l02m3J21k39M19n0J14j72j17J11N2j92
2173D7M4k83p7K95l54L11p6J44J8l97R7O7r6K63j55j34K02j04K3o3k69j3L55K6
2197a29m8k95K55k23N0K93k25qK58k30P1O2N6M9j82Ll5J84N5l08J74l1N6k1j45
2222c14R9k6L00j60j01K53j66Mk06P6K51K08k97L01r4K92m26J12k69K29L3m5j63
$$ plain form
2245 -109 -205 528 111 281 136 161 114 264 303 131 406 205 149 428 426 378 166 302 275 115 343 225 371
2268 371 171 -33 188 114 176 476 269 484 117 434 259 420 400 123 134 121 342 -137 117 405 226 -8
2290 -8 114 165 30 122 129 -101 -260 177 -220 -144 24 42 -50 -202 -80 -132 60 32 -327 -39 -7 -4 48 -164 -303
2315 -303 -350 -41 -216 -75 -544 -73 -257 -22 -158 -228 -126 -309 -481 -462 -450 -363 -359 -322 -334 -305 -250 -248 -136 -402
2339 -402 -352 -349 -238 21 21 -45 -141 -491 -264 -150 178 -107 -90 -110 -195 -47 -16 188 58 20 -425 64 -18 -98 87
2364 87 132 131 149 198 231 -97 65 213 -129 -47 173 -117 208 35 82 192 -23 239 398 210 -63 247 12
2387 12 281 109 348 476 302 509 387 97 196 170 115 400 162 233 181 255 170 156 264 104 172 -21 34 210
2411 210 396 72 -155 469 387 -12 -217 383 179 175 -151 -250 187 -98 278 159 68 252 80 -74 -260 120
$$ packed form
2245a09r6P33m17J70j45K5m7J50L9j72K75k01n6K79km8k12J36k7j60K28j18J46
2268C71k00k04K21p4O2L00k07K15l67L17j75J61k0k77J1j3K21m79K54K88j79k34
2290hJ22N1j35R2Pk30j59M37l97P6J68J8r2j52J22n2J92k8l59K88L2LN2k12j39
2315c03m7L09j75J41m69M71j84K35j36p0J02j83j72J9J2Q7ML7j2K9N5KJ12k66
2339d02N0LJ11K59%o6r6l50K27J14L28k85J7k0q5J48L1K04j30l8m45M89q2q0J85
2364H7M5jJ8M9L3l28J62J48l42Q2K20k90L25j73M7J10k15K62J59j88k73L10k35
2387A2K69j72K39J28j74K07j22k90R9k6n5K85k38P1n2P4q5j4J08j60O8j93N5J76
2411B10J86l24k27O24q2l99k05O00k04ml26r9M37k85L76j19r1J84j72j54j86L80
$$ plain form
2433 120 3 -60 -17 64 -336 -140 -158 -185 -279 -268 -145 -224 -221 -210 149 -347 18 -266 -148 -356 -424 -260 -339 -484
2457 -484 -401 -507 -173 25 -79 -425 -202 -61 -102 -342 -357 190 -257 -147 -434 -376 -166 -371 -70 -277 -81
2478 -81 101 -63 187 -73 -143 -45 -170 -19 130 82 127 -157 42 -33 85 -117 33 44 -19 -11 -209 236 -87
2501 -87 170 41 130 -42 72 -130 205 10 93 18 177 364 135 300 281 322 -87 351 123 323 -19 289
2523 289 372 26 366 -37 88 188 -65 248 86 125 38 191 255 -49 117 20 -26 197 175 135 135 384 25
2546 25 142 153 92 267 -124 81 102 50 -189 302 402 220 -212 -80 104 6 -84 -103 -216 -114 136 -306 -233
2569 -233 -96 -194 78 221 91 -342 -112 -73 -56 -153 -113 -196 -79 -341 88 -93 88 -181 -441 -175 -290 -23
2591 -23 -440 -167 -240 -220 -264 -347 -147 -156 -135 -87 9 12 -175 92 42 -269 -262 -102 124 -256 -313 110 -65 120 -243
$$ packed form
2433A20j17o3M3Q1m00J96j8k7r4J1J23p9LJ1L59m96L65k84J18k08o8J64p9j45
2457d84Q3j06L34J98j04l46K23J41m1k40j5N47m47J10k87N8K10k05L01k07J96
2478h1J82j64K50k60p0R8j25J51J49m8M5k84J99p5J18k02J50J1o3Qj98M45l23
2501h7K57j29Q9j72J14k02L35j95Q3p5J59J87k29J65j9M1m09M38k28K00l42L08
2523B89Q3l46L40m03J25J00k53L13j62L9q7J53O4l04J66r7m6K23k2m0%K49l59
2546B5J17J1o1J75l91K05K1n2k39M91J00j82m32J32J84r8r0j9j13J02K50m42P3
2569b33J37r8K72J43j30m33K30L9J7r7M0q3J17k62M29j81J81k69k60K66j15K67
2591b3m17K73p3K0m4q3K00rK1M8R6Lj87K67n0l11PJ60K26l80n7M23j75J85l63
$$ plain form
2616 -243 -194 329 -52 -38 83 -155 29 -51 14 -203 237 -46 -77 -14 -131 229 99 149 262 162 184 218 -83
2639 -83 140 246 -51 147 280 36 74 255 57 90 177 118 290 -19 17 63 -24 362 158 -155 -12 76 146
2662 146 351 137 98 637 211 350 238 -67 22 -102 37 -34 87 355 -88 -123 172 206 -2 -6 -261 41
2684 41 -136 24 -152 -112 -122 143 -216 -85 -42 147 107 98 -50 -107 -120 69 11 66 -150 92 163 19 78 -46
2708 -46 -22 -78 -212 -255 -245 -80 -58 -199 -206 -76 -231 -323 -584 -362 7 96 3 -140 -201 -134 -37 -138 -320 -130 -236
2733 -236 -103 -185 11 11 -80 -41 -95 -55 159 -213 -310 -312 -152 43 -136 -106 -152 -30 365 79 -7 -61 -438 -40 123
2758 123 87 138 64 164 -136 301 -109 -82 138 229 253 144 85 169 -13 38 395 390 -38 443 307 205 335 322
2782 322 303 61 220 159 -67 89 335 144 103 310 238 488 40 82 341 122 66 88 251 68 14 121 -233
$$ packed form
2616b43M9N23l81J4J21k38J84q0O5k17M40k83l1O3j17L60j30N0J13j00K2L4l01
2639h3K23J06k97J98J33k44L8J81j98L3Q7n9J72l09L6M6q7L86k04l13J43Q8P0
2662A46K05k14l9N39m26J39j12l05Q9j24J39p1J21K68m43l5K95L4k08mk55L02
2684D1j77J60j76M0j0K65l59J31M3J89m0rj48n7j3J89n8N5k16K42P1j44N9j24
2708d6K4n6j34m3J0J65K2j41pJ30j55r2k61K22L69Q9r3j43o1O7R7j01j82J90j06
2733b36J33q2J96%r1L9n4M0K14l72r7kJ60J95j79L0m6J22L95k86q6n4l77L98J63
2758A23l6N1p4J00l00M37m10K7K20R1K4j09n9Q4j82N1L57nm28M81j36j02J30j3
2782C22j9k42J59o1k26J56K46j91m1K07p2K50m48M2K59k19n6K2J63j83n4J07l54
$$ plain form
2805 -233 -53 242 116 242 2 301 49 285 63 -142 69 -128 82 -153 343 -122 18 -15 28 -216 -91
2826 -91 0 -42 -245 117 111 -76 198 155 -144 -91 -14 -182 -166 -34 55 47 -22 -395 -90 -36 -53 -132 177 325 -165
2851 -165 -190 -256 -251 -233 -161 -369 -99 193 -274 -236 -27 -38 216 -131 245 -179 -187 20 64 -220 -191 15 -48 216
2875 216 124 -150 -121 106 -439 254 -443 -267 -290 -232 214 -19 -188 273 -45 25 208 46 18 -118 -275 34
2897 34 106 -12 390 356 149 91 36 68 -46 344 175 -97 234 273 455 189 288 243 42 60 62 6 139 86 404
2922 404 154 10 -1 -13 177 -44 90 370 242 235 115 -106 158 -77 -18 -434 -253 238 -48 -32 347 127
2944 127 -210 77 114 116 152 -53 -156 237 -123 -251 -14 11 -154 -413 -32 -44 -9 34 5 -120 -136 -33 -49 -148
2968 -148 250 -129 105 96 -155 -273 -118 -322 18 242 -157 -44 -255 -260 -282 -137 -80 28 -152 -148 -114 118 -204
$$ packed form
2805b33J80K95j26J26k40K99k52K36k22k05K11j97K10k35M96m65J40l3M3k44J25
2826i1R1m2k03L62oj87K74m3k99N3P7j68J6J32Q9qo9l73L05N4j7p9L09J48m90
2851a65k5o6NJ8P2k08K70K92m67L8K09j1K54l47L76m24qK07M4k84K9K06o3K64
2875B16r2k74K9K27n45O93o97J76k3N8M46k33j69M61l18P0J83j62k8j36j57L09
2897C4P2j18M02l4k07n8n5L2j14L90j69k72L31L9J82k66R9m5k01J8Kn6J33n3L18
2922D04k50j44j1j2J90k21J34K80j28pj20k21K64k35N9m16J81M91k86J6L79k20
2944A27l37K87L7KL6k05j03L93l60j28K37K5j65k59L81j2L5M3k9j25j6J03j6r9
2968a48L98l79K34rk51j18J55k04L40K24l99J13k11nk2J45N7J08j80ML4K32l22
$$ plain form
2991 -204 -165 -58 77 141 -161 -55 -165 -199 88 -54 61 -201 82 81 -242 -436 337 -76 149 286 152 -133
3013 -133 178 168 -56 163 -146 -181 168 177 120 149 -37 165 166 95 -72 54 3 41 381 2 149 -94 48 137
3037 137 309 280 242 233 155 -575 241 279 189 127 104 52 -6 -86 -80 183 46 264 235 190 -95 316 205 231 -19 94
3063 94 -19 204 -13 175 231 87 -40 -153 -147 238 -107 -67 -199 -268 159 -139 73 117 -152 170 408 187
3085 187 -282 -200 -109 55 38 -117 114 59 96 162 -172 -58 -138 -320 -97 -185 149 -14 -307 -81 -71 -2 -327
3108 -327 -432 30 -146 -53 -59 -115 -81 67 -87 -151 64 -104 -110 -257 -330 -68 -42 -90 -218 -345 -220 12 137 3
3132 3 -122 -104 -7 112 -114 -13 20 -34 -10 -1 112 -63 -138 49 140 113 142 188 -155 159 103 1 28 98 -238 2
3158 2 393 175 236 -126 -25 246 280 -73 127 168 -53 57 309 140 -8 47 312 212 110 -7 246 197
$$ packed form
2991b04L9J07J35O4l02J06j10l4K87j42J15k62K83jl23j94P73m13K25J37j34k85
3013a33L11j0k24K19l09l5L49Rn7K9j86K02Jp1j67J26n1L8L40l79J47k43J42Q9
3037A37J72k9l8rp8p30Q16L8r0o2k3n2n8q0OK63j37K18k9m5k85M11j11K6k50J13
3063I4j13K23k17J88N6j44j27j13OL85l45M0j32o9M27k98K12M4k69L22K38k21
3085A87m69Q2R1J64j7j55K31n5L7O6l34J14q0j82K23q8L34j63k93K26J0O9l25
3108c27j05M62j76R3on6L4J48j54o4K15j68oj47p3K62K6m8j28j27J25K32J25j34
3132Cj25J8R7J19k26J01L3n4K4RJ13j75p5J87R1k7K9M6l43L14n6j02K7P0l36K40
3158BL91k18O1l62J01K71L4l53K00M1k21J10K52j69j48N5K65j00j02j17K53m9
$$ plain form
3180 197 197 133 405 53 116 49 78 170 14 286 -48 2 178 -56 -126 44 180 115 130 -233 -115 23 -173 60
3204 60 201 -106 -48 142 58 227 103 -57 67 150 54 -202 -88 -30 -51 183 165 -122 -384 -146 -267 -65 -284
3227 -284 -191 -115 -104 50 172 -248 -307 93 -3 -163 71 -3 -17 -66 131 -103 -91 235 -5 -115 138 110 -289
3250 -289 -7 -165 -37 -66 -166 -205 63 -172 -13 344 150 104 -281 -21 -91 -121 233 80 -309 -237 222 127
3272 127 121 229 327 75 54 102 195 129 177 64 295 40 -199 197 29 15 -10 25 -130 193 464 180 65 279
3296 279 50 -222 231 347 -12 20 125 230 130 -78 130 128 118 320 154 115 -33 150 47 448 166 26
3318 26 69 -75 156 50 65 211 169 -31 179 290 174 -200 -103 -220 268 47 -3 -5 166 86 156 25 -95
3341 -95 -38 -43 -174 -200 -45 -24 154 -146 -50 -185 -39 -16 -26 267 7 -117 30 51 -35 158 -244 -111 -68 -140
$$ packed form
3180A97%o4K72l52O3o7K9R2j56K72l34N0J76k34p0J70J36o5J5l63J18J38j96K33
3204F0J41l07N8J90q4J69j24j60J24Q3r6k56J14N8k1K34j8k87k62K38j21K02k19
3227b84R3P6J1J54J22m20n9M00r6j60K34p4j4m9J97k34J2L26k40j10K53k8l99
3250b89K82j58J28k9j00l9K68k35J59L57j94m6l85K60p0l0L54j53l89P2M59r5
3272A27oJ08R8k52k1M8R3o6M8j13K31k55k39L96j68j4k5L5j55L23K71k84j15K14
3296B79k29k72M53J16l59L2J05J05j00k08K08kj0K02j66l9j48J83j03M01k82j40
3318B6M3j44K31j06J5J46m2k00K10J11j16l74R7j17M88k21n0kJ71q0P0j31j20
3341i5N7nj31k6J55K1J78l00R6j35J46K3j0K93k60j24J47K1q6J93m02J33M3p2
$$ plain form
3365 -140 146 -10 -91 72 -349 -217 -272 -182 4 -107 -204 110 -102 -130 -128 -177 -86 201 67 -45 -248 115 -42
3388 -42 -199 -37 -111 306 -202 -238 4 201 54 0 75 -206 -96 14 -10 -171 83 123 -45 28 60 93 4 -55
3412 -55 48 302 310 153 180 -50 -11 286 273 162 126 441 26 -31 105 -5 -24 145 111 -58 470 133 65 146
3436 146 -23 -322 64 276 285 -80 52 230 282 -97 111 168 97 -268 40 -37 -150 -210 -52 76 45 161 107
3459 107 -46 -229 91 82 89 -47 -187 124 210 -25 260 18 -179 -335 20 137 -41 -193 87 -94 -38 -102
3481 -102 -204 184 -109 -90 48 6 224 211 200 -250 -89 -121 3 -116 129 81 2 188 -99 -160 -260 -43 -74
3504 -74 51 108 -15 -188 153 -182 24 -331 103 -319 -124 -134 -196 151 162 -175 -44 -32 20 -226 -275 142 33
3527 33 107 -237 178 190 -322 -9 20 83 34 39 125 100 328 233 314 -119 141 86 -68 -263 182 254 116 61 -61
$$ packed form
3365a40K86j56q1J63m21J32n5R0J86j11r7L14k12k8Km9R1K87j34j12k03L63j57
3388d2j57J62p4M17n08l6K42J97j47n4P5k81J10J10k4j61K54M0j68P3L2L3q9n9
3412e5J03K54Qj57K7k30L9K97j3j11l6L15m15n7J36j10j9J69l4j69N28l37o8Q1
3436A46j69k99L86K12Rl65J32J78N2l79K08N7p1l65L08p7j13o0J58J28l1J16n4
3459A07j53j83L20rPj36j40L11Q6k35K85k42j97j56L55J17j78j52K80j81N6o4
3481a02j02L88k93J9J38m2K18j3j1m50J61l2J24j19K45m8p9J86k87o1j00K17l1
3504g4J25N7j23j73L41l35K06l55M34m22J95j0o2L47J1l37J31J2N2k46m9M17j09
3527C3P4l44M15J2n12L13K9O3m9NQ6k5K28r5Q1m33K60n5j54j95M45P2j38n5j22
$$ plain form
3552 -61 -53 -88 -123 39 361 -24 98 235 200 -121 47 166 292 105 265 -7 166 19 -82 21 -37 147
3574 147 -3 79 -153 -109 123 47 -18 -46 297 182 108 -49 -118 -46 -72 -84 -65 48 103 -7 326 175 67 10
3598 10 -218 -185 -136 -206 -40 -100 -234 173 -110 13 -135 -6 -440 -151 -31 2 51 144 -6 -123 -81 -71 -113 -241
3622 -241 -70 108 -133 -283 -49 2 94 19 53 -134 22 111 90 139 170 -93 -212 -26 -15 -189 -146 20 -17 -383
3646 -383 -30 242 -51 114 30 -38 -232 -54 16 -2 -73 255 212 87 -19 -4 63 -116 -2 181 -41 -75 -251
3669 -251 371 64 -198 255 7 -80 35 296 59 -169 49 224 240 -1 252 -72 -60 320 347 -92 55
3690 55 -35 161 42 -95 50 209 57 -48 -22 164 180 16 84 -120 -6 86 -62 146 -26 159 128 -135
3712 -135 -134 70 52 328 -166 6 -100 -39 -20 -108 -235 -219 -57 -142 -250 131 305 104 -33 93 -236 234 166
$$ packed form
3552f1Ql5l5J62L22l85J22J37l5l21J68J19J26j87J60k72J73j47j01J03n8J84
3574A47j50Q2k32M4K32p6o5k8L43j15p4j57o9P2k6j2J9J13N5j10L33j51j08n7
3598A0k28L3M9p0J66o0j34M07k83J23j48J29m34K89J20L3M9R3j50j17M2J0m2j28
3622b41J71J78k41j50K34N1R2p5L4j87J56Q9k1M9L1k63j19J86J1j74M3J66l7l66
3646c83L53K72k93J65q4o8j94J78P0j8p1L28m3j25j06J5O7j79J14J83k22l4j76
3669b51O22l07k62M53k48q7J15K61k37k28K18J75J6k41K53l24J2L80K7m39J47
3690E5r0J96j19j37J45J59j52j05K6J86J6j64O8k04J14R2j48K08j72J85l1k63
3712a35JK04j8K76m94J72j06O1J9q8j27J6J62q5j08L81J74k01j37J26l29M70o8
$$ plain form
3735 166 -173 126 177 -44 16 250 -9 -48 -156 -104 -302 -76 -305 -104 -330 -117 274 -114 -38 66 -91 -391
3757 -391 -339 -6 -95 -118 -30 -138 -167 -105 216 -2 -122 12 1 -73 -120 -421 26 -63 -84 97 -188 -139 -276 -285 -85
3782 -85 100 65 -130 42 242 82 64 275 -92 199 -113 16 124 -78 83 -301 -15 -143 171 200 130 64
3804 64 290 -51 50 228 223 185 -28 62 -280 -47 184 35 -32 -145 15 192 -99 120 -58 55 -22 107
3826 107 248 116 220 -126 206 122 -225 -66 181 -263 34 6 -240 18 216 -234 108 183 57 11 9 17 9
3849 9 170 -254 189 193 -152 -189 123 -173 -200 -128 3 -157 -162 -25 9 192 193 85 -258 -60 -17 20 -193 -92 -195
3874 -195 -311 27 -21 -91 -13 -137 -255 53 -62 -144 64 52 -55 -189 -230 -122 7 114 -45 65 -357 -229
3896 -229 -165 -304 -30 78 -64 123 -75 -114 34 74 112 -171 -155 50 135 -352 199 -22 -200 -50 -10 21 159
$$ packed form
3735A66l39K99N1k21O0K34k59l9j08N2j98K26k29K01k26K13L91l88P6J04j57l00
3757c91N2L33q9k3Q8j08k9O2L21k18j20J34j1p4m7l01M47q9k1J81k85M9j37rK00
3782h5J85l5j95J72K00j60j8K11l67K91l12J29J08k02J61l84K86j28L14K9p0o6
3804F4K26l41J01J78nl8k13R0l42K33K31j49o7j13J60J77k91K19j78J13p7J29
3826A07J41j32J04l46L32q4l47J59K47m44K97k8k46K58J98m50L42P5j26m6kQq
3849IJ61m24M43Ml45l7L12k96k7P2J31j60nJ37L4J83Jj08l43J98M3L7k13J01j03
3874a95j16L38m8p0P8j24j18L08j15q2K08j2j07j34m1J08J29J07j59J10m22J28
3896b29O4j39K74J08j42J87j98l9J48M0L8k83J6K05Q5m87N51k21j78J50M0L1J38
$$ plain form
3919 159 316 411 24 -191 5 -5 89 142 215 108 92 129 -111 -69 513 187 197 4 126 -145 -183 156 0
3942 0 -10 -74 -65 -123 -90 15 289 26 -303 -200 194 -106 177 -114 205 114 -229 69 163 95 62 -131 -300 54
3966 54 231 146 45 162 174 -96 2 -3 170 -344 -65 91 35 81 -226 6 207 205 128 149 137 -13 -107 -268 -111
3991 -111 -22 -86 119 -20 -236 9 -251 -60 18 -68 -44 7 -180 41 -64 52 211 -88 -248 71 134 -371
4013 -371 14 61 105 -140 59 27 -122 -116 -199 74 -18 -314 147 -139 -377 -329 -114 -93 289 -129 -149 139 -47
4036 -47 -111 84 -146 -97 43 166 6 -97 -52 -145 11 110 -114 210 136 -239 -24 -102 -154 144 38 97 55 62
4060 62 132 85 -70 32 31 -115 174 213 67 -57 -29 -80 112 32 19 -211 71 -78 331 -209 -26 54 243 33
4084 33 -131 219 10 -165 97 145 205 -167 -40 130 -146 119 -4 258 88 -69 60 -8 143 66 199 22
$$ packed form
3919A59J57R5l87k15J96j0R4N3P3j07j6L7k40M2N82l26J0j93J22k71l8L39j56
3942@j0o4Rn8L3J05K74k63l29J03L94l00K83k91L19r1l43K98R4o8l3j93j69L54
3966E4J77q5j01J17J2k70R8nJ73n14K79J56n6M6l07K32K01kp7K1j2j50r4j61J57
3991a11Q9o4K05j39k16K45k60J91P8q6K4N1j87K21j05J16J59k99j60L19O3n05
4013c71L85M7M4k45J99l2j49Oq3K73r2k96M61k86k38M8K15K1L82m18k0K88j86
4036d7o4J95k30M9J40J23j60j03M5r3J56R9k24L24p4l75K15p8n2K98j06N9m2P
4060F2P0m7j55J02jj46K89L9j46j24K8n1J92q0j3k30K82j49M09n40J83Q0J89k10
4084C3j64L50k09j75K62M8O0l72J27J70k76K65j23K62j70j57J29o8J51p7J33j77
$$ plain form
4106 22 -28 -303 8 -133 -282 158 -146 -407 -159 -109 -18 167 26 -127 27 -117 -17 -116 -26 65 -134 -243
4128 -243 -32 -189 113 81 -54 -175 103 -64 103 -107 -18 161 -77 43 -33 340 -348 56 -73 -119 -29 186
4150 186 -398 227 10 161 189 7 -14 -248 105 116 63 231 217 36 129 262 -117 109 -108 42 87 -227
4172 -227 -33 -93 93 89 -213 -59 24 36 -287 27 -65 -1 316 322 339 -305 -120 74 205 -19 -91 1 123 187
4196 187 31 -15 279 39 -36 104 223 146 311 -163 49 59 122 83 -55 128 224 -137 287 -69 -184 111
4218 111 1 175 8 96 78 67 -222 149 41 20 109 181 -11 -193 -137 147 139 -180 55 -15 -61 -116 44 -92
4242 -92 -151 34 -54 -12 -8 -27 72 182 -202 44 -145 193 -147 188 174 423 -104 178 -147 -134 171 92 96 87 18
4267 18 223 -177 -79 -297 19 -156 -91 94 -282 -154 -119 210 -19 116 -392 -76 41 225 69 29 -113 -32
$$ packed form
4106B2n0k75L11j41j49M40l04k61K48N0R1J85j41j53J54j44J00r9R0R1j99j09
4128b43K11j57L02l2j35j21K78j67J67k10Q9J79k38J20p6L73o88M04j29m6R0K15
4150A86n84O25k17J51K8j82k1k34L53J1n3J68j4j81R3J33l79K26k17J50M5l14
4172b27J94o0J86ml02J54Q3J2l23L14r2O4L17OJ7o44J85J94J31k24p2R2J22O4
4196A87j56m6K94k40p5J40J19p7J65m74K12J0O3l9j38J83R6l61M24l56j15K95
4218A11j10J74j67Q8j8j1k89L71j08k1Q9P2j92j82N6K84ql19K35p0m6n5J60j36
4242i2n9J85q8M2Mj9R9J10l84K46j89L38l40L35j4K49n27K82l25J3L05p9Mro9
4267A8K05m00R8k18L16j75O5J85l76J28L5L29k29J35n08L16J17J84j56m0j42Q1
$$ plain form
4289 -32 213 129 -131 250 -212 -132 -91 -159 128 162 290 42 44 128 -144 212 89 24 -60 343 -95 62 -213 71
4313 71 16 106 126 15 -6 -226 33 -79 35 -7 96 151 -297 -186 170 -147 35 69 -233 -26 -3 -87 -144 -128
4337 -128 286 -60 -68 235 119 47 166 35 -220 -207 -46 2 130 74 -215 -133 4 -134 163 16 -142 -75 -133
4360 -133 -232 -201 271 -69 209 -189 -28 223 -126 199 68 44 -151 -49 -34 -69 -117 -327 193 153 125 -177 138
4383 138 113 126 68 152 -91 -108 137 348 -136 -330 274 -119 -75 38 11 -35 13 36 223 80 -24 34 -255 -143
4407 -143 -14 -202 -128 -42 -68 160 -59 69 -210 162 73 -83 59 -247 177 273 89 -156 -1 5 46 81 -123
4430 -123 22 -54 -173 67 -78 -8 -51 -220 20 6 5 80 295 71 182 -155 -19 59 -6 129 -166 212 -19
4453 -19 200 231 -122 -211 191 22 72 -67 84 103 51 100 139 173 123 85 -58 -244 194 -87 -8 19 207 123 59
$$ packed form
4289c2K45q4k60L81m62Q0M1o8K87L4J28k48KQ4k72L56j23o5q4M03m38J57k75K84
4313G1n5R0K0j11k1k20K59j12J14m2J03N5m48J11L56l17J82L4l02K07K3q4n7J6
4337a28M14l46qL03j16p2J19j31k55J3J61M8J28n6k89Q2J37j38K97j47j58O7n8
4360a33r9L1M72l40K78l98J61K51l49L25j31k4j95J02J5l5m8k10N20m0k8l02L15
4383A38k5J3n8Q4k43j7K45K11m84j94O04l93M4J13k7m6M8K3J87j43j04N8k89J12
4407a43J29j88P4Q6k6K28k19J28k79L72q9j56J42l06M24R6j84k45J55OM1L5k04
4430a23J45p6j19K40j45P0m3j69K40j4jP5K15k24J11l37J36P8o5J35k95L78k31
4453a9K19L1l53q9M02j69N0j39J51J9n2M9L9L4n0l8j43j86M38k81P9K7J88q4o4
$$ plain form
4478 59 292 -334 238 2 -398 -14 -34 -162 -8 -173 7 182 -172 -169 -60 -65 -115 -200 -288 116 140 -120 58
4501 58 -91 -90 114 139 -203 121 -9 -71 -107 -85 93 -177 -177 81 -91 -114 106 -252 106 122 87 314 157 26
4525 26 -14 22 94 340 -83 26 -208 -96 -35 -121 20 -171 -216 -83 -110 -264 -216 -13 230 209 212 218 -206 -256 -81
4550 -81 -148 -135 -59 -6 52 -144 59 -35 -299 -78 77 223 266 147 147 -135 349 123 -477 -2 -50 216 -160 -205
4574 -205 22 -7 -26 35 116 55 135 -82 -23 12 21 27 -170 1 -245 -4 99 16 -26 -167 -64 83 31 34 -116 282
4600 282 -282 204 -311 5 139 54 -5 -11 243 187 18 -27 -175 75 362 -220 9 -80 -5 -128 16 145 39
4623 39 -25 -198 214 -43 45 -26 -40 219 185 -114 -232 -25 -237 -121 17 -401 -273 10 -152 101 -97 11
4645 11 -273 172 -4 -133 125 -79 108 -148 -79 -83 50 -119 259 -139 -178 33 79 2 120 -353 100 191 37
$$ packed form
4478E9K33o26N72k36m00L84k0j28J54j65J80J75l54LJ09nn0q5q8M04K4k60J78
4501E8j49JK04K5l42L24j30o2l6K2J78k70%K58j72k3K20l58L58J6l5K27j57j31
4525B6m0L6P2K46m23J09k34J12O1q6J41j91m5J33k7j54M8K03K43k1LOm24n0J75
4550h1o7J3P6N3N8j96K03r4k64K21J55J46M3j19%k82M84k26o00M75m8K66l76m5
4574b05K27k9j9O1Q1o1Q0k17N9L5ROj97J71k46K41J03q3m2j41J03J47n2Lj50L98
4600B82n64M86n15L16J34q5n9oK54n6j69m5j48K50K87n82K29q9P5j23J44J29j06
4623C9o4j73M12k57Q8p1j4K59l4k99j18K07k12J16J38m18J28K83j62K53j98J08
4645A1k84M45j76j29K58k04J87k56O9mJ33j69L78l98l9K11M6p7J18m73M53R1j54
$$ plain form
4668 37 -175 153 -23 -157 33 9 -319 -182 89 -63 188 -310 117 19 289 47 39 -238 14 29 40 -110
4690 -110 1 -109 142 12 -73 15 -92 2 60 20 51 108 -70 223 -83 222 20 96 -203 -30 126 83 -35
4713 -35 189 -126 256 242 -156 -86 -99 166 -188 301 98 71 -115 -66 92 98 70 -290 -160 -58 -38 -8 2 61
4737 61 149 92 -90 -85 -368 -202 155 132 123 166 199 221 -143 -80 23 -130 -97 170 36 160 16 -156 98 115 103
4762 103 -5 -244 278 -147 95 -8 -228 -211 185 16 -100 61 174 -63 -7 129 199 215 210 72 -164 127
4784 127 -50 -62 -54 104 -287 196 102 31 -89 -82 -210 340 -125 -131 99 -83 24 -106 43 -354 -74 -62 137
4807 137 71 1 -166 -15 -16 -104 -42 -42 -17 27 -341 -45 48 131 317 -122 95 363 -220 -260 55 22 81 -186 -42
4832 -42 67 44 229 120 88 -101 209 142 208 59 -313 -58 -17 93 67 206 -87 104 46 -94 -327 231 -58
$$ packed form
4668C7k12L28j76j34J90k4l28J37K71j52K51m98M27r8K70k42qk77K52J5J1j50
4690a10J11j10K51j30q5Q8j07R4N8m0L1N7j78K93l06L05k02P6k99J73J56m3j18
4713c5K24l15L82j4l98P0j3K65l54M89k03k7j86M9J58Ok8l60J30J02K0L0J0N9
4737F1Q8n7j82Nk83J66L57k3rM3L3K2l64O3J03j53L3K67j34J24j44j72K54J7j2
4762A03j08k39N22m25K42j03k20J7L96j69j16J61J13k37N6J36P0J6nj38k36K91
4784A27j77j2QJ58l91M83r4p1j20Pj28N50m65oK30j82J07j30J49l97K80J2J99
4807A37o6p0j67J51jq8O2%K5M4l68K96R3Q3J86m39K17K68n83m0L15l3N9k67J44
4832d2J09k3J85j09l2j89L10o7O6j49l72K55M1J10k6J39k93J91n8j40k33N58k89
$$ plain form
4855 -58 48 137 18 208 225 148 -195 347 14 188 193 -158 112 -119 -78 41 27 -331 183 -103 85 107 -79
4878 -79 -290 -47 -289 -107 127 -69 110 -183 172 113 80 -32 79 149 154 197 125 -144 -46 66 -149 -25 -144
4901 -144 205 -87 -335 -9 253 -118 -192 -140 195 -105 -51 -30 137 -117 194 49 -5 -222 36 20 194 -299
4923 -299 -137 312 9 -241 -7 240 -51 -137 214 -89 63 110 -238 -239 -79 192 79 141 -22 25 35 -21 151
4946 151 69 233 78 -21 -27 101 68 -144 8 3 277 -19 -116 21 72 90 -301 128 18 -321 280 77 79 -102
4970 -102 233 129 -35 165 46 36 158 177 -45 75 -25 -132 -37 51 -96 -119 17 -104 53 73 185 -327
4992 -327 154 2 -24 -263 -118 79 -114 -247 4 10 -20 -173 107 9 238 158 109 -114 -130 -254 -40 -199 -83
5015 -83 114 -303 53 -175 31 -296 -296 -86 104 -1 -287 -43 36 -138 -253 -286 -256 -80 72 -236 -141 -247
$$ packed form
4855e8J06Q9j19J90J7p7l43N42l33J74Nl51K70k31M1J19j4l58N14k86J88K2j86
4878g9k11K43k42J82K34j96J79k93L55n9l3j12J11P0NM3p2k69R8J12k15J24j19
4901a44L49k92k48L26K62l71p4N2L35l00N4K1J67k54L11j45n4k17K58j6J74m93
4923b99J62M49l03k50K34K47k91q6L51l03J52M7l48jJ60K71j13O2j63M7J0n6J72
4946A51q2J64j55r9oJ28l3k12J52nK74k96r7J37N1J8l91M29j10l39O01k03Kj81
4970a02L35j04j64K00j19j0J22J9k22J20j00j07R5Q8j47k3J36j21J57K0J12n12
4992c27M81j52k6k39J45J97j93j33K51Ol0j53K80r8K29q0m9k23j6j24K14j59J16
5015h3J97m17L56k28K06l27%K10J90j05k86K44P9j74j15l3L0J76J52l08R5j06
$$ plain form
5037 -247 -72 -187 84 -17 -37 -71 -9 -415 158 226 -73 -208 -243 -184 112 206 36 -287 -369 188 -36 216 194
5060 194 -38 -169 -283 8 16 -38 148 168 -103 -229 199 160 -110 13 -63 -3 37 49 91 56 140 -28 -76 70
5084 70 139 -121 -84 243 204 20 231 65 57 177 -289 111 -214 9 206 6 45 -172 161 -158 -92 236 42
5107 42 202 181 81 153 -85 -226 -322 -118 -100 304 -15 299 56 64 175 132 0 -79 109 -6 -215 54 -127
5130 -127 -84 -84 -248 257 -77 122 -88 -151 64 73 -152 48 122 31 -402 31 173 226 -175 -356 528 156 -154
5153 -154 79 -231 -215 21 35 140 88 188 197 178 -214 -83 206 -45 125 274 -42 -29 -129 39 -34 -35 86
5176 86 30 71 -92 100 150 -228 330 196 193 80 -133 50 -191 -67 130 119 69 161 370 -221 174 129 250
5199 250 -3 -104 137 219 -13 -251 21 -81 -214 55 111 213 78 65 -93 261 44 -309 161 -263 140
$$ packed form
5037b47J75j15K71j01k0l4O2m06N73O8k99j35l5N9K96R4j70l23q2N57k24K52k2
5060A94k32j31j14K91Qn4J86K0k71j26M28l9k70J23p6O0M0J2M2l5Q4j68m8J46
5084G0O9k60L7L27l9j84K11j66qJ20m66M00l25K23J97k00L9k17L33l19O6L28j94
5107D2J60k1j00P2k38j41r6K04J8M04l19L14k43QJ11m3j32p9J88j15k09K69j81
5130a27M3%j64N05l34J99k10o3K15Rk25K00P4r1m33M33J42N3m01j81Q84l72l10
5153a54K33l10J6K36J4J05n2J00Rj9l92J31K89k51J70J49l16J3j00J68p3jJ21
5176H6n6M1j63J92N0l78N58j34lj13k13J83k41J24J97j1n0R2K09n91L95m5J21
5199B50k53j01K41Q2k32k38K72j02j33K69N6J02j35j3j58L54k17l53M70m24M03
$$ plain form
5220 140 -53 43 -269 126 -377 150 0 61 73 -82 8 138 186 -39 -139 -58 -1 -120 214 -53 27 191 12
5243 12 -100 -1 -14 100 49 -58 455 -387 127 -31 -79 84 111 343 152 -50 48 299 -148 -44 -66 -211 -1
5266 -1 -193 -106 79 357 186 47 161 -41 -2 -19 111 67 18 81 92 -115 67 121 24 342 49 -3 -31 -164
5290 -164 57 424 237 -113 -229 -145 -163 -71 186 -148 -28 -20 208 21 -77 73 -174 112 47 63 -110 -25 -41
5313 -41 107 -16 -63 235 118 89 28 19 -169 -118 -146 -97 164 -181 -85 -95 376 227 76 -125 -228 225 -183 -287
5337 -287 7 139 -48 -150 -53 -169 242 -11 381 247 -9 178 40 36 214 183 11 -34 -110 -91 158 185 198
5360 198 -74 141 -80 -22 -47 114 -116 36 -118 36 32 -90 82 -3 22 -155 -36 21 35 44 -218 214 -34
5383 -34 2 -144 71 70 88 -194 -176 -75 -265 -26 180 89 20 1 320 -17 12 38 -227 -84 134 -19 2 94
$$ packed form
5220A40j93R6l12L95n03N27j50O1J2j55R0J30M8k25j00Q1N7j19L34k67Q0J64j79
5243A2j12R9j3J14n1j07N13q42N14j58m8J63K7K32j91k02R8K51m47J04k2j45K10
5266aj92Q7J85K78j71j39J14k02L9j7J30m4m9O3J1k07J82N4r7L18k93n2k8j33
5290a64K21L67j87l50j16Q4j8R2K57l34J20QK28j87r8J50k47K86o5J6j73Q5j6
5313d1J48j23m7K98j17k9o1rj88N1k8M9K61l45R6j0M71j49j51k01j03M53m08j04
5337b87K94J32j87j02R7j16M11k53L92j34k56J87j38mJ78l1j72m5p6J9K49K7J3
5360A98k72K15k21N8k5J61k30J52j54J54mj22J72q5K5j77J19N7J4Rk62M32k48
5383c4L6j46K15jJ8k82J8J01j90K39K06r1o9j9L19l37K9K6k65J43K18j53K1R2
$$ plain form
5407 94 81 -15 -118 5 4 -40 -6 -324 30 -36 -82 55 -73 130 86 -113 122 94 127 -75 196 -127 193 -240
5431 -240 173 83 -177 161 173 134 48 198 -26 57 256 -96 -47 250 48 178 135 -73 58 294 -97 -149 132
5454 132 -217 76 -113 -69 14 344 -117 91 28 -227 -148 38 91 147 -191 17 150 92 274 166 198 -105 -108
5477 -108 101 8 100 112 -323 -123 22 38 14 69 -10 -268 -45 -129 226 112 45 -123 4 -32 42 235 39 -25
5501 -25 -126 235 19 173 -90 -135 174 48 267 172 118 -13 -122 146 -101 160 -51 43 -93 22 -204 -16
5523 -16 -5 31 -43 -95 255 48 241 11 -113 86 -142 -258 -240 -234 112 150 45 146 56 39 -29 -146 343 6
5547 6 53 78 17 18 -293 -138 162 -94 -53 205 -77 0 -12 -366 48 15 -174 -143 203 85 129 -133 -47 -161 60
5572 60 -119 -148 115 52 -259 41 124 28 255 -58 84 77 -201 -240 -94 58 30 -274 64 49 212 249 -62 43
$$ packed form
5407I4j3r6j03J23jm4L4l18L54o6m6J37j28K03m4j99K35k8L3k02K71l23L20m33
5431b40M13r0k60L38J2l9q6J50k24Q3J99l52M9K97k02J30m3k08J31K36l91n2K81
5454A32l49K93j89M4Q3L30m61K08o3k55P9J86N3N6l38K08J33n8J82j08L2l03l
5477a08K09r3R2J2m35K00J45J6k4N5p9k58K23q4L55j14o7j68J27l6P4J93j96o4
5501b5j01L61k16J54k63m5L09j26K19r5n4j31j09K68k47K61k11R4j36J15k26J88
5523a6J1L6p4n2L50k07J93k30j24J99k28j16J8OL46L8j05J01r0j7o8j17M89l37
5547FM7K5o1Jl11J55L00k56M1K58k82P7j2l54M14l3j89L1L46j18M4k62Q6j14K21
5572F0j79k9K63o3l11L00Q3r6K27l13J42pk78l9J46J52k8l04L38j5J63L7l11J05
$$ plain form
5596 43 -271 207 -176 74 -316 -223 -13 -148 -94 216 111 -109 132 -95 -12 -46 -132 -28 -7 -11 146 158 -259
5619 -259 45 -26 149 205 23 86 70 46 -176 212 104 -171 -544 209 -57 133 72 308 71 62 1 -232 -22
5642 -22 -110 -156 -56 -92 -373 120 -26 62 -154 24 3 -126 -148 -44 -114 40 57 110 53 121 164 134 11 -85 -99
5667 -99 151 -181 -121 -223 -11 -236 -131 -127 -32 106 -50 118 52 -35 -47 -150 116 200 -89 79 -206 64 -25
5690 -25 54 41 100 241 235 81 -42 -251 64 16 222 -65 98 -41 -111 174 121 -69 7 -169 130 -119 391
5713 391 166 326 -64 197 28 49 82 -83 -177 -195 88 -161 -106 146 -10 60 151 -264 -141 307 77 10 2
5736 2 175 202 -16 162 -112 219 355 69 92 194 168 -116 62 -15 -186 20 -82 -347 -78 -60 -20 -6 125
5759 125 16 -27 157 118 131 -52 59 -147 -146 -376 108 41 -28 -128 53 399 -229 -16 -44 270 77 -65 121
$$ packed form
5596D3l14M78l83K50l90R3K10j35N4L10j05k20K41k27Q3l4q6J04K1mJ57J2m17
5619b59L04p1J75N6j82O3j6k4k22L88j08k75l73P53k66J90o1K36k37ro1k33K10
5642b2q8m6J00l6k81M93j46Q8k16J78k1j29k2J04p0J54J7N3n7O8M3l0j23r6j4
5667i9K50l32O0j02K12k25J05MR5J38j56J68o6q7j2j03K66Q4k89J68k85K70q9
5690b5P9j3N9J41oj54j23k09L15m8K06k87J63j39p0K85n3j90P6j76K99k49N10
5713C91k25J60l90K61j69K1L3j65r4j8K83k49N5K52j56P0R1m15J23M48k30o7q
5736BJ73K7k18J78k74L31J36k86K3J02k6k84J78p7j71K06j02k65K69J8M0J4J31
5759A25j09m3J84l9J3j83J11k06Jk30M84o7o9j00J81L46o28K13k8L14j93j42J86
$$ plain form
5782 121 184 -176 15 140 114 -1 88 207 79 -53 -127 148 -41 139 248 -232 116 179 -114 7 64 245
5804 245 -137 -445 -234 122 88 129 158 37 23 -33 -147 -134 66 -287 55 330 79 -148 -122 -62 45 -370 -84
5827 -84 -78 328 -120 153 20 11 49 -244 193 133 221 12 128 -19 26 73 27 -93 -3 -115 -123 139 168 198 -224
5852 -224 52 -54 -10 67 -136 19 -300 -108 -337 61 222 -23 261 -101 -111 205 206 -129 0 48 77 -110
5874 -110 -227 -109 52 -30 91 -13 33 139 -137 -390 154 -35 88 47 -55 -60 7 177 -259 75 -33 40
5896 40 -83 162 156 -143 23 228 -122 166 -27 13 -61 26 204 84 -104 293 5 -54 105 -197 -87 -224
5918 -224 34 39 82 -145 -94 12 31 23 80 205 73 -48 -128 26 -114 -48 -220 -115 -37 120 -390 -251 -204 -239
5942 -239 40 -107 -18 -143 137 178 19 -9 5 -88 172 256 15 140 -28 60 -208 38 -13 -50 30 30 -78 -199
$$ packed form
5782A21O3l60J91J25k6j15Q9J19j28j32p4K75j89J80J09m80L48O3k93J21N7J81
5804B45l82l08K11L56l4M1K9j21j4n6j14J3K00l53L42K75k51k27K6O0J07m15K86
5827h4OM06m48K73j33rL8k93M37o0Q8k09J16j47M5M7m6j20R0j12qK62K9L0m22
5852b24K76j06M4P7k03J55l19J92k29L98J61k45K84l62j0L16Jl35J29M8K9j87
5874a10j17J18J61q2J21j04M6J06k76k53N44j89J23m1j02nO7J70m36L34j08P3
5896D0j23K45ok99J66K05l50K88j93M0p4Q7J78j20j88L97k88n9J59l02J10j37
5918b24K58NM3k27N1J06J9qN7J25j32j21q0J54j40O6j72J05P8J57n10J39M7l5
5942b39K79j47Q9j25K80M1j59k8J4r3K60Q4k41J25j68Q8k68K46n1l7Q0%j08j21
$$ plain form
5966 -199 -117 -122 -6 -303 28 229 -177 -65 -91 7 -266 23 185 150 210 111 -100 -72 -168 59 -19 90 201 -83
5990 -83 -62 -11 191 123 49 98 97 -12 -472 -112 -381 -318 -68 52 146 -69 34 -211 -157 -50 -88 -152 7 89 109
6015 109 79 -304 -4 122 -219 -242 77 4 5 -17 103 -7 -213 22 243 -48 -153 -80 210 161 -37 -176 102
6038 102 -5 -92 187 -3 150 48 -219 -188 -67 -439 0 4 -39 -65 -194 26 -113 -57 220 -78 26 88 -281
6061 -281 25 -226 130 -241 27 -20 -84 -56 106 91 -82 509 -170 49 124 -202 164 -138 38 94 53 177
6083 177 -118 229 98 -81 13 197 -10 159 -89 97 -143 -86 -26 203 347 -121 -63 -64 156 -37 -86 -184 216
6106 216 36 252 -141 25 -196 -45 -169 147 77 52 173 -51 97 123 100 249 132 183 247 52 -312 197
6128 197 233 21 41 -63 -134 -58 78 263 -72 42 37 -4 274 65 70 40 -221 -85 161 149 1 150 78 201
$$ packed form
5966a99Q2nJ16k97L31K01m06J12k6R8k73K89J62l5O0r9k11K8r6K27p8J09J11k84
5990h3K1N1K02o8p4M9jj09m60L60k69O3K50J20R4k15J03k45N4J07l8o4J59Q2K0
6015A09l0l83L00J26l41k3L19p3Jk2J20j10k06K35K21k91j05P3K90m9j98j39K78
6038A02j07q7K79j90J53j02k67L1J21l72M39Mm3k6j29K20j39N6K77k98J04O2l69
6061b81L06k51L56l71K68m7o4K8J62j5j73N91o79K19P5l26L66l02J76N6m1J24
6083A77k95L47j31j79R4J84k07J69k48J86k40N7O0K29J44m68N8jK20j93m9r8M00
6106B16j80K16l93J66k21J51j24L16p0k5J21k24J48K6k3J49j17N1O4j95l64N09
6128A97L6k12K0j04p1P6J36J85l35J14nm1K78k09Nl0k61J36K46j2j48J49p2J23
$$ plain form
6152 201 -74 174 49 -90 27 176 -137 62 122 -148 149 42 315 -3 176 75 -139 -170 13 47 -252
6173 -252 -137 121 164 393 167 66 105 -188 -67 34 -246 -5 54 65 -163 30 -65 30 82 77 204 -17 -24 83
6197 83 -30 38 45 171 115 -193 -257 -1 -100 227 65 304 -225 -166 141 -45 98 201 -118 -6 184 222 67
6220 67 84 -161 44 -20 -25 -115 -235 8 29 -7 23 -12 3 73 -112 42 -344 104 44 -203 -234 -49 -125 -39 -160
6245 -160 294 51 219 -84 316 86 100 -1 -58 118 191 312 -172 106 62 97 -163 -171 121 -191 -146 -124 54
6268 54 10 -110 71 -166 -273 120 -15 -27 116 198 -209 86 -97 54 -174 -152 58 -102 10 -31 -112 79
6290 79 128 127 -49 215 51 -217 -9 -89 -112 75 -154 29 -40 22 -165 -145 23 -31 -229 -149 -73 44 -187 78
6314 78 -203 -37 198 -121 47 263 -173 352 133 -249 -249 12 -206 -280 -11 315 -177 -21 222 68 -166
$$ packed form
6152B01k75K48j25j39J17J49l13J99O0k70K97j07K73l18J79j01k14l1J83L4k99
6173b52J15K58M3K29k26j01L9k93J21J01k80K41N9J1k28J93r5R5N2nJ27k21pJ07
6197H3j13O8PJ26n6l08o4K56r9L27j62K39n29N9L07j86J43J03l19J12J90L8j55
6220F7J7k45K05o4nr0j20K43K1l6L0l5J5P0j85J54l86M48o0k47l1J85p6Q6j21
6245a60M54k43J68l03M00k30J4j01n7J76P3J21m84K78m4L5k60qK92l12M5K2J78
6268E4m4j20J81k37j07L93j35j2J43Q2m07K95j83J51k28K2K10j60J12m1q1J91
6290G9M9jj76K64j64k68K08q0k3J87k29J83o9O2j87K0J68n4j98Q0P6J17k31K65
6314G8k81J66K35l19J68K16m36N25k19l82%K61k18p4K69L26m92J56K43j54k34
$$ plain form
6335 -166 -207 197 15 28 -69 252 30 180 280 0 -421 -156 -54 -112 -340 173 301 280 35 -62 -244 -76
6357 -76 2 -129 334 -120 -30 27 -3 -15 99 -169 127 73 107 -3 9 -64 -114 -69 -232 -21 -13 -138 207 -2 -88
$$ packed form
6335a66m1M04j82J3r7L21k22J50J00k80m21K65J02n8k28N13J28k1k45r7j82J68
6357g6P8j31M63m54R0N7l0j2J14k68K96n4L4j10J2p3n0M5j63K11Qj25L45k09q6
$$ [...]
8191A51
##END NTUPLES=NMR FID
##END=
