##TITLE=1H_TG-2281
 CDCl3, 8 sc, 
 28.1.2020
##JCAMPDX= 6.0         $$ Bruker NMR JCAMP-DX V2.0
##DATA TYPE= NMR FID
##DATA CLASS= NTUPLES
##ORIGIN= UXNMR, Bruker Analytische Messtechnik GmbH
##OWNER= root
$$ XWIN-NMR		Version 3.5
$$ Tue Jan 28 14:27:58 2020 Russian Standard Time (UT+4h)  she@DPX200
##.OBSERVE FREQUENCY= 200.1315
##.OBSERVE NUCLEUS= ^1H
##.DELAY= (6, 6)
##.ACQUISITION MODE= SIMULTANEOUS
##.ACQUISITION SCHEME= undefined
##.AVERAGES= 8
##.DIGITISER RES= 18
##SPECTROMETER/DATA SYSTEM= spect
##.PULSE SEQUENCE= zg30
##.SOLVENT NAME= CDCl3
##.SHIFT REFERENCE= (INTERNAL, CDCl3, 0, 15.7039)
##AUDIT TRAIL= $$ (NUMBER, WHEN, WHO, WHERE, WHAT)
$$ ##TITLE= Audit trail, XWIN-NMR		Version 3.5
$$ ##JCAMPDX= 5.01
$$ ##ORIGIN= Bruker BioSpin GmbH
$$ ##OWNER= she
$$ F:/spectra/data/she/nmr/H-F/1/audita.txt
$$ ##AUDIT TRAIL=  $$ (NUMBER, WHEN, WHO, WHERE, WHAT)
(   1,<2020-01-28 14:26:53.93 +0400>,<she>,<DPX200>,
      <created by zg, POWCHK disabled, PULCHK disabled
       configuration hash MD5:
       00 E9 B6 7A A2 85 ED C7 34 08 36 98 17 FE 4E 26
       data hash MD5: 16K
       1A FA 0C 38 8B 7C 7B 02 FA CD 77 45 68 67 6C 93>)
$$ ##END=
$$ 
$$ hash MD5
$$ 05 B8 72 91 C9 C1 05 30 6B C6 41 44 79 41 02 24
##$RELAX= 
##$RELAX= 
##$RELAX= 
##$RELAX= 
##$RELAX= 
##$RELAX= 
$$ Bruker specific parameters
$$ --------------------------
##$DU= <F:/spectra>
##$EXPNO= 1
##$NAME= <H-F>
##$PROCNO= 1
##$TYPE= <nmr>
##$USER= <she>
##$AMP= (0..31)
100 100 100 100 100 100 100 100 100 100 100 100 100 100 100 100 100 100 
100 100 100 100 100 100 100 100 100 100 100 100 100 100 
##$AQSEQ= 0
##$AQ_mod= 1
##$AUNM= <au_zg>
##$AUTOPOS= <>
##$BF1= 200.13
##$BF2= 200.13
##$BF3= 200.13
##$BF4= 200.13
##$BF5= 200.13
##$BF6= 200.13
##$BF7= 200.13
##$BF8= 200.13
##$BYTORDA= 1
##$CFDGTYP= 0
##$CFRGTYP= 5
##$CHEMSTR= <none>
##$CNST= (0..31)
1 1 145 1 1 1 1 1 1 1 1 1 1 1 1 1 1 1 1 1 1 1 1 1 1 1 1 1 1 1 1 1 
##$CPDPRG= <>
##$CPDPRG1= <>
##$CPDPRG2= <>
##$CPDPRG3= <>
##$CPDPRG4= <mlev>
##$CPDPRG5= <mlev>
##$CPDPRG6= <mlev>
##$CPDPRG7= <mlev>
##$CPDPRG8= <mlev>
##$CPDPRGB= <>
##$CPDPRGT= <>
##$D= (0..31)
0 1.2 0 0 0 0 0 0 0 0.06 0 0.03 0 0 0 0 0.0002 0 0 0 0 0 0 0 0 0 0 0 0 
0 0 0 
##$DATE= 1580207213
##$DBL= (0..7)
120 120 120 120 120 120 120 120 
##$DBP= (0..7)
150 150 150 150 150 150 150 150 
##$DBP07= 0
##$DBPNAM0= <>
##$DBPNAM1= <>
##$DBPNAM2= <>
##$DBPNAM3= <>
##$DBPNAM4= <>
##$DBPNAM5= <>
##$DBPNAM6= <>
##$DBPNAM7= <>
##$DBPOAL= (0..7)
0.5 0.5 0.5 0.5 0.5 0.5 0.5 0.5 
##$DBPOFFS= (0..7)
0 0 0 0 0 0 0 0 
##$DE= 6
##$DECBNUC= <off>
##$DECIM= 24
##$DECNUC= <off>
##$DECSTAT= 4
##$DIGMOD= 1
##$DIGTYP= 9
##$DL= (0..7)
0 120 120 120 120 120 120 120 
##$DP= (0..7)
150 150 150 150 150 150 150 150 
##$DP07= 0
##$DPNAME0= <>
##$DPNAME1= <>
##$DPNAME2= <>
##$DPNAME3= <>
##$DPNAME4= <>
##$DPNAME5= <>
##$DPNAME6= <>
##$DPNAME7= <>
##$DPOAL= (0..7)
0.5 0.5 0.5 0.5 0.5 0.5 0.5 0.5 
##$DPOFFS= (0..7)
0 0 0 0 0 0 0 0 
##$DQDMODE= 0
##$DR= 18
##$DS= 0
##$DSLIST= <SSSSSSSSSSSSSSS>
$$ [...]
##$SUBNAM2= <"">
##$SUBNAM3= <"">
##$SUBNAM4= <"">
##$SUBNAM5= <"">
##$SUBNAM6= <"">
##$SUBNAM7= <"">
##$SUBNAM8= <"">
##$SUBNAM9= <"">
##$SW= 24.9337058887773
##$SWIBOX= (0..15)
0 0 2 0 0 0 0 0 0 0 0 0 0 0 0 0 
##$SW_h= 4990.01996007984
##$TD= 16384
##$TD0= 1
##$TE= 0
##$TE2= 300
##$TE3= 300
##$TEG= 300
##$TL= (0..7)
0 120 120 120 120 120 120 120 
##$TP= (0..7)
150 150 150 150 150 150 150 150 
##$TP07= 0
##$TPNAME0= <>
##$TPNAME1= <>
##$TPNAME2= <>
##$TPNAME3= <>
##$TPNAME4= <>
##$TPNAME5= <>
##$TPNAME6= <>
##$TPNAME7= <>
##$TPOAL= (0..7)
0.5 0.5 0.5 0.5 0.5 0.5 0.5 0.5 
##$TPOFFS= (0..7)
0 0 0 0 0 0 0 0 
##$TUNHIN= 0
##$TUNHOUT= 0
##$TUNXOUT= 0
##$USERA1= <user>
##$USERA2= <user>
##$USERA3= <user>
##$USERA4= <user>
##$USERA5= <user>
##$V9= 5
##$VALIST= <valist>
##$VCLIST= <CCCCCCCCCCCCCCC>
##$VD= 0
##$VDLIST= <DDDDDDDDDDDDDDD>
##$VPLIST= <PPPPPPPPPPPPPPP>
##$VTLIST= <TTTTTTTTTTTTTTT>
##$WBST= 1024
##$WBSW= 4
##$XGAIN= (0..3)
0 0 0 0 
##$XL= 0
##$YL= 0
##$YMAX_a= 236114
##$YMIN_a= -127615
##$ZGOPTNS= <>
##$ZL1= 120
##$ZL2= 120
##$ZL3= 120
##$ZL4= 120
##$ABSF1= 10
##$ABSF2= 0
##$ABSG= 5
##$ABSL= 3
##$ALPHA= 0
##$AQORDER= 0
##$ASSFAC= 0
##$ASSFACI= 0
##$ASSFACX= 0
##$ASSWID= 0
##$AUNMP= <proc_1d>
##$AZFE= 0.1
##$AZFW= 0.1
##$BCFW= 1
##$BC_mod= 2
##$BYTORDP= 1
##$COROFFS= 0
##$CY= 11.3945322036743
##$DATMOD= 1
##$DC= 2
##$DFILT= <>
##$DTYPP= 0
##$F1P= 16.9975609425685
##$F2P= -3.02152046262296
##$FCOR= 0.5
##$FTSIZE= 0
##$FT_mod= 4
##$GAMMA= 1
##$GB= 0.15
##$INTBC= 1
##$INTSCL= 1
##$ISEN= 128
##$LB= 0.24
##$LEV0= 0
##$LPBIN= 0
##$MAXI= 10000
##$MC2= 0
##$MEAN= 0
##$ME_mod= 0
##$MI= 1.114404
##$NCOEF= 0
##$NC_proc= 0
##$NLEV= 6
##$NOISF1= 3.799351
##$NOISF2= 2.8
##$NSP= 1
##$NTH_PI= 0
##$NZP= 0
##$OFFSET= 15.70392
##$PC= 1
##$PHC0= -9785.109
##$PHC1= 12.40081
##$PH_mod= 1
##$PKNL= yes
##$PPARMOD= 0
##$PSCAL= 0
##$PSIGN= 0
##$REVERSE= no
##$SF= 200.130013532006
##$SI= 16384
##$SIGF1= 3
##$SIGF2= 2
##$SINO= 400
##$SIOLD= 16384
##$SREGLST= <1H.CDCl3>
##$SSB= 0
##$STSI= 0
##$STSR= 0
##$SW_p= 3612.71676300578
##$SYMM= 0
##$S_DEV= 0
##$TDeff= 0
##$TDoff= 0
##$TI= <>
##$TILT= no
##$TM1= 0
##$TM2= 0
##$TOPLEV= 0
##$USERP1= <user>
##$USERP2= <user>
##$USERP3= <user>
##$USERP4= <user>
##$USERP5= <user>
##$WDW= 1
##$XDIM= 8192
##$YMAX_p= 0
##$YMIN_p= 0
$$ End of Bruker specific parameters
$$ ---------------------------------
##NTUPLES= NMR FID
##VAR_NAME=  TIME,          FID/REAL,        FID/IMAG
##SYMBOL=    X,             R,               I
##VAR_TYPE=  INDEPENDENT,   DEPENDENT,       DEPENDENT
##VAR_FORM=  AFFN,          ASDF,            ASDF
##VAR_DIM=   8192,          8192,            8192
##UNITS=     SECONDS,       ARBITRARY UNITS, ARBITRARY UNITS
##FACTOR=    0.0002004,     1,               1
##FIRST=     0,             0,               0
##LAST=      1.6414764,     0,               0
##MIN=       0,             -127615,         0
##MAX=       1.6414764,     236114,          0
$$ Real data points
##PAGE= N=1
##DATA TABLE= (X++(R..R)), XYDATA
0 0 0 0 0 0 0 0 0 0 -8 8 -8 8 -16 16 -20 24 -32 33 -40 48 -57 65 -78 89 -105 119 -135 153 -174 197 -222
31 -222 252 -281 316 -353 393 -436 484 -539 599 -664 733 -812 900 -997 1105 -1226 1366
48 1366 -1522 1704 -1919 2172 -2482 2868 -3361 4025 -4963 6404 -8913 14570 -57076 83876
62 83876 128369 -127615 -115920 75659 67994 -126673 -108507 39529 32315 -76647 -31188 61368
74 61368 24140 -51954 -15865 22540 -23804 -58481 -7412 35028 28838 14355 2905 -19470
86 -19470 -11160 12593 -3753 -25823 16081 50793 5123 -24269 31061 46825 -25310 -42683
98 -42683 33947 50063 -14255 -7813 63933 51553 -21387 -18948 28593 17124 -626 38129 46186
111 46186 -10349 -10794 55755 44762 -34605 -19564 62417 44941 -30108 -5625 58728 25421
123 25421 -28471 3849 31207 -12418 -13951 50100 42135 -34964 -31658 32840 18593 -35547 -7622
136 -7622 40761 4956 -33396 5969 27761 -24360 -40554 11396 15733 -35098 -25026 29230
148 29230 13963 -37793 -26395 -1305 -30067 -35477 14357 15320 -40203 -33656 16738 -8877 -63623
161 -63623 -28501 19935 -26118 -61769 3105 35789 -40341 -70252 6452 20445 -68900 -75875
173 -75875 27409 44281 -49018 -63730 14352 13045 -62121 -52374 18408 7224 -50372 -28845
185 -28845 26351 6593 -43721 -34485 1189 -1335 -24439 -26253 -4105 20271 14395 -26330 -43289
198 -43289 -1139 27579 -10417 -36041 8129 35893 -8095 -29553 17864 30548 -23416 -29109
210 -29109 32030 33555 -24840 -11713 52827 31598 -39342 -17102 48995 28275 -20862 10647
222 10647 48661 7918 -20226 24913 45556 -10 -10596 31655 32845 -1856 11554 41645
234 41645 14968 -13594 21748 46167 4615 -12313 38515 52200 -5464 -23134 29439 45112
246 45112 5179 -541 27207 17365 -2786 19060 30835 -4843 -13822 29273 37079 -7929 -14079
259 -14079 27376 29607 -9421 -15651 8169 9883 2585 13458 11175 -12501 -10397 15439 5214
272 5214 -24245 -9995 20131 2309 -25255 -2494 18229 -12541 -31750 -929 7886 -27692
284 -27692 -26739 16277 12562 -32636 -30354 4347 -6379 -35640 -16688 11851 -9812 -35969 -14890
297 -14890 7234 -12393 -34018 -22815 -8704 -11436 -13981 -14229 -17535 -9138 947 -19838 -43772
310 -43772 -17505 19049 -4133 -40895 -15798 17962 -11294 -38912 -3731 16751 -25384 -37784
322 -37784 13890 24824 -28881 -34783 20323 22253 -33632 -33322 23244 27231 -19148 -19425 16025
335 16025 9260 -17764 -2205 21392 2672 -12322 10458 21019 -1205 -4847 16620 13029 -6088
348 -6088 4661 23202 11043 -4 16369 21659 0 -3123 19667 23578 6572 8670 21085
361 21085 11135 353 15711 25526 7703 -1479 17554 26904 9592 4199 16613 14447 3049
374 3049 8902 15784 6118 8128 27239 19206 -10668 -5456 24141 18508 -8507 -699 20603 9003
388 9003 -5624 10133 16498 -8623 -13917 12951 14816 -15216 -11812 21334 15907 -22414 -21764 10117
402 10117 7510 -17646 -11161 8269 -3120 -19286 -6299 1942 -14124 -19744 -5643 -6054 -16769
415 -16769 -8871 11 -13952 -23446 -9027 -6248 -24803 -23224 -381 -2395 -24800 -21655 -4042
428 -4042 -13078 -27776 -12887 -74 -22244 -33469 -3758 9727 -23396 -38915 -6826 7741
440 7741 -22687 -33661 -5495 5554 -14532 -21371 -9802 -10748 -15925 -4973 352 -14228 -19360
453 -19360 -2621 4629 -8835 -15513 -5810 -625 -4148 -4111 -2875 -3988 1007 6470 -2944 -13481 -899
468 -899 15567 5469 -9203 2485 14273 759 -6526 10331 15544 -1780 -2967 16195 15457
481 15457 -378 4446 17899 8691 -2878 10304 21710 8640 1268 16636 20096 1300 -1336
494 -1336 17901 21037 5027 5043 17473 12613 3939 14513 19335 384 -3739 20208 23837 -1607
508 -1607 -4599 21009 21757 -4990 -7693 14179 15628 916 3006 11059 3000 -3514 7174 11410
522 11410 -3157 -8258 5540 9947 -2635 -6321 3134 2751 -6650 -6146 -2310 -4986 -4036 2623 -3099
537 -3099 -14821 -9216 1444 -6171 -16655 -7233 1479 -11068 -18226 -5064 357 -13752 -19796 -8910
551 -8910 -5407 -13407 -13191 -6234 -10103 -16345 -11514 -8016 -15576 -16929 -5934 -3899 -16538 -18934 -7812
566 -7812 -5892 -13591 -12387 -9146 -13736 -12064 -1191 -4280 -19917 -15372 2573 -2462 -20525 -13781
580 -13781 5947 1642 -14460 -10874 1099 -3726 -10079 -907 3688 -7396 -8454 6581 7670 -7708
594 -7708 -7720 8369 6891 -6689 -2014 11914 8221 -2607 2553 9110 2697 852 9834 11549 3854
609 3854 5873 12407 7525 2605 10757 15456 5203 1177 13935 20361 9656 3265 11094 14429
623 14429 7578 6786 13061 12187 9851 13893 14890 4686 3097 15418 17964 5279 883 11665 16076
638 16076 9960 6728 6193 4678 7582 11782 6887 -587 6168 15423 6937 -6594 -1120 10937 7254
653 7254 -2395 532 6032 1241 -2808 3290 2602 -7481 -6557 4660 1849 -9513 -5354 5017 -1729
668 -1729 -13695 -8103 67 -5707 -10891 -4221 -2262 -10255 -11812 -5626 -6712 -12243 -9513 -5787 -11249
683 -11249 -14405 -5913 -2780 -14183 -19497 -8426 -3567 -13060 -16468 -6527 -4457 -12687 -13910 -9231
697 -9231 -11274 -12630 -5730 -5284 -14812 -14538 -2593 -1223 -13561 -16130 -5936 -2603 -8501 -9102 -4643
712 -4643 -4690 -5946 -4596 -5349 -8650 -5543 1803 475 -7720 -6027 2181 1638 -4551 -2638 1693 109
728 109 -735 3752 3786 -793 1277 6006 1533 -2757 4646 10323 3999 -666 6676 10034 2902 194
744 194 7378 10250 4761 3632 8156 8495 5931 7643 8658 3278 2710 11202 13157 3404 1401 11071
760 11071 12254 2481 1099 9106 9644 4988 5757 7441 2999 3156 10100 8113 -1869 -1363 9357 10356
776 10356 -309 -2979 5373 6442 -1228 -2530 2365 2918 -486 479 636 -3611 -3605 1620 88 -6623
792 -6623 -5477 618 -1778 -7170 -4688 -1527 -5594 -8735 -5648 -4221 -6789 -6654 -5365 -8131 -10384
807 -10384 -7211 -5203 -10075 -12338 -6134 -3724 -10504 -14637 -8587 -3899 -9230 -13930 -10997 -7550 -8083
822 -8083 -7956 -8666 -12252 -11508 -5393 -5409 -12544 -12868 -4511 -2735 -10073 -12140 -7420 -5234 -5783 -6515 -7582
839 -7582 -8621 -5044 -743 -3243 -9910 -7598 581 255 -7097 -6496 1530 2210 -4314 -4162 87 195
855 195 -584 2202 2341 -820 602 5633 3791 -1162 1946 6827 4566 876 4954 8635 5786 2477
871 2477 4658 7585 6426 5770 7353 7471 5969 7562 9127 5707 3879 8963 12340 7005 2720 8169
887 8169 12803 8588 3494 5510 7834 8258 8395 7075 5099 6311 9567 7573 2370 2561 8417 9204
903 9204 4337 1678 4429 6931 4834 2552 1699 1536 2710 4835 2895 -900 -313 3606 1855 -3896
919 -3896 -2664 2255 1736 -2881 -2993 -1215 -2596 -3725 -2868 -3668 -5135 -3840 -2218 -4585 -6855 -4421
935 -4421 -3186 -6852 -10098 -6669 -2819 -5230 -8832 -7553 -4764 -6467 -9160 -8192 -7475 -7454 -6275 -5986
951 -5986 -9363 -10071 -5329 -4108 -9847 -11823 -7072 -3455 -5672 -8665 -7824 -6124 -5919 -6240 -7129 -7505 -5470
968 -5470 -2555 -2811 -6866 -7243 -2403 -1081 -4592 -6917 -2722 733 -1100 -2831 -1636 -573 -1519 -512
984 -512 -270 -630 769 3168 2316 -72 612 3562 3461 1389 2133 4531 5371 3982 3208 4858 6166
1001 6166 5458 4492 4077 5854 8172 8793 5822 3887 6465 9806 7114 3957 6389 9845 9501 6234
1017 6234 5401 6473 8251 9060 6625 4034 5353 9669 9862 5153 3060 5531 8635 6844 3513 3883
1033 3883 6565 7454 4954 2836 2497 3977 5680 4549 1070 387 4243 5392 794 -1637 609 2613
1049 2613 590 -1362 -380 1000 -51 -1537 -2478 -2705 -2065 -1678 -2533 -4243 -3825 -2741 -3101 -5171 -5901
1066 -5901 -4103 -3369 -5655 -7374 -5033 -3415 -5393 -7300 -7384 -6406 -5294 -4972 -6901 -8172 -6073 -3613
1082 -3613 -5759 -9463 -8332 -4285 -3825 -7034 -8806 -6433 -3250 -4215 -6977 -7721 -5922 -3724 -3744 -5567
1098 -5567 -6145 -4576 -1789 -3032 -6190 -5373 -1526 -239 -3146 -3677 -2101 -843 -594 -1226 -2313 -1409
1114 -1409 913 1461 96 -300 1652 2624 1364 115 1052 3975 4118 2453 2100 3986 4759 4048 3372
1131 3372 3706 4524 6083 5963 3793 4039 7040 7736 4037 3346 6210 8845 7349 4831 5132 6738 7435
1148 7435 6223 5102 5175 6617 8162 6613 4051 4092 7204 8183 4446 1993 4995 7445 5587 3320
1164 3320 3542 4299 4059 4060 2732 1511 2770 4676 3236 -175 151 2681 2551 -295 -1119 472 1426
1181 1426 -146 -1530 -944 -695 -1807 -2281 -2676 -2918 -2172 -1433 -3324 -5301 -4034 -1772 -3472 -6497 -5525
1198 -5525 -2502 -3339 -5747 -6423 -5165 -4772 -4936 -5935 -7640 -6389 -3761 -3866 -7174 -8923 -6119 -3276
1214 -3276 -5467 -8520 -7421 -4023 -3651 -6153 -6997 -6162 -5115 -4239 -4653 -7105 -6783 -2658 -1117 -5055
1230 -5055 -7179 -3517 -1337 -3116 -4665 -3152 -1884 -1204 -1736 -2519 -2675 -1285 456 139 -1804 -1003
1246 -1003 2208 2698 -310 -863 1803 3109 769 181 3302 4204 2557 2991 3118 2393 3421 5059 4020
1263 4020 2156 4326 6833 5482 2332 3798 6508 6154 3420 3463 5678 6778 5925 4954 4062 4210 6095
1280 6095 7245 4416 2336 5292 7998 5134 1362 3412 6478 5421 2700 3112 4075 4362 4617 3677
1296 3677 1376 982 3436 3865 905 -637 2160 3649 959 -1187 123 1666 489 -1229 -1095 -720
1312 -720 -1148 -795 -996 -3366 -3154 -844 -1126 -4648 -4320 -1117 -1747 -5413 -5919 -3155 -3046 -4698 -4949 -4772
1330 -4772 -4716 -4329 -4082 -5528 -7022 -5394 -3201 -5031 -8195 -6617 -3104 -4124 -7709 -7798 -4751 -4276 -5823
1347 -5823 -5654 -5487 -5743 -4772 -3485 -5498 -7398 -4522 -1706 -4492 -6840 -4048 -1669 -2974 -4750 -3953
1363 -3953 -3033 -2642 -2482 -2237 -2714 -2840 -630 -230 -2306 -2710 223 1630 -1074 -1830 1512 2912 666
1380 666 -724 1443 2200 1282 2375 2718 1795 2456 4851 3796 823 2317 6048 5525 1845 2123 6057
1397 6057 6184 3933 3217 4626 5367 5407 5182 4544 3756 5232 7138 5185 1907 3882 7740 6629 2628
1414 2628 2988 5755 5383 4083 3435 3506 3440 5172 5182 2496 1250 4224 5521 2153 -155 2279 4523
1431 4523 2553 299 1114 1954 1160 500 755 68 -569 683 814 -2154 -2825 -107 706 -3011 -4077
1448 -4077 -847 -44 -3266 -4031 -1942 -2000 -3521 -3571 -3599 -3906 -3400 -2362 -3773 -5933 -5067 -2460 -3105 -6448
1466 -6448 -6108 -3344 -2685 -5812 -5960 -4556 -4052 -4436 -4474 -5532 -5905 -3742 -2245 -4715 -7565 -4845 -1316
1483 -1316 -3425 -6417 -4606 -1596 -2511 -4047 -3577 -3294 -2998 -1911 -1851 -2907 -3521 -783 470 -2008 -3721
1500 -3721 -938 1704 -416 -2522 -236 1816 752 -433 1121 1091 722 2245 2681 474 806 4131
1516 4131 4045 1106 1168 4479 4920 2291 1728 4178 5050 3889 3435 3493 4005 4652 5452 4606 3028 4454
1534 4454 6730 5707 2393 3414 6574 5887 3205 3544 5435 5062 3898 4522 3668 2445 4522 5646
1550 5646 3211 1283 3725 5766 3166 465 1852 4159 2893 802 1260 2697 1857 1552 1092 433
1566 433 -437 1224 1760 -528 -1958 584 1809 -1978 -3387 -843 339 -2349 -3154 -1832 -1844 -2083 -2238
1583 -2238 -3050 -4412 -3560 -1825 -2739 -5565 -5071 -2283 -2572 -5385 -5957 -3389 -2787 -4314 -5055 -4742 -4224
1600 -4224 -3975 -3435 -4503 -6595 -4609 -1845 -3826 -6641 -5024 -1825 -3031 -5647 -5009 -3284 -2712 -3332
1616 -3332 -3129 -3668 -3673 -2394 -1550 -3319 -4281 -1845 -85 -1770 -3663 -1573 561 -707 -2253 -1200 -62
1633 -62 -254 -243 754 58 -288 1707 2068 -27 -126 2702 3225 986 652 3140 3835 2161 1777 2748 3311
1652 3311 3445 3790 3251 2258 3693 4971 4244 1677 2615 5937 5594 2292 2435 5310 5505 3287 3514
1669 3514 4085 4037 4304 5002 3827 2063 4120 5964 3669 940 3002 5389 4193 1641 1644 3224 3107
1686 3107 2299 1537 1650 1661 2333 2477 366 -635 1785 2560 93 -1471 735 1698 -222 -1832 -543
1703 -543 -7 -1141 -1328 -1086 -2445 -1760 -810 -1454 -3789 -3353 -753 -1469 -4526 -4545 -1977 -1928 -3892 -4570
1721 -4570 -3346 -2972 -3470 -3764 -4074 -4707 -3735 -2395 -3684 -6051 -4801 -1904 -3017 -5723 -5138 -2501 -2776
1738 -2776 -4735 -4283 -3378 -3612 -3334 -2788 -3918 -4421 -2090 -1276 -3355 -4625 -2395 -560 -1795 -3406 -2655
1755 -2655 -639 -1187 -1852 -1458 -1029 -1039 -104 60 -1077 -839 1355 1952 -908 -791 1834 2547 458 246
1773 246 2295 2831 1917 1718 2180 2283 2920 3465 2783 1422 2802 4766 4273 1637 2143 4941 5316 2595
1791 2595 2102 4239 4583 3490 3552 3492 3065 4379 5501 3652 1579 3786 5722 3779 1460 2541 4282
1808 4282 4220 2374 2110 2992 3231 3288 2572 1436 1252 2861 3400 1079 -270 1695 3090 1078 -951
1825 -951 596 1828 429 -743 -17 -287 -714 -195 -447 -2067 -1896 -7 -508 -2960 -3179 -630 -1023
1842 -1023 -3296 -3597 -2112 -1864 -2767 -3157 -3131 -3059 -3048 -2536 -3627 -4708 -3836 -2099 -2945 -5605 -4488 -2108
1860 -2108 -2713 -4886 -4568 -3258 -3131 -3914 -3782 -4017 -4347 -2798 -2018 -4136 -4945 -2637 -945 -2786 -4523
1877 -4523 -2980 -1240 -1782 -3425 -2969 -1734 -1357 -1461 -1537 -1689 -1978 -508 338 -1649 -1965 646 1525 -564
1895 -564 -1582 859 2079 489 -35 968 1511 1581 2004 1595 837 1888 3476 2828 1132 1562 3628
1912 3628 3983 1973 1865 3935 4351 2981 2392 3164 3392 3552 4260 3627 2384 3769 5609 3524 1656
1929 1656 3365 5510 4240 2193 2477 4026 3461 3021 2562 2634 2452 3218 3591 2010 1309 2983 3999
1946 3999 1778 68 1574 3270 1707 284 829 1785 1194 269 934 109 -75 792 199 -1505 -1554 341
1964 341 515 -2157 -2582 -185 -453 -2191 -2797 -2031 -1417 -2338 -2149 -2992 -3037 -2312 -1498 -2722 -4259 -3612 -1268
1983 -1268 -2555 -4825 -4582 -2241 -2315 -3911 -3985 -3592 -3435 -3267 -3091 -3889 -4734 -2949 -1598 -3542 -5014 -2909
2001 -2909 -1376 -2391 -4196 -3459 -2125 -2013 -2825 -2481 -2440 -2199 -1299 -1399 -2351 -2710 -881 370 -1593 -2358
2019 -2358 -204 967 -844 -1503 126 613 376 252 660 363 630 1874 1437 -192 733 2577 2508 475
2037 475 619 2967 3410 1626 1276 2734 3327 2952 2620 2843 2413 3133 4347 3149 1560 2702 4772
2054 4772 3630 1882 2438 4603 4266 2552 2787 3051 3184 3396 3015 2164 2108 3349 3880 2197 1124 2408
2072 2408 3768 2131 611 1488 3055 2135 840 1348 1253 1164 1566 1534 -50 -410 1473 1500 -916 -1611
2090 -1611 859 892 -1076 -1650 -490 -63 -1045 -1911 -1643 -1784 -1488 -1307 -2147 -3101 -2437 -930 -1498 -3714
2108 -3714 -3853 -1357 -1705 -3623 -4046 -2689 -2345 -3083 -3244 -3330 -3283 -2795 -2087 -3604 -4539 -3023 -1453 -3022
2126 -3022 -4582 -3386 -1780 -2630 -3420 -3138 -2232 -2278 -2656 -2435 -2779 -2888 -1844 -1259 -2475 -3180 -1190 204
2144 204 -1704 -2688 -978 406 -1043 -1610 -505 149 -116 21 346 -279 120 1648 1096 -302 -54 2234
2162 2234 2215 376 485 1933 2587 1897 962 1853 2225 2500 2564 2298 1547 2419 4090 3264 1164 2044 4188
2181 4188 3907 1784 1873 3593 3653 3115 2690 3018 2637 3525 3857 2191 1382 3011 3941 2654 1107 2050
2199 2050 3616 2758 1096 1346 2504 2328 1613 1360 1390 1290 1748 1766 432 -323 1473 1654 56 -1125
2217 -1125 270 1046 111 -948 -673 -58 -300 -490 -1126 -1457 -907 -670 -895 -2524 -2298 -468 -1041 -2712
2235 -2712 -3264 -1708 -1028 -2371 -3035 -2493 -2189 -2397 -2373 -2905 -3643 -2543 -1476 -2872 -4237 -3112 -1360
2252 -1360 -2546 -3985 -3759 -1833 -2087 -2712 -2994 -2572 -2536 -1831 -2339 -2718 -2924 -1946 -1120 -1887 -3072 -1819
2270 -1819 -166 -1346 -2536 -1607 -217 -533 -1309 -1155 -830 -513 474 227 -986 -568 1223 937 -530
2287 -530 -271 1374 1830 1031 517 1321 2150 1765 1508 1481 1682 2332 2799 2234 1213 1845 3497 3334 1581
2306 1581 1769 3573 3947 2068 1946 2610 3110 2942 3018 2487 2198 3159 3492 2455 1781 2764 3731 2960 1663
2325 1663 1734 3100 2799 1487 1584 2193 2324 2178 1799 1228 1212 1770 2034 329 -276 1484 2052 657 -579
2344 -579 319 1101 330 -91 -399 -704 -188 -29 -792 -1634 -1207 -282 -797 -2317 -2089 -1068 -401 -2108 -2919
2363 -2919 -1940 -995 -2106 -2687 -2484 -2090 -2099 -1786 -2415 -3481 -2537 -1464 -2316 -4158 -3481 -1924 -1911 -3337 -3616
2382 -3616 -2729 -1982 -2396 -2852 -2995 -2538 -1937 -1948 -2666 -2874 -2012 -1143 -1851 -2920 -2598 -627 -1142 -2116 -1870
2401 -1870 -905 -734 -1073 -984 -1362 -1074 245 102 -1103 -954 572 841 -434 -633 252 1191 989 354 584
2420 584 974 1435 1709 1040 1253 1765 2347 2014 1023 1541 2678 3188 1494 1291 2479 2963 2804 1936 2619
2439 2619 2707 3104 3128 2137 1939 2786 3214 2343 1763 2137 3324 3138 1493 1718 2437 2879 2332 1712 1492 2250
2459 2250 2756 2053 1074 770 1923 2629 1380 406 1071 2007 1277 321 229 896 932 690 -203 -421 -16 428
2479 428 175 -1255 -998 65 -7 -1212 -1808 -1037 -532 -1053 -2272 -2125 -1283 -1429 -1677 -1778 -2290 -2007 -1335
2498 -1335 -2014 -3204 -2692 -1379 -1720 -3436 -2850 -1948 -1890 -2670 -3033 -2835 -2294 -1844 -2633 -2895 -2732 -2027 -1877
2517 -1877 -2778 -3081 -2245 -1054 -1578 -3034 -2305 -1288 -1272 -1690 -2148 -1603 -1511 -680 -1138 -1693 -1275 -399 -288
2536 -288 -1144 -1236 -487 355 -203 -498 -166 675 749 365 6 489 1342 1350 731 269 911 1681 1732 992 872 1925
2558 1925 2503 1941 1100 1892 2543 2451 1780 1562 1949 2955 3246 1955 1550 2496 3093 2582 1818 1750 2911
2577 2911 3369 2401 1723 1818 2640 2560 1855 1303 1540 2500 2702 1530 1092 1835 2365 1661 734 1163 1805 1740
2597 1740 780 492 468 999 1364 570 -254 458 777 395 -747 -676 -99 268 -570 -1358 -874 -271 -278 -1489
2617 -1489 -1902 -1529 -879 -848 -1768 -2055 -1448 -919 -1181 -2807 -2447 -1150 -1337 -2224 -2792 -2395 -1700 -1693 -2495 -3002
2637 -3002 -2469 -1766 -2043 -3100 -2949 -2088 -1472 -2134 -2759 -2619 -1958 -1529 -2357 -2676 -1734 -1410 -1713 -2144 -2368
2656 -2368 -1741 -828 -1090 -1967 -2040 -656 -295 -909 -1561 -1102 -473 -339 -395 -755 -449 303 379 -124 -115 671 1030
2677 1030 718 153 237 1450 1695 992 398 1235 1979 1832 1061 1099 1886 2252 2075 1428 1186 2469 2797 2061
2697 2061 1471 1827 2899 2437 2144 1573 2073 2880 2573 1954 1862 2439 2805 2369 1360 1645 2307 2762 1732
2716 1732 1225 1407 2351 1940 1076 1012 1652 1659 1321 906 927 976 1637 1197 -47 15 1097 954 -30 -212 206
2737 206 503 177 -673 -757 -317 137 -853 -1171 -958 -805 -465 -1309 -1730 -1822 -714 -664 -1911 -2145 -1467 -999
2757 -999 -1783 -2151 -2312 -2105 -1178 -1780 -2828 -2639 -1514 -1558 -2430 -2798 -2136 -1372 -1585 -2281 -2488 -1970 -1515 -1583
2777 -1583 -1899 -2270 -1478 -1500 -1561 -2387 -2175 -1065 -786 -1977 -2092 -1219 -571 -950 -1387 -1549 -571 -251 -703 -900
2797 -900 -821 -40 354 -705 -884 205 390 655 147 148 802 1271 699 91 758 1295 1514 1051 657 1158
2817 1158 1887 2014 1220 924 1518 2503 2027 1102 1694 2265 2367 2118 1626 1653 2164 2352 1915 1215 1872 2529
2837 2529 2649 1603 1461 2248 2581 1944 1072 1565 2202 2139 1482 1391 1592 1786 1738 1403 893 843 1806 1319 323
2858 323 409 1015 1246 636 -138 -65 611 821 8 -603 -534 246 3 -899 -990 -740 -376 -670 -1354 -1501 -653
2879 -653 -595 -1459 -1814 -1445 -1057 -917 -1600 -2264 -1790 -1030 -1494 -2116 -2321 -1674 -1359 -1962 -2635 -2099 -1850 -1271
2899 -1271 -2082 -2574 -2051 -1434 -1704 -2157 -2123 -2006 -1041 -1406 -1887 -2322 -1614 -972 -1488 -2350 -1860 -727 -1020 -1626
2919 -1626 -1654 -965 -534 -246 -900 -1267 -439 176 -367 -992 -548 76 413 -172 -297 188 757 933 10 273
2939 273 740 992 1083 399 424 1091 1890 1433 544 679 1967 1637 1195 1019 2016 2100 2053 1563 1117 1839 2535
2960 2535 1969 1374 1461 2135 2313 1827 1388 1439 2191 2149 1652 1278 1751 2177 1978 1192 978 1796 2145 1518 1051
2981 1051 681 2016 1618 940 449 1039 1264 854 259 -6 541 1080 566 273 -193 321 358 -165 -626 -626
3001 -626 -51 131 -763 -1194 -614 -137 -594 -1314 -1360 -1008 -467 -1231 -1421 -1833 -1163 -988 -1790 -2036 -1940 -1101 -1370
3022 -1370 -2165 -2151 -1688 -1109 -1320 -2313 -2244 -1575 -1824 -2032 -2185 -1889 -1431 -1334 -1659 -2211 -1630 -1310 -1253 -1867 -1835
3043 -1835 -1413 -911 -1537 -1413 -1605 -690 -109 -871 -1207 -997 -412 -443 -1065 -919 -293 115 -58 -456 -299 384
3063 384 528 336 -122 253 710 850 900 215 547 1167 1450 954 568 1447 1479 1341 901 968 1715 1834 1501
3084 1501 1240 1303 2121 2184 1468 1310 1692 2151 2161 1344 924 2099 2315 1695 1224 1446 2068 2016 1563 1139 1389
3105 1389 2246 1821 704 493 1316 1797 1102 612 1051 1410 1289 1266 212 430 928 854 404 -110 508 772
3125 772 535 -359 -416 -49 109 -92 -751 -478 -49 -423 -617 -1425 -762 -382 -450 -1598 -1568 -917 -754 -1207 -1963
3146 -1963 -1913 -1088 -1031 -1386 -2267 -1737 -1201 -1136 -1698 -2476 -1692 -1633 -1566 -2032 -2136 -1651 -1340 -1524 -2111 -1949 -1125
3167 -1125 -1284 -1626 -1761 -1700 -1280 -1163 -1356 -1665 -1258 -674 -844 -1832 -1652 -499 -656 -682 -1202 -624 -444 -136
3187 -136 -552 -892 -364 87 501 -418 -515 113 932 797 -267 282 1086 863 531 212 695 1140 1266 575
3207 575 464 916 1810 1405 978 1066 1461 1854 1448 1211 1330 2035 1921 1579 1321 1366 2109 1849 1163 1276 1515
3228 1515 1887 1780 1147 1160 1770 2243 1431 827 1188 1836 1558 1118 739 901 1555 1242 348 436 952 960 499
3249 499 305 417 821 486 65 -215 -34 423 191 -418 -362 103 51 -299 -706 -1076 -510 -143 -951 -1262 -1158
3270 -1158 -464 -738 -1183 -1711 -1329 -816 -1064 -1396 -1693 -1007 -1039 -1602 -1954 -1654 -1303 -1213 -1549 -1912 -1632 -1255
3290 -1255 -943 -1613 -1899 -1419 -922 -1279 -1830 -1575 -1044 -806 -1245 -1370 -1345 -567 -935 -1333 -1440 -924 -516 -677
3310 -677 -762 -1055 -468 -224 -476 -1006 -627 105 320 -387 -433 -222 199 537 -322 20 284 671 519 247 172
3331 172 931 996 535 428 515 1299 1362 570 463 1163 1161 1414 665 822 1544 2020 1740 836 1195 1730 1820 1137
3353 1137 1128 1140 1908 2053 903 1051 1539 1888 1550 997 1023 1297 1715 1172 708 1095 1671 1314 787 285 912
3374 912 996 903 511 109 589 918 508 137 -173 495 718 -273 -376 -264 -3 55 -749 -827 -600 99 -379
3395 -379 -930 -1057 -373 -452 -772 -1389 -1275 -708 -570 -1222 -1642 -1222 -677 -1197 -1448 -1919 -1419 -1244 -1320 -1550 -1864
3416 -1864 -1077 -806 -1725 -1792 -1481 -1072 -1211 -1690 -1806 -1382 -853 -1485 -1693 -1705 -1063 -1289 -1096 -1371 -1711 -893
3436 -893 -744 -977 -1062 -852 -645 -357 -835 -706 -336 -176 -436 -593 -453 49 631 -292 -227 -4 464 631 -86
3457 -86 94 376 777 926 -5 558 817 1343 857 407 743 999 1311 1175 973 970 1617 1429 1059 854 1474
3478 1474 1710 1366 765 1080 1844 1678 1480 1150 1018 1964 1854 1236 849 1094 1325 1401 819 645 1001 1632
3498 1632 1188 587 593 857 1146 792 401 379 811 1243 325 113 411 966 289 -23 39 226 433 -350 -536
3519 -536 -447 34 -152 -551 -743 -510 17 -576 -901 -1232 -773 -187 -720 -1080 -1059 -419 -473 -1000 -1461 -1408 -1079
3540 -1079 -851 -1365 -1719 -1508 -891 -1134 -1403 -1575 -1224 -1041 -1323 -1647 -1640 -1111 -902 -1565 -1840 -1162 -831 -802 -1043
3561 -1043 -1334 -1134 -948 -805 -1105 -1328 -419 -510 -819 -1036 -658 -203 -346 -401 -757 -459 79 393 -226 -501
3581 -501 153 613 91 -105 415 361 726 381 90 635 855 835 534 483 888 1108 876 822 631 1005 1395
3602 1395 1045 491 734 1257 1536 1180 851 1159 1636 1591 894 827 1211 1810 1470 1040 954 1524 1375 822 660
3623 660 570 1353 1232 732 792 678 1151 880 596 322 795 1050 837 -144 185 618 778 379 -132 271 533
3644 533 519 -377 -103 285 28 -232 -530 -721 -273 124 -314 -1026 -755 -84 -364 -910 -1123 -600 -618 -694 -1260
3665 -1260 -1197 -1019 -547 -812 -1727 -1377 -832 -916 -1421 -1292 -1107 -689 -1063 -1353 -1524 -1312 -760 -1168 -1318 -1501
3685 -1501 -1264 -1138 -1042 -1712 -1218 -791 -648 -1181 -1299 -989 -591 -940 -1229 -1206 -484 -400 -410 -837 -873 -291 -69
3706 -69 -151 -449 -423 117 96 -185 -93 219 663 325 -59 -67 743 406 49 419 256 592 946 223 414 1084
3728 1084 1048 1044 784 781 1081 1225 1220 807 780 1459 1512 1058 915 870 1614 1362 1169 759 1182 1626 1111 817 960
3751 960 1249 1316 927 592 808 999 1399 890 522 795 1124 869 332 430 591 999 456 160 152 487 675
3772 675 296 -401 276 526 94 -50 -79 -186 -70 -305 -727 -646 -40 131 -473 -730 -719 -658 -549 -758 -1328
3793 -1328 -1046 -353 -713 -1168 -1567 -877 -472 -1105 -1151 -893 -910 -1010 -999 -1454 -1412 -928 -961 -1124 -1408 -815 -790 -990
3815 -990 -1445 -1263 -820 -559 -699 -1292 -1096 -565 -470 -930 -902 -1028 -202 -331 -794 -678 -7 -78 -365 -669 -514
3836 -514 -71 287 -42 -386 -11 -119 170 52 56 170 787 448 100 172 356 848 263 475 299 750 639
3857 639 540 774 877 1202 1227 558 593 1101 981 1013 1049 999 1205 1420 922 892 865 1416 1565 816 803 1003 1201
3880 1201 1209 799 1050 996 1357 1108 476 600 1386 912 608 203 329 1003 744 641 -32 442 768 235 115
3901 115 51 406 511 -12 -78 -33 234 320 37 -435 -347 -165 -38 -469 -593 -430 -230 -305 -903 -847 -618 -543 -993
3924 -993 -1359 -810 -700 -741 -1060 -1375 -926 -869 -872 -1231 -1316 -813 -933 -1230 -1298 -1178 -857 -735 -1249 -1417 -612 -610 -997
3947 -997 -1425 -1278 -962 -864 -796 -1086 -1379 -513 -410 -855 -1129 -732 -112 -159 -793 -764 -499 -181 4 -814 -492
3968 -492 58 292 104 -263 48 545 567 415 -142 350 761 306 143 473 593 595 426 671 477 935 1209
3989 1209 641 204 526 1068 1042 944 533 1062 932 1038 755 753 1438 1372 735 932 391 1137 1273 948 403
4010 403 985 1159 847 1031 575 1088 1014 772 620 464 845 956 746 206 252 972 927 -6 191 327 380
4031 380 501 -25 -98 103 203 69 -471 -363 -27 51 -187 -389 -564 40 -138 -469 -714 -405 -453 -553 -997
4052 -997 -776 -711 -265 -885 -1018 -921 -585 -481 -1063 -1260 -880 -677 -957 -1034 -1396 -698 -943 -1057 -1134 -1104 -495 -543
4074 -543 -844 -1200 -1039 -632 -635 -737 -1145 -564 -514 -670 -912 -1071 -420 -473 -633 -795 -744 -402 -384 -761 -557 -343
4096 -343 140 99 -799 -240 192 185 267 -205 -67 492 625 1 115 401 951 323 465 438 797 875 862 443
4118 443 105 661 1202 911 567 669 1113 1432 733 594 903 1049 1192 956 531 1005 1107 1055 738 866
4138 866 990 1254 883 658 775 1024 869 522 568 670 760 712 360 426 681 537 442 -32 240 570 746 105
4160 105 -58 57 342 355 -208 -222 -75 148 170 -461 -409 -48 34 -693 -786 -404 -395 -342 -536 -480 -304 -462 -702
4183 -702 -926 -1317 -727 -345 -647 -1170 -1070 -699 -735 -724 -948 -734 -930 -1124 -926 -1044 -970 -931 -928 -1223 -1323 -816
4205 -816 -663 -611 -1361 -780 -417 -635 -777 -844 -574 -567 -247 -553 -793 -562 -286 -318 -774 -694 -62 -55 -345 -445 -313
4228 -313 104 156 -315 -198 218 299 113 -72 35 302 441 266 119 446 731 700 437 491 635 1080 519
4249 519 579 451 511 1021 623 370 1017 1101 779 1020 417 542 1074 1247 976 634 737 992 1127 401 702
4270 702 820 967 855 313 268 894 976 457 306 683 1083 707 376 48 787 849 361 -60 -271 69 459
4291 459 85 167 -149 172 206 -75 -491 -166 170 2 -608 -489 -178 -84 -108 -569 -503 -515 -255 -555 -845 -481
4313 -481 -640 -537 -971 -952 -642 -144 -482 -901 -1034 -771 -801 -785 -1180 -832 -645 -648 -850 -1067 -840 -528 -703 -1216
4335 -1216 -965 -997 -606 -830 -973 -676 -721 -275 -816 -1091 -599 -223 -397 -840 -735 -277 -193 -184 -519 -421 211 328
4357 328 -220 -214 -126 76 136 -152 -38 462 759 450 89 398 238 958 282 311 571 789 756 595 455 777
4379 777 1000 857 861 664 608 1076 969 526 652 682 1050 953 486 697 1143 949 466 420 599 876 864 636
4401 636 84 667 1026 577 373 584 660 810 354 189 96 763 595 99 137 278 400 627 349 133 41
4422 41 313 -60 -167 48 96 227 -182 -465 -45 -324 -103 -474 -511 -396 -449 -489 -661 -722 -305 -369 -547 -1017
4444 -1017 -750 -499 -296 -919 -1010 -768 -768 -575 -1084 -1007 -582 -613 -569 -1076 -1044 -522 -421 -714 -1061 -729 -906 -762
4466 -762 -803 -681 -451 -333 -549 -862 -812 -384 -333 -551 -688 -243 -236 -202 -140 -583 -308 -10 -217 -279 -90 60 154
4489 154 50 -230 -246 188 245 12 -206 384 429 650 270 303 663 614 703 319 248 455 978 107 365 707
4511 707 1006 1148 485 714 807 687 863 776 495 702 1129 1053 385 713 821 942 703 243 641 1005 843
4532 843 388 286 587 817 501 513 131 622 811 520 60 377 345 351 239 24 425 628 492 166 -61
4553 -61 200 396 71 -170 -518 5 47 -151 -504 -63 -198 19 -757 -576 -297 -267 -154 -843 -868 -428 -500 -459
4575 -459 -693 -861 -359 -460 -781 -893 -750 -575 -561 -692 -977 -500 -597 -829 -609 -471 -443 -302 -779 -811 -814 -407
4597 -407 -312 -841 -758 -624 -630 -442 -851 -290 -271 -197 -275 -998 -339 47 -413 -266 -399 -19 -123 4 6 -123 -129 285
4621 285 -172 -207 240 283 226 20 -33 -1 668 441 228 -237 139 713 240 155 410 636 871 531 346 536
4643 536 485 663 391 355 526 549 884 367 542 836 1092 561 342 256 730 932 634 439 290 463 860
4664 860 563 41 560 536 600 560 244 614 819 791 408 483 563 162 169 179 177 274 81 -86 -101 145 111 29 -391
4689 -391 -544 -183 -47 -133 -561 -384 127 -515 -551 -746 -264 -101 -545 -632 -436 -475 -606 -302 -717 -818 -632
4710 -632 -285 -721 -720 -701 -417 -437 -732 -734 -731 -565 -394 -604 -864 -467 -568 -463 -954 -909 -401 -452 -777 -1123 -323
4733 -323 -296 -265 -717 -643 -166 -258 -337 -488 -134 -290 24 -517 -739 -151 159 -56 -141 -414 452 144 -78 -109
4755 -109 -342 149 672 25 62 400 494 576 419 379 307 278 755 583 458 397 490 515 343 467 696 717 638 423
4779 423 647 851 1130 500 603 879 810 919 466 103 400 706 710 128 334 841 380 243 98 578 780
4800 780 601 301 105 481 394 53 269 166 425 96 348 -64 -106 238 87 -88 -151 -41 99 -253 -301
4821 -301 -134 -213 10 -386 -338 -79 -160 -170 -543 -652 -170 -318 -212 -534 -563 -586 -248 -454 -606 -633 -469 -244
4843 -244 -434 -716 -1046 -841 -505 -675 -821 -782 -433 -470 -591 -779 -356 -417 -441 -718 -523 -378 -226 -457 -652
4864 -652 -523 -382 -240 -433 -653 -410 -1 -82 -411 -438 -154 -46 -111 -120 -247 -16 390 31 113 278 263 132
4886 132 87 -214 374 496 247 354 305 468 404 348 271 302 430 649 235 269 534 532 389 435 546 626 617 697 566
4911 566 466 583 1034 493 370 592 1042 762 460 541 528 640 468 404 508 611 598 359 411 -14 511 177
4933 177 222 234 87 486 258 193 143 176 161 343 -323 75 49 194 -92 -370 -284 87 -424 -294 -687 -150 -161
4956 -161 -52 -521 -518 -284 -264 -229 -604 -590 -634 -102 -636 -674 -553 -250 -303 -655 -654 -426 -208 -518 -461 -382 -448 -435 -240
4981 -240 -615 -529 -134 -416 -498 -569 -306 -284 -530 -727 -618 -460 -489 -151 -556 -390 -258 -53 -476 -609 -238 -348
5003 -348 -167 -291 -444 -304 87 80 -208 -309 129 123 -47 61 15 436 495 128 -39 445 287 280 298 158 419
5026 419 595 564 361 75 261 666 588 141 348 772 502 404 522 658 883 765 381 440 777 580 425
5047 425 377 485 555 516 171 299 319 565 642 213 373 435 361 226 48 165 374 503 387 41 31 311 422
5070 422 -112 -24 237 -143 119 -94 -171 100 105 -57 -102 -371 -59 -143 -86 -426 -647 -88 2 -544 -477 -195 73
5093 73 -513 -355 -510 -395 -549 -440 -716 -397 -446 -517 -829 -767 -423 -469 -502 -836 -778 -613 -346 -501 -980 -571
5115 -571 -218 -475 -836 -451 -630 -337 -158 -404 -383 -246 202 -305 -503 -456 -99 -104 -175 -402 -259 58 15 -282
5137 -282 8 -144 137 -69 -56 -45 278 388 25 -176 85 330 179 -72 125 340 551 337 319 317 376 541
5159 541 93 172 -24 492 548 247 207 102 621 418 596 549 429 306 547 195 465 570 597 403 214 376
5181 376 485 577 329 328 409 654 240 34 325 285 603 210 -201 106 92 83 125 119 -193 259 259 0 -124 -156 150
5206 150 -104 -202 -154 -295 209 -168 -388 -350 -93 93 -537 -588 -456 -254 -174 -524 -523 -723 -123 -409 -627 -796
5228 -796 -109 -358 -688 -343 -604 -408 -494 -571 -672 -471 -323 -365 -764 -555 -369 -257 -439 -369 -508 -257 -131
5249 -131 -192 -525 -126 24 -372 -255 -395 115 2 87 -422 -343 -247 419 -173 -527 -153 -2 93 -308 -305 62
5271 62 162 189 -19 -345 66 519 426 -65 274 368 564 382 50 194 213 453 392 344 579 359 593 333
5293 333 -183 464 702 723 72 374 597 517 346 99 212 149 549 309 406 721 489 -56 76 283 308 438
5315 438 491 186 31 466 311 180 -74 71 227 480 241 49 -8 416 -21 -177 -119 169 -69 -74 -180 -298
5337 -298 -153 -235 -150 -213 -32 264 -234 -191 -605 -175 -175 8 -202 -815 -372 -225 -280 -258 -508 -154 -340 -543 -479
5360 -479 -504 -5 -270 -362 -478 -389 -379 -287 -710 -420 -180 -210 -442 -697 -291 -120 -289 -594 -623 -94 -157 -357 -168
5383 -168 -498 -416 -126 -445 -207 -237 -38 133 -213 -32 -26 -92 -130 -105 135 -248 184 -24 -234 135 100 291 -16
5406 -16 -144 13 408 215 261 83 285 151 69 -106 405 443 378 212 -183 411 705 483 321 89 375 402
5428 402 523 308 295 470 479 201 91 261 413 438 403 269 615 877 360 598 187 305 545 135 -162 195
5450 195 227 145 158 61 254 280 204 -152 -2 143 193 -11 -82 -118 -15 98 -58 -55 99 -240 65 -481 -382 158
5474 158 32 -104 -456 -181 -396 -185 -216 -203 -172 -351 -46 -338 -24 -201 -189 -229 -608 -355 -310 -289 -294 -195 -497
5497 -497 -581 119 -142 -458 -188 -235 -115 -285 -622 -123 -321 -242 -473 -185 -188 -65 -451 -574 -551 -111 -84 -221
5519 -221 -169 -224 184 -33 -28 -132 90 148 -77 -153 -37 -63 -104 8 -117 133 86 224 151 -193 409 450 456 -66
5543 -66 52 122 275 159 49 114 527 491 117 239 153 434 419 464 -56 286 253 172 275 402 273 711 461
5566 461 223 664 442 465 -35 130 557 525 242 150 68 247 149 465 44 70 209 85 175 193 202 514 256
5589 256 -20 -319 71 306 211 95 -279 -127 -155 -159 -19 -80 28 -41 -393 -479 6 -165 9 -404 -412 1 -238
5612 -238 -238 12 -472 -107 -300 -565 -268 -116 -171 -148 -447 -364 -435 -328 -582 -318 -695 -392 -91 -293 -229 -226 -85
5635 -85 12 -456 -385 -614 -280 -218 -296 -84 -186 -164 -12 -291 -245 96 -224 -258 -393 1 62 -346 -130 15 87
5658 87 207 -228 270 -59 118 -37 185 92 -72 275 398 -123 -247 -94 -16 366 322 -111 186 192 195 190 353
5681 353 202 472 466 71 528 288 421 233 43 529 391 492 -42 52 263 197 126 276 -50 288 351 75
5703 75 31 54 390 179 152 36 67 59 269 163 -2 250 -34 -11 -347 133 111 211 -29 -458 -4 194 -87
5726 -87 -27 -310 27 -87 -121 -232 -503 -144 -105 -175 -293 -205 -199 178 5 -421 59 -106 -200 -309 -231 -518 -185
5749 -185 -177 -255 -333 -104 -165 -195 -550 -326 -173 -157 -501 -549 -211 -298 -64 -284 -606 -58 -100 -312 -636 -129 222
5772 222 -515 -287 -114 -236 -326 -105 -240 -135 -40 -190 104 -446 -199 88 11 49 160 90 251 220 279 -63
5794 -63 -47 296 191 -131 2 87 -4 122 24 332 404 4 -148 239 194 557 317 -65 182 350 269 131 199
5817 199 -219 303 454 -4 128 106 258 280 13 -68 273 258 153 146 314 373 303 230 343 66 186 169 -44
5840 -44 268 233 144 203 -75 -202 114 57 59 105 -23 235 28 55 -60 98 52 -2 26 -49 -296 99 -65 -167
5864 -167 -266 -137 -263 -53 -504 -301 -101 -509 -98 -225 -279 -119 -188 -213 -190 -478 -236 -243 -233 -128 -112 18 -108
5887 -108 -201 -451 -53 9 -242 -254 -85 -186 -144 -462 62 -161 -114 -149 -221 -190 193 -6 -82 40 -363 -141 132
5910 132 -122 -182 -181 4 -92 -523 62 -141 29 37 -120 -272 163 318 43 -295 327 518 -216 -137 -212 214 81
5933 81 100 184 164 284 516 227 262 180 478 204 -19 330 314 383 159 290 209 56 376 147 56 -101 169
5956 169 276 172 50 411 30 343 301 -29 147 336 122 4 -114 381 351 -10 192 -63 189 210 146
5977 146 9 300 78 82 -263 -197 13 37 -208 -300 177 191 381 43 -405 -257 22 -228 -58 24 184 -73
5999 -73 231 -406 -255 0 -104 -251 -142 -175 74 -298 -278 -225 -288 -118 -218 -128 -254 -163 -264 -238 -577 -321 -133
6022 -133 -137 -221 -209 -240 -187 -282 -454 -358 245 -136 -154 -403 -31 -91 -110 -89 -362 -229 -100 118 -113 -156 61 -73
6046 -73 -282 -197 -306 50 43 -43 120 128 50 410 -131 -6 230 396 251 283 -216 57 594 116 73 -60 104
6069 104 47 -4 6 149 237 83 383 200 498 45 -134 281 69 175 256 119 31 34 188 468 131 -5 18
6092 18 405 29 241 -68 145 206 127 318 62 77 156 115 156 -178 136 129 -110 -236 63 191 -166 -197 -34
6115 -34 67 -127 124 -209 24 -205 -60 -79 -40 -97 -212 52 -348 -444 -8 331 16 -240 -319 -135 19 -118
6137 -118 -33 -300 -174 53 -102 -126 -244 -258 -386 -147 -87 2 -363 -226 -442 -506 -263 -313 -250 -177 -359 51 -197
6160 -197 -10 -66 -117 -49 97 81 -460 -153 -202 177 -219 -160 14 56 -81 -132 -58 318 80 -22 -110 159 -267
6183 -267 -47 101 56 296 155 -15 106 -21 497 91 1 -54 17 110 120 212 190 137 345 298 337 416 354 408 261
6208 261 229 114 322 -66 206 191 183 236 566 154 54 218 37 332 -3 207 54 23 206 42 -73 50
6230 50 41 142 292 67 -13 -20 -159 -205 73 -73 -108 93 -74 -140 259 -130 -236 -21 46 190 -251 -211 26 264
6254 264 -194 -137 -178 3 13 192 0 -11 305 -8 -135 -112 -150 -30 -115 -400 -91 -249 57 -62 -243 -340 -47
6277 -47 83 110 -235 -219 47 -333 -200 -260 -289 -112 142 -234 -336 10 -284 -42 -202 -94 -62 -242 -285 -391
6299 -391 -104 249 112 -315 -152 114 202 93 -176 -226 -125 334 -153 -135 286 220 32 61 200 218 153 155 -123
6322 -123 33 179 -87 -192 182 134 160 275 -131 194 70 181 296 31 202 38 162 295 69 -92 137
6343 137 184 160 -52 129 15 -113 116 373 238 18 422 128 -8 -128 208 -26 93 7 1 172 116 162
6365 162 124 -161 118 -119 -19 197 384 70 255 -158 -175 67 74 12 47 99 -329 -4 -326 -83 -247 74
6387 74 -382 112 -170 41 -169 -274 -144 7 120 -308 -240 -147 -6 -24 -474 -93 -97 -222 271 -461 14 -165
6409 -165 -189 -230 -324 -250 -273 109 -219 9 -137 200 -224 -137 138 -352 -207 -1 -32 129 106 -194 -146 -47 72
6432 72 15 -343 56 182 -177 -22 -68 -42 -78 324 85 170 -87 40 96 175 -258 68 -128 -74 13 -286 212
6455 212 -95 -106 287 -248 390 229 290 41 -107 31 147 21 -148 10 214 146 49 133 34 230 204 118 -80
6478 -80 -41 299 220 42 -47 294 338 130 51 149 -138 134 151 -69 17 92 -7 -83 77 38 -137 36 -263 -200 -31
6503 -31 219 -155 -255 -39 -68 0 -258 -29 6 -73 146 21 -406 333 -126 -53 -38 -54 -33 -127 -1 195 35
6526 35 -339 -99 -109 21 -141 307 -43 -75 -221 -361 -245 82 -12 -4 -111 -9 -85 -225 14 -155 -166 462 -212
6549 -212 278 -103 -143 -369 -69 -87 20 -206 -440 -124 -172 51 -59 -237 -119 43 314 -212 45 18 -117
6570 -117 144 -44 70 105 -181 189 154 -53 -95 161 131 132 -11 162 70 -72 -26 -292 203 112 365 -31 150
6593 150 189 269 270 41 279 307 -27 208 309 111 79 47 3 35 507 -127 -215 129 52 16 200 52 82 42 365
6618 365 241 -114 -162 65 130 -62 -74 11 -15 -189 31 -90 72 75 195 -186 125 -96 88 105 -102 -49 84
6641 84 -240 -21 -309 -166 162 81 -4 -79 144 -191 -83 7 302 -209 -287 -81 -237 -121 -239 -301 -149 -192 -202
6664 -202 -106 -24 32 -392 -171 19 357 -4 110 -174 -45 -36 -67 137 -28 -237 -57 -39 115 -10 -136 -101 -125
6687 -125 19 -192 -188 -171 62 139 -80 -50 112 23 -146 267 109 91 -16 25 -115 -180 24 -17 164 50 -55
6710 -55 13 109 88 65 -161 10 275 53 -234 62 412 109 -33 -209 -25 320 183 -119 -255 63 189 165
6732 165 -86 204 89 305 -65 20 174 98 36 -118 57 38 -128 16 187 60 153 93 260 182 35 163
6754 163 -225 353 -21 85 20 148 -28 12 170 -44 -55 -120 3 211 152 -79 9 -8 -129 36 -16 -79 13
6777 13 -316 -232 -11 210 -106 110 -133 22 124 123 -274 -20 -248 7 106 20 -212 99 -32 -31 -58 34 -19 -206
6801 -206 21 -382 -170 -176 -158 -104 139 180 -255 -336 30 -77 -60 -30 -212 75 -151 -244 36 13 -160 -55 -263
6824 -263 150 -49 -47 125 103 67 65 33 -200 -69 -5 -62 -27 32 379 -74 170 -19 199 223 -18 36 54 152 -116
6849 -116 112 157 222 127 270 -83 132 329 333 -35 187 -144 -70 -153 -99 -125 74 -77 -264 -236 24 -99 119
6872 119 95 -18 34 -70 90 305 64 -236 239 99 -15 -78 288 151 33 231 29 81 6 109 -36 80
6894 80 50 208 352 17 35 18 2 -196 -7 -24 -47 294 -86 25 58 -109 67 -94 94 -189 96 -35 157
6917 157 0 -80 139 -27 62 13 -164 71 -96 -172 19 -87 -62 -102 185 -18 -47 11 143 -172 18 -56 -115
6940 -115 76 -5 -139 -92 -74 209 -35 53 -12 113 44 -250 79 95 61 240 85 113 -35 -170 -39 -202 292
6963 292 -100 52 -164 102 -51 86 242 -156 51 -126 56 -242 139 -232 -136 -58 146 62 50 102 5 206
6985 206 120 -236 141 -43 -63 -179 180 5 -7 -114 94 294 -41 288 97 169 -11 -39 -114 120 -71 178
7007 178 316 -219 -104 -47 245 175 44 8 -77 168 74 -217 -178 100 -77 -5 -188 117 -164 87 -67 144
7029 144 32 -58 10 19 -36 159 -335 177 196 -152 -257 -17 -35 -104 -7 48 -214 -140 115 103 14 -84 38 -14 -169
7054 -169 -101 108 -151 -102 -90 -190 -209 113 -129 -34 -263 -65 -16 -13 28 18 -143 6 -234 -222 7 90 -92 -64
7078 -64 121 -112 80 128 305 65 156 -128 30 -75 171 178 130 -19 -273 -195 -104 128 -184 -191 99 126 -48 -153
7102 -153 -13 12 260 326 72 15 121 82 -72 -83 182 -278 -11 -79 -73 105 314 -72 7 176 86 154 -90 247
7126 247 -75 66 -51 132 -46 -35 -259 53 -47 163 13 -139 -21 -228 -351 -273 -248 140 247 265 500
7147 500 186 52 171 216 19 -61 80 76 96 150 207 186 -66 -6 221 191 -132 27 108 -228 124 108 20 -172
7171 -172 -39 24 -221 71 121 108 302 -77 -91 -23 55 -79 230 -22 -45 200 91 -4 49 -394 112 -31 21
7194 21 -195 125 62 -158 41 -222 17 99 338 -311 -115 -75 148 23 -145 -182 -96 -201 -239 -207 11 90 -42
7217 -42 70 -152 382 83 154 106 -91 -196 -251 188 -138 286 -282 -55 88 118 50 42 -124 -110 17 -46 30 94
7241 94 -33 15 134 49 -255 214 -153 -260 42 -23 148 -340 61 -79 18 -146 -62 -29 167 185 261 48 13
7264 13 211 -60 85 6 237 178 -86 -139 168 40 -116 123 -181 -116 -20 66 12 137 70 197 -19 -133 31
7287 31 -167 26 -244 97 45 80 -69 52 12 201 -151 -18 -65 -136 213 43 107 58 314 58 214 -58 -145
7310 -145 179 117 8 50 -162 -54 1 -12 16 -109 216 -65 -113 -97 64 70 -223 -127 -101 225 -160 363 -121 -197
7334 -197 6 -71 196 -253 216 -19 206 -279 92 156 69 -252 -108 243 -52 189 21 117 7 77 276 -221
7356 -221 35 36 150 -280 -189 30 -377 -65 -12 -239 -52 34 42 -43 -24 -279 167 -117 104 -245 -107 -10 140
7379 140 38 3 24 -70 87 -424 99 -19 -13 -18 -170 -274 93 -415 70 53 32 1 125 159 -40 197 -34 227
7403 227 237 60 183 178 173 -378 292 277 118 -41 225 -127 -7 -333 239 22 170 -67 -72 218 -164 182 -114
7426 -114 270 46 164 185 391 137 -221 12 196 -43 -55 86 17 -50 -199 -67 -152 146 -153 16 189 -45
7448 -45 -104 -5 -360 -246 -139 -202 7 -120 198 207 -81 21 -89 71 -60 -108 64 -293 32 -167 -3 226
7470 226 -25 81 132 -52 36 -147 -140 113 -81 88 -103 -35 -102 -128 -106 -252 -173 301 -49 84 120 -9 -126
7493 -126 -69 77 126 -10 -71 111 110 -195 102 -139 -228 -260 -20 -11 70 -48 -89 -289 -101 -83 -13 -428 -152 -17
7517 -17 94 106 -102 -60 -195 114 -163 -105 37 23 -37 0 155 -127 -136 176 -90 -80 -184 91 124 -202 228 -115
7541 -115 54 -42 -170 -89 78 -7 -99 -19 -96 -80 81 279 229 69 110 57 286 -91 88 421 183 -234 -9
7564 -9 -86 170 -20 -3 -107 -45 0 -52 59 -19 150 200 84 -269 140 -39 347 114 173 48 -193 130 -55
7587 -55 18 4 366 292 -79 -55 -437 176 148 -177 119 -31 -1 -149 68 -126 -71 -113 71 144 -58 66 154 177
7611 177 -77 -92 -320 -284 -254 -63 -295 195 -262 -56 -73 78 -232 50 170 -13 -170 -146 16 -145 235 -217
7633 -217 -230 -444 151 -34 -119 -17 12 275 152 -247 -2 268 -226 49 -41 93 153 381 51 -93 -60 176
7655 176 -39 306 -243 -151 -49 78 360 3 -22 -355 -21 76 -26 -94 -23 -61 -52 75 52 194 -123 -185 -211 72
7679 72 101 259 85 120 -155 93 253 -219 76 129 46 -137 242 -39 125 50 195 198 -40 155 -134 -49 46
7702 46 -85 -12 354 60 277 36 58 97 -178 -172 30 212 264 58 57 196 50 6 22 -130 -143 -182 -23 -52 -49
7727 -49 -175 -22 -6 10 -131 -184 -251 -400 -109 -100 104 -233 -169 -97 -241 -263 83 -155 7 -194 -165 -101 -214 131
7751 131 27 68 -100 -228 -276 5 -186 21 76 -47 263 -57 286 117 10 61 88 -149 25 -124 -273 -177
7773 -177 -178 -143 233 -93 -197 226 -71 -120 67 262 -30 -110 11 210 -117 197 -1 -204 52 263 209 -28
7795 -28 31 54 200 -18 -148 -67 58 -118 -14 -288 -84 -109 -60 245 -51 -10 53 266 -185 86 130 243 128
7818 128 48 74 169 19 -98 246 160 -63 45 303 -68 148 120 -101 120 -105 73 20 101 10 -241 221 204
7841 204 96 22 -90 61 149 74 -319 -40 38 -178 139 -275 -214 232 59 57 21 51 -19 -313 87 125 -9 117
7865 117 115 82 126 -135 9 -74 -1 147 -369 70 139 42 -53 -254 3 -123 28 -50 -171 -218 198 -325 -231 -103
7889 -103 125 -12 -57 254 304 -68 -13 -2 -93 313 -232 -130 137 -175 -23 -127 -28 -111 -58 -18 -159 -137 -220 -337
7913 -337 4 159 -130 167 58 42 -243 63 9 161 29 -77 -227 -201 -52 209 254 244 -196 53 249 78
7935 78 -9 -196 211 234 90 -156 127 210 -123 29 -28 248 198 241 91 -68 179 181 -135 221 115 282 153
7958 153 8 -41 405 74 59 245 29 243 81 51 -149 -251 65 240 -19 75 -44 0 -113 -171 28 -244
7980 -244 24 26 28 195 52 88 58 44 124 -288 -212 -10 -326 -79 -147 -145 128 144 179 -105 60 20 130 -132 -101
8005 -101 263 -88 -36 -147 -14 -329 -203 -25 -156 -233 -50 -56 -123 -32 -175 26 -177 53 -7 -243 -163 -115 24
8028 24 81 244 87 -288 44 -48 154 -86 20 -76 325 -351 -98 -16 -216 50 107 5 -93 -74 59 137 171
8051 171 -107 -28 218 90 142 -123 95 -85 45 -57 248 244 -79 -253 -2 167 -32 251 -54 319 191
8072 191 -16 -194 116 69 146 -28 -56 85 131 32 175 -285 -147 184 13 39 396 132 -100 74 -16 33 50
8095 50 47 -40 106 82 210 240 78 -230 182 296 -78 24 -14 429 40 -87 77 29 107 -5 -3 -6 -111 -70 -147
8120 -147 71 -206 226 -138 -136 -70 -181 30 -44 290 -376 -63 -44 -14 -193 -217 -115 0 -110 99 -91 -32 256
8143 256 -94 -299 -66 27 -95 -359 -172 144 109 -83 -220 10 -40 -81 214 -102 -54 -303 -136 -209 -268 -19
8165 -19 -256 -68 -459 133 190 60 52 352 224 -64 -67 112 37 -6 -23 -130 -215 -55 210 -403 49 -119 -164 286
8189 286 -244 -145
8191a45
$$ Imaginary data points
##PAGE= N=2
##DATA TABLE= (X++(I..I)), XYDATA
0 0 0 0 0 0 0 0 0 -8 8 -8 8 -16 16 -24 28 -32 40 -48 56 -66 80 -91 104 -122 142 -160 184 -208 236 -266
30 -266 300 -338 378 -424 472 -526 584 -649 721 -799 883 -979 1084 -1199 1329 -1474 1642
47 1642 -1828 2043 -2296 2593 -2952 3396 -3955 4696 -5715 7219 -9670 14344 -26437 121473
61 121473 236114 -64174 -57708 141239 142852 -62167 -37712 129517 128167 -3566 27409
72 27409 119882 77242 -15393 20810 73170 35874 950 56455 94844 64223 28183 20284
84 20284 10834 21282 46078 37966 14414 45142 72035 25655 -11104 36461 56702 -7620 -23725
97 -23725 52835 70994 290 -6860 58098 43701 -33249 -27390 34438 28965 -2251 21636 31280
110 31280 -19935 -26115 34145 27350 -47268 -34553 46748 29933 -50274 -31504 36951 6188
122 6188 -55218 -22845 18631 -17629 -31515 21265 14725 -59105 -54518 18039 10763 -47748 -25769
135 -25769 25026 -8340 -52997 -16438 12910 -33202 -51112 2261 13938 -36328 -32818 19443
147 19443 4845 -50414 -37602 2335 -14532 -26322 14120 17087 -37364 -36203 16939 1648
159 1648 -49756 -16923 36941 -1364 -42417 13546 47135 -24507 -56576 20528 44084 -35772
171 -35772 -42707 56449 68682 -31431 -49430 35897 43519 -31260 -22989 52131 43082 -20290 -2780
184 -2780 53067 30277 -23045 -8065 36396 32183 4827 7202 30302 42454 26383 -7885 -13812
197 -13812 29528 54875 16433 -11658 29374 56099 11187 -14712 29993 46964 -3594 -11981
209 -11981 46317 50660 -9506 -4813 54971 35982 -32876 -10627 59261 37778 -20640 4231
221 4231 46071 8778 -24990 18138 41919 -4890 -21227 22523 28357 -11515 -6646 24582 3668
234 3668 -26775 3862 30271 -8735 -30139 14721 28816 -27455 -43647 12088 29135 -18314
246 -18314 -30412 1889 -809 -24965 -9624 6070 -23798 -33895 5808 13583 -31379 -38986 3319
259 3319 6484 -34583 -38978 -6100 -943 -16015 -12002 -10984 -29769 -27513 -2131 -7644 -34715 -22371
273 -22371 8708 -7002 -36146 -16254 7391 -19392 -39581 -7401 7957 -24209 -26964 12964
285 12964 10045 -34933 -32239 8803 4026 -26069 -9778 19301 -1099 -28170 -6377 18307 -2359
298 -2359 -22974 -6264 12808 7659 455 1980 1855 5738 12007 -1931 -17539 7763 39798 15663
312 15663 -21561 2329 38008 11691 -18758 13675 38777 915 -14380 32612 44556 -8190
324 -8190 -17309 37692 41956 -13521 -13381 43996 45784 -6698 -9624 30957 27975 -2389 9313 34264
338 34264 16955 -2669 17968 30395 6838 -681 20703 20624 203 7404 26213 14316 -1545
351 -1545 11377 18460 -1081 -4948 17574 20845 -200 -2058 11202 4400 -7124 4436 14344
364 14344 -2551 -12991 5132 13719 -5596 -13858 -221 986 -11466 -7492 1996 -5782 -8681
377 -8681 4104 -3145 -28407 -22041 8197 2890 -25907 -19795 4291 -5257 -24224 -11863 -2048
390 -2048 -22598 -28217 -1601 2065 -26475 -25728 5743 139 -36185 -33126 2916 2444 -26012 -21262
404 -21262 962 -8636 -26048 -13771 -1063 -15317 -21671 -5624 -2211 -13824 -9399 439 -11354
417 -11354 -20307 -5494 1906 -13431 -12812 8753 7196 -15668 -12942 7572 2001 -13009 -274
430 -274 14153 -3783 -14814 12283 24744 -7401 -21209 12353 28214 -2117 -14040 16250
442 16250 27377 3283 -5780 10019 13779 6763 13774 18775 5919 1250 17525 23578 8287
455 8287 1410 13947 19929 13917 11210 13932 13492 14542 17615 10166 2264 13756 27846 16160
469 16160 -274 10135 23071 10829 1170 15665 21992 4447 1000 19048 18912 465 2511
482 2511 16855 9215 -3323 7482 19234 5179 -5081 8253 12760 -4978 -8359 10826 13700
495 13700 -4802 -7304 5870 2673 -8000 -758 5001 -10619 -14692 6881 10060 -15232 -19590
508 -19590 5635 6748 -20300 -21703 2282 4619 -13608 -14404 -3570 -9049 -16715 -7359 -2053 -15057
522 -15057 -19727 -5336 -515 -14307 -18451 -7676 -6119 -15481 -14717 -7604 -8764 -10070 -5651 -8941
536 -8941 -18697 -12845 -676 -6900 -17056 -7785 1465 -8480 -16338 -3051 3513 -10108 -15369 -2242
550 -2242 3524 -5048 -6305 1087 -825 -6876 -2190 3712 -1503 -3743 6413 8823 -3142 -5266 7945
565 7945 10950 1821 1622 7679 5884 5326 13606 11004 -1734 2780 19914 15385 -1592 4828 24229
580 24229 18376 222 4420 18747 15201 6394 13747 19402 9444 6553 19579 20685 5044 4753
594 4753 20469 19977 5291 8221 22382 17251 4474 8446 16891 11212 6952 15117 16486 7326
608 7326 6886 13549 9677 3909 10096 14305 5123 220 11477 16157 3611 -3416 4667 9709 1743
623 1743 -206 6245 6106 636 2133 3006 -4747 -6263 4556 6136 -6888 -10465 1093 4864 -3982
638 -3982 -8295 -6973 -5842 -4099 -1014 -5741 -11903 -6480 1558 -6750 -18768 -11619 1265 -3084 -14052
653 -14052 -11478 -3811 -7738 -12685 -7533 -5936 -14038 -12893 -2115 -3844 -14949 -11629 -937 -6429
667 -6429 -17699 -11033 -611 -5605 -12189 -5643 -2377 -9179 -11072 -3261 -2843 -8347 -6026 -648 -4534
682 -4534 -7817 -188 3092 -6698 -10447 1800 7627 -2259 -6729 3655 6947 -2089 -3837 2901 3959
697 3959 1462 6373 7539 -388 -287 10855 11432 -715 -2090 9120 13197 5768 3875 9017 9743
712 9743 6623 7316 8120 5805 8471 14228 11660 3902 5007 13692 12263 5146 6356 11668 10405 7586
728 7586 10172 10650 5697 6477 10953 6971 3471 9161 13854 6509 803 7167 10819 3000 -195 6960
744 6960 9869 2864 464 4993 5443 1398 1123 2826 -1010 -2107 4564 5688 -4034 -7092 2437 4001
760 4001 -6440 -7908 456 1354 -5478 -5871 -3059 -6523 -7649 -2047 -3176 -12123 -10948 -476 -727
775 -727 -11909 -13752 -4906 -3523 -11309 -12663 -6015 -5361 -9487 -9633 -8171 -10924 -10816 -5798 -6519 -12488
791 -12488 -11228 -4772 -6265 -11887 -9689 -5137 -8559 -11152 -7032 -4341 -7105 -7911 -5767 -7025 -8592
806 -8592 -5179 -2522 -6336 -7888 -2640 105 -5610 -9078 -1866 2803 -2394 -6825 -1952 2390 990
821 990 -455 -382 -2058 -897 5014 5062 -1652 -1231 7418 8427 353 -1044 5545 8221 6083 4277 4525
838 4525 4672 7241 10201 7086 1203 4315 12515 11286 3681 3904 11403 11481 4694 4217 9587 9948 7432
855 7432 9005 9559 5985 6426 11036 8506 3602 6023 10928 8362 4039 6926 10179 6395 2289 4496
871 4496 7267 5563 4011 5083 4929 3073 3276 4545 1670 -210 3617 6084 96 -3827 1164 5467
887 5467 -94 -5523 -2566 897 186 -1622 -2246 -4324 -3418 -841 -3009 -7882 -6551 -948 -997 -6451
903 -6451 -8765 -5153 -2959 -5702 -8047 -7960 -6802 -5712 -4622 -6098 -9591 -8662 -4960 -6261 -10814 -9563
919 -9563 -3954 -4665 -9438 -9250 -6370 -6719 -7763 -7143 -6206 -7145 -5862 -4460 -5651 -7662 -5544 -3512 -6117
936 -6117 -7964 -4112 -89 -2741 -6501 -4554 -684 -1920 -4277 -2788 -681 -450 216 461 -1773 -1649
952 -1649 2533 3732 -957 -2505 3202 6771 3520 214 2022 4827 4597 4227 3814 4301 6071 8175
968 8175 6764 3098 3403 8066 9604 5197 3328 7681 10834 7781 5747 6813 7887 6878 7168 7629
984 7629 7545 7963 9267 7980 5177 5881 8779 8303 5511 5937 8237 7912 5763 4708 5933 7027 5607
1001 5607 3954 4016 5637 6378 5290 2253 628 3074 5663 2769 -619 1343 4684 2819 -1168 -1532
1017 -1532 177 927 641 -1278 -3725 -2311 1380 566 -4708 -6233 -2803 -414 -2709 -6445 -5178 -2328
1033 -2328 -2293 -5375 -7348 -6286 -4847 -3682 -5362 -8021 -8196 -4230 -3579 -7782 -9961 -6578 -4383 -6435
1049 -6435 -8364 -6866 -5412 -6126 -7631 -7750 -6858 -6114 -5462 -6190 -6783 -6181 -4824 -4920 -6379 -6542 -4238 -3072
1067 -3072 -5156 -6362 -2812 -1585 -3359 -5217 -3843 -2009 -1357 -1078 -2457 -3084 -259 1353 -422 -2936
1083 -2936 -1224 2912 2844 -92 -910 1869 4664 3482 460 870 3469 5591 4712 3076 2450 4685
1099 4685 6758 5487 2542 3600 7672 7912 4693 4115 6098 7314 7046 5725 4776 5678 7604 7490
1115 7490 5693 5199 6599 7194 5486 4196 5511 7802 6910 4468 4286 5977 6074 4679 3975 4254 4786
1132 4786 5354 4117 2516 2198 4793 4860 620 -331 2961 4669 1828 -1237 -228 1618 1304 -578
1148 -578 -1726 -1523 -125 389 -1292 -3517 -3824 -1109 -803 -4334 -6477 -3396 -409 -3617 -6361 -5751
1164 -5751 -3933 -4404 -5014 -5580 -6266 -5248 -3753 -5045 -7768 -7188 -4442 -4789 -7444 -7672 -5400 -4329 -6233
1181 -6233 -7395 -6128 -5570 -6417 -6778 -5937 -5527 -5037 -4604 -5976 -6994 -5214 -3069 -4165 -6755 -5120 -2051
1198 -2051 -2517 -5137 -4963 -3003 -1983 -2228 -3102 -3657 -2277 630 452 -2817 -3401 -432 2570 195 -2364
1215 -2364 -369 3524 3303 -316 21 2123 2859 3210 2484 1365 2102 5530 6050 2058 700 4647 6863
1232 6863 4863 2964 4574 6302 5828 4961 4364 4340 5651 7034 5804 4270 4880 7228 7395 3959 2975
1249 2975 6206 7518 4378 3768 6197 6603 4494 3866 4604 4194 3900 5044 4236 2322 3692 5663 3437
1266 3437 462 1990 4342 3334 380 269 2229 2781 937 -512 -497 80 837 683 -1473 -3252 -647
1283 -647 1633 -1739 -5235 -3135 263 -1522 -4753 -4211 -2506 -2642 -3498 -4463 -5803 -5452 -3153 -2930 -5715
1300 -5715 -6629 -4019 -2954 -5421 -7571 -5585 -3780 -4623 -6384 -5792 -4277 -4894 -4908 -4962 -6043 -6023 -3585
1317 -3585 -3582 -6438 -6145 -2685 -2852 -6063 -6113 -2521 -2051 -4046 -4473 -3230 -2740 -2607 -1913 -3061 -3620 -1523
1335 -1523 409 -1198 -3360 -1466 2120 961 -2541 -1780 1929 2232 575 315 1382 1747 2369 3335
1351 3335 1565 523 3495 5783 3251 554 3504 6408 4515 2411 3329 4883 5286 4497 4571 4556 4470
1368 4470 5774 5958 4199 3658 6293 7343 4238 3125 5928 7387 4458 3177 5380 5977 4757 4513
1384 4513 5300 4160 4124 5438 4441 1919 3120 6031 4948 622 1195 4768 4457 1220 515 2418 2634
1401 2634 2027 839 434 -56 791 1725 -112 -2949 -1071 2614 414 -3761 -2997 -57 -385 -3167 -3356
1418 -3356 -2894 -2483 -1793 -1786 -4256 -5489 -2593 -1341 -4709 -6837 -4031 -1809 -4123 -6369 -5389 -3719 -4724
1435 -4724 -5525 -5027 -5304 -5418 -4381 -4002 -5786 -6635 -3897 -2770 -6029 -7009 -3218 -1867 -5280 -5815 -3380
1452 -3380 -3071 -4642 -4289 -3503 -3401 -3282 -2444 -2702 -4396 -2901 -57 -799 -3961 -2831 295 566 -2021
1469 -2021 -2366 105 951 -36 -58 113 111 1632 2803 1039 -1179 1467 5155 2761 -433 1763 4987
1486 4987 4035 1996 2583 3949 4028 4228 4560 3242 3215 5448 6266 3619 1899 4737 6974 4592 2313
1503 2313 4511 6707 5344 3215 4255 4984 4037 4863 5125 3552 3239 5764 5370 1859 2003 4991 5555
1520 5555 2149 1493 3879 4453 2532 1247 1985 1933 2579 2258 1037 -198 787 2678 1050 -2243 -1077
1537 -1077 2133 847 -2342 -2227 274 -505 -1930 -2160 -2459 -3239 -1740 -577 -3493 -5117 -2843 -981
1553 -981 -3478 -5892 -4025 -1653 -3224 -5294 -4734 -3139 -3755 -4800 -4554 -4938 -4958 -3776 -3304 -5295 -6352
1570 -6352 -3782 -2546 -5636 -6695 -3499 -2535 -4538 -5304 -3987 -3243 -3922 -3925 -3743 -4909 -3665 -1605 -2323
1587 -2323 -4324 -3775 -476 -1217 -4017 -4008 -724 -86 -1817 -2504 -1024 -16 -501 -75 -949 -1734 378 2613
1605 2613 1531 -1608 436 3781 2323 -658 800 3101 3352 2413 2296 2130 2628 3693 4466 2372
1621 2372 1797 4205 5855 4012 2093 3778 6194 4649 2521 3782 5102 4584 3985 4414 4098 3602
1637 3602 4988 4802 3082 2873 5428 5377 2627 2047 4639 4883 2773 1857 3347 3599 3201 2850 2195 1875
1655 1875 2306 3088 2315 -127 796 3424 2433 -565 -1200 2072 2081 -822 -922 219 -362 -513 -343 -1882
1673 -1882 -2707 -1117 349 -1858 -4413 -2438 -120 -1924 -4205 -3723 -1864 -2254 -3543 -4027 -3737 -3271
1689 -3271 -2903 -3025 -4350 -4972 -3057 -2623 -4578 -5985 -3649 -2059 -4175 -5608 -4156 -2887 -4143 -4188
1705 -4188 -3755 -4155 -3979 -2595 -3273 -4850 -3851 -1725 -1865 -4566 -4013 -1344 -773 -2981 -3710 -1881 -1149
1722 -1149 -1597 -2232 -1619 -1522 -802 -7 -623 -2448 -573 1972 1126 -1607 -525 2704 1913 220 478 1845
1740 1845 2045 1924 2200 1851 1472 3582 4024 2175 1186 3051 5035 3336 1919 3135 4735 4113 2737
1757 2737 3118 4141 3829 4004 4212 3526 3107 4938 5342 2560 2234 4858 5383 2721 2170 4269 4649 3292
1775 3292 2570 3028 2989 3365 3495 2464 1614 2390 4058 2743 150 657 3360 3321 111 -604 1941 2100
1793 2100 694 80 61 -332 694 1050 -746 -2687 -764 871 -1278 -3604 -2059 16 -1014 -2932
1809 -2932 -2697 -2145 -2176 -2367 -2612 -3630 -3748 -2234 -1900 -3816 -5106 -2976 -1661 -3989 -5599 -3759 -2100
1826 -2100 -3822 -4781 -3691 -3035 -3934 -3853 -3558 -4573 -4073 -2170 -2720 -5031 -4436 -1962 -1786 -4243 -4184 -2429
1844 -2429 -1676 -2871 -3291 -2633 -1948 -1609 -1664 -2018 -2555 -1358 363 -493 -2884 -1401 1231 602 -1761 -1002
1862 -1002 1299 1235 237 605 698 669 1982 2157 715 418 2629 3718 1869 573 2199 3902 3114 1744
1880 1744 2487 3718 3564 2952 3132 2989 2849 4070 4939 2656 2382 4671 5368 2766 2096 4408 5104 3318
1898 3318 2453 3657 4034 3554 3608 3439 2562 3062 4249 2976 1774 1931 4095 3313 1180 1050 2718 3111
1916 3111 1226 720 1445 1637 1097 1203 681 -436 658 1948 -60 -1904 -656 1550 -149 -2314
1932 -2314 -1669 216 -472 -1590 -1985 -1913 -1959 -1408 -1491 -2959 -3057 -1651 -1328 -3112 -4478 -2911 -1318 -3033
1950 -3033 -4443 -3766 -2509 -3193 -3938 -3650 -3730 -3584 -2768 -2829 -4244 -4195 -2080 -2315 -4761 -4802 -2281 -1986 -3989
1969 -3989 -3994 -2559 -2351 -2807 -2989 -2916 -2900 -1733 -1250 -1767 -3210 -1946 78 -480 -2764 -2436 727 253 -1300
1988 -1300 -1091 -67 17 -87 144 -188 -371 1194 2338 331 -909 1332 3192 1889 170 823 2891
2005 2891 2810 1566 1912 2803 2714 3030 2906 2421 2250 3776 4190 2422 1609 3989 5026 2969 1870 3500
2023 3500 4222 3235 3046 3441 3078 3424 3779 3238 1848 2609 4143 3597 1659 1684 3725 3734 1876 1243 2663
2042 2663 3170 2257 1438 1781 1512 1565 1925 957 -352 449 2285 957 -1469 -598 1772 528 -1378 -1191
2060 -1191 -364 -584 -716 -855 -1904 -1703 -917 -379 -2139 -3454 -1793 -703 -1991 -3548 -2766 -1378 -2428
2077 -2428 -3516 -3406 -2308 -2602 -2603 -2777 -3858 -3866 -2175 -2172 -4211 -4532 -2187 -1879 -3890 -4478 -2546 -2201 -3203
2096 -3203 -3794 -2957 -2636 -2672 -2332 -2536 -3124 -2399 -1231 -1620 -3518 -2860 -444 -593 -2807 -2932 -425 -67
2114 -67 -1020 -1040 -660 -494 -47 335 -497 -1062 312 1770 416 -918 578 2367 1269 -7 734 1914
2132 1914 1994 1571 1825 1796 1683 2726 2814 1651 1275 2978 4135 2135 1011 3007 4470 2895 1565
2149 1565 2857 3830 2970 3072 3148 2517 2885 3970 3531 2280 2245 3740 3976 1967 1720 3378 3754 2119
2167 2119 1625 2346 2817 2590 2147 1833 1290 1998 2615 1646 226 832 2815 1502 -334 -338 1238 1258 -351
2186 -351 -568 -232 -398 -125 -331 -1410 -1813 -260 78 -1565 -2811 -1581 -343 -1287 -2892 -2291 -744
2203 -744 -1764 -2710 -2541 -2384 -2515 -1995 -2092 -3349 -3655 -1920 -1423 -3438 -4014 -2539 -1884 -3158 -3519 -3010
2221 -3010 -2237 -2658 -2892 -2930 -3028 -2126 -1908 -2434 -3366 -2489 -1141 -1294 -3350 -3144 -1204 -705 -2072 -2320 -1344
2240 -1344 -645 -1157 -857 -1174 -1205 -465 683 -203 -1536 -111 1504 766 -1094 -64 1487 1173 370 574
2258 574 1173 1457 1765 1628 1474 1333 2103 2574 1946 783 2257 3909 2758 1070 1903 3363 3052 2329
2276 2329 2493 2610 2832 3244 2853 2153 2356 3790 3232 1869 2044 3625 3655 2363 1761 2599 3178 2539 2334
2295 2334 2088 2117 2596 2464 1857 1127 1432 2923 2159 572 696 2250 1925 137 -410 799 1082 668
2313 668 108 -354 7 361 508 -877 -1424 -537 272 -609 -2399 -1446 -520 -787 -2181 -2294 -1553 -1281 -1818
2332 -1818 -2008 -2580 -2526 -1745 -1508 -3020 -3315 -2025 -1474 -2734 -3841 -2435 -1600 -2906 -3445 -2853 -2664 -2384
2350 -2384 -2528 -2719 -3355 -2703 -1500 -2032 -3539 -3000 -1588 -1444 -3000 -3188 -1705 -979 -1851 -2134 -2063 -1121
2368 -1121 -1103 -1125 -1459 -1689 -624 549 -656 -2063 -872 766 304 -656 -489 373 1057 504 145 265
2386 265 909 1392 1571 877 401 1793 2548 1576 811 1418 3096 2349 1427 1708 2758 2816 2368 2096 2110 2562
2406 2562 3490 3032 1485 1963 3207 3463 2203 1770 2847 3699 2379 2050 2034 2633 2958 2427 1955 1957 2439
2425 2439 2997 2268 1223 1386 2739 2405 1015 659 1894 2172 981 212 748 857 881 587 63 -359
2443 -359 655 1085 -317 -991 -490 588 -436 -1474 -1866 -542 -303 -1247 -1935 -1561 -1042 -1037 -1690 -2289 -2495
2462 -2495 -1257 -1174 -2419 -2939 -2038 -817 -2182 -3257 -2783 -1703 -2030 -2545 -2865 -2831 -2433 -1991 -2830 -3353
2480 -3353 -2795 -1717 -1816 -2970 -3118 -2105 -1626 -2143 -3060 -2369 -1460 -1514 -2033 -2006 -2100 -1189 -832 -1427 -2190 -1524
2500 -1524 -155 -345 -1703 -1216 34 153 -582 -745 -366 224 646 -58 -340 35 1045 1255 382 -75
2518 -75 1268 1914 1492 404 834 2445 2050 1333 1486 2113 2247 2531 2205 1689 1909 2829 3123 1544 1579
2537 1579 2933 3059 2405 1816 2259 2860 2869 2253 1895 2448 2738 2789 2231 1673 2344 2813 2437 1565 1106 2298
2557 2298 2721 1457 888 1616 2201 1426 807 507 729 1368 1425 423 -45 744 1653 564 -505 -439 449
2576 449 582 -523 -1121 -638 -175 -283 -1254 -1687 -1162 -601 -1144 -1680 -2336 -1222 -694 -1719 -2624 -2134 -1330
2595 -1330 -1516 -2665 -2813 -2372 -1458 -2006 -2354 -2900 -2200 -1543 -2136 -3248 -2832 -2002 -1567 -2847 -2796 -2397 -1545
2614 -1545 -1848 -2721 -2504 -2101 -1487 -1640 -2187 -2418 -1472 -712 -1582 -2323 -1640 -518 -436 -1395 -1536 -667 -104 -744
2634 -744 -997 -1057 -512 605 92 -594 -490 781 976 384 -96 178 1263 1257 581 491 1450 1904 1505 988
2654 988 1217 1552 2341 1842 1458 1380 2487 2857 1689 1318 1847 2644 2517 1772 1688 2175 2798 2171 1870 1904
2674 1904 2621 2943 1980 1363 1864 2446 2348 1716 1334 2187 2514 2070 1112 1283 1661 1914 1359 892 808 1457
2694 1457 1914 808 303 635 1571 717 42 -121 503 626 55 -503 -776 -76 275 -325 -1315 -939 -390
2713 -390 -223 -1203 -1950 -988 -573 -1254 -1848 -2016 -1111 -1238 -1925 -2305 -2098 -1779 -1306 -2281 -3027 -2259 -1333 -1662
2733 -1662 -2896 -2700 -1828 -1633 -2177 -2824 -2571 -1700 -1448 -1996 -2625 -2240 -1803 -1389 -2210 -2940 -1896 -1090 -1361
2752 -1361 -1884 -2069 -820 -672 -1390 -1733 -1482 -792 -547 -713 -1651 -956 -93 182 -692 -839 162 625 337
2771 337 -241 -162 681 932 755 229 463 1257 1326 742 748 887 1566 1985 881 817 1828 2380 1695 1179 1565
2792 1565 2079 2320 2057 1799 1648 2469 2735 1513 1554 2238 2842 2258 1795 1600 2369 2529 1813 1497 1696 2418
2812 2418 2433 1409 950 1429 1980 2023 1292 572 1448 2147 1321 435 890 1136 1285 610 191 428 724 792
2832 792 12 -436 -76 192 198 -586 -1121 -492 51 -765 -1465 -1116 -274 -462 -1419 -1695 -1087 -979 -1278 -1669 -2203
2853 -2203 -1588 -1017 -1382 -2443 -2061 -1282 -1511 -2025 -2349 -1752 -1499 -1681 -2170 -2367 -2008 -1604 -1959 -2276 -2331 -1781
2873 -1781 -1211 -1548 -2457 -2403 -1471 -1347 -1754 -2084 -1040 -1036 -865 -1719 -1784 -1326 -623 -752 -1414 -1143 -535 66 -635
2894 -635 -921 -668 205 80 -392 -391 12 496 555 134 -5 852 995 1006 238 525 1361 1710 1117 585 1042
2915 1042 1953 1637 970 1021 1738 2006 1782 1580 1453 2144 2347 1855 1261 1663 2263 1985 2149 1515 1882 2503
2935 2503 2321 1606 1496 1992 2703 1881 1435 1247 1849 2133 1831 957 1175 1959 1762 542 435 1144 1691
2954 1691 1151 554 533 968 1217 563 -361 115 481 500 265 -652 -455 224 -363 -903 -1173 -313 -396 -642 -1416
2975 -1416 -1179 -630 -575 -1157 -1801 -1683 -1007 -1094 -1962 -1998 -1294 -1193 -1535 -1894 -2078 -1656 -1489 -1581 -1999 -2353 -1327
2996 -1327 -1545 -1842 -2439 -1876 -1376 -1311 -1881 -2112 -1507 -975 -1743 -2301 -1687 -1379 -1297 -1203 -1744 -1522 -775 -544 -1260
3017 -1260 -1544 -888 -400 -714 -894 -999 -440 -34 -6 -689 -486 507 653 -157 -545 215 747 1007 364 222
3037 222 493 1130 1022 611 542 1379 1526 780 1067 1120 1327 2076 1642 854 1414 2184 2063 1117 1344 1817 1995
3058 1995 2149 1455 1290 2111 2323 1462 1571 1390 1965 2113 1430 1376 1590 2222 1651 1111 1248 1900 1504 908
3078 908 680 868 1188 1190 956 399 922 1401 1046 3 -60 639 839 486 -152 -203 97 544 -143 -690 -503
3099 -503 -134 14 -725 -949 -553 -348 -721 -1207 -1712 -920 -531 -1263 -1791 -1362 -1065 -1032 -1819 -1791 -1549 -1156 -1578
3120 -1578 -1905 -2199 -1468 -1203 -1593 -2203 -2243 -1336 -1266 -1862 -2230 -1679 -1318 -1260 -1701 -2112 -1545 -1161 -875 -1738 -1931
3141 -1931 -977 -132 -1247 -1865 -1349 -749 -532 -1078 -1289 -850 -265 -171 -817 -922 -188 -11 -125 -420 -117 289
3161 289 475 284 122 107 962 1091 461 314 855 1578 1044 821 584 1095 1434 1391 806 923 1599 1630 1340
3182 1340 1176 1432 1526 1803 1318 1220 1788 2050 1923 1257 1204 1841 1993 1849 1143 1141 2335 2045 1087 1381 1509
3203 1509 1757 1564 1118 792 919 1404 1147 760 442 1298 1251 658 320 401 940 1089 248 -359 333 617
3223 617 416 -265 -346 94 166 -488 -787 -997 -221 175 -757 -1269 -786 -391 -902 -1260 -1220 -1074 -778 -1063 -1767
3244 -1767 -1404 -1159 -895 -1392 -1914 -1431 -1215 -905 -1565 -2119 -1574 -1154 -1274 -1871 -1797 -1140 -1312 -1508 -1949 -1602
3264 -1602 -1206 -1005 -1491 -1600 -1295 -868 -985 -1761 -1675 -816 -954 -926 -1089 -1061 -579 -106 -669 -1009 -597 56 -218
3285 -218 -427 -506 -52 460 285 -226 -278 430 921 363 -110 355 707 945 588 270 961 1326 1303 645 704
3306 704 1220 1443 1366 900 1128 1635 1858 1590 731 1072 1934 1584 1424 1247 1837 1618 1521 1003 1120 1635 1990
3327 1990 1638 1054 1182 1721 1712 1209 881 1058 1534 1480 706 539 930 1294 1080 573 166 947 1004 650 -145
3348 -145 215 558 328 -51 -187 275 260 462 -591 -608 -279 101 -428 -810 -869 -314 -322 -704 -1555 -1183 -338
3369 -338 -608 -1285 -1279 -1134 -729 -1129 -1532 -1342 -1174 -954 -1444 -1656 -1490 -1087 -1161 -1745 -1920 -1604 -820 -994 -1839
3390 -1839 -1869 -1159 -902 -1220 -1872 -1639 -1184 -843 -1373 -1706 -1183 -738 -735 -1139 -1473 -913 -116 -373 -896 -609 -115
3411 -115 -243 -489 -750 -598 -52 -90 -284 -394 -164 338 181 -56 -54 175 749 820 78 276 1034 1258 530
3432 530 506 785 1115 1246 999 799 1234 1847 1315 906 813 1802 1821 1408 1105 1241 1607 1677 1269 964 1276
3453 1276 1876 1856 1107 1131 1389 1778 1424 932 900 1416 1348 843 886 1114 1277 1200 710 642 869 886 950 374 113
3476 113 749 737 524 59 158 431 385 -327 -363 -257 139 -53 -582 -626 -669 -59 -203 -841 -880 -419 -313 -952
3498 -952 -1297 -952 -790 -647 -1139 -1528 -976 -728 -740 -1554 -1514 -1346 -917 -1467 -1716 -1441 -1131 -871 -1315 -1653 -1119
3519 -1119 -947 -1169 -1156 -1469 -1467 -1045 -753 -1068 -1287 -787 -540 -1180 -1649 -1172 -480 -657 -1138 -1110 -780 -289 -417
3540 -417 -798 -687 -376 67 -105 -298 -377 411 543 48 -200 172 659 565 281 22 509 584 835 392 419
3561 419 767 1062 1208 271 771 1328 1273 751 703 1025 1384 1435 990 953 1230 1655 1473 1067 985 1549 1491 929
3583 929 727 901 1691 1443 1166 740 1192 1732 1216 758 677 1352 1370 819 676 129 942 1346 863 357 274
3604 274 1108 832 576 -131 378 546 556 -103 -278 168 541 40 -572 -271 73 -19 -732 -853 -775 -191 -331
3625 -331 -852 -873 -810 -486 -823 -908 -1015 -877 -557 -1096 -1459 -1432 -703 -1121 -1071 -1685 -1157 -623 -969 -1606 -1471 -1004
3647 -1004 -589 -1446 -1537 -1172 -990 -749 -1010 -1607 -1430 -664 -656 -1483 -1204 -750 -543 -1080 -1194 -1011 -539 -421 -774
3668 -774 -828 -587 -166 -137 -758 -521 -36 -32 -76 -336 -122 84 318 133 -203 240 438 780 529 74 228 775
3690 775 749 390 595 658 1164 773 709 761 809 1317 900 637 965 1334 1358 1039 1090 1006 1264 1323 1028 891 1258
3713 1258 1557 1122 870 1215 1457 1400 1003 567 1101 1392 1486 550 422 1139 1247 628 422 548 1048 550
3733 550 712 122 -31 819 504 330 -8 123 138 358 -234 -400 -94 321 164 -765 -558 -15 -80 -451 -538
3754 -538 -803 -222 -280 -483 -1105 -859 -507 -995 -903 -1241 -1102 -818 -755 -1239 -1348 -927 -1166 -1426 -1591 -1068 -848
3775 -848 -1259 -1460 -1363 -1202 -936 -1127 -1455 -1114 -1054 -817 -1319 -1220 -1246 -743 -829 -865 -1121 -905 -390 -581 -885 -947
3797 -947 -377 -333 -641 -772 -535 -326 26 -137 -293 -418 213 -85 -228 -234 274 632 221 118 156 512 476 335
3819 335 19 317 901 958 503 615 916 1135 1103 638 799 1196 1406 1249 686 922 1429 1294 888 612 1025
3840 1025 1239 1391 829 848 1115 1239 1133 932 922 936 1448 906 712 904 1468 1161 520 1004 997 1192 806
3861 806 86 270 644 685 506 123 156 624 174 188 -131 -197 386 273 -186 -507 28 -170 -176 -276 -599 -233
3883 -233 -457 -406 -787 -935 -457 -408 -924 -1351 -800 -689 -840 -991 -1152 -1087 -489 -941 -1307 -1111 -577 -1007 -1061
3904 -1061 -1347 -827 -974 -817 -1281 -1379 -1130 -437 -1020 -1426 -1118 -1174 -861 -1174 -1137 -1021 -632 -491 -796 -1174 -925
3925 -925 -74 -231 -479 -896 -462 120 -246 -712 -676 75 163 -126 -326 -336 -92 233 60 -137 247 619 370
3946 370 71 457 598 798 556 419 472 743 865 499 532 836 1068 1062 631 855 960 1415 983 544 940
3967 940 1249 1147 1026 731 831 1435 1214 1130 575 1225 1485 1114 517 684 1242 1097 763 442 606 1109
3987 1109 721 663 212 400 621 691 87 323 514 419 593 78 -71 -115 240 -144 -397 -223 127 170 -286
4008 -286 -495 -485 322 -210 -907 -700 -248 -316 -805 -695 -659 -747 -490 -776 -1077 -873 -469 -686 -998 -1023 -808 -776
4030 -776 -790 -1321 -806 -1095 -840 -1119 -1292 -966 -535 -844 -1170 -1152 -966 -382 -928 -1039 -1253 -588 -581 -1001 -1233
4051 -1233 -1028 -386 -442 -759 -807 -789 -269 -36 -536 -379 40 -153 -44 -381 -245 1 196 140 -232 -152 295
4072 295 137 342 8 544 545 241 452 55 559 1033 619 418 588 867 1073 635 608 669 947 928 586 674
4094 674 877 1134 993 786 567 1036 1102 768 546 711 972 1276 737 804 799 1000 1061 657 455 838 978 678
4116 678 332 248 819 897 370 569 772 535 759 190 159 238 429 321 111 -155 -111 354 2 -584 -280 83
4138 83 -15 -393 -519 -257 -318 -130 -735 -907 -407 -438 -401 -1028 -916 -375 -655 -1131 -1113 -734 -502 -593 -841 -1123
4160 -1123 -674 -770 -821 -994 -921 -490 -663 -761 -1088 -1075 -707 -640 -1144 -1228 -713 -536 -630 -1049 -869 -545 -494 -641 -863
4183 -863 -601 -395 -126 -460 -893 -493 -215 -222 -438 -424 -457 -79 158 -496 -240 34 278 128 -124 133 231 709
4205 709 208 375 491 865 634 362 518 630 430 512 514 333 851 950 784 344 870 779 853 805 584 1033
4227 1033 1097 985 747 730 1323 969 773 644 750 1214 1034 704 644 659 1412 830 452 268 676 753 630
4248 630 508 410 616 773 571 0 158 660 429 226 256 39 271 413 3 -329 -119 25 -47 -282 -361
4269 -361 -360 34 -395 -565 -361 -201 -62 -846 -606 -550 -64 -725 -893 -826 -550 -652 -966 -747 -800 -800 -678 -815
4291 -815 -967 -843 -594 -604 -1026 -970 -693 -506 -852 -854 -767 -542 -866 -1043 -1050 -831 -654 -163 -697 -657 -679 -215 -632
4314 -632 -802 -367 -279 -394 -307 -392 -591 -239 53 -297 -216 -83 200 294 -131 -243 -108 244 199 203 78 773 615
4337 615 -108 290 540 555 438 290 31 542 831 889 738 503 842 788 777 770 703 946 1306 898 526 951
4359 951 1120 642 559 850 925 894 856 583 713 1049 813 717 290 847 1014 754 510 345 557 898 444 150
4381 150 241 341 362 106 -145 -160 246 578 150 124 -209 183 178 -70 -132 -205 -28 -49 -459 -749 -171 -102 -354
4404 -354 -910 -521 -172 -509 -474 -824 -799 -455 -608 -708 -1037 -745 -177 -423 -1065 -907 -391 -427 -639 -1350 -735
4425 -735 -502 -660 -1009 -1195 -587 -825 -579 -985 -1028 -488 -638 -480 -915 -566 -537 -104 -744 -743 -226 -177 -284 -628
4447 -628 -596 -347 -201 -349 -143 -103 -235 57 89 -79 -279 257 412 -1 -86 286 630 247 275 178 364 439
4469 439 448 154 294 578 667 574 349 447 826 497 682 374 808 1013 500 388 492 1052 854 594 343 424
4491 424 1016 942 536 729 868 821 743 585 568 741 891 644 510 340 949 933 506 483 275 333 580 267
4513 267 -61 316 445 451 42 144 -36 535 23 -53 -248 16 260 -199 -475 -178 -82 -207 -475 -364 -515
4534 -515 -139 -467 -625 -540 -451 -264 -309 -588 -938 -451 -139 -855 -1003 -440 -502 -199 -857 -950 -904 -342 -699 -914
4556 -914 -1079 -623 -220 -908 -710 -911 -412 -816 -889 -1023 -702 -212 -598 -986 -535 -229 -274 -540 -870 -595 244
4577 244 -452 -375 -350 -190 130 -200 -316 -190 115 -177 -52 -135 163 318 123 406 241 146 366 737 80
4598 80 294 465 801 602 332 608 673 696 527 200 115 960 643 276 604 628 489 1006 334 254 704 970
4620 970 690 539 539 1096 543 373 519 473 882 808 295 639 687 935 687 233 147 622 533 498 187 570 192
4643 192 545 120 56 136 356 234 -15 -76 172 321 305 -520 -450 152 -220 -233 -672 -183 -92 -138 -481 -744 -434
4666 -434 -153 -549 -346 -551 -221 -180 -610 -571 -767 -401 -553 -710 -755 -524 -349 -611 -936 -613 -448 -400 -375 -772
4688 -772 -909 -413 -454 -623 -1067 -554 -183 -439 -637 -751 -557 -272 -379 -465 -546 -282 -41 -315 -463 -365 -75
4709 -75 -71 -257 -249 -342 -67 -38 -359 -411 -92 173 -47 -174 188 367 307 194 5 293 507 472 280 123 357
4732 357 604 285 13 236 479 699 426 522 147 498 598 499 512 736 1047 786 320 260 737 797 902 422
4754 422 507 630 1060 657 335 108 708 447 639 268 487 485 336 66 123 241 482 104 75 217 167 419
4776 419 145 -172 -24 -79 327 -495 -198 21 54 -90 -126 -682 -59 65 -172 -101 -601 -231 -460 -577 -484 -171
4798 -171 -254 -249 -715 -595 -590 -285 -716 -683 -728 -237 -379 -584 -954 -764 -431 -541 -802 -1149 -570 -123 -712 -595
4820 -595 -939 -564 -297 -498 -763 -943 -339 -357 -390 -452 -538 -267 -446 -499 -317 -373 50 -113 -449 -569 -216 -217 -32
4843 -32 -2 -226 40 19 -50 -193 0 487 -21 -158 247 364 358 191 -9 153 606 603 238 281 431 576 652
4866 652 163 314 551 942 666 128 453 636 772 199 275 510 696 602 323 286 617 650 788 157 285
4887 285 473 722 312 523 460 440 757 552 445 157 496 560 -1 206 549 404 211 -47 141 556 239
4908 239 -90 -221 -60 274 220 -96 -163 -329 -84 149 -541 -431 -233 4 -293 -258 -419 -367 -319 -250 -454 -383
4930 -383 -202 -402 -768 -531 -352 -99 -532 -597 -688 -351 -92 -768 -623 -584 -48 -416 -774 -740 -795 -220 -459 -798
4952 -798 -508 -356 -92 -522 -825 -624 -409 -369 -375 -519 -492 -131 -322 -478 -696 -175 -187 -94 -513 -146 193 -138
4974 -138 -59 -431 -434 153 170 -106 170 96 508 317 -71 32 249 424 387 37 455 529 524 352 440 462 679 525
4998 525 354 481 655 641 478 407 544 488 654 678 523 551 716 607 372 358 654 364 589 383 275 451
5020 451 861 336 129 415 620 510 278 179 554 429 317 88 -185 348 65 112 -71 -345 266 27 269
5041 269 -77 -268 239 23 -179 -178 -264 -231 -65 -273 -325 -253 -12 -155 -608 -534 -420 -232 -417 -635 -366 -116
5063 -116 -367 -602 -550 -411 -291 -455 -879 -343 -451 -258 -383 -904 -571 -259 -345 -653 -1165 -735 -70 -509 -875
5084 -875 -947 -233 -394 -351 -558 -631 -25 -167 -596 -49 -406 -418 -387 -279 -449 -109 -302 -271 -62 -85 -129 16 166
5107 166 -198 -173 219 281 159 -165 155 47 103 270 37 24 389 349 266 204 589 906 660 459 300 388 389
5130 389 392 101 311 517 407 429 395 653 636 408 245 406 631 792 610 2 253 669 452 161 503 452
5152 452 498 238 218 244 414 612 120 83 389 242 561 451 -278 156 295 373 102 -42 235 197 159 -95
5174 -95 -276 34 241 -22 -563 -80 -3 -56 -320 -404 -39 75 -225 -382 -348 -192 -342 -371 -552 -581 -285 -253 -412
5197 -412 -501 -145 -415 -414 -405 -499 -626 -105 -264 -732 -584 -428 -510 -512 -509 -340 -436 -79 -541 -458 -220 -148 -37 -324 -566
5222 -566 -273 -136 -139 -248 -470 -228 -310 135 -381 -168 174 133 -281 -220 417 148 -152 -474 -13 133 189 -54
5244 -54 -42 295 259 529 106 48 222 195 517 75 104 444 481 202 367 102 684 520 211 218 338 811 617
5267 617 -88 326 500 476 442 505 185 575 829 96 139 359 384 531 350 486 301 628 758 -6 388 495
5289 495 628 -17 233 229 286 301 42 -244 54 325 170 88 121 192 322 218 -184 -192 -83 102 -138 -474 155
5312 155 -416 -313 -128 -204 -319 -59 -123 -288 -570 -148 -174 -272 -570 -447 -263 221 -644 -547 -437 -401 -301 -460
5334 -460 -533 -400 -39 -285 -628 -685 -272 -244 2 -666 -370 -3 45 -276 -465 -272 -218 -188 -319 -403 -52 174
5356 174 64 -619 -429 56 21 -320 -323 -234 -61 196 -34 8 -18 147 161 -154 141 258 161 312 341 159 324
5379 324 480 4 -23 -124 323 417 339 60 413 270 780 165 306 311 577 256 478 448 438 296 257 239 466
5402 466 705 549 375 261 502 559 570 338 81 183 532 272 -4 166 777 209 328 89 115 474 103
5423 103 24 -64 35 81 -1 -110 -278 -119 -70 -48 -360 51 162 -339 -411 49 -327 108 305 -294 -203 -252 -137
5446 -137 -500 -324 -451 -67 -358 -389 -113 -271 -272 -474 -671 -223 -98 -248 -482 -240 -454 -239 -323 -305 -704 -723
5468 -723 -295 -190 -396 -319 -128 -226 -481 -456 -450 -341 -296 -205 -397 -94 195 -295 -453 -406 35 -103 73 -447 81
5491 81 81 267 -3 -263 64 -19 151 -15 -69 -16 115 145 -11 137 290 199 31 259 -143 363 451 261 93
5514 93 319 414 534 122 133 -50 490 346 175 195 240 834 276 342 561 694 348 501 374 301 570 66
5536 66 289 193 485 430 214 289 192 333 767 193 -218 261 521 122 -239 172 -104 358 180 -80 -37 -323
5558 -323 146 52 -189 -192 -161 -31 6 173 -196 -204 -125 -395 -283 -232 124 -234 -42 -158 -202 -246 -195 -255 -469 -355
5582 -355 -130 -227 -330 -426 -249 -387 -366 -278 -443 -226 -506 -519 -387 -181 39 -639 -410 -323 -244 -188 -416 -527 228
5605 228 -35 -340 -305 -211 -309 -389 -294 -174 -153 -509 -131 -10 -309 -228 -249 66 -216 -277 -175 -105 19 -242 19
5628 19 211 -162 -145 134 -234 17 159 162 -133 192 372 202 -140 185 -60 429 187 350 358 -32 525 224
5650 224 191 225 311 326 431 469 404 454 232 195 100 397 684 212 425 380 627 418 302 86 111 407 467 32
5674 32 136 584 332 170 346 -209 -29 375 327 55 276 229 -50 79 -162 97 -84 240 -32 -352 -53
5695 -53 84 -177 -96 -65 -83 237 -29 -335 -261 52 -335 -174 -200 -203 -287 138 -335 -216 -168 -177 -342 -466 -172 -93
5719 -93 -358 -483 -407 -214 -391 -319 -364 -338 -194 -399 -177 -252 -262 -68 -150 -344 -122 -1 36 58 -660 -244 -191 12
5743 12 -207 -262 -357 -134 -130 154 -227 -149 80 51 35 -456 -12 -51 -329 -100 134 34 146 167 -36 185 23
5766 23 264 231 246 19 185 204 79 238 472 383 264 182 99 297 403 -43 435 347 457 179 152 344 22
5789 22 312 37 36 481 294 -5 339 348 4 366 102 232 70 387 481 347 162 113 326 213 23 132
5811 132 -74 151 289 -192 -54 142 74 -113 77 -169 48 255 146 -146 -386 31 48 32 -108 72 -237
5832 -237 -33 17 -457 -13 -19 -184 -138 -151 -412 -136 -173 -311 -291 -111 35 -165 -633 -105 -283 -138 -642 -277
5854 -277 -42 -86 -194 -234 -31 -398 -123 -198 -290 -351 -175 24 -254 -426 -255 -96 -153 -364 -76 -277 -18 287
5876 287 -456 -235 -5 -134 -114 -75 265 145 258 71 -187 120 -29 157 76 0 213 263 301 222 26 126
5898 126 204 -114 160 221 266 376 199 14 237 450 384 200 -10 253 406 283 339 115 500 264 345 85
5920 85 167 392 479 31 308 71 159 519 -56 228 93 488 380 115 91 589 196 282 234 424 -127 26
5942 26 296 -189 354 155 -21 222 148 120 73 -170 10 69 154 -55 -157 -61 -32 249 149 -30 -350 -172 97
5965 97 -112 -216 -255 25 -143 -272 -175 -89 -171 69 -172 -169 -162 215 -168 -205 -113 84 -238 -255 -425 -397 -58 -125 108
5990 108 -329 -255 -45 -114 -327 -440 68 -709 -269 -288 -222 -16 -254 -3 -334 45 -72 -246 -87 -5 -207 195
6012 195 115 78 -137 -45 207 -188 -205 171 169 220 -19 -2 322 448 176 174 -27 4 279 226 -164 94 427 212
6036 212 257 428 242 135 162 183 153 331 345 36 69 186 195 236 383 285 261 194 103 5 302 233 392 155 208
6061 208 -14 198 189 37 214 98 298 303 -132 27 97 -5 322 316 226 7 154 98 -10 34 29 -47 -76 105 -41
6086 -41 97 170 -230 -73 102 -103 -335 -281 -274 29 25 -165 -160 -10 75 -144 -467 -359 -221 68 -223 -442 -402 -34
6110 -34 -364 -278 -311 -182 -20 -54 -258 -189 -199 -182 -58 -222 -50 -244 -84 -203 20 -313 -76 208 -392 -192
6132 -192 -104 50 -137 -431 -127 -146 194 -54 -281 -38 80 -8 61 -259 -85 254 56 -203 32 -166 138
6153 138 155 190 12 248 275 342 -274 -123 172 46 -266 -133 -50 305 253 -5 372 159 233 207 67 43 64
6176 64 287 343 7 -16 314 327 191 84 85 438 376 130 246 76 308 -143 277 83 274 229 -75 68 79
6199 79 350 289 -32 176 160 268 83 197 -190 87 -85 1 -113 -218 109 -311 305 -42 67 -41 -357
6220 -357 -151 -270 8 428 16 17 31 -288 -24 -382 0 -369 -191 -316 -90 -169 -434 -370 4 13 -230 -127
6242 -127 149 -94 -492 -268 -217 -64 -81 -71 -124 -363 -8 -31 -269 -312 -11 -318 -27 -205 -255 -352 -271 135 -101
6265 -101 289 -269 -188 -46 -13 147 28 -30 -193 -76 60 -57 181 -100 -174 36 138 55 25 309 184 270
6287 270 47 84 -89 78 -168 -13 271 -9 204 -90 -145 -88 -51 45 61 209 262 174 -15 306 276 81 33
6310 33 48 72 127 307 65 122 141 345 326 -9 53 219 112 185 -216 -128 222 349 191 226 -85 142 172 -123
6334 -123 -89 -264 168 77 148 -161 -162 257 101 55 -208 -301 116 -110 -308 -69 109 264 -146 -269 -163 211
6356 211 -148 -188 -17 -210 -96 -259 -191 -141 6 -61 -51 138 -161 -184 -208 -50 -291 -160 -367 -67 -260 -5
6378 -5 -8 -93 306 -346 65 -139 -98 -298 -54 -78 -101 75 -285 -32 44 -209 -47 -77 -107 4 243 -208 -205 -250 255
6403 255 318 -135 121 118 -217 -312 -8 -171 -26 82 -46 89 -316 7 332 -35 -46 34 104 85 111 23 291
6426 291 91 8 68 -30 -201 145 243 2 39 156 -199 -22 136 115 70 316 -9 313 26 364 232 -132
6448 -132 114 -11 72 -42 -113 -119 192 289 73 207 11 -119 158 17 202 -213 178 240 26 89 146 -105 142
6471 142 -87 258 -142 -110 -63 -193 170 58 40 -4 -414 51 27 -353 -126 -181 175 -91 -219 -198 153 29
6493 29 -45 3 -250 -292 386 -163 -190 -52 -32 -96 -114 24 -83 -16 -166 -93 -228 70 51 -320 -217 -75 -124 -9
6517 -9 -14 -248 -137 90 -164 275 -155 46 137 -114 -144 -10 -268 -272 53 41 -36 -21 -343 39 -180 342 117 -107
6541 -107 -41 29 19 -20 -69 35 -132 29 79 -82 -101 5 -59 191 -154 -51 53 -29 129 21 97 250 312 8
6565 8 288 -12 141 80 81 274 -38 190 164 187 123 154 -24 198 38 -33 113 -56 53 198 -307 277 154
6588 154 460 38 6 136 35 4 140 -94 295 228 102 -148 -369 -102 283 299 37 96 -21 -112 -174 360
6610 360 -79 -100 79 -46 62 -11 -77 -253 173 -147 -172 -123 -59 -240 20 -26 -368 170 -50 -190 -57 -161
6632 -161 139 30 -51 -173 -209 -233 -202 -114 0 -128 -140 230 -8 201 -126 -79 -379 -322 -161 -170 25 -66 -102 254
6656 254 -74 -23 58 -15 51 69 -30 -210 -244 -176 -23 6 -212 -28 -238 144 290 -293 -134 16 -152 148 -16
6679 -16 160 -135 18 6 18 170 -115 -299 37 52 53 -50 -51 255 -20 25 54 102 -55 81 -92 93 149 48
6703 48 -14 22 168 -3 -157 -205 -106 32 158 -113 41 156 212 303 281 49 236 128 29 -31 318 -79 182
6726 182 -299 -88 -121 -235 147 -77 131 169 7 139 -285 -424 169 50 -58 34 -55 5 92 -102 65 -289
6748 -289 134 71 -177 -170 -54 -84 -7 -269 -25 26 -239 -294 -168 -117 -75 61 -297 -99 89 84 50 -26 -149 32
6772 32 -96 -104 -106 -113 -76 -63 118 69 118 114 -250 -61 -127 -77 -49 284 72 18 156 -220 17 -58 -44 -55 -359 -62 -79
6799 -79 -137 49 -138 -144 -170 204 -78 153 2 273 202 86 47 150 174 -40 188 322 176 73 69 -149 115
6822 115 77 136 127 -46 155 285 -53 183 -200 212 303 120 176 94 -152 -191 105 -214 -113 88 335 -15 127
6845 127 128 -143 -160 -113 -30 -98 134 7 9 253 391 -2 60 24 100 101 83 180 146 -137 3 -195 125 378 -35
6870 -35 156 -150 -250 -122 -233 89 -257 -3 -30 -5 27 -173 -335 160 -236 -124 -4 -115 67 -42 -23 45
6892 45 205 94 -29 154 -271 -14 -251 129 -14 -140 -193 18 -158 -67 -287 11 -102 62 17 -324 169
6913 169 4 55 -104 131 52 -26 61 -272 69 -37 119 62 119 -103 110 -145 118 -119 44 -102 61 275
6935 275 151 -82 -42 -15 50 201 -97 44 -252 -130 -130 13 3 -203 -100 152 -41 89 -73 -117 403 -156
6957 -156 249 164 -173 -74 -279 73 41 6 50 290 -298 -29 236 263 79 275 170 -71 269 -59 -128 -105 -216
6980 -216 19 -415 85 399 261 -59 -148 247 173 -19 3 -197 188 4 -131 115 -22 -1 -10 -317 130 -88
7002 -88 68 256 150 -22 -335 48 -51 37 69 -130 271 -76 141 -57 -20 55 -183 -89 37 -59 -178 -32 -24
7025 -24 -167 -96 -202 -65 167 -12 86 232 -257 290 -29 121 -226 127 -6 84 -56 142 -25 -34 -32 -141 -28
7048 -28 -163 367 -137 -164 -219 4 66 116 2 -122 121 -125 -308 -9 172 -85 23 279 157 -16 58 -161
7070 -161 -143 335 -59 -63 -166 43 50 5 130 -80 -5 97 87 -34 1 156 190 275 118 -124 -135 178 -144 61
7094 61 -150 54 241 -166 -28 -56 -48 -5 129 -82 38 -320 115 227 -72 -165 -79 222 193 -263 -132 55 98
7117 98 -14 -207 31 -65 -112 22 -15 -317 -146 190 127 -179 72 -57 -108 230 47 -46 214 -150 153 263
7139 263 -27 103 -5 -11 148 19 -99 76 107 -156 89 -23 -103 -64 190 -235 -191 4 157 43 18 -290
7161 -290 89 159 -95 200 -60 62 -183 90 -239 -56 -260 -57 -102 -123 -309 -157 148 -119 54 -62 14
7182 14 -161 160 -23 -229 130 -105 -363 -176 -221 95 -36 -191 -97 -51 -85 -164 19 -40 36 -125 -53 -64 -128 -50
7206 -50 125 -84 -61 141 265 -67 67 125 172 -69 -12 -280 154 146 -345 114 128 90 107 -11 -59 -218 -168 -175 -139
7231 -139 54 223 -50 -91 -237 -23 122 -90 -62 385 6 12 -130 101 8 114 172 -236 70 37 -57 -21 -71
7254 -71 -96 -181 -214 -16 -26 -429 37 -62 73 148 79 229 -77 -105 42 -63 -294 -150 102 -154 -199 95 231
7277 231 246 62 -38 76 374 280 121 19 307 -13 341 63 -21 -4 143 64 -186 13 -28 19 207 68
7299 68 -195 -213 -59 -101 -21 171 202 218 215 -81 117 6 -42 34 136 4 44 4 -135 79 -188 -152 -36 92
7323 92 184 96 -130 69 -15 7 -100 56 -372 -134 -74 -278 -32 64 321 102 141 -130 122 89 -50 -51 36 106
7347 106 206 87 203 -142 87 146 -59 -100 373 33 175 10 28 65 160 58 -119 148 -75 151 69 95
7369 95 36 -180 102 64 -300 224 96 89 9 36 -111 222 283 -151 20 -114 96 -126 195 -205 -264 -43 -131
7392 -131 176 125 -83 125 -204 30 -55 110 160 -51 -222 -238 -81 86 44 115 94 0 -297 112 -49 63 74
7415 74 145 188 57 90 -228 -140 -258 122 15 -95 201 -93 72 -35 190 29 14 163 65 261 -43 -168
7437 -168 69 26 -29 -210 -19 103 31 254 23 -81 -83 -84 -46 -36 -1 146 152 -146 -165 157 11 -93 -71 -39 -273
7462 -273 -141 238 84 -134 -17 -176 214 -374 36 -44 -85 10 184 90 55 59 -57 -290 102 -120 210 -250
7484 -250 -89 222 56 157 105 -50 -62 596 206 13 141 -39 -34 16 129 -116 103 -6 -5 10 -64 -169 73
7507 73 75 87 -34 -40 275 -20 248 68 -10 -43 -45 -248 -141 -17 -183 150 -37 304 138 36 20 -52 11 384
7531 384 409 70 112 207 -125 161 123 41 -142 243 -15 128 -113 -99 60 51 -60 -177 -149 332 227 73 -18
7554 -18 168 307 118 -148 95 172 48 145 -103 -2 -188 -137 -37 -263 93 81 -37 -111 -226 -194 -270 -29 -101
7577 -101 60 -14 136 -167 131 -169 29 15 -302 144 54 28 210 144 -153 27 -61 98 -66 49 155 -188
7599 -188 -64 -12 -52 -443 -91 103 -171 -225 -43 29 -4 -126 112 85 296 -162 -2 100 -190 33 -83 -50
7621 -50 -76 84 -157 56 14 -126 80 371 -1 25 166 -97 -206 -55 221 190 214 -201 8 -225 98 -201
7643 -201 161 25 149 113 -179 -115 32 43 -212 -3 -10 65 171 343 46 421 74 29 186 95 127 -212 287
7666 287 -112 -219 122 418 -79 17 -117 16 -104 -39 48 -182 222 64 -122 167 96 -35 3 165 -86 -166
7688 -166 -166 38 -145 217 -268 125 -104 -64 6 285 110 -36 -174 -205 -34 -43 162 -139 -177 -131 -272 185 16
7711 16 55 -74 -298 40 112 -57 -119 34 -122 -70 9 -9 -157 -78 -172 155 64 -93 3 -32 -364 15 -280 -28
7735 -28 -89 -33 231 -95 179 162 197 -136 -141 -179 -54 55 131 28 56 63 77 -180 -136 -123 59 165 -58 -206 167
7760 167 71 -116 -86 120 -37 -132 98 8 -151 11 52 149 77 -72 -126 277 232 -159 282 62 44 107 -73 58
7784 58 -61 20 118 59 47 -323 -147 243 -231 275 95 -30 273 231 -242 -31 218 114 149 183 -237 226 179
7807 179 163 258 -48 -187 -165 68 144 125 -301 202 -122 -321 68 363 -15 -92 30 56 371 158 -386 -282
7829 -282 -98 -92 21 -203 236 -53 -36 -106 -87 -48 -134 118 -146 319 235 -42 -87 -390 -85 34 -428 100 -90
7852 -90 -68 254 171 29 -88 127 -78 -98 99 -291 -67 -35 -286 -180 -298 58 -246 -65 -214 -37 131 183
7874 183 -50 -172 -141 -224 1 -63 -125 -22 -150 -131 -234 -14 75 -11 87 -124 104 28 74 -178 264 58 125 143
7898 143 141 -138 193 -7 -224 -71 -74 -72 -35 334 -157 73 197 -162 210 139 209 157 -54 -116 177 81 -225 -56
7922 -56 151 45 261 158 271 289 82 -14 -160 288 11 205 177 -178 161 237 112 114 34 -90 77 -33 -25
7945 -25 -85 -89 59 217 -1 293 134 -174 -48 -261 179 -147 -26 116 157 -108 43 -82 -154 -191 -294 -246 131
7968 131 -111 -139 -83 56 -116 35 206 -240 -75 -16 -107 55 -328 -58 51 -12 152 -196 -118 84 126 -66
7990 -66 -12 31 30 -98 118 23 -334 -25 -58 -174 -283 19 -214 -37 -76 141 -118 -307 3 131 163 -27 27
8013 27 -1 161 51 12 55 55 -19 -266 175 196 92 -134 116 226 -304 228 275 -15 -45 -9 -56 -32 -223 197
8037 197 144 -18 134 41 -34 -147 51 -230 75 373 382 -22 300 -48 87 0 104 329 138 -50 185 -241
8059 -241 59 -117 190 12 110 14 2 -40 -257 83 79 -302 -261 76 79 87 207 44 71 -81 -157 275 12 -57 56
8084 56 -36 112 -52 -189 -87 -199 -92 -199 26 -39 52 -307 191 5 -62 -2 -86 -157 -464 -92 -298 -40 22
8107 22 -141 89 -3 122 -376 9 -79 -106 -163 -292 -78 -57 -63 87 -399 -59 7 -208 93 244 199 -37 15 174
8131 174 43 -361 -119 -123 137 55 -158 -110 -192 67 123 -11 -77 47 26 194 -64 391 -86 73 218 60 -87
8154 -87 -75 62 -10 -12 -163 240 240 25 52 91 36 26 6 23 156 315 212 -15 -271 -67 80 367 -288 187
8178 187 99 223 83 80 24 -55 95 317 221 27 154 190 65
8191F5
##END NTUPLES=NMR FID
##END=
