##TITLE=1H_TG-2281-4
 CDCl3, 8 sc, 
 31.1.2020
##JCAMPDX= 6.0         $$ Bruker NMR JCAMP-DX V2.0
##DATA TYPE= NMR FID
##DATA CLASS= NTUPLES
##ORIGIN= UXNMR, Bruker Analytische Messtechnik GmbH
##OWNER= root
$$ XWIN-NMR		Version 3.5
$$ Fri Jan 31 14:28:59 2020 Russian Standard Time (UT+4h)  she@DPX200
##.OBSERVE FREQUENCY= 200.1315
##.OBSERVE NUCLEUS= ^1H
##.DELAY= (6, 6)
##.ACQUISITION MODE= SIMULTANEOUS
##.ACQUISITION SCHEME= undefined
##.AVERAGES= 8
##.DIGITISER RES= 18
##SPECTROMETER/DATA SYSTEM= spect
##.PULSE SEQUENCE= zg30
##.SOLVENT NAME= CDCl3
##.SHIFT REFERENCE= (INTERNAL, CDCl3, 0, 15.7039)
##AUDIT TRAIL= $$ (NUMBER, WHEN, WHO, WHERE, WHAT)
$$ ##TITLE= Audit trail, XWIN-NMR		Version 3.5
$$ ##JCAMPDX= 5.01
$$ ##ORIGIN= Bruker BioSpin GmbH
$$ ##OWNER= she
$$ F:/spectra/data/she/nmr/H-F/1/audita.txt
$$ ##AUDIT TRAIL=  $$ (NUMBER, WHEN, WHO, WHERE, WHAT)
(   1,<2020-01-31 14:27:47.46 +0400>,<she>,<DPX200>,
      <created by zg, POWCHK disabled, PULCHK disabled
       configuration hash MD5:
       00 E9 B6 7A A2 85 ED C7 34 08 36 98 17 FE 4E 26
       data hash MD5: 16K
       13 58 B8 2A 85 B9 AC 6D 32 38 43 CB F1 94 DD 6F>)
$$ ##END=
$$ 
$$ hash MD5
$$ BF 05 12 80 53 A5 2C FC D0 07 6F 56 E2 4E A8 90
##$RELAX= 
##$RELAX= 
##$RELAX= 
##$RELAX= 
##$RELAX= 
##$RELAX= 
$$ Bruker specific parameters
$$ --------------------------
##$DU= <F:/spectra>
##$EXPNO= 1
##$NAME= <H-F>
##$PROCNO= 1
##$TYPE= <nmr>
##$USER= <she>
##$AMP= (0..31)
100 100 100 100 100 100 100 100 100 100 100 100 100 100 100 100 100 100 
100 100 100 100 100 100 100 100 100 100 100 100 100 100 
##$AQSEQ= 0
##$AQ_mod= 1
##$AUNM= <au_zg>
##$AUTOPOS= <>
##$BF1= 200.13
##$BF2= 200.13
##$BF3= 200.13
##$BF4= 200.13
##$BF5= 200.13
##$BF6= 200.13
##$BF7= 200.13
##$BF8= 200.13
##$BYTORDA= 1
##$CFDGTYP= 0
##$CFRGTYP= 5
##$CHEMSTR= <none>
##$CNST= (0..31)
1 1 145 1 1 1 1 1 1 1 1 1 1 1 1 1 1 1 1 1 1 1 1 1 1 1 1 1 1 1 1 1 
##$CPDPRG= <>
##$CPDPRG1= <>
##$CPDPRG2= <>
##$CPDPRG3= <>
##$CPDPRG4= <mlev>
##$CPDPRG5= <mlev>
##$CPDPRG6= <mlev>
##$CPDPRG7= <mlev>
##$CPDPRG8= <mlev>
##$CPDPRGB= <>
##$CPDPRGT= <>
##$D= (0..31)
0 1.2 0 0 0 0 0 0 0 0.06 0 0.03 0 0 0 0 0.0002 0 0 0 0 0 0 0 0 0 0 0 0 
0 0 0 
##$DATE= 1580466466
##$DBL= (0..7)
120 120 120 120 120 120 120 120 
##$DBP= (0..7)
150 150 150 150 150 150 150 150 
##$DBP07= 0
##$DBPNAM0= <>
##$DBPNAM1= <>
##$DBPNAM2= <>
##$DBPNAM3= <>
##$DBPNAM4= <>
##$DBPNAM5= <>
##$DBPNAM6= <>
##$DBPNAM7= <>
##$DBPOAL= (0..7)
0.5 0.5 0.5 0.5 0.5 0.5 0.5 0.5 
##$DBPOFFS= (0..7)
0 0 0 0 0 0 0 0 
##$DE= 6
##$DECBNUC= <off>
##$DECIM= 24
##$DECNUC= <off>
##$DECSTAT= 4
##$DIGMOD= 1
##$DIGTYP= 9
##$DL= (0..7)
0 120 120 120 120 120 120 120 
##$DP= (0..7)
150 150 150 150 150 150 150 150 
##$DP07= 0
##$DPNAME0= <>
##$DPNAME1= <>
##$DPNAME2= <>
##$DPNAME3= <>
##$DPNAME4= <>
##$DPNAME5= <>
##$DPNAME6= <>
##$DPNAME7= <>
##$DPOAL= (0..7)
0.5 0.5 0.5 0.5 0.5 0.5 0.5 0.5 
##$DPOFFS= (0..7)
0 0 0 0 0 0 0 0 
##$DQDMODE= 0
##$DR= 18
##$DS= 0
##$DSLIST= <SSSSSSSSSSSSSSS>
$$ [...]
##$SUBNAM2= <"">
##$SUBNAM3= <"">
##$SUBNAM4= <"">
##$SUBNAM5= <"">
##$SUBNAM6= <"">
##$SUBNAM7= <"">
##$SUBNAM8= <"">
##$SUBNAM9= <"">
##$SW= 24.9337058887773
##$SWIBOX= (0..15)
0 0 2 0 0 0 0 0 0 0 0 0 0 0 0 0 
##$SW_h= 4990.01996007984
##$TD= 16384
##$TD0= 1
##$TE= 0
##$TE2= 300
##$TE3= 300
##$TEG= 300
##$TL= (0..7)
0 120 120 120 120 120 120 120 
##$TP= (0..7)
150 150 150 150 150 150 150 150 
##$TP07= 0
##$TPNAME0= <>
##$TPNAME1= <>
##$TPNAME2= <>
##$TPNAME3= <>
##$TPNAME4= <>
##$TPNAME5= <>
##$TPNAME6= <>
##$TPNAME7= <>
##$TPOAL= (0..7)
0.5 0.5 0.5 0.5 0.5 0.5 0.5 0.5 
##$TPOFFS= (0..7)
0 0 0 0 0 0 0 0 
##$TUNHIN= 0
##$TUNHOUT= 0
##$TUNXOUT= 0
##$USERA1= <user>
##$USERA2= <user>
##$USERA3= <user>
##$USERA4= <user>
##$USERA5= <user>
##$V9= 5
##$VALIST= <valist>
##$VCLIST= <CCCCCCCCCCCCCCC>
##$VD= 0
##$VDLIST= <DDDDDDDDDDDDDDD>
##$VPLIST= <PPPPPPPPPPPPPPP>
##$VTLIST= <TTTTTTTTTTTTTTT>
##$WBST= 1024
##$WBSW= 4
##$XGAIN= (0..3)
0 0 0 0 
##$XL= 0
##$YL= 0
##$YMAX_a= 80747
##$YMIN_a= -120354
##$ZGOPTNS= <>
##$ZL1= 120
##$ZL2= 120
##$ZL3= 120
##$ZL4= 120
##$ABSF1= 10
##$ABSF2= 0
##$ABSG= 5
##$ABSL= 3
##$ALPHA= 0
##$AQORDER= 0
##$ASSFAC= 0
##$ASSFACI= 0
##$ASSFACX= 0
##$ASSWID= 0
##$AUNMP= <proc_1d>
##$AZFE= 0.1
##$AZFW= 0.1
##$BCFW= 1
##$BC_mod= 2
##$BYTORDP= 1
##$COROFFS= 0
##$CY= 11.3945322036743
##$DATMOD= 1
##$DC= 2
##$DFILT= <>
##$DTYPP= 0
##$F1P= 16.9975609425685
##$F2P= -3.02152046262296
##$FCOR= 0.5
##$FTSIZE= 0
##$FT_mod= 4
##$GAMMA= 1
##$GB= 0.15
##$INTBC= 1
##$INTSCL= 1
##$ISEN= 128
##$LB= 0.24
##$LEV0= 0
##$LPBIN= 0
##$MAXI= 10000
##$MC2= 0
##$MEAN= 0
##$ME_mod= 0
##$MI= 1.114404
##$NCOEF= 0
##$NC_proc= 0
##$NLEV= 6
##$NOISF1= 3.799351
##$NOISF2= 2.8
##$NSP= 1
##$NTH_PI= 0
##$NZP= 0
##$OFFSET= 15.70392
##$PC= 1
##$PHC0= -9945.229
##$PHC1= 15.00081
##$PH_mod= 1
##$PKNL= yes
##$PPARMOD= 0
##$PSCAL= 0
##$PSIGN= 0
##$REVERSE= no
##$SF= 200.130013532006
##$SI= 16384
##$SIGF1= 3
##$SIGF2= 2
##$SINO= 400
##$SIOLD= 16384
##$SREGLST= <1H.CDCl3>
##$SSB= 0
##$STSI= 0
##$STSR= 0
##$SW_p= 3612.71676300578
##$SYMM= 0
##$S_DEV= 0
##$TDeff= 0
##$TDoff= 0
##$TI= <>
##$TILT= no
##$TM1= 0
##$TM2= 0
##$TOPLEV= 0
##$USERP1= <user>
##$USERP2= <user>
##$USERP3= <user>
##$USERP4= <user>
##$USERP5= <user>
##$WDW= 1
##$XDIM= 8192
##$YMAX_p= 0
##$YMIN_p= 0
$$ End of Bruker specific parameters
$$ ---------------------------------
##NTUPLES= NMR FID
##VAR_NAME=  TIME,          FID/REAL,        FID/IMAG
##SYMBOL=    X,             R,               I
##VAR_TYPE=  INDEPENDENT,   DEPENDENT,       DEPENDENT
##VAR_FORM=  AFFN,          ASDF,            ASDF
##VAR_DIM=   8192,          8192,            8192
##UNITS=     SECONDS,       ARBITRARY UNITS, ARBITRARY UNITS
##FACTOR=    0.0002004,     1,               1
##FIRST=     0,             0,               0
##LAST=      1.6414764,     0,               0
##MIN=       0,             -120354,         0
##MAX=       1.6414764,     80747,           0
$$ Real data points
##PAGE= N=1
##DATA TABLE= (X++(R..R)), XYDATA
0 0 0 0 0 0 0 0 0 0 0 -8 8 -8 8 -8 16 -16 16 -24 25 -32 40 -45 49 -57 66 -80 88 -101 113 -129 145 -162 185
33 185 -205 230 -256 286 -315 350 -390 431 -475 528 -584 648 -719 797 -888 991 -1110 1251
51 1251 -1419 1626 -1882 2218 -2670 3319 -4342 6179 -10542 42616 -7260 -86860 34006 80747
65 80747 -1346 -52172 25581 63021 18862 -8167 19484 14202 -6221 7189 24411 -3423
77 -3423 -12002 28197 48560 6745 -23510 -4105 19568 10686 -3383 -3470 11140 26624 18050 -16300
91 -16300 -21304 19058 32002 -15183 -35061 15688 46599 3617 -29697 -924 23319 1653
103 1653 -14862 -2297 6446 8339 16439 4111 -26554 -16469 29751 26353 -27259 -30523 23971
116 23971 34508 -13406 -28591 4716 16496 -1621 -5520 -743 -5016 5012 22088 65 -35480
129 -35480 -14082 32865 20117 -24570 -16209 21388 14358 -16065 -12442 4997 1768 -47 8510
142 8510 197 -11131 8469 23638 -7688 -33048 -591 31197 6039 -19846 3626 24188
154 24188 2350 -15475 -2943 5674 2651 9064 8169 -10663 -4699 28443 21224 -26269 -25931 26017
168 26017 32748 -14212 -20230 23009 28895 -8372 -15480 7313 7518 -1837 12304 15929 -10823 -12571
182 -12571 25240 29311 -17176 -30414 14512 35749 -183 -24177 1878 28127 13967 -14235
194 -14235 -17318 5709 23307 10019 -15744 -12153 15626 18029 -8948 -14653 8145 13298 -5263
207 -5263 -7543 5553 2699 -4390 5619 5952 -15429 -12706 20796 19421 -23159 -26535 18812 24912
221 24912 -20752 -29238 14150 26441 -9577 -25121 -2755 10213 2466 -3299 -9104 -14557 1158
234 1158 20875 2780 -28900 -15193 20941 11858 -24778 -20886 13520 17690 -7408 -17547 -8570
247 -8570 60 6318 4252 -13395 -19351 6657 22599 -5119 -28880 -5286 20277 1021 -23286
260 -23286 -8532 14323 8496 -7092 -8909 -5628 -1753 5460 2495 -12180 -9774 12029 12963 -12526
274 -12526 -17075 8353 15581 -7347 -17025 701 12448 5300 -3168 -7355 -7311 4412 14127 -993
288 -993 -18665 -1456 23984 8372 -23369 -13794 19524 18462 -10589 -16917 3274 15044 7753
301 7753 -4558 -10404 -3586 11061 11521 -6614 -12507 6626 16822 -1048 -15295 -3510 10611
314 10611 7690 -205 -4482 -6076 2217 13723 3562 -18123 -9942 18940 14441 -17143 -15145 17263
328 17263 17166 -15507 -20074 7333 14731 -3275 -8231 1163 1219 -1816 2906 -970 -13261 -5633 14642
343 14642 7221 -18133 -12528 16199 14082 -16418 -22492 2541 15248 1379 -12100 -9043 2255
356 2255 8125 60 -14860 -13446 6708 13720 -5793 -18998 -3776 12793 4333 -12485 -13273 -2089
370 -2089 6224 5316 -4805 -12897 -3844 10890 3055 -18079 -13804 11706 13843 -10613 -17636 2388
384 2388 12383 -1062 -12016 -7276 1716 5310 1812 -6931 -8213 4565 10246 -5776 -17290 -387
398 -387 17254 4704 -15440 -8885 9459 8540 -4691 -8152 -2014 4210 7383 2265 -9183 -7399
412 -7399 10521 13315 -8936 -18164 4712 21351 4483 -15227 -7404 9940 10151 -1677 -8423
425 -8423 -3782 7983 12968 92 -13771 -3574 16300 10409 -12764 -12526 10452 16507 -1122
438 -1122 -9990 -335 6793 3590 -531 -3074 -2692 5524 11111 -598 -13196 -1816 15895 6721
452 6721 -14163 -9394 12322 13485 -5252 -11450 1010 9558 2781 -7256 -7298 3173 11047 4025
466 4025 -10088 -9876 5564 11462 -1920 -12727 -4320 8605 7448 -3832 -9890 -3955 7143 7504
480 7504 -7041 -14907 630 16372 3676 -17955 -11706 10754 10916 -8195 -12767 690 7611
493 7611 968 -5885 -6647 -2601 4030 4308 -6090 -11394 1191 12116 393 -15024 -7318 9145
507 9145 6264 -8075 -8704 2160 6028 143 -6347 -7042 101 8127 3135 -10795 -9381 8564 12446
522 12446 -6253 -15848 178 13588 3172 -11001 -6191 6977 8616 -1223 -8901 -5743 5495
535 5495 11003 883 -11320 -4933 11345 10470 -6607 -11614 2417 11869 4082 -6549 -5177 4849
549 4849 10119 2846 -8728 -7138 7906 13368 -646 -11193 -589 12583 6467 -7158 -5972
562 -5972 5712 9143 1416 -4826 -2184 5581 8437 524 -8348 -3005 10490 9703 -5019 -8689 4794
577 4794 11373 184 -8994 -2252 7988 7294 -1330 -6598 -2032 7752 8479 -4074 -11579 71 13346
592 13346 5555 -10593 -7940 7723 9661 -3701 -10041 -1726 7283 6161 -2292 -8547 -4457 6875
606 6875 8388 -5526 -13204 84 13123 3433 -12353 -7831 7359 7598 -5503 -10526 -1659 7269
620 7269 5039 -4796 -9419 -1987 7208 3268 -8563 -8708 4200 8709 -2557 -10524 -2696 6900 3271
635 3271 -6482 -7962 64 6974 3822 -6087 -9060 908 8971 979 -10641 -5713 8191 8297 -5042
650 -5042 -10224 -478 8654 4424 -6321 -8419 1783 10792 4691 -8538 -8441 5675 11014 -1370
664 -1370 -10553 -1209 11029 6843 -5351 -6814 2311 8215 4265 -3746 -5438 2703 10408 4680 -6991
679 -6991 -5183 7984 10189 -2210 -7699 2693 11209 4872 -5050 -4237 4491 8673 3341 -4193 -3080
694 -3080 6426 10301 682 -8003 -616 11294 7442 -5912 -6183 6744 11684 1925 -6850 -3126 6363
709 6363 8851 1287 -6172 -2358 8525 9273 -2901 -9131 1343 11601 5137 -7211 -6216 5770
723 5770 10023 1030 -7691 -4525 5597 8266 -299 -7735 -2336 8091 6382 -5581 -8731 2107
737 2107 9135 1685 -7567 -4801 4615 6574 -1251 -7677 -3760 5153 5616 -3694 -8111 251 7883
752 7883 1656 -8574 -6337 4455 6608 -2269 -8149 -2916 5121 4448 -3881 -8250 -1704 6848 3934
767 3934 -7084 -8559 3118 8960 -1065 -10791 -4705 6946 6410 -4004 -8311 -1566 6104 4122
781 4122 -4840 -8006 239 8189 3179 -7780 -6957 4770 8617 -1458 -9380 -2714 7306 5868
795 5868 -3652 -6769 121 6659 3526 -4747 -5747 3003 8393 1360 -7439 -3666 6790 7061 -2999
810 -2999 -7052 780 8068 4237 -4399 -5118 3007 7599 1500 -6270 -3381 6435 8167 -1424 -7668
825 -7668 -871 8476 5825 -4480 -6525 2547 8860 3174 -6109 -5197 4659 8582 144 -8115 -2849
840 -2849 8012 7403 -3735 -8181 174 7998 3964 -5225 -5814 2554 7640 1453 -6883 -4924 4595
855 4595 6994 -1809 -8103 -1854 7259 4720 -5531 -7366 1179 6417 743 -6410 -4307 3391 5307
870 5307 -1804 -7699 -3176 5309 4401 -4845 -7945 251 6769 1270 -7630 -6290 2861 5789 -1644
885 -1644 -7840 -3381 5005 4531 -4486 -8758 -1610 6482 3458 -6419 -7838 1640 7358 267 -8671
900 -8671 -5685 4272 6213 -2493 -8187 -2209 6393 4421 -5299 -7971 405 7055 2361 -6079 -5535
915 -5535 2921 6369 -364 -7026 -3275 5293 5646 -2633 -6524 83 6958 3318 -5328 -5620 3007 7356
931 7356 1044 -5834 -2533 5471 5719 -2226 -6095 174 7297 4458 -4185 -5156 3122 7833 1559 -5998
947 -5998 -3450 5394 7103 -511 -5875 -865 6934 5319 -3466 -5989 1812 8234 3511 -5122 -4664
962 -4664 3974 7631 594 -6407 -2667 6039 6451 -1910 -6282 -104 6926 3686 -4913 -5564 2855 7284
978 7284 1057 -5969 -3491 4277 5290 -1761 -6254 -1476 5548 3941 -4010 -6231 1036 6260 991
993 991 -6735 -4813 3889 5713 -1955 -7337 -2489 4846 3501 -4515 -6880 -72 5876 1796 -6630
1008 -6630 -6614 2226 6181 -1246 -8516 -4113 4995 4788 -3923 -7800 -1537 5062 2404 -5548 -6832 717
1024 717 5960 702 -7199 -5674 3133 5486 -2050 -7664 -2595 5006 3635 -4166 -6459 -104 5120
1039 5120 1621 -5336 -5105 2492 5853 -571 -6901 -3060 5007 4522 -3308 -5937 516 5772 2173
1054 2173 -4578 -4476 2411 5941 598 -5746 -2923 5213 6074 -2218 -6620 -183 7052 3848 -4408
1069 -4408 -4833 2950 6754 1339 -5001 -3211 4292 6671 51 -6077 -1847 6659 5983 -3121 -6278
1084 -6278 1286 7555 3061 -4667 -3942 3551 6450 582 -5361 -2633 4962 6074 -1399 -6028 -367
1099 -367 6648 3762 -4383 -4979 2571 6032 581 -4932 -2540 3675 4547 -1281 -5559 -1748 5011 4170
1115 4170 -3662 -6086 787 5986 949 -6134 -4169 3398 4806 -1629 -6194 -2222 4147 3480 -3572
1130 -3572 -6703 -895 5528 2367 -5807 -6155 1984 5421 -1247 -7223 -3355 3780 3641 -2944 -6421
1145 -6421 -1945 4032 2682 -4538 -6788 73 5541 795 -6589 -4862 2949 4289 -2599 -6560 -1727
1160 -1727 4121 2596 -3649 -5584 -430 4405 1609 -5149 -5134 2330 5541 -889 -6566 -2269 4599
1175 4599 3299 -3671 -5293 478 5066 2126 -4124 -4660 1691 5663 801 -5747 -3253 4707 5603
1190 5603 -2037 -5973 -154 5980 3095 -3763 -4365 1968 5957 2140 -4208 -3835 3296 6378 232
1205 232 -5563 -1590 6058 4975 -2765 -4774 1306 5773 2362 -3406 -3261 2594 5755 1477 -4464
1220 -4464 -2749 4302 5555 -1429 -5288 321 6281 2986 -4110 -3851 2737 5133 365 -4168 -2293
1235 -2293 3399 4777 -790 -5247 -1505 5077 3737 -3887 -5270 1725 5867 698 -5450 -3516 2922
1250 2922 4495 -915 -5517 -2523 3929 4155 -2843 -6494 -726 5439 2020 -5566 -5108 2403 5017
1265 5017 -928 -5927 -3072 2830 3530 -1934 -5767 -2093 3969 2979 -4131 -6103 508 4968 205
1280 205 -5922 -3775 2833 3723 -1996 -5511 -2063 3362 2860 -2862 -5424 -401 4752 1549 -5227 -4591
1296 -4591 2612 4860 -1274 -5712 -1666 4169 3172 -2548 -4762 -433 4444 2670 -3504 -4777 1802
1311 1802 5914 787 -5670 -2896 4462 4894 -1721 -5047 -178 4969 3267 -2602 -4205 978 5448
1326 5448 2553 -3801 -3573 3519 6002 -219 -5166 -921 5430 4091 -2097 -3623 1282 4916 2504
1341 2504 -2699 -3118 2346 5484 1162 -4222 -1806 4702 4728 -1710 -4380 692 5383 2683 -2953 -3159
1357 -3159 1998 4901 1277 -3911 -2747 3509 5261 -878 -5366 -776 5549 3239 -3772 -4378 1703
1372 1703 4999 1055 -4059 -3233 2252 4467 -269 -5137 -2515 4063 4165 -2726 -5755 -94 4931
1387 4931 1647 -4601 -4161 1643 4071 -178 -4662 -3068 2397 3665 -1699 -5679 -1673 4360 2500
1402 2500 -4266 -5096 1122 4135 -241 -4807 -2891 2167 3199 -1267 -4983 -2073 3242 2849 -3116
1417 -3116 -5254 164 4930 1011 -5095 -3743 2572 3977 -1261 -4750 -1628 3317 3187 -1979 -4683
1432 -4683 -657 4479 2686 -3812 -4397 2151 5349 225 -4835 -2154 3698 3931 -1229 -4049 -573
1447 -573 4294 3464 -2345 -4234 1043 5441 2105 -3997 -2874 3615 5076 -520 -4101 -517 4248
1462 4248 3402 -1410 -3216 678 4836 2898 -2848 -3491 2614 5562 546 -4337 -1144 4663 3949 -1676
1478 -1676 -3679 591 4595 2682 -2360 -3274 1645 5139 1554 -4070 -2840 3584 5023 -1010 -4721
1493 -4721 -408 4797 2812 -2741 -3692 901 4266 1704 -3378 -3462 2025 4754 12 -5073 -2260 3897
1509 3897 3477 -2445 -4447 167 3885 1416 -3354 -3588 891 3673 470 -4221 -3106 2502 3773
1524 3773 -1827 -5407 -1086 4033 1782 -3787 -3933 1086 3346 -128 -4100 -3043 1770 3500 -881
1539 -881 -4949 -2117 3570 2769 -3379 -4945 451 4309 562 -4305 -3161 1981 3535 -587 -4453
1554 -4453 -2309 2976 3645 -1711 -4983 -631 4650 2229 -3922 -3850 2038 4355 117 -3693 -1970 2714
1570 2714 3644 -420 -4017 -1301 4073 3649 -2183 -4035 1147 5025 1318 -3699 -2129 3171 3970 -308
1586 -308 -3065 -618 3471 3397 -938 -3389 261 4840 2814 -2946 -2956 2837 4934 85 -3684 -680
1602 -680 3973 3452 -983 -3129 141 4170 2939 -2171 -3524 1640 5163 1276 -4033 -2151 3625
1617 3625 4090 -1216 -3773 -106 3882 2613 -1831 -3349 250 4144 2009 -3313 -3547 2217 4610
1632 4610 -442 -4594 -1448 3660 2620 -2255 -3677 -13 3245 1551 -2834 -3659 642 3782 392
1647 392 -4419 -2927 2844 3404 -2226 -4803 -571 3447 1208 -3346 -3502 426 3008 471 -3801 -3554
1663 -3554 1474 3707 -1097 -5189 -1792 3588 2294 -3353 -4311 326 3320 614 -3503 -3309 1003
1678 1003 3362 82 -4235 -2905 2667 3608 -1892 -4916 -415 4188 1539 -3545 -3194 1447 3373
1693 3373 361 -3166 -2364 1942 3533 -365 -4089 -1288 3836 2971 -2546 -3630 1397 4282 775
1708 775 -3277 -1832 2473 3557 12 -3077 -1114 3234 3560 -1226 -3795 512 4904 2117 -3239
1723 -3239 -2478 2875 4163 0 -3067 -923 3120 3438 -378 -3127 -373 4090 3116 -2317 -3526 1788
1739 1788 4911 951 -3667 -1624 3234 3446 -786 -3098 -590 3107 2888 -1246 -3456 51 4153
1754 4153 1890 -3458 -3082 2497 4015 -677 -3821 -937 2912 2212 -1716 -3278 -420 2924 1773
1769 1773 -2699 -3676 934 3744 -5 -4361 -2280 2941 2665 -2245 -3957 -449 2739 1158 -2682
1784 -2682 -3476 -22 3139 746 -3821 -3474 1845 3506 -1515 -4829 -1283 3240 1678 -2871 -3620 31
1800 31 2589 726 -3072 -3291 812 3389 -39 -4316 -2424 2745 2919 -2237 -4172 -41 3440 1092
1816 1092 -2855 -2751 818 2836 593 -3062 -2496 2047 3557 -735 -4118 -772 3863 2182 -2645
1831 -2645 -2984 1402 3479 783 -2677 -1852 1901 3387 208 -3226 -1284 3354 3517 -1549 -3678 792
1847 792 4501 1568 -2912 -2058 2462 3596 348 -2611 -1275 2709 3597 -360 -3381 -377 4195 2871
1863 2871 -2423 -2989 1868 4235 653 -2899 -1351 2620 3159 -194 -2749 -835 3043 3012 -1469 -3382
1879 -3382 527 4154 1489 -3267 -2385 2358 3305 -679 -3141 -888 2503 2315 -1230 -3213 -530 3177
1895 3177 1915 -2863 -3442 1352 3637 -240 -3962 -1703 2550 2262 -1753 -3374 -701 2472 1533 -2290
1911 -2290 -3570 -11 3257 690 -3892 -3052 1960 3071 -1498 -4099 -1095 2518 1532 -2226 -3312
1926 -3312 -403 2603 1108 -2935 -3348 919 3271 -259 -4090 -1924 2697 2317 -2100 -3497 -60
1941 -60 2683 1091 -2387 -2704 570 2965 658 -3178 -2398 2217 3262 -1129 -3818 -399 3405 1789
1957 1789 -2306 -2553 966 3049 954 -2343 -2071 1754 3504 62 -3261 -1147 3377 3023 -1693 -3066
1973 -3066 909 3810 1377 -2321 -1816 1843 3295 704 -2456 -1470 2659 3522 -473 -3240 -20 3903
1989 3903 2238 -2184 -2343 1705 3586 712 -2285 -1357 2179 3087 -21 -2719 -808 3104 2771 -1657
2005 -1657 -3048 975 3797 985 -2866 -1823 2182 2846 -400 -2748 -1016 2329 2429 -1175 -3270
2020 -3270 -314 3311 1575 -2957 -2900 1501 3210 -410 -3413 -1514 2138 2184 -1348 -3273 -904 2501
2036 2501 1697 -2337 -3558 297 3251 430 -3686 -2483 1879 2528 -1328 -3502 -1128 2095 1590 -1895
2052 -1895 -3308 -512 2613 1014 -3048 -3091 1155 2977 -645 -3692 -1546 2240 1898 -1764 -3166 -312
2068 -312 2412 1141 -2283 -2831 624 2984 402 -3245 -2035 2286 2726 -1345 -3329 -223 2921 1570
2084 1570 -1970 -2575 677 3061 1021 -2438 -2129 1901 3366 -145 -3222 -695 3237 2581 -1573 -2621
2100 -2621 775 3309 1371 -1950 -1899 1501 3345 682 -2486 -1280 2816 3220 -731 -2845 325 3578
2116 3578 1872 -1826 -1973 1506 3164 898 -2166 -1463 2139 3130 -113 -2767 -514 3220 2398 -1670
2132 -1670 -2565 1029 3307 833 -2356 -1615 1798 2739 -35 -2627 -1111 2390 2499 -1288 -3039 116
2148 116 3173 1334 -2628 -2458 1343 2749 -49 -2924 -1569 1840 2213 -1073 -3228 -876 2501 1582
2164 1582 -2381 -3089 552 2866 140 -3236 -2097 1563 2157 -1058 -3169 -1112 1923 1616 -1825 -3275
2180 -3275 -285 2611 739 -2971 -2606 1228 2426 -709 -3201 -1368 1941 1769 -1540 -3029 -355
2195 -355 2366 1210 -2351 -2755 804 2866 53 -3129 -1676 2117 2346 -1205 -2949 -375 2581 1597
2211 1597 -1737 -2579 572 3017 1013 -2564 -1983 1935 2999 -399 -2825 -663 2790 2188 -1273 -2358
2227 -2358 490 3012 1491 -1817 -1911 1498 3225 606 -2487 -982 2701 2815 -793 -2454 337 3110
2243 3110 1742 -1560 -1848 1210 3047 890 -2140 -1329 2220 2962 -317 -2570 -185 3026 2087 -1595
2259 -1595 -2212 980 3023 940 -2111 -1571 1680 2777 -32 -2681 -947 2449 2343 -1337 -2809 222
2275 222 2881 1099 -2313 -2145 1232 2585 93 -2698 -1574 1833 2259 -1032 -3072 -624 2487 1382
2291 1382 -2175 -2703 634 2454 137 -2819 -1865 1324 2042 -817 -3005 -1156 1925 1598 -1872 -3062
2307 -3062 -40 2502 447 -2739 -2308 1111 2126 -615 -2925 -1413 1799 1757 -1483 -3008 -381 2368
2323 2368 987 -2370 -2522 859 2548 -27 -2821 -1523 1829 2136 -1029 -2692 -508 2365 1600 -1724
2339 -1724 -2555 573 2817 728 -2462 -1754 1804 2649 -352 -2494 -627 2363 2109 -1080 -2228 368
2355 368 2811 1387 -1843 -1743 1533 2867 314 -2276 -774 2418 2465 -739 -2158 321 2782 1635
2371 1635 -1405 -1712 1182 3032 832 -2065 -1134 2266 2659 -396 -2254 -33 2781 1881 -1232 -1994
2387 -1994 830 2844 1019 -1976 -1515 1699 2795 -57 -2467 -797 2442 2090 -1226 -2353 271
2402 271 2644 1090 -1913 -1986 1085 2589 161 -2484 -1426 1859 2127 -1077 -2638 -332 2351 1274
2418 1274 -1973 -2290 589 2202 206 -2542 -1756 1314 2018 -813 -2897 -1000 1914 1434 -1841 -2681
2434 -2681 134 2239 371 -2516 -2065 1011 1991 -505 -2781 -1345 1707 1714 -1494 -2838 -243 2284
2450 2284 909 -2255 -2334 821 2280 -111 -2657 -1451 1615 2010 -835 -2689 -548 2158 1510 -1701
2466 -1701 -2286 607 2623 605 -2242 -1556 1525 2343 -317 -2344 -675 2227 1952 -1071 -2186 439
2482 439 2714 1131 -1828 -1628 1445 2724 188 -2189 -706 2256 2193 -693 -2039 215 2656 1591
2498 1591 -1406 -1749 1237 2824 663 -2004 -959 2105 2493 -355 -2023 -130 2542 1866 -1122 -1969
2514 -1969 796 2734 960 -1878 -1379 1629 2522 -37 -2240 -637 2145 1963 -1097 -2155 272 2431
2530 2431 1055 -1800 -1801 1035 2378 89 -2349 -1231 1721 1854 -1022 -2429 -380 2038 1126 -1818
2546 -1818 -2204 494 2129 164 -2390 -1677 1241 1801 -779 -2678 -841 1810 1194 -1779 -2468 99
2562 99 2054 324 -2352 -2027 898 1863 -551 -2687 -1301 1615 1498 -1428 -2604 -254 2030 796
2578 796 -2018 -2156 590 2074 -45 -2525 -1449 1466 1710 -954 -2498 -527 2037 1227 -1657 -2178
2594 -2178 545 2283 429 -2099 -1414 1409 2080 -352 -2215 -632 2054 1654 -1194 -2143 442 2401
2610 2401 926 -1739 -1468 1326 2426 85 -2008 -634 2034 2070 -693 -1909 353 2529 1344 -1465
2626 -1465 -1574 1179 2604 485 -1886 -861 1964 2267 -348 -1974 -111 2362 1706 -1198 -1817 814
2642 814 2640 804 -1807 -1279 1522 2318 -99 -2055 -610 2096 1792 -1105 -2008 292 2227 901
2658 901 -1702 -1629 1025 2242 -28 -2300 -987 1679 1694 -959 -2243 -235 1926 977 -1780 -2059 540
2675 540 2016 69 -2273 -1497 1168 1719 -828 -2481 -809 1741 1139 -1620 -2366 83 1947 321
2691 321 -2240 -1836 841 1837 -564 -2549 -1089 1549 1347 -1325 -2440 -260 1892 698 -1983 -1975 586
2708 586 1913 -144 -2387 -1349 1356 1572 -925 -2344 -482 1872 1119 -1589 -2019 507 2052 361
2724 361 -2040 -1341 1321 1976 -433 -2069 -457 1999 1506 -1112 -1883 403 2255 903 -1645 -1344
2740 -1344 1307 2282 69 -1912 -606 2015 1954 -716 -1803 284 2415 1257 -1270 -1492 1141 2443
2756 2443 537 -1710 -782 1781 2196 -325 -1848 24 2336 1534 -1071 -1623 817 2352 734 -1581
2772 -1581 -1135 1446 2215 -46 -1914 -449 2021 1663 -942 -1826 379 2127 855 -1631 -1520 1038
2788 1038 2066 -54 -2006 -908 1580 1672 -859 -2100 -169 1950 977 -1661 -1895 665 1956 57
2804 57 -2112 -1331 1154 1595 -699 -2335 -675 1686 1083 -1572 -2190 130 1789 244 -2131 -1714 880
2821 880 1643 -520 -2305 -989 1401 1191 -1312 -2234 -270 1749 578 -1895 -1953 619 1670 -231
2837 -231 -2219 -1236 1213 1402 -921 -2237 -504 1685 953 -1544 -1963 447 1937 169 -1969 -1264
2853 -1264 1250 1745 -509 -2009 -395 1799 1401 -1102 -1747 416 2142 811 -1583 -1343 1237 2165
2869 2165 -24 -1842 -464 1883 1698 -686 -1695 228 2214 1269 -1288 -1497 1025 2316 452 -1552
2885 -1552 -753 1759 2025 -324 -1721 62 2149 1447 -1007 -1481 717 2203 791 -1466 -1121 1353
2901 1353 2116 -1 -1788 -382 1925 1611 -868 -1666 331 2076 916 -1398 -1382 1015 1955 27
2917 27 -1880 -890 1619 1640 -774 -1996 -68 1906 903 -1430 -1694 604 1857 166 -1894 -1178 1129
2934 1129 1515 -632 -2166 -699 1566 971 -1533 -2030 145 1643 281 -1972 -1635 784 1527 -507
2950 -507 -2209 -1007 1286 1132 -1231 -2196 -271 1618 550 -1807 -1788 602 1642 -231 -2112 -1122
2966 -1122 1083 1305 -831 -2030 -462 1598 887 -1451 -1862 450 1858 175 -1835 -1221 1132 1641
2982 1641 -456 -1950 -457 1635 1207 -1075 -1712 284 1989 729 -1551 -1267 1135 2000 -94 -1767
2998 -1767 -509 1695 1631 -624 -1571 174 2017 1139 -1150 -1346 933 2144 381 -1595 -696 1602
3014 1602 1883 -354 -1553 9 1995 1393 -894 -1412 665 2096 763 -1400 -955 1454 2002 -101
3030 -101 -1672 -283 1885 1457 -822 -1482 336 1970 843 -1372 -1242 1021 1914 81 -1751 -724
3046 -724 1523 1569 -779 -1828 -136 1753 814 -1433 -1581 590 1760 203 -1769 -1226 1125 1523 -608
3063 -608 -2065 -570 1539 1019 -1375 -1867 163 1595 245 -1735 -1496 748 1494 -489 -2076 -941
3079 -941 1185 1088 -1226 -2026 -208 1507 465 -1727 -1692 552 1449 -228 -2016 -1088 1051 1222 -868
3096 -868 -2053 -427 1543 807 -1475 -1702 446 1625 150 -1745 -1152 1111 1452 -508 -1828 -507
3112 -507 1538 1165 -1027 -1652 259 1847 672 -1517 -1192 1044 1753 -83 -1659 -612 1556 1495 -571
3129 -571 -1613 142 1894 1088 -1200 -1210 930 2030 319 -1440 -647 1566 1776 -239 -1503 -69
3145 -69 1845 1226 -877 -1259 661 2021 705 -1342 -865 1326 1828 -36 -1527 -228 1754 1391 -747
3162 -747 -1497 375 1907 850 -1259 -1158 1052 1860 102 -1650 -626 1475 1451 -693 -1690 -24 1647
3179 1647 874 -1253 -1474 556 1696 191 -1746 -1167 1067 1414 -578 -1847 -417 1390 922 -1301
3195 -1301 -1706 140 1490 275 -1705 -1407 688 1435 -427 -1942 -827 1207 954 -1175 -1925 -175
3211 -175 1457 410 -1648 -1571 515 1405 -194 -1920 -1073 1030 1205 -829 -1892 -280 1434 694 -1479
3228 -1479 -1611 391 1471 75 -1697 -1162 968 1418 -450 -1872 -535 1480 1093 -986 -1638 274
3244 274 1707 553 -1363 -1143 932 1603 -63 -1584 -538 1439 1424 -635 -1494 189 1782 928 -1176
3261 -1176 -1198 856 1804 314 -1400 -635 1468 1600 -309 -1430 44 1858 1210 -847 -1205 696 1966
3278 1966 591 -1306 -843 1285 1777 -86 -1377 -202 1677 1366 -723 -1398 423 1868 823 -1225
3294 -1225 -1084 1004 1719 -11 -1541 -558 1366 1378 -618 -1528 -21 1620 837 -1261 -1400 588 1541
3311 1541 178 -1539 -944 1031 1346 -601 -1709 -396 1317 852 -1109 -1600 198 1440 185 -1629
3327 -1629 -1301 824 1296 -447 -1814 -646 1167 936 -1038 -1775 -151 1339 357 -1524 -1383 482
3343 482 1312 -242 -1835 -987 1020 1082 -874 -1811 -310 1342 551 -1287 -1524 340 1374 103 -1611
3360 -1611 -1078 938 1335 -501 -1677 -417 1371 948 -1005 -1444 221 1536 418 -1414 -1125 906
3376 906 1534 -153 -1536 -499 1404 1243 -697 -1378 184 1728 762 -1128 -1055 909 1662 265 -1292
3393 -1292 -594 1465 1562 -345 -1333 115 1757 1068 -880 -1095 696 1770 501 -1214 -713 1258 1649
3410 1649 -77 -1319 -150 1642 1260 -638 -1309 371 1796 669 -1148 -931 965 1607 28 -1418
3426 -1418 -526 1364 1332 -599 -1455 66 1554 802 -1209 -1204 642 1537 81 -1458 -819 1028 1288 -614
3444 -614 -1653 -318 1367 797 -1126 -1482 244 1478 200 -1595 -1134 809 1233 -500 -1691 -617
3460 -617 1144 823 -985 -1654 -91 1322 365 -1505 -1294 467 1266 -365 -1747 -901 993 946 -872
3477 -872 -1703 -275 1290 541 -1291 -1494 282 1351 42 -1590 -1019 952 1163 -552 -1632 -402
3493 -402 1235 834 -971 -1398 224 1432 423 -1364 -1024 807 1440 -168 -1488 -439 1299 1182
3509 1182 -712 -1340 268 1566 695 -1074 -997 800 1616 261 -1234 -537 1304 1417 -381 -1295 125
3526 125 1628 928 -865 -985 719 1746 413 -1148 -655 1200 1574 -146 -1261 -106 1633 1163
3542 1163 -685 -1222 458 1663 546 -1093 -804 929 1537 44 -1290 -468 1369 1247 -611 -1318
3558 -1318 163 1595 656 -1075 -1097 625 1491 66 -1341 -694 1050 1163 -517 -1487 -206 1250 763
3575 763 -1097 -1449 311 1344 137 -1445 -1001 800 1088 -445 -1533 -510 1059 830 -992 -1600
3591 -1600 -41 1290 302 -1481 -1208 551 1201 -304 -1615 -752 901 919 -877 -1634 -216 1122 488
3608 488 -1231 -1396 300 1244 -19 -1534 -957 908 1049 -557 -1521 -331 1148 707 -996 -1332 238
3625 238 1397 273 -1344 -952 812 1348 -236 -1463 -362 1326 1028 -692 -1187 252 1437 623
3641 623 -1050 -925 731 1475 188 -1241 -423 1296 1308 -447 -1254 213 1511 851 -825 -957 660
3658 660 1600 385 -1110 -654 1095 1439 -104 -1251 -50 1590 1091 -677 -1022 423 1571 496
3674 496 -1048 -744 901 1475 40 -1264 -359 1316 1161 -660 -1235 220 1455 608 -1068 -1010 636
3691 636 1377 93 -1316 -647 1025 1097 -527 -1401 -248 1218 641 -1038 -1209 328 1269 61 -1339
3708 -1339 -926 741 1018 -375 -1498 -543 1003 770 -958 -1489 33 1146 210 -1444 -1126 550 1103
3725 1103 -361 -1513 -729 880 758 -753 -1496 -169 1140 430 -1263 -1314 379 1174 -176 -1501 -810
3742 -810 854 914 -598 -1396 -308 1141 690 -921 -1349 290 1330 244 -1316 -869 834 1166 -282
3759 -282 -1300 -289 1176 934 -714 -1138 241 1455 545 -987 -858 720 1387 68 -1275 -373 1246
3776 1246 1183 -434 -1134 151 1396 820 -784 -893 670 1476 362 -1011 -503 1118 1368 -146 -1183
3793 -1183 -53 1419 1010 -651 -1007 500 1520 469 -986 -693 939 1430 34 -1125 -206 1311
3809 1311 1083 -626 -1135 262 1352 515 -941 -868 690 1328 56 -1205 -533 1026 1049 -539 -1252
3826 -1252 -80 1220 606 -1011 -1149 358 1146 -4 -1280 -843 676 1013 -502 -1366 -478 989 709
3843 709 -900 -1360 69 1145 115 -1278 -1073 498 1009 -324 -1475 -749 802 760 -838 -1421 -190
3860 -190 1083 354 -1228 -1220 349 1092 -125 -1385 -759 766 908 -550 -1420 -264 1061 545 -995
3877 -995 -1201 205 1193 186 -1169 -759 737 1100 -329 -1269 -318 1112 902 -647 -1171 144 1262
3894 1262 515 -996 -875 686 1265 -5 -1222 -385 1155 1082 -434 -1051 195 1321 801 -765 -861
3911 -861 649 1422 268 -1051 -473 1021 1271 -169 -1031 -12 1292 936 -547 -860 511 1424 480
3928 480 -915 -570 905 1335 -1 -1069 -236 1261 1015 -574 -1046 240 1339 534 -853 -829 621
3945 621 1259 55 -1126 -503 981 1004 -472 -1215 -70 1118 604 -872 -1043 382 1152 86 -1216
3962 -1216 -692 677 1004 -415 -1305 -408 981 654 -876 -1228 107 1046 123 -1155 -1022 505 923
3979 923 -310 -1391 -592 815 680 -770 -1356 -131 1015 352 -1155 -1119 348 1026 -197 -1281 -711
3996 -711 726 887 -592 -1307 -277 1030 523 -966 -1162 245 1103 91 -1201 -792 724 1072 -314
4013 -314 -1215 -298 1024 761 -711 -1161 172 1202 401 -966 -811 652 1281 -40 -1151 -337 1063
4030 1063 980 -435 -1044 128 1271 659 -694 -807 683 1391 237 -966 -394 995 1129 -188 -1018
4047 -1018 23 1309 851 -597 -890 455 1335 369 -808 -524 941 1260 -117 -975 -144 1231 953
4064 953 -473 -975 267 1315 515 -886 -782 587 1220 52 -1068 -469 955 898 -515 -1149 -17
4081 -17 1162 569 -869 -999 360 1113 92 -1126 -693 739 936 -367 -1238 -343 991 596 -871
4098 -871 -1171 98 936 125 -1137 -927 487 898 -377 -1263 -505 830 619 -744 -1288 -100 976
4115 976 196 -1073 -1021 288 913 -160 -1256 -656 699 747 -601 -1282 -281 1008 499 -991 -1065 223
4133 223 979 58 -1169 -736 611 926 -327 -1221 -278 1007 659 -634 -1083 216 1099 369 -909 -772
4151 -772 652 1086 -44 -1029 -318 1029 912 -422 -910 83 1211 639 -737 -710 568 1322 199 -910
4169 -910 -451 944 1145 -186 -950 -12 1206 772 -597 -784 512 1244 390 -823 -529 919 1160 -105
4187 -105 -957 -140 1177 896 -495 -857 352 1298 466 -860 -706 698 1105 3 -1046 -388 942
4204 942 851 -460 -1032 9 1044 503 -845 -868 426 1031 3 -1023 -610 755 841 -371 -1174 -261
4222 -261 934 483 -845 -1086 184 959 139 -1053 -823 506 872 -326 -1217 -491 854 554 -755
4239 -755 -1211 -52 902 200 -1150 -923 354 836 -207 -1228 -658 622 673 -617 -1235 -230 865
4256 865 412 -953 -1001 285 953 -25 -1096 -708 613 877 -342 -1106 -205 944 589 -647 -970 172
4274 172 1056 331 -932 -702 608 1040 -63 -965 -263 923 859 -419 -838 194 1171 564 -773 -665
4292 -665 590 1183 155 -909 -360 944 1045 -262 -913 113 1115 702 -582 -714 487 1209 298
4309 298 -839 -456 806 1088 -86 -929 -81 1060 816 -462 -833 328 1178 467 -739 -638 683
4326 683 1121 50 -963 -280 879 918 -466 -959 41 1076 518 -780 -818 391 1093 15 -978 -564
4344 -564 729 833 -413 -1123 -238 886 487 -783 -1016 152 911 64 -1037 -785 525 797 -389
4361 -389 -1208 -456 735 571 -739 -1133 -36 854 215 -1053 -892 305 874 -204 -1179 -627 598 577
4379 577 -653 -1178 -187 910 316 -894 -967 206 930 4 -1019 -644 630 787 -377 -1120 -225 928
4397 928 586 -707 -857 190 966 268 -942 -649 594 841 -154 -906 -245 937 729 -459 -906 227
4415 227 1175 483 -698 -721 585 1135 100 -810 -258 826 950 -214 -854 79 1147 625 -542 -668
4433 -668 492 1069 252 -810 -480 822 1088 -130 -899 -58 1005 811 -451 -771 318 1083 444 -780
4451 -780 -574 690 1084 -5 -907 -284 939 814 -437 -904 100 994 412 -777 -743 437 926 51
4469 51 -918 -482 739 791 -388 -1038 -136 893 343 -758 -924 190 898 35 -1027 -671 591 808
4487 808 -369 -1093 -365 708 445 -791 -1047 14 866 171 -1034 -817 374 780 -289 -1165 -522 623
4505 623 544 -672 -1083 -172 824 312 -891 -913 243 887 -37 -1008 -640 615 786 -419 -1017 -183 816
4524 816 457 -681 -877 189 958 206 -914 -618 574 846 -158 -924 -214 850 684 -419 -863 172
4542 172 1074 437 -660 -645 526 1046 85 -825 -263 855 876 -216 -825 148 1015 575 -524 -593 465
4561 465 1097 281 -782 -339 834 965 -79 -768 26 1002 744 -377 -747 335 1120 334 -707 -523
4579 -523 711 996 -34 -817 -164 851 795 -398 -871 140 1026 378 -757 -649 480 912 12 -942
4597 -942 -382 719 724 -379 -953 -108 867 437 -816 -909 212 851 -17 -1019 -674 427 761 -362 -1139
4616 -1139 -334 724 456 -739 -1022 -15 740 122 -957 -784 350 773 -254 -1090 -449 622 525 -573
4634 -573 -1041 -54 786 180 -868 -815 227 835 -76 -1063 -567 563 710 -459 -987 -156 789 398 -738
4653 -738 -897 200 821 142 -903 -589 527 772 -189 -944 -236 845 630 -515 -822 121 996 331
4671 331 -674 -593 495 968 88 -833 -225 827 792 -321 -794 133 1041 560 -482 -537 539 1019 162
4690 162 -680 -309 834 916 -142 -730 29 942 679 -423 -619 393 1038 338 -653 -465 671 979 -58
4709 -58 -703 -159 848 686 -435 -743 132 983 371 -689 -586 496 897 -30 -887 -413 658 668 -401
4728 -401 -939 -36 787 394 -719 -807 219 792 76 -964 -565 511 707 -376 -1001 -272 662 365 -673
4747 -673 -889 63 749 96 -875 -722 323 645 -271 -1038 -413 569 478 -639 -958 -74 782 203 -820
4766 -820 -777 241 700 -122 -987 -562 538 565 -496 -978 -168 740 381 -645 -832 163 834 35 -869
4785 -869 -524 503 690 -193 -884 -208 808 613 -510 -783 170 913 273 -709 -604 524 844 -2 -732
4804 -732 -210 783 762 -347 -701 146 954 485 -584 -520 467 963 159 -666 -265 810 885 -150 -631 30
4824 30 941 657 -441 -594 394 1008 264 -676 -371 635 862 -81 -691 -123 869 655 -437 -658 254
4843 254 877 381 -657 -555 512 797 -77 -825 -305 754 641 -449 -805 -1 833 327 -643 -701 296
4862 296 725 -16 -906 -529 568 571 -346 -936 -231 666 448 -619 -890 101 773 20 -898 -605 333 644
4882 644 -307 -978 -390 561 454 -613 -912 -5 691 139 -843 -814 288 634 -137 -969 -497 571 519 -446
4902 -446 -915 -153 675 337 -673 -789 249 773 5 -852 -452 461 707 -246 -885 -191 707 559 -539
4921 -539 -726 173 896 300 -661 -545 522 876 25 -760 -241 758 756 -348 -669 129 882 461 -499 -541
4941 -541 431 918 150 -677 -210 771 847 -175 -634 89 929 578 -451 -568 438 924 266 -586 -341
4960 -341 640 872 -70 -707 -102 869 615 -394 -636 220 916 332 -632 -524 459 821 -34 -737 -277 690
4980 690 658 -364 -829 58 807 347 -667 -695 354 767 59 -813 -424 545 655 -337 -874 -229 676 295
5000 295 -690 -831 107 666 35 -856 -603 317 613 -289 -964 -445 592 411 -594 -888 -77 649 188
5019 188 -800 -715 210 687 -206 -911 -427 538 542 -428 -885 -129 739 242 -664 -797 146 685 -18 -790 -475
5040 -475 471 693 -299 -863 -149 680 506 -546 -750 197 771 168 -625 -472 504 792 -70 -725 -158 809
5060 809 641 -346 -633 148 854 420 -511 -491 463 808 100 -618 -227 652 739 -200 -615 112 897 550 -460
5081 -460 -507 406 917 226 -594 -337 630 812 -69 -603 -130 861 600 -357 -603 235 849 379 -585 -431
5101 -431 514 763 -24 -725 -258 745 568 -361 -661 75 738 292 -640 -621 324 706 -58 -836 -369 528
5121 528 541 -364 -758 -72 681 358 -659 -790 91 651 61 -810 -534 346 519 -320 -851 -334 513 350
5141 350 -615 -876 -82 627 94 -789 -703 269 585 -155 -873 -429 455 479 -425 -856 -88 604 253 -689 -696
5162 -696 225 690 -34 -785 -420 465 607 -258 -776 -185 684 356 -526 -684 165 761 120 -651 -431 496
5182 496 706 -83 -645 -211 702 610 -329 -567 145 868 365 -501 -469 458 829 44 -595 -106 717 644 -130
5203 -130 -641 78 841 472 -440 -562 450 831 185 -589 -285 616 759 -87 -618 34 819 501 -322 -502
5223 -502 280 840 268 -606 -403 539 752 -1 -639 -178 656 534 -378 -676 115 713 281 -565 -493 292
5243 292 686 -36 -766 -355 513 482 -330 -753 -144 654 288 -617 -685 163 654 -30 -768 -481 342 558 -300
5264 -300 -823 -233 555 397 -612 -805 -86 597 68 -769 -621 286 539 -164 -837 -384 484 431 -412 -755
5284 -755 -150 619 189 -672 -698 283 670 -56 -701 -400 410 545 -274 -763 -152 618 378 -565 -639 178 664
5305 664 188 -698 -482 497 663 -114 -675 -166 626 503 -380 -577 164 762 309 -442 -446 436 789 52 -619
5326 -619 -192 671 703 -205 -635 147 824 424 -380 -391 391 748 175 -530 -227 677 741 -88 -536 28 683
5347 683 528 -298 -536 239 777 284 -461 -375 490 696 -27 -554 -149 691 538 -318 -610 87 671 253
5367 253 -601 -534 288 623 -13 -676 -295 469 524 -292 -724 -82 577 279 -572 -621 139 613 -6 -732 -486
5388 -486 381 550 -309 -697 -237 530 346 -530 -685 80 581 112 -702 -589 269 516 -182 -764 -326 438
5408 438 409 -480 -734 -100 547 195 -609 -700 187 549 -133 -721 -353 365 510 -287 -719 -129 614 324 -502
5429 -502 -615 213 669 51 -638 -352 480 588 -200 -632 -131 626 484 -391 -482 129 699 309 -508 -403
5449 -403 401 701 -47 -569 -67 672 614 -175 -527 61 783 394 -423 -402 460 792 133 -473 -256 624 690
5470 690 -159 -537 76 705 489 -327 -472 290 716 233 -482 -279 503 695 -10 -584 -63 702 443 -268
5490 -268 -559 148 630 269 -514 -507 352 545 -40 -624 -280 527 454 -350 -652 -32 623 292 -596 -551 193
5511 193 550 -9 -674 -421 406 423 -228 -738 -165 520 231 -491 -698 53 560 -36 -695 -506 298 490
5531 490 -243 -751 -247 412 297 -450 -725 -67 505 143 -574 -516 182 516 -126 -681 -344 384 362 -345 -701
5552 -701 -118 554 173 -536 -571 217 597 76 -590 -341 449 544 -138 -652 -118 677 496 -359 -562 177 694
5573 694 238 -441 -359 404 611 -9 -566 -112 592 543 -185 -457 138 754 303 -388 -356 385 728 176 -472
5594 -472 -198 531 641 -131 -537 26 704 447 -320 -389 270 752 116 -465 -254 460 567 -54 -570 -98
5614 -98 636 460 -339 -542 153 670 277 -550 -442 425 523 -2 -544 -219 493 446 -258 -626 5 587 248
5635 248 -506 -484 196 538 -37 -659 -393 380 445 -297 -695 -119 484 240 -489 -635 74 515 50 -666 -482
5656 -482 228 434 -240 -716 -326 386 254 -502 -706 -27 527 32 -676 -565 172 461 -117 -737 -342 423
5676 423 343 -296 -624 -32 505 222 -454 -548 145 549 -43 -569 -359 393 515 -165 -605 -90 545 387 -357
5697 -357 -480 147 630 136 -515 -256 402 609 31 -557 -130 585 553 -192 -504 127 586 307 -345 -253 434
5718 434 622 81 -472 -182 612 569 -98 -462 69 670 391 -344 -384 263 752 194 -445 -233 451 600 -56
5739 -56 -465 -47 585 453 -309 -455 197 601 250 -513 -300 362 554 -65 -584 -210 510 421 -328 -561 38
5760 38 563 233 -478 -497 181 501 72 -582 -308 352 398 -275 -619 -209 391 221 -493 -548 75 443 18
5781 18 -689 -395 225 425 -239 -640 -222 374 196 -424 -672 -5 444 53 -591 -482 214 463 -126 -574
5801 -574 -305 402 337 -320 -651 48 487 171 -451 -552 185 509 -12 -586 -271 368 470 -162 -531 -101
5821 -101 522 323 -370 -486 122 533 198 -505 -312 399 508 -109 -494 -77 544 442 -221 -405 172 598
5841 598 284 -377 -293 372 613 159 -536 -175 554 480 -124 -396 110 643 332 -237 -317 230 654 94 -436
5862 -436 -253 457 570 -22 -495 -32 638 394 -219 -429 171 647 169 -458 -301 420 592 -57 -490 -130
5882 -130 500 389 -257 -482 34 525 189 -405 -434 225 543 -82 -599 -232 328 380 -204 -619 -115 497 233
5903 233 -464 -570 63 487 22 -607 -429 267 387 -273 -634 -263 419 268 -428 -584 -23 444 18 -488
5923 -488 -474 199 404 -111 -622 -313 395 362 -363 -578 -20 460 156 -388 -472 148 495 -44 -587 -348 371
5944 371 412 -188 -580 -156 531 288 -343 -466 191 583 129 -484 -284 406 438 -108 -440 -95 550 447 -235
5965 -235 -406 111 549 285 -381 -289 314 539 63 -467 -152 501 492 -114 -446 109 579 353 -326 -326 320 544
5987 544 160 -358 -179 545 555 -25 -371 -17 557 384 -320 -375 220 512 225 -385 -273 316 517 -42 -456
6008 -456 -101 405 454 -258 -488 104 497 224 -397 -384 236 494 -37 -510 -274 360 366 -246 -599 -132 401
6029 401 230 -393 -533 155 404 -22 -602 -397 271 341 -253 -569 -156 360 254 -455 -596 5 414 -10
6049 -10 -467 -449 150 368 -156 -571 -201 250 286 -334 -559 -23 415 98 -454 -460 126 428 12 -613 -314 376
6071 376 402 -241 -516 -100 456 222 -363 -488 128 452 33 -463 -322 299 433 -51 -496 -108 433 362 -243
6092 -243 -438 185 573 231 -385 -289 287 610 67 -423 -47 483 498 -184 -411 33 541 332 -249 -273 346
6113 346 593 107 -375 -136 489 501 -94 -421 1 550 371 -237 -367 218 587 263 -366 -256 295 504
6133 504 -24 -456 -115 471 368 -300 -448 82 513 206 -408 -361 227 472 -19 -486 -200 401 342 -205 -494
6154 -494 -28 438 155 -363 -463 97 407 -46 -501 -362 300 346 -222 -635 -246 399 220 -385 -490 73
6174 73 436 51 -563 -417 202 418 -143 -618 -315 321 284 -378 -584 -13 432 91 -495 -446 158 422 -49
6195 -49 -552 -278 287 305 -220 -526 -32 470 260 -347 -484 96 424 88 -430 -290 330 426 -80 -416 -43
6216 -43 483 331 -222 -377 147 501 186 -358 -196 349 569 39 -460 -103 500 391 -189 -416 85 559
6236 559 324 -255 -236 285 567 48 -421 -106 422 458 -36 -399 -24 500 350 -252 -357 203 504 165 -356
6257 -356 -216 299 479 -51 -393 -122 499 340 -229 -398 100 468 181 -364 -295 223 383 -72 -468 -124
6277 -124 354 332 -295 -496 -33 398 183 -451 -391 74 478 6 -477 -305 277 276 -219 -539 -172 398 160
6298 160 -385 -507 63 417 17 -429 -322 132 317 -160 -549 -210 305 219 -330 -516 -37 346 62 -438
6318 -438 -442 125 352 -6 -509 -245 295 290 -255 -537 -42 341 184 -367 -446 180 433 57 -414 -276 272 402
6340 402 -162 -431 -33 418 266 -236 -340 235 509 146 -340 -219 280 475 23 -406 -10 475 384 -158
6360 -158 -361 158 507 214 -291 -268 261 567 134 -347 -168 438 455 -68 -376 86 512 338 -278 -327 235
6381 235 528 89 -345 -207 354 428 -43 -405 -92 449 288 -272 -449 94 468 179 -387 -253 299 399
6401 399 -78 -456 -133 342 286 -214 -419 -51 405 154 -387 -380 148 412 -68 -519 -289 246 335 -189 -489
6422 -489 -138 312 160 -401 -457 58 311 2 -500 -386 136 272 -211 -465 -211 313 252 -356 -559 43 384
6443 384 57 -469 -428 116 378 -68 -455 -224 280 256 -202 -484 -44 492 173 -372 -416 140 347 9 -374
6464 -374 -222 320 335 -174 -426 -59 446 302 -283 -335 124 539 90 -316 -229 324 463 8 -351 -82 471
6485 471 368 -162 -358 51 504 249 -225 -203 307 503 62 -328 -72 376 399 -119 -406 32 550 281 -244
6506 -244 -219 199 508 140 -303 -190 387 430 -107 -431 -61 419 261 -202 -340 198 508 114 -364 -222 295
6527 295 444 -9 -412 -116 361 269 -252 -462 28 447 144 -418 -337 207 380 -66 -491 -259 228 290 -217
6548 -217 -520 -94 339 142 -375 -362 61 363 -85 -503 -354 120 307 -235 -389 -183 311 187 -418 -429 -26
6569 -26 364 26 -532 -338 189 296 -116 -447 -208 241 261 -247 -464 -45 307 134 -390 -330 129 410 16
6590 16 -472 -199 331 379 -167 -360 26 380 301 -300 -360 195 436 91 -345 -215 330 460 -74 -404 -78
6611 -78 424 351 -196 -361 188 493 188 -275 -151 278 415 20 -310 -42 435 423 -139 -315 70 498 235
6632 235 -289 -255 255 481 40 -348 -162 376 438 -89 -367 8 420 328 -226 -316 168 444 101 -329 -282 303
6654 303 329 -118 -371 -75 337 209 -212 -433 -10 386 135 -418 -341 165 335 -90 -398 -210 208 200 -273
6675 -273 -499 -93 276 134 -436 -442 78 330 9 -448 -260 193 314 -198 -415 -121 346 145 -335 -444 76
6696 76 362 24 -406 -286 150 222 -103 -396 -152 292 231 -280 -392 14 335 124 -398 -271 189 299 -35
6717 -35 -387 -205 257 338 -152 -394 8 413 207 -275 -308 160 415 90 -396 -185 262 377 -65 -353 13
6738 13 429 258 -182 -269 118 466 179 -348 -200 301 465 -21 -302 -25 435 394 -120 -272 129 522 242
6759 242 -254 -245 208 415 108 -289 -151 336 388 -77 -331 45 420 187 -206 -269 172 448 153 -375 -214
6780 -214 313 364 -79 -474 -53 351 242 -247 -344 97 301 111 -383 -289 257 310 -74 -416 -188 249 215 -217
6802 -217 -437 -22 302 63 -370 -348 101 365 -88 -505 -269 155 267 -203 -499 -46 215 128 -312 -390 55
6823 55 350 -2 -460 -298 138 319 -130 -492 -208 199 171 -272 -437 64 321 76 -359 -292 151 335 -72
6844 -72 -420 -121 296 250 -220 -337 43 309 126 -278 -275 141 418 79 -321 -176 368 427 -84 -302 16 423
6866 423 294 -108 -325 192 480 81 -282 -161 358 386 -6 -287 -18 375 297 -90 -223 155 504 278 -293
6887 -293 -201 301 515 -6 -304 -81 420 351 -109 -285 91 455 239 -172 -341 138 393 78 -342 -163 288
6908 288 286 -118 -379 -57 415 201 -227 -381 45 355 52 -343 -285 220 279 -52 -366 -173 286 274 -263 -408
6930 -408 -44 309 76 -369 -393 135 255 -105 -410 -220 191 209 -192 -426 -139 336 125 -398 -342 40 296
6951 296 -30 -409 -200 194 248 -179 -389 -177 241 135 -322 -370 -38 291 -42 -401 -234 119 291 -78 -429
6972 -429 -98 218 227 -228 -412 -7 355 69 -273 -273 135 344 84 -389 -120 299 314 -79 -355 30 391 260
6994 260 -185 -292 138 402 93 -254 -153 261 396 -88 -299 8 388 266 -184 -292 168 387 190 -253
7014 -253 -217 285 429 -3 -212 -71 302 279 -96 -260 74 373 161 -214 -280 134 377 57 -295 -194 281
7035 281 324 -19 -336 -25 320 196 -227 -324 77 370 71 -291 -275 259 304 -74 -401 -60 278 217 -202 -325
7057 -325 86 198 67 -349 -328 108 223 -125 -401 -197 158 241 -174 -426 -89 280 80 -333 -392 41 251
7078 251 -23 -382 -260 108 226 -126 -429 -124 302 119 -317 -329 15 228 37 -373 -295 166 269 -159 -405
7099 -405 -75 275 216 -224 -311 24 339 126 -272 -286 136 379 15 -301 -147 266 316 -187 -314 -4 358
7120 358 177 -225 -237 251 370 136 -273 -106 290 374 -40 -281 -67 441 309 -194 -240 116 405 126 -261
7141 -261 -169 184 411 42 -261 -33 358 304 -165 -299 105 388 185 -222 -163 202 354 40 -263 -128 312
7162 312 239 -153 -347 -29 340 219 -196 -286 81 398 70 -281 -229 200 302 -73 -300 -157 305 113 -279
7183 -279 -358 -5 278 68 -340 -354 117 251 -56 -411 -213 173 174 -239 -381 -63 264 65 -307 -336 49 231
7205 231 -56 -392 -307 175 213 -180 -395 -100 246 81 -279 -402 57 211 54 -377 -265 110 222 -73 -384
7226 -384 -199 259 197 -212 -353 9 322 140 -285 -283 179 319 -52 -309 -166 239 306 -209 -328 47 318
7247 318 224 -244 -217 186 390 78 -270 -131 266 379 -55 -245 2 382 216 -172 -245 161 412 133 -240
7268 -240 -119 230 360 -21 -309 -85 350 308 -137 -251 76 385 213 -146 -147 235 333 6 -350 -84 312
7289 312 349 -100 -269 -37 365 180 -215 -280 160 357 63 -279 -167 242 228 -47 -299 -74 203 201 -227 -306
7311 -306 99 285 8 -312 -237 123 208 -97 -373 -144 154 164 -228 -397 -89 306 117 -372 -298 16 231
7332 231 -45 -348 -255 159 213 -177 -425 -97 273 157 -343 -304 11 261 2 -317 -244 159 289 -142 -398
7353 -398 -146 275 205 -148 -262 -8 286 109 -301 -185 142 283 -52 -299 -91 299 217 -176 -289 -18 431
7374 431 105 -211 -257 200 284 27 -303 -114 300 369 -19 -204 36 361 255 -192 -142 211 323 130 -248
7395 -248 -74 248 362 29 -288 -41 343 305 -129 -197 14 356 234 -222 -208 257 290 37 -274 -73 336
7416 336 295 -105 -243 4 366 162 -232 -217 116 297 75 -293 -216 235 249 -107 -332 -67 295 152 -242
7437 -242 -342 59 242 57 -312 -245 108 253 -82 -361 -112 230 168 -252 -348 11 268 -10 -379 -226 58
7458 58 263 -57 -383 -238 149 208 -169 -384 -122 232 83 -295 -279 39 207 -2 -286 -248 185 210 -110 -359
7480 -359 -165 269 169 -235 -324 26 251 4 -302 -221 183 259 -81 -364 -167 203 279 -99 -333 41 327
7501 327 69 -257 -203 75 345 28 -243 -61 313 321 -66 -225 24 381 200 -201 -186 107 356 130 -270
7522 -270 -73 291 334 -49 -255 -55 360 205 -104 -254 85 346 149 -214 -227 230 394 19 -244 -50 254
7543 254 280 -108 -280 89 307 151 -219 -256 153 291 6 -255 -134 242 232 -43 -304 -95 309 91 -216
7564 -216 -260 102 234 3 -315 -188 151 199 -183 -337 -85 201 178 -208 -309 42 194 70 -344 -306 83
7585 83 235 -23 -398 -158 224 203 -218 -379 -25 266 21 -291 -289 32 220 18 -322 -223 123 176 -158 -322
7607 -322 -88 249 147 -256 -335 52 267 21 -305 -244 131 253 -104 -299 -103 208 217 -116 -254 36 287
7628 287 119 -284 -186 137 258 13 -246 -124 206 267 -83 -207 -4 343 194 -175 -234 196 317 81 -218
7649 -218 -114 323 320 -50 -235 101 365 223 -168 -201 123 319 121 -181 -151 220 355 -24 -211 -100 230
7670 230 277 -118 -278 74 291 145 -237 -233 159 265 17 -267 -193 217 257 -86 -321 24 282 125 -240 -242
7692 -242 102 280 46 -263 -177 197 229 -131 -314 -150 217 161 -233 -310 33 265 0 -231 -234 109 268 -117
7714 -117 -288 -147 174 164 -160 -316 -57 218 87 -227 -328 114 166 -95 -364 -220 178 195 -149 -384 -67
7735 -67 212 166 -253 -282 77 253 -18 -256 -196 111 204 -41 -273 -80 288 210 -139 -260 47 328 70 -251
7757 -251 -152 159 365 -61 -233 -106 190 227 -66 -257 0 342 192 -206 -231 193 309 90 -226 -98 289
7778 289 236 -97 -254 36 303 210 -145 -161 134 308 85 -147 -154 252 314 46 -193 -56 344 249 -93 -227
7800 -227 40 291 128 -192 -192 149 278 89 -261 -111 198 190 -110 -240 0 254 146 -229 -152 52 246 56
7822 56 -261 -128 183 232 -112 -311 10 191 157 -293 -311 1 244 70 -297 -197 78 233 -159 -341 -136
7843 -136 163 188 -184 -364 -25 216 54 -276 -245 29 252 -57 -276 -181 138 130 -182 -298 -12 250 46 -255
7865 -255 -259 107 249 9 -299 -150 169 204 -65 -279 -65 260 116 -129 -200 36 228 61 -252 -210 163 302
7887 302 -9 -205 -67 253 217 -127 -206 26 282 103 -172 -157 181 296 45 -250 -81 279 274 -63 -187 49
7909 49 330 130 -182 -212 185 297 81 -206 -74 267 261 -29 -228 0 334 239 -192 -223 60 303 127 -158
7931 -158 -227 128 262 23 -273 -37 287 201 -100 -215 5 291 100 -230 -156 167 207 -3 -284 -139 238
7952 238 204 -117 -268 -115 209 79 -215 -323 19 209 -133 -262 -278 142 169 -166 -330 -122 154 104 -212
7973 -212 -313 9 230 17 -222 -210 51 158 -72 -348 -157 168 189 -173 -353 -7 154 95 -227 -241 85
7994 85 187 -66 -283 -114 216 162 -111 -313 -33 182 145 -187 -233 64 277 43 -225 -119 155 255 -17
8015 -17 -263 -34 261 202 -64 -223 51 260 71 -138 -143 99 256 30 -247 -91 316 224 -100 -167 44 299
8037 299 170 -188 -184 144 276 54 -243 -114 253 259 -60 -184 15 355 172 -83 -115 108 340 102 -178 -178
8059 -178 157 230 -79 -268 -33 159 201 -91 -273 59 306 116 -230 -143 180 257 -43 -199 -120 96 255 -74
8081 -74 -275 -32 225 94 -178 -207 101 182 13 -250 -173 119 108 -103 -287 -153 193 84 -217 -253 -4 258
8103 258 -31 -271 -224 86 220 -45 -335 -192 142 169 -158 -267 -13 166 -1 -223 -266 34 163 20 -255
8124 -255 -191 150 172 -131 -303 -40 186 116 -176 -257 49 262 -8 -215 -132 108 205 -53 -263 -9 235 166
8146 166 -155 -229 5 298 77 -238 -124 135 274 63 -268 -48 266 264 -90 -246 80 307 192 -127 -90
8167 -90 156 302 16 -189 -69 231 228 -14 -213 67 293 183 -134 -169 118 286 107 -172 -78 208 210 -64
8189 -64 -219 -61
8191f1
$$ Imaginary data points
##PAGE= N=2
##DATA TABLE= (X++(I..I)), XYDATA
0 0 0 0 0 0 0 0 0 0 0 0 0 8 -8 8 -8 8 -16 16 -16 22 -24 27 -32 39 -40 48 -56 64 -72 80 -90 102 -114 126
34 126 -142 158 -174 194 -216 240 -264 292 -323 359 -397 442 -490 546 -614 689 -779 890 -1027
53 -1027 1200 -1434 1760 -2247 3058 -4651 8938 -43244 -120354 12149 67459 -25238 -77561
66 -77561 6917 48444 -11270 -48116 -12789 -4211 -25505 -15506 5676 -14747 -25199 8705 22023
79 22023 -22864 -49160 -18195 11332 -1209 -18178 -13360 1333 7631 -5033 -30989 -28832 9609
92 9609 19927 -23323 -38603 11525 37291 -11033 -44757 -9232 20484 -3927 -23443 -5295
104 -5295 8095 2658 1095 -7352 -26751 -14186 25675 18965 -31517 -31287 23645 30609 -21645 -35142
118 -35142 6171 20756 -4521 -12470 -926 -887 1551 11324 -5771 -31886 -8295 34738 17715
131 17715 -29411 -19616 21572 13834 -20497 -14784 10091 7701 -1438 4389 656 -9846 3709
144 3709 16225 -9900 -29483 4216 34314 5605 -24192 -710 21797 -1687 -21165 -3112
156 -3112 11288 4154 3132 3879 -8992 -5711 19689 12105 -28893 -24359 26962 31001 -18965 -26079
170 -26079 18646 23933 -17342 -24423 6308 11261 -3993 2677 8267 -12692 -15203 17021 18914
183 18914 -24146 -32262 14759 32631 -8238 -31411 -518 24279 3334 -24544 -18787 7714
195 7714 18739 316 -22375 -14255 12973 12711 -15027 -19673 5466 11341 -9391 -13448 2502
208 2502 2392 -7830 -1896 1681 -13666 -11976 15598 13086 -25718 -26691 17895 22946 -22638 -29790
222 -29790 15161 25383 -15170 -29521 151 15197 302 -9407 -8727 -7990 3547 16020 -2005
235 -2005 -28433 -12081 22718 11568 -25002 -18099 18060 18046 -12772 -20573 -3152 7279 6468 905
249 905 -11320 -12966 9444 20261 -7546 -27925 -1837 23622 2443 -22354 -4913 19026 8349
262 8349 -11745 -10416 -654 3001 5439 2059 -8906 -6070 12488 11348 -12821 -15615 10169 16316
276 16316 -8169 -16514 4492 15490 2547 -8377 -7193 -2381 6109 11106 -2666 -16405 -43
289 -43 21428 4410 -24626 -11514 21750 16359 -15546 -18309 6701 16164 1933 -10942 -10437 -402
303 -402 10464 7347 -9588 -13169 5619 13671 -5425 -17928 -2540 12377 4937 -6791 -7901
316 -7901 -4606 1778 8199 -1372 -18082 -8521 17256 10919 -19809 -16867 14971 13704 -19276 -21331
330 -21331 9494 16108 -6811 -13726 -199 2213 -4031 -1831 -2291 -10456 -4076 12456 4574 -18692
344 -18692 -12001 15103 10726 -19451 -21025 7890 17846 -1706 -15443 -7292 5298 6803 -3072
357 -3072 -13632 -8251 10042 12967 -7402 -17833 -88 15108 3021 -14119 -10137 4804 10110
370 10110 3831 -5988 -9812 -113 11387 3027 -14792 -8130 15698 14654 -10902 -15730 6859 15647
384 15647 -1222 -12055 -2629 7977 7751 1408 -5159 -4122 6664 10231 -4309 -12751 4345 19233
398 19233 4095 -15452 -5868 13861 10197 -5803 -7166 2889 8140 6497 321 -7275 -3628 11290
412 11290 11560 -8865 -14576 8713 21750 1116 -17878 -5512 13573 9924 -4918 -8539 -100
425 -100 9453 9411 -3583 -13363 -1601 15568 7305 -14518 -11362 12279 15286 -5694 -13909 -419
439 -419 7966 1741 -3993 -3657 -1340 4040 6331 -4169 -13399 -1491 13773 3351 -16193 -9006
453 -9006 12674 10722 -10144 -14177 1597 9225 -420 -9744 -6134 4394 8255 -1021 -12551 -8809
467 -8809 6591 9573 -5192 -13707 -2373 9860 4887 -7678 -10283 -1443 7492 4575 -8360 -12366
481 -12366 3205 15121 442 -18707 -8890 13840 11125 -10043 -12660 3859 9891 -167 -7295
494 -7295 -4417 1505 5449 3557 -5110 -7778 4151 12271 -348 -13740 -3779 12800 7655 -7968
508 -7968 -6816 5846 8113 -337 -5591 -2703 4477 9034 2585 -8596 -5121 11170 12276 -6514
522 -6514 -13340 4660 16527 3150 -10991 -3433 10523 8819 -3053 -7815 -896 9110 10263
535 10263 -917 -10104 -1659 12824 9085 -8084 -10220 5756 13218 2200 -8251 -3741 6679
548 6679 8515 -576 -9128 -4443 9355 11337 -3712 -12161 132 12245 3778 -10005 -6414 6506
562 6506 7689 -2252 -7374 -2225 4886 4767 -3417 -9302 -2418 8991 5760 -8828 -10563 3710 8911
577 8911 -3664 -11703 -2486 7415 3579 -6270 -8749 -1955 5716 3533 -7995 -12115 482 11125
591 11125 1026 -13970 -8856 7329 6980 -7738 -12015 -769 7210 2283 -6853 -9690 -3109 6143
605 6143 4715 -8135 -12714 1301 11887 129 -14677 -7508 8287 6258 -8017 -10611 785
618 785 7970 2331 -7484 -8804 158 7442 1744 -8900 -6867 5847 8246 -4125 -10544 -715 8253
633 8253 2524 -7197 -5958 3368 7641 1870 -6910 -6832 3534 9191 198 -9716 -2923 10008 7443
648 7443 -6587 -9274 2693 10139 2922 -7232 -5914 4980 10598 1970 -9421 -6363 7696 10599
662 10599 -2748 -10174 859 11820 4825 -7858 -6620 4404 8270 1635 -5568 -4335 4055 8746
676 8746 1385 -8610 -4809 7903 8170 -4892 -8776 2849 9829 1112 -8417 -4841 4878 6647 -563
691 -563 -6752 -3452 5211 6346 -3491 -9916 -1217 9334 3606 -9298 -7538 5812 8377 -3435
705 -3435 -10592 -3634 5760 5162 -3481 -8711 -2981 6419 4716 -7195 -10711 884 9313 770 -10948
720 -10948 -7132 5316 6977 -3916 -10689 -4318 5491 5306 -4300 -9631 -2419 6675 2985 -8488
734 -8488 -9138 2693 7892 -1281 -9763 -4532 5000 4629 -4079 -8411 -2293 5679 4008 -5271 -7760
749 -7760 1236 7362 -119 -9109 -4630 6276 6273 -3798 -7988 -646 6565 3576 -4796 -6595 1126
764 1126 7818 3027 -7035 -6213 5468 9167 -1933 -9825 -1426 9717 6336 -4970 -7083 1734
778 1734 7987 3603 -4941 -5511 3395 9253 2282 -7458 -4397 7258 8837 -2452 -8463 178 9486
793 9486 5330 -4796 -5755 2635 7617 2476 -5110 -3896 4748 7888 -231 -7580 -1975 7937 6046
808 6046 -4421 -6646 2361 8181 2202 -6051 -4547 3979 6710 -628 -6895 -2249 6693 5928 -4189
823 -4189 -8286 95 8090 3311 -6859 -6564 3356 7611 -86 -8227 -4837 4973 6457 -2892 -9172
838 -9172 -2009 7618 4548 -6852 -8937 1188 7505 1119 -7638 -5946 3116 5884 -1590 -8407 -4357
853 -4357 4923 5141 -4226 -8741 -950 6900 2298 -7628 -7305 2386 6131 -1043 -7398 -3408 4109 4027
869 4027 -3633 -7567 -1510 5855 3132 -5861 -6972 2014 6971 -65 -8024 -4453 4856 5852 -2597
884 -2597 -7241 -1167 6326 3663 -5213 -7017 1384 7880 2675 -6579 -5734 4295 7819 -641 -8158
899 -8158 -2872 6954 6470 -3130 -6975 600 7940 3776 -5602 -5842 3472 8366 1712 -6143 -3459 5208
915 5208 6692 -1120 -6263 -872 6953 5240 -3426 -5604 1946 7459 2170 -5789 -4033 4849 7267
930 7267 -393 -6328 -1482 6163 4471 -3687 -5759 1559 7227 2452 -5656 -4783 3808 6702 -854
945 -854 -7241 -2592 5879 5431 -3091 -6910 -415 6237 2790 -5825 -6164 2348 6880 342 -7470 -4894
961 -4894 3960 5596 -2459 -7983 -2510 5610 3874 -4965 -7578 -117 5709 904 -7085 -5823 2962
976 2962 5667 -1933 -8014 -3576 4031 3254 -4224 -7025 -928 4977 1653 -6063 -6290 1461 5240 -1162
992 -1162 -7742 -4012 4470 4432 -3992 -7692 -1261 5365 2163 -5645 -6108 1467 5769 152 -7165 -4988
1008 -4988 3908 5963 -2377 -8037 -1900 6558 4213 -5042 -6859 964 6457 1987 -5544 -4842 3187
1023 3187 6611 4 -6737 -3171 5445 5892 -2428 -6531 -71 6786 3572 -4320 -4892 2451 6413
1038 6413 1409 -4869 -2939 4504 6121 -1059 -6039 -753 6708 4478 -3656 -4745 2551 6592 1449
1053 1449 -4762 -2849 4197 5898 -354 -5343 -1153 6165 5051 -3406 -6131 1378 7403 2471 -5513
1068 -5513 -4067 4086 6163 -569 -5839 -2128 4928 5203 -2147 -6511 -971 6469 3931 -5195 -6467
1083 -6467 2107 6891 701 -6423 -3961 3813 4937 -2036 -6690 -2177 4861 3957 -3906 -6810 -180
1098 -180 5764 1392 -6466 -5284 2764 4894 -1819 -6494 -2467 3501 2706 -3429 -6121 -1101 4529
1113 4529 2141 -5340 -6198 1403 5301 -851 -7086 -3461 4079 3839 -3391 -6471 -1169 4516 2155
1128 2155 -4690 -5974 760 5756 1113 -6447 -4988 3519 5415 -2062 -6834 -1423 5257 3323 -3715
1143 -3715 -5377 332 5187 2281 -4489 -4887 2416 6469 482 -6109 -2762 5065 4895 -2568 -5210
1158 -5210 810 5899 2662 -3578 -3777 2132 5667 1599 -4366 -2799 4472 6116 -1002 -5567 -108
1173 -108 6432 3546 -3580 -3704 2897 6033 1602 -4076 -2833 3678 5990 262 -5203 -1401 6121
1188 6121 5355 -2841 -5303 1512 6669 2287 -4432 -3315 3403 5850 536 -4924 -2749 4268 5610
1203 5610 -1197 -5865 -589 6199 3503 -4387 -5022 2103 5382 538 -4742 -2983 2992 4568 -775
1218 -775 -5542 -2534 4178 3962 -3234 -5891 570 5514 865 -5843 -3984 2902 4061 -1768 -5454
1233 -5454 -1993 3334 2995 -2797 -5886 -1049 4634 1920 -5319 -5300 2200 4961 -1311 -6534 -2961 3594
1249 3594 3475 -2689 -5818 -1427 4248 2796 -4198 -6144 455 5575 871 -6172 -4182 3573 4712
1264 4712 -2164 -6029 -1491 4177 3086 -2728 -4997 -304 4790 2495 -4318 -4795 2350 5676 -86
1279 -86 -5490 -1996 4551 3914 -2242 -4536 138 4859 2992 -2794 -3861 1752 5575 1388 -4633 -2697
1295 -2697 4558 5483 -1397 -4785 431 5766 3167 -2873 -3437 1802 5492 2419 -3386 -3074 3419 6195
1311 6195 186 -5167 -1170 5880 4691 -2484 -4428 1381 5768 2432 -3322 -3257 2464 5544 1404
1326 1404 -4279 -2569 4179 5287 -1456 -5352 55 5837 2917 -3605 -3641 1936 4623 873 -3737
1341 -3737 -2774 2694 4473 -566 -4920 -1585 4426 3250 -3420 -4861 1111 4844 795 -4562 -3309
1356 -3309 2266 3864 -682 -4903 -2364 3418 3717 -2700 -5875 -368 5140 1601 -5187 -4339 2358
1371 2358 4470 -830 -5112 -2750 2733 3478 -1802 -5458 -1588 4308 3036 -3928 -5506 881 5035
1386 5035 567 -5334 -3306 2991 4000 -1270 -4807 -1699 3446 3299 -2266 -4868 -24 5134 2078
1401 2078 -4457 -3907 2747 4833 -520 -4423 -1181 3875 3396 -1578 -3914 -107 4491 2907 -2871
1416 -2871 -3731 2195 5698 872 -4621 -1961 4467 4529 -1365 -3871 471 4776 3025 -2016 -3344 1292
1432 1292 5466 2350 -3583 -2924 3809 5745 -341 -4519 -608 5077 3837 -1847 -3462 1027 4980
1447 4980 2650 -2864 -3353 2284 5562 1078 -4294 -1957 4405 4478 -1679 -4359 321 4624 2396 -2611
1463 -2611 -3201 1326 4379 1331 -3899 -3064 2963 4747 -909 -5085 -931 4514 2518 -3402 -4105 1022
1479 1022 4035 873 -3770 -3277 1715 3962 -388 -5180 -2609 3578 3660 -2774 -5452 -134 4424 1163
1495 1163 -4383 -3873 1348 3668 -66 -4407 -3149 2271 3684 -1640 -5675 -1629 4122 2455 -3786
1510 -3786 -4566 875 3798 174 -4216 -3003 1750 3388 -565 -4431 -2171 3056 3188 -2511 -5000
1525 -5000 131 4634 1353 -4129 -3016 2337 3543 -699 -3863 -1507 3003 3430 -1228 -4173 -469
1540 -469 4550 2654 -3352 -3759 2300 5078 453 -4051 -1624 3572 3829 -915 -3730 -414 4317 3572
1556 3572 -1974 -3993 990 5407 1942 -3926 -2568 3547 4755 -394 -3588 -598 3864 3405 -1070
1571 -1070 -3427 136 4584 3042 -2682 -3521 2086 5062 454 -4099 -1326 3908 3536 -1422 -3373
1586 -3373 114 3632 2265 -2075 -3250 835 4388 1397 -3898 -2927 2966 4013 -1427 -4421 -506
1601 -506 3853 2071 -2717 -3613 326 3510 1190 -3577 -3615 1680 4154 -516 -5103 -2206 3455 2729
1617 2729 -2952 -4515 33 3435 899 -3507 -3698 476 3249 314 -4418 -3452 2266 3538 -1989
1632 -1989 -5289 -1130 3634 1502 -3651 -3817 597 2985 234 -3679 -3265 1289 3293 -673 -4688
1647 -4688 -2142 3267 2760 -3044 -4606 435 3928 596 -3747 -2701 1626 3184 -227 -3700 -2271
1662 -2271 2617 3590 -1369 -4545 -317 4531 2118 -3504 -3296 2016 4128 375 -3348 -1817 2553
1677 2553 3648 -232 -3615 -1202 3979 3676 -1929 -3997 1151 5089 1437 -3561 -2063 3026 3837
1692 3837 -40 -2913 -883 3090 3473 -724 -3465 -47 4551 2736 -2826 -2959 2482 4489 164
1707 164 -3412 -1008 3306 3165 -824 -2983 -229 3578 2686 -2091 -3489 1124 4615 972 -3962 -2202
1723 -2202 3241 3442 -1410 -3707 -378 3136 2251 -1901 -3522 -91 3647 1629 -3588 -3604 1951 4110
1739 4110 -760 -4664 -1664 3122 2256 -2415 -3757 -331 2863 1396 -2690 -3699 185 3442 417
1754 417 -4384 -3084 2583 3094 -2123 -4518 -679 2940 1157 -2844 -3278 127 2688 658 -3327 -3246
1770 -3246 1352 3361 -945 -4567 -1576 3382 2162 -2965 -3749 587 3144 552 -2989 -2619 1278
1785 1278 3197 231 -3734 -2281 2843 3464 -1741 -4275 137 4157 1571 -3050 -2603 1632 3426
1800 3426 515 -2770 -1877 2247 3653 -116 -3649 -884 3995 3101 -2192 -3334 1591 4313 1016
1815 1016 -2823 -1527 2413 3326 333 -2586 -1080 3136 3610 -954 -3481 475 4556 2035 -2836
1830 -2836 -2144 2574 3769 148 -2712 -815 2686 3138 -479 -3009 -403 3770 2812 -2228 -3346 1537
1846 1537 4461 612 -3548 -1674 2897 3072 -892 -3122 -741 2822 2532 -1539 -3593 -16 3844
1861 3844 1591 -3456 -3071 2061 3606 -787 -3918 -1262 2637 2053 -1726 -3381 -678 2657 1633
1876 1633 -2611 -3690 513 3447 70 -4173 -2412 2445 2479 -1988 -3727 -557 2403 1204 -2364
1891 -2364 -3313 -38 2861 816 -3512 -3070 1705 3179 -1183 -4224 -1147 2954 1699 -2505 -3245 189
1907 189 2749 804 -2702 -2870 887 3309 200 -3899 -2127 2890 3057 -1836 -3759 189 3438 1342
1923 1342 -2460 -2479 1039 3187 857 -2782 -2207 2144 3625 -425 -3599 -615 3739 2481 -2132 -2710
1939 -2710 1357 3538 1008 -2248 -1554 1919 3314 427 -2709 -1144 3198 3417 -1280 -3182 827
1954 827 4172 1490 -2493 -1793 2153 3392 430 -2445 -1105 2563 3227 -392 -3056 -290 3774 2467
1970 2467 -2315 -2830 1631 3815 493 -2873 -1441 2372 2792 -403 -2779 -989 2738 2642 -1502 -3419
1986 -3419 266 3674 1195 -3185 -2457 1986 2930 -628 -3181 -1241 2167 2093 -1401 -3243 -638 2778
2002 2778 1544 -2724 -3210 985 3158 -274 -3797 -1791 2231 1979 -1661 -3276 -737 2191 1433 -2258
2018 -2258 -3409 80 3015 545 -3616 -2678 1908 2768 -1357 -3753 -973 2578 1569 -2142 -3123 -64
2034 -64 2696 1093 -2821 -2920 1093 3328 -112 -3659 -1666 2718 2510 -1710 -3132 58 2905 1385
2050 1385 -1995 -2447 802 3137 935 -2786 -1938 2318 3320 -708 -3210 -232 3310 2015 -1771
2065 -1771 -2266 1070 3139 1131 -1984 -1587 1851 3329 299 -2825 -810 3253 2974 -1391 -2716 970
2081 970 3620 1422 -2045 -1665 1803 3330 646 -2442 -1212 2622 3197 -720 -2955 36 3573 2066
2097 2066 -2129 -2353 1494 3342 604 -2467 -1433 2047 2836 -247 -2832 -867 2858 2474 -1691 -3072
2113 -3072 595 3279 824 -2815 -1961 1627 2591 -395 -2831 -1261 2055 2201 -1342 -3202 -361 2862
2129 2862 1348 -2707 -2792 1066 2763 -362 -3258 -1633 1830 1928 -1291 -3094 -867 2220 1420 -2302
2145 -2302 -3272 318 2881 215 -3382 -2277 1694 2301 -1145 -3226 -1139 2045 1575 -1805 -3096 -199
2161 -199 2597 974 -2792 -2680 1284 2889 -322 -3344 -1343 2264 2007 -1397 -2767 -199 2470 1423
2177 1423 -1936 -2493 829 2996 519 -2835 -1633 2266 2697 -875 -2781 -135 2805 1736 -1578
2192 -1578 -2229 868 3069 1143 -2204 -1617 1967 3121 -12 -2703 -564 3134 2465 -1358 -2283 802
2208 802 3242 1409 -1811 -1756 1503 3213 551 -2491 -1095 2690 2945 -862 -2663 196 3215 1792
2224 1792 -1732 -2090 1225 3060 741 -2264 -1460 1935 2892 -337 -2758 -649 2785 2134 -1692 -2588
2240 -2588 676 2882 734 -2368 -1831 1458 2495 -198 -2749 -1220 2175 2104 -1461 -3029 -73 2693
2256 2693 1022 -2591 -2394 1034 2413 -269 -2913 -1617 1665 1931 -1246 -3146 -757 2324 1356 -2368
2272 -2368 -2989 438 2504 58 -2983 -2028 1349 2100 -975 -3079 -1213 1946 1606 -1823 -3095 -132
2288 -132 2564 708 -2689 -2321 1154 2348 -503 -2937 -1205 1968 1852 -1205 -2698 -300 2435 1329
2304 1329 -2043 -2459 967 2842 345 -2633 -1412 2035 2383 -774 -2491 -246 2579 1723 -1555 -2234
2320 -2234 743 2918 889 -2190 -1569 1991 2898 -137 -2505 -475 2735 2171 -1103 -2216 580 2972
2336 2972 1439 -1732 -1783 1533 3167 460 -2337 -906 2489 2490 -754 -2268 135 2860 1698 -1454
2352 -1454 -1928 1060 2947 748 -2121 -1311 1901 2678 -372 -2475 -339 2581 1783 -1464 -2175 683
2368 683 2643 809 -2158 -1748 1358 2489 -223 -2624 -1065 2132 1935 -1475 -2638 114 2465 867
2384 867 -2272 -2228 849 2336 -92 -2749 -1556 1626 1976 -1203 -3013 -630 2227 1116 -2233 -2655
2400 -2655 462 2250 34 -2756 -1924 1208 1964 -819 -2896 -1135 1935 1459 -1817 -2834 56 2249
2416 2249 532 -2552 -2093 987 2112 -428 -2695 -1204 1762 1759 -1297 -2642 -246 2346 1095 -2020
2432 -2020 -2165 965 2459 60 -2458 -1173 1809 2096 -791 -2417 -276 2457 1644 -1543 -2180 758
2448 758 2869 701 -2119 -1424 1779 2585 -174 -2275 -444 2377 2038 -1041 -2084 499 2797 1336
2464 1336 -1648 -1655 1536 2834 310 -2165 -695 2271 2272 -595 -2091 131 2652 1613 -1422 -1784 1048
2481 1048 2755 688 -2038 -1170 1872 2445 -454 -2242 -298 2396 1653 -1341 -2037 539 2515 687
2497 687 -2045 -1673 1364 2354 -343 -2475 -861 2026 1681 -1356 -2427 68 2301 872 -2096 -2159
2513 -2159 771 2157 -90 -2554 -1492 1562 1727 -1149 -2745 -624 2040 1030 -2025 -2390 309
2528 309 2011 85 -2533 -1913 1042 1778 -844 -2737 -1010 1751 1286 -1758 -2594 -72 1931 422
2544 422 -2284 -1973 850 1958 -433 -2598 -1157 1663 1592 -1275 -2480 -195 2172 921 -1970 -2026
2560 -2026 894 2277 42 -2295 -1272 1666 1931 -717 -2359 -331 2327 1411 -1488 -1992 732 2524
2576 2524 686 -1957 -1329 1591 2338 -157 -2096 -477 2263 1875 -995 -2013 551 2628 1235 -1646
2592 -1646 -1451 1491 2632 207 -1931 -677 2060 2179 -599 -1905 178 2527 1502 -1369 -1501 1132
2608 1132 2595 605 -1876 -960 1894 2253 -457 -2107 -140 2297 1553 -1297 -1876 595 2424 636
2624 636 -1943 -1427 1395 2212 -302 -2306 -757 1920 1517 -1269 -2322 54 2188 861 -1962 -1969 892
2641 892 2069 -200 -2400 -1247 1537 1640 -1113 -2532 -433 1855 919 -1873 -2224 336 1921 69
2657 69 -2286 -1637 1086 1719 -873 -2567 -861 1690 1144 -1628 -2361 143 1853 361 -2151 -1832 868
2674 868 1832 -523 -2445 -1093 1592 1437 -1262 -2309 -92 2016 856 -1851 -1970 796 2093 35
2690 35 -2185 -1284 1540 1893 -727 -2201 -284 2126 1304 -1457 -1895 650 2325 576 -1837 -1243 1441
2707 1441 2269 -197 -2028 -421 2192 1753 -904 -1752 488 2418 1068 -1462 -1290 1412 2446 237
2723 237 -1817 -566 2079 2040 -576 -1726 261 2432 1282 -1303 -1447 1064 2347 493 -1713 -906
2739 -906 1732 2106 -368 -1891 -101 2235 1504 -1181 -1665 696 2273 710 -1723 -1345 1303 2010
2755 2010 -235 -2086 -578 1806 1588 -1086 -2009 73 2014 797 -1762 -1762 876 1932 -128 -2191
2771 -2191 -1187 1337 1550 -960 -2317 -405 1820 900 -1778 -1991 394 1780 -14 -2198 -1504 1008
2787 1008 1560 -795 -2347 -723 1555 1004 -1661 -2217 88 1762 282 -2083 -1717 895 1624 -555
2803 -555 -2400 -974 1425 1319 -1188 -2263 -178 1830 692 -1846 -1834 737 1973 -26 -2130 -1151
2819 -1151 1484 1647 -676 -2094 -283 1952 1169 -1302 -1789 599 2119 519 -1789 -1198 1453 2065
2835 2065 -321 -1857 -356 1984 1517 -953 -1620 453 2260 968 -1441 -1254 1376 2231 205 -1705
2851 -1705 -547 1901 1902 -625 -1695 320 2246 1204 -1237 -1394 1032 2241 469 -1698 -875 1724
2867 1724 2018 -405 -1840 -59 2073 1421 -1093 -1566 643 2147 682 -1602 -1229 1350 2026 -217
2883 -217 -2015 -606 1795 1519 -984 -1867 144 2001 740 -1619 -1497 788 1822 -85 -1983 -1037
2899 -1037 1325 1457 -878 -2189 -340 1708 778 -1681 -1880 415 1676 24 -2094 -1377 1005 1501
2915 1501 -756 -2278 -733 1468 969 -1518 -2102 58 1690 252 -2022 -1583 751 1547 -480 -2204
2931 -2204 -991 1279 1180 -1140 -2148 -203 1696 640 -1772 -1812 633 1739 -91 -1998 -1095 1296
2947 1296 1483 -764 -1980 -337 1795 1097 -1320 -1737 520 1943 322 -1732 -1085 1262 1838 -340
2963 -340 -1756 -333 1807 1496 -842 -1570 340 2134 923 -1325 -1264 1216 2117 106 -1651 -415
2979 -415 1763 1738 -623 -1565 217 2124 1211 -1137 -1328 917 2165 437 -1583 -851 1654 1950 -397
2996 -397 -1697 -94 2008 1349 -973 -1471 562 2046 730 -1501 -1132 1219 1929 -176 -1855 -478
3012 -478 1672 1413 -939 -1722 213 1831 650 -1516 -1446 831 1708 -87 -1903 -1008 1304 1463 -874
3029 -874 -2073 -246 1596 712 -1576 -1718 440 1584 44 -1925 -1286 965 1408 -696 -2129 -687
3045 -687 1389 852 -1452 -1987 58 1540 200 -1895 -1524 741 1452 -480 -2105 -1002 1272 1213 -1092
3062 -1092 -2068 -198 1647 578 -1708 -1654 614 1605 -48 -1868 -1018 1166 1441 -741 -1955 -305
3078 -305 1614 962 -1262 -1603 559 1890 321 -1688 -1005 1196 1716 -318 -1649 -286 1659 1291
3094 1291 -869 -1593 354 2000 787 -1325 -1172 1180 1904 64 -1591 -438 1678 1616 -580 -1509
3110 -1509 183 2039 1175 -1150 -1279 933 2102 500 -1481 -726 1532 1815 -324 -1576 46 1872
3126 1872 1297 -896 -1361 502 2015 613 -1473 -994 1217 1735 -137 -1690 -369 1559 1290 -893
3142 -893 -1645 189 1724 717 -1414 -1326 774 1663 -61 -1803 -827 1294 1286 -847 -1867 -149 1485
3159 1485 667 -1432 -1653 418 1552 37 -1852 -1281 951 1292 -746 -2068 -595 1297 838 -1406
3175 -1406 -1841 11 1471 232 -1828 -1472 723 1319 -414 -1991 -960 1201 1053 -1123 -1928 -150
3191 -150 1495 402 -1542 -1519 490 1460 -119 -1849 -1054 1143 1286 -714 -1826 -275 1552 853 -1227
3208 -1227 -1569 433 1655 265 -1581 -1031 1123 1568 -274 -1586 -294 1541 1210 -936 -1556 382
3224 382 1909 702 -1352 -1052 1045 1780 65 -1520 -449 1590 1566 -537 -1460 292 1903 1051 -1036
3241 -1036 -1203 860 1947 404 -1395 -640 1470 1719 -268 -1402 -9 1797 1218 -854 -1298 662
3257 662 1920 571 -1387 -849 1220 1686 -129 -1480 -366 1514 1222 -810 -1534 257 1763 630
3273 630 -1358 -1286 874 1613 -50 -1623 -789 1213 1214 -827 -1682 -89 1479 706 -1331 -1518 379 1578
3291 1578 29 -1737 -1087 928 1273 -729 -1954 -554 1323 834 -1253 -1733 51 1402 188 -1737
3307 -1737 -1390 767 1343 -470 -1887 -789 1164 898 -1064 -1774 -160 1393 498 -1498 -1483 481 1412
3324 1412 -89 -1743 -882 1075 1210 -756 -1714 -216 1437 737 -1188 -1423 450 1553 272 -1553
3340 -1553 -937 1021 1473 -398 -1569 -303 1473 1130 -862 -1383 413 1716 596 -1231 -988 1000
3356 1000 1655 22 -1377 -459 1572 1443 -576 -1391 330 1803 948 -949 -971 848 1825 351 -1259
3373 -1259 -526 1412 1588 -315 -1320 20 1763 1112 -860 -1162 670 1828 456 -1221 -776 1211
3389 1211 1524 -143 -1405 -285 1428 1174 -773 -1452 289 1643 625 -1272 -1053 840 1507 -58
3405 -58 -1530 -670 1247 1154 -703 -1598 -103 1400 607 -1301 -1426 468 1459 -9 -1754 -935 949
3422 949 1126 -653 -1702 -481 1208 717 -1141 -1696 86 1359 197 -1609 -1253 736 1185 -482
3438 -482 -1766 -690 1112 826 -1052 -1639 -121 1239 394 -1421 -1402 542 1350 -270 -1726 -830 1038
3455 1038 1073 -789 -1625 -220 1321 620 -1210 -1369 398 1463 159 -1504 -871 991 1375 -447 -1481
3472 -1481 -240 1524 1062 -862 -1292 357 1652 478 -1188 -863 927 1586 -41 -1410 -440 1473
3488 1473 1337 -582 -1256 339 1662 794 -914 -920 849 1664 266 -1169 -534 1365 1485 -346 -1276
3505 -1276 108 1670 1031 -789 -1041 734 1662 448 -1126 -706 1121 1507 -160 -1336 -257 1495
3521 1495 1099 -793 -1364 412 1614 533 -1193 -1011 839 1377 -100 -1397 -560 1200 1110 -737 -1535
3538 -1535 -74 1427 614 -1213 -1348 498 1396 -71 -1571 -852 929 1069 -619 -1564 -395 1171
3554 1171 709 -1163 -1609 236 1307 124 -1564 -1085 735 1085 -554 -1676 -624 1046 794 -1022
3570 -1022 -1584 -104 1222 335 -1436 -1303 506 1247 -273 -1633 -723 1027 986 -782 -1532 -161 1221
3587 1221 619 -1165 -1298 409 1343 168 -1408 -858 1048 1287 -464 -1379 -179 1308 875 -890 -1217
3604 -1217 373 1516 464 -1148 -851 906 1477 -103 -1295 -260 1400 1183 -591 -1215 296 1529
3620 1529 720 -935 -842 810 1598 267 -1160 -445 1296 1417 -391 -1158 182 1574 939 -752 -1030
3637 -1030 639 1559 399 -1088 -625 1059 1429 -131 -1267 -131 1437 1029 -747 -1175 403 1551
3653 1551 434 -1120 -845 843 1370 -73 -1337 -518 1156 1040 -701 -1417 -13 1396 568 -1135
3669 -1135 -1173 518 1247 -32 -1443 -824 859 968 -557 -1489 -416 1143 639 -1146 -1449 201 1199
3686 1199 -24 -1455 -1035 613 1002 -475 -1544 -604 1032 712 -967 -1548 -61 1109 250 -1351
3702 -1351 -1160 540 1119 -313 -1559 -737 920 876 -731 -1453 -146 1114 546 -1109 -1253 408 1293
3719 1293 18 -1382 -787 919 1154 -503 -1335 -214 1248 793 -861 -1175 318 1366 481 -1064
3735 -1064 -786 891 1344 -155 -1276 -230 1326 1031 -548 -1119 287 1452 674 -902 -819 807 1510
3752 1510 221 -1165 -402 1257 1248 -357 -1118 151 1476 857 -728 -895 687 1526 339 -1030 -565
3769 -565 1034 1269 -185 -1215 -58 1406 972 -651 -1039 448 1393 456 -1036 -803 773 1314 -96
3786 -96 -1228 -363 1184 1024 -633 -1240 58 1308 561 -1091 -1044 525 1186 -57 -1313 -715 937
3803 937 935 -566 -1420 -248 1061 577 -1089 -1259 265 1120 -63 -1400 -929 719 988 -473 -1506
3820 -1506 -487 973 614 -946 -1411 -16 1068 182 -1360 -1147 535 1036 -311 -1466 -565 888
3836 888 787 -793 -1390 -137 1127 490 -1097 -1175 412 1206 -74 -1355 -744 840 955 -429 -1295
3853 -1295 -220 1154 731 -877 -1107 422 1317 236 -1079 -777 842 1277 -203 -1153 -199 1260 947
3870 947 -584 -1036 292 1380 623 -873 -805 832 1410 115 -1093 -292 1163 1209 -373 -1054 197
3887 197 1391 864 -724 -848 643 1464 324 -962 -480 1048 1319 -138 -1078 -50 1304 873 -665
3904 -665 -961 425 1362 457 -948 -742 784 1262 -64 -1144 -356 1124 974 -654 -1140 83 1203
3921 1203 423 -1014 -986 476 1159 -48 -1262 -639 827 944 -604 -1362 -184 1069 473 -1059 -1192
3938 -1192 290 1117 37 -1314 -907 664 960 -488 -1369 -404 944 556 -928 -1353 40 1115 146
3955 146 -1247 -1023 499 1006 -322 -1376 -600 898 734 -715 -1375 -170 1133 391 -1106 -1067 452
3972 452 1134 -76 -1303 -662 802 949 -457 -1291 -294 1106 687 -855 -1057 334 1224 247 -1113
3989 -1113 -696 764 1136 -198 -1091 -288 1172 926 -574 -1048 292 1298 537 -919 -775 798 1323
4006 1323 9 -1043 -264 1153 1115 -307 -1020 173 1321 774 -657 -790 650 1370 295 -936 -440
4023 -440 978 1199 -172 -990 35 1260 854 -673 -949 405 1322 425 -938 -637 762 1155 -135
4040 -135 -1148 -296 1064 825 -608 -1075 125 1167 386 -986 -860 507 1068 -22 -1246 -599 799
4057 799 904 -539 -1321 -107 1015 435 -1025 -1138 266 1015 -11 -1256 -844 609 813 -518 -1349
4074 -1349 -440 910 578 -891 -1250 8 931 88 -1248 -929 483 927 -325 -1328 -596 738 625
4091 625 -667 -1251 -111 989 344 -1079 -1069 412 942 -44 -1223 -657 797 855 -550 -1192 -152 1063
4109 1063 604 -843 -1037 278 1102 147 -1025 -653 783 1063 -232 -1089 -199 1091 799 -551 -966
4126 -966 292 1263 470 -883 -625 730 1213 43 -981 -216 1129 1036 -348 -957 178 1305 698
4143 698 -712 -701 619 1322 246 -891 -333 963 1087 -185 -969 28 1257 771 -591 -810 398
4160 398 1270 375 -903 -634 806 1120 -111 -975 -242 1025 799 -535 -915 189 1193 427 -904
4177 -904 -836 631 1109 -42 -1043 -513 761 866 -558 -1149 -67 1030 424 -877 -1025 274 1001
4194 1001 -17 -1163 -704 628 789 -507 -1237 -362 853 473 -855 -1120 55 874 71 -1105 -931
4211 -931 467 794 -348 -1273 -455 748 670 -733 -1289 -69 942 236 -1105 -987 391 939 -129
4228 -129 -1153 -567 708 844 -475 -1170 -118 987 524 -820 -992 347 1078 177 -1014 -591 774
4245 774 1041 -230 -1050 -197 1042 775 -625 -851 230 1137 328 -798 -618 682 1144 62 -905 -196
4263 -196 1002 1023 -325 -937 209 1224 593 -643 -699 623 1249 175 -815 -389 966 1108 -263 -884
4281 -884 31 1162 725 -514 -815 449 1259 345 -793 -499 787 1053 -134 -939 -172 1021 829 -511
4299 -511 -947 173 1075 398 -813 -653 629 1037 -104 -1063 -432 811 785 -499 -1115 -45 1000 437
4317 437 -891 -905 241 918 -47 -1138 -679 640 756 -480 -1207 -332 772 467 -832 -981 39 911
4335 911 68 -1089 -808 459 754 -344 -1251 -438 685 485 -741 -1145 -98 855 249 -1018 -941 345
4353 345 910 -174 -1088 -568 665 738 -550 -1137 -118 985 442 -775 -841 275 1023 176 -977 -562
4371 -562 734 857 -223 -1046 -236 986 725 -581 -835 321 1133 417 -752 -554 743 1080 -42
4388 -42 -858 -206 920 937 -394 -847 227 1203 549 -686 -554 616 1129 139 -802 -309 922 1057 -194
4407 -194 -846 58 1123 723 -580 -749 452 1167 285 -847 -462 823 980 -114 -967 -140 998 772
4425 772 -552 -911 243 1092 334 -817 -582 571 944 -90 -963 -361 826 725 -479 -1030 -24
4442 -24 949 425 -827 -791 343 914 37 -1071 -614 628 647 -491 -1088 -262 775 426 -810 -1050 127
4461 127 844 -33 -1054 -707 458 668 -390 -1150 -449 677 521 -680 -1053 -64 803 113 -1011 -870
4479 -870 361 783 -263 -1083 -485 690 661 -529 -1014 -49 854 388 -805 -851 319 929 -24 -1034
4497 -1034 -530 703 874 -262 -999 -156 936 583 -572 -791 290 1021 263 -818 -512 688 991
4514 991 -89 -846 -164 939 820 -392 -769 275 1043 474 -642 -594 635 1110 104 -780 -294 893
4532 893 937 -268 -837 156 1165 616 -548 -683 441 1126 205 -802 -424 826 964 -117 -768 -66
4550 -66 983 656 -432 -779 282 1045 314 -768 -617 549 918 -143 -1004 -278 814 692 -469 -920
4568 -920 55 974 337 -739 -779 348 899 -51 -1022 -624 636 694 -489 -1111 -194 723 428 -818 -993
4587 -993 124 799 33 -1065 -728 460 680 -386 -1042 -358 686 489 -639 -997 -20 807 131 -967
4605 -967 -817 343 752 -231 -1021 -465 653 604 -655 -1024 -129 878 269 -859 -874 303 907 -26 -930
4624 -930 -480 672 770 -328 -951 -111 827 484 -654 -806 235 962 187 -751 -517 620 962 -83
4642 -83 -841 -116 953 702 -406 -722 278 1037 429 -628 -525 567 1032 131 -761 -247 909 882 -185
4661 -185 -723 162 1068 592 -479 -552 535 1091 245 -717 -337 754 896 -138 -734 -49 924 635 -478
4680 -478 -744 315 989 245 -711 -547 597 892 -129 -906 -274 775 632 -536 -827 70 832 348
4698 348 -761 -691 352 764 -68 -962 -497 609 618 -498 -912 -92 797 305 -762 -843 145 742 31 -940
4718 -940 -633 482 644 -371 -1016 -348 668 480 -753 -946 -13 761 89 -902 -800 387 706 -216
4736 -216 -1052 -459 681 486 -542 -954 -35 774 242 -760 -752 340 865 -107 -919 -548 593 644 -331
4755 -331 -920 -154 802 470 -550 -763 320 946 177 -818 -448 552 873 -150 -820 -122 863 724 -440
4774 -440 -693 214 1000 413 -607 -531 572 974 25 -731 -195 822 794 -219 -703 182 958 578 -475
4793 -475 -565 546 1044 185 -702 -315 844 877 -206 -751 56 945 661 -433 -633 305 923 298 -688
4812 -688 -442 609 873 -137 -856 -169 779 645 -476 -803 82 828 236 -750 -622 368 796 -69 -907
4831 -907 -419 629 512 -492 -959 -115 732 303 -699 -879 179 735 -50 -898 -557 470 557 -289 -946
4850 -946 -287 596 345 -697 -891 41 604 107 -829 -706 338 610 -286 -986 -396 613 492 -629 -933
4869 -933 -46 636 221 -751 -760 322 713 -98 -872 -477 602 635 -318 -879 -68 823 384 -628 -694 285
4889 285 913 165 -740 -431 579 776 -124 -801 -122 804 585 -469 -677 203 955 334 -608 -437 536
4908 536 879 42 -701 -160 857 756 -240 -694 169 976 538 -480 -518 462 982 196 -678 -232 794
4927 794 793 -160 -763 4 861 608 -463 -613 309 897 267 -660 -370 658 813 -91 -782 -200 710 527
4947 527 -495 -765 139 784 274 -630 -670 363 776 -55 -816 -367 585 522 -456 -862 -59 715 302 -700
4967 -700 -802 211 688 -51 -852 -518 461 548 -396 -957 -255 671 363 -696 -799 7 724 48 -924 -666
4987 -666 363 585 -282 -937 -356 551 420 -564 -817 -65 757 178 -809 -740 267 650 -92 -918 -408 571
5007 571 572 -372 -815 -23 755 389 -622 -626 261 804 73 -755 -404 570 709 -129 -726 -67 816 596 -425
5028 -425 -641 285 876 355 -585 -420 550 867 5 -657 -186 837 720 -273 -610 170 864 464 -501 -439
5048 -439 487 895 148 -635 -203 715 753 -149 -654 39 802 528 -498 -545 392 907 230 -700 -378 513
5068 513 801 -68 -699 -115 765 507 -433 -674 191 763 278 -684 -526 414 721 -86 -839 -256 565 543
5088 543 -449 -877 -23 701 284 -682 -693 258 627 -26 -875 -496 430 558 -409 -849 -195 575 307 -703
5108 -703 -789 86 604 -8 -841 -557 372 591 -291 -910 -360 586 315 -493 -772 -76 671 137 -707 -684 336
5129 336 637 -126 -821 -339 568 515 -427 -768 -98 673 278 -578 -608 251 745 97 -632 -384 588 654 -233
5150 -233 -706 -129 724 449 -443 -641 318 852 223 -554 -402 510 766 51 -659 -151 708 655 -260 -533
5170 -533 185 870 403 -535 -468 481 786 152 -596 -233 753 693 -119 -560 32 812 489 -376 -482 394 828
5191 828 194 -580 -352 562 712 -95 -665 -117 736 451 -414 -589 240 760 264 -574 -507 443 695 -168
5211 -168 -803 -267 577 490 -394 -744 37 658 166 -601 -706 240 647 -136 -781 -468 432 470 -379 -896 -123
5232 -123 547 233 -670 -807 118 560 -41 -730 -581 371 501 -345 -886 -303 583 373 -593 -790 16 643
5252 643 107 -768 -659 350 659 -165 -799 -393 572 491 -372 -771 -48 649 265 -672 -574 177 697 14
5272 14 -691 -367 561 658 -221 -623 -64 747 492 -363 -585 283 785 211 -530 -390 513 786 -79 -637 -39
5293 -39 685 616 -227 -570 197 825 366 -444 -360 498 759 96 -534 -161 689 678 -194 -571 165 833 369
5314 369 -384 -446 385 799 130 -647 -322 618 706 -91 -612 -81 708 458 -439 -582 179 747 235 -600 -417
5335 -417 426 670 -126 -762 -246 576 478 -441 -731 16 630 221 -632 -585 244 575 -29 -735 -431 478 453
5356 453 -406 -727 -121 575 247 -644 -697 148 533 -12 -767 -526 305 429 -223 -764 -300 576 308 -527
5376 -527 -702 -43 619 89 -677 -566 293 538 -154 -733 -332 534 433 -383 -788 -25 653 148 -580 -579 269
5397 269 613 14 -729 -344 485 619 -286 -717 -92 629 356 -432 -541 227 715 127 -560 -342 505 623
5417 623 -42 -654 -92 690 498 -295 -503 214 817 351 -462 -352 456 786 103 -525 -115 662 701 -231
5437 -231 -489 138 772 428 -407 -401 375 756 172 -549 -218 587 655 -153 -631 37 716 402 -377 -527 228
5458 228 729 167 -580 -408 416 577 -133 -624 -162 560 441 -372 -688 33 621 203 -610 -540 306 508
5478 508 -80 -664 -320 435 442 -415 -732 -93 516 210 -629 -586 125 534 -20 -766 -498 313 438 -283 -745
5499 -745 -282 462 287 -543 -684 -11 585 135 -655 -519 307 501 -212 -748 -315 477 372 -509 -699 30
5519 30 540 186 -631 -542 245 544 -35 -618 -301 445 504 -232 -641 -86 611 307 -376 -478 259 680 108
5540 108 -612 -277 478 597 -127 -545 -50 653 502 -273 -465 235 764 293 -433 -294 517 685 38 -545
5560 -545 -121 657 587 -190 -497 130 814 377 -403 -402 358 758 126 -478 -201 535 657 -78 -494 -40 674
5581 674 430 -340 -494 190 676 104 -539 -368 431 611 -119 -614 -157 515 426 -315 -599 116 615 136
5601 136 -553 -429 332 509 -93 -673 -286 437 446 -384 -651 -78 487 111 -591 -548 162 589 -121 -673 -401
5622 -401 299 424 -302 -705 -171 487 226 -509 -635 3 467 19 -724 -493 304 350 -168 -697 -254 449
5642 449 319 -451 -624 49 526 188 -526 -450 236 484 -7 -629 -313 493 424 -267 -647 46 634 285 -441
5663 -441 -515 209 623 87 -553 -368 458 600 -158 -568 -23 637 433 -310 -443 250 711 242 -415 -285
5683 -285 472 715 -56 -459 -91 620 525 -181 -431 133 695 379 -324 -348 400 679 133 -499 -109 562 537
5704 537 -182 -517 -1 613 362 -337 -413 280 623 150 -481 -268 429 482 -92 -483 -136 530 390 -327 -495
5725 -495 165 599 146 -451 -468 299 491 -68 -632 -251 478 333 -330 -610 -37 473 172 -535 -548 165 421
5746 421 -36 -660 -412 334 370 -313 -696 -133 509 263 -498 -645 81 522 7 -605 -499 254 451 -244
5766 -244 -685 -281 369 342 -416 -650 -23 512 139 -507 -473 197 510 -103 -611 -318 434 375 -280 -572 -63
5787 -63 532 227 -407 -419 216 603 115 -484 -283 472 491 -162 -535 80 566 405 -305 -468 180 617 195
5808 195 -431 -348 452 614 3 -463 -103 622 491 -194 -397 220 604 310 -350 -341 283 702 75 -431 -185
5829 -185 524 537 -166 -447 73 588 345 -252 -359 275 579 75 -440 -251 455 535 -113 -484 -58 582 434
5850 434 -303 -498 140 558 129 -468 -361 288 531 -83 -614 -222 375 374 -353 -600 -70 495 122 -506 -482
5871 -482 191 458 -62 -653 -387 287 319 -279 -602 -181 407 197 -512 -587 74 454 -37 -623 -407 225 376
5892 376 -189 -701 -217 389 245 -408 -580 -5 440 145 -487 -486 248 484 -119 -551 -245 400 396 -283 -538
5913 -538 -14 513 213 -413 -522 195 565 -8 -462 -277 408 458 -141 -510 -106 523 403 -352 -431 171 613
5934 613 173 -400 -238 381 598 24 -425 -14 531 423 -180 -365 138 630 315 -322 -261 356 593 114
5954 114 -431 -111 529 518 -176 -442 75 572 345 -320 -320 251 598 137 -419 -197 401 491 -124 -454 -42
5975 -42 496 360 -297 -480 81 496 133 -470 -368 247 475 -99 -569 -126 399 303 -291 -567 -90 417 127
5996 127 -503 -441 159 443 -47 -560 -329 287 333 -253 -577 -127 408 224 -453 -516 80 444 1 -560 -363
6017 -363 270 410 -184 -611 -198 372 258 -340 -557 -50 441 29 -503 -448 222 480 -77 -580 -292 401
6037 401 325 -237 -565 -4 505 214 -482 -426 267 485 -39 -465 -294 382 419 -155 -450 -17 563 326 -279
6058 -279 -389 223 529 157 -448 -251 412 574 -20 -455 15 525 432 -143 -379 105 591 267 -387 -258
6078 -258 399 554 44 -411 -131 503 503 -120 -395 145 562 344 -232 -328 314 598 160 -412 -150 429 494
6099 494 -93 -483 11 466 347 -274 -464 183 535 179 -448 -395 272 455 -97 -523 -159 439 263 -249
6119 -249 -508 -1 449 170 -409 -424 180 403 -147 -566 -252 356 292 -231 -608 -108 397 166 -394 -537 90
6140 90 383 -17 -516 -391 203 290 -238 -574 -191 354 128 -373 -526 19 393 41 -489 -385 240 438 -105
6161 -105 -548 -223 363 286 -281 -517 26 459 120 -420 -373 215 428 21 -496 -218 366 434 -227 -525 7
6182 7 526 279 -302 -324 169 549 128 -357 -221 421 509 -76 -391 -35 564 451 -239 -334 173 559 291 -284
6204 -284 -305 382 595 50 -376 -146 449 460 -169 -398 131 581 342 -295 -318 233 580 101 -409 -143 358
6225 358 442 -115 -468 -35 542 283 -337 -394 218 543 183 -422 -252 294 474 -106 -481 -120 346 248 -281
6246 -281 -483 51 497 95 -468 -427 239 476 -75 -499 -256 326 245 -319 -500 -84 337 150 -455 -435 83
6267 83 345 27 -555 -331 266 330 -264 -637 -119 334 239 -385 -470 34 340 29 -536 -360 185 312 -179
6288 -179 -565 -217 337 313 -279 -496 -55 409 156 -398 -335 208 425 -27 -429 -203 432 478 -175 -423 -19
6309 -19 479 273 -366 -345 196 469 61 -424 -189 383 508 -18 -336 -12 407 351 -139 -348 195 541 176
6330 176 -275 -212 362 542 -7 -347 -55 452 418 -142 -364 80 535 265 -210 -242 291 522 135 -356 -161
6351 -161 498 407 -71 -405 15 548 296 -234 -389 144 503 72 -419 -270 334 403 -98 -438 -96 402 219
6372 219 -275 -496 46 456 110 -409 -388 241 419 -152 -469 -228 359 320 -277 -495 -59 363 103 -429 -404
6393 -404 70 357 -15 -490 -249 213 242 -266 -567 -166 338 146 -390 -459 11 321 21 -439 -322 233 299
6414 299 -180 -479 -184 332 210 -331 -425 16 438 118 -437 -397 182 454 -66 -466 -213 299 288 -188 -395
6435 -395 36 450 209 -337 -322 199 466 57 -396 -137 318 427 -104 -356 26 501 293 -246 -345 149 494
6456 494 222 -277 -211 353 495 27 -314 -62 492 392 -159 -319 171 490 266 -252 -261 324 483 11 -349
6477 -349 -56 406 405 -122 -348 22 464 252 -248 -306 177 444 140 -387 -202 333 416 -151 -417 -70 389
6498 389 211 -360 -362 77 366 100 -407 -331 211 330 -114 -434 -176 315 236 -183 -406 -14 410 87 -389
6519 -389 -414 -27 274 -110 -565 -264 232 224 -305 -503 -85 341 128 -421 -482 65 359 11 -471 -290 218
6540 218 315 -174 -496 -162 305 220 -323 -409 67 365 99 -390 -315 146 358 -66 -438 -227 301 327 -186 -329
6562 -329 35 416 230 -344 -354 198 449 72 -371 -125 347 368 -90 -368 15 483 235 -282 -281 169 480
6583 480 113 -324 -106 336 470 -1 -290 -35 472 366 -190 -320 151 484 199 -291 -227 305 454 46
6603 46 -284 -67 380 397 -87 -316 87 460 252 -253 -252 174 430 77 -368 -177 293 392 -160 -378 2 380
6625 380 260 -262 -358 87 413 54 -406 -291 239 333 -106 -485 -207 339 285 -273 -423 40 301 -10 -364
6646 -364 -372 133 302 -43 -440 -257 244 272 -257 -418 -95 328 174 -414 -404 60 325 4 -506 -279 247
6667 247 287 -215 -427 -148 277 181 -309 -435 32 410 132 -493 -295 191 385 -115 -436 -82 326 246 -229
6688 -229 -404 -17 404 136 -300 -294 222 402 2 -345 -135 317 260 -129 -398 16 443 321 -257 -379 192
6709 192 434 126 -271 -193 277 375 10 -281 -23 444 322 -196 -230 154 512 190 -280 -199 282 492 59
6730 59 -281 -36 491 312 -93 -353 120 395 195 -256 -279 226 513 55 -322 -118 333 345 -226 -339 2
6751 2 384 152 -255 -385 97 337 2 -383 -287 250 287 -148 -431 -143 261 179 -224 -442 59 347 36 -372
6773 -372 -294 116 363 -95 -482 -205 221 216 -263 -390 -24 294 141 -455 -398 42 330 -74 -333 -223 201
6794 201 247 -205 -483 -155 342 158 -369 -417 84 399 57 -407 -328 183 329 -105 -365 -113 377 228 -234
6815 -234 -414 48 461 101 -323 -279 215 331 -41 -364 -144 356 275 -157 -349 17 404 178 -171 -241 163
6836 163 430 53 -316 -113 339 369 -60 -261 85 455 266 -178 -273 144 488 157 -246 -167 262 399 64
6857 64 -317 -27 382 384 -84 -251 106 476 172 -249 -227 283 435 10 -285 -158 391 332 -77 -430 36 401
6879 401 198 -264 -214 184 386 64 -344 -244 277 316 -104 -437 -77 306 182 -286 -339 41 358 -1 -375
6900 -375 -290 122 266 -106 -432 -137 292 210 -214 -387 5 311 144 -399 -278 85 315 -35 -461 -263 211
6921 211 210 -177 -398 -185 287 112 -303 -347 8 374 -15 -376 -312 191 336 -131 -339 -99 359 260 -216 -394
6943 -394 69 361 107 -350 -212 210 339 -40 -311 -107 256 305 -139 -289 103 388 213 -265 -296 216 426
6964 426 6 -293 -121 391 396 -44 -310 -9 430 307 -149 -220 156 409 140 -244 -108 342 469 25 -280
6985 -280 56 407 258 -169 -304 129 383 164 -264 -200 271 426 -25 -293 -100 306 279 -120 -294 103 347
7006 347 152 -287 -295 133 380 -69 -340 -240 284 222 -135 -358 -73 289 199 -260 -321 39 289 61 -365 -347
7028 -347 121 312 -142 -446 -208 270 200 -296 -444 -11 257 62 -336 -337 86 299 -34 -410 -188 153 147 -196
7050 -196 -429 -105 242 84 -342 -332 -7 278 -67 -429 -272 173 287 -142 -404 -136 294 188 -187 -328
7070 -328 68 358 54 -303 -245 205 370 -73 -286 -124 293 243 -147 -292 84 423 167 -212 -227 193 313
7091 313 -32 -268 -100 332 341 -58 -285 98 437 210 -155 -202 209 400 100 -244 -119 337 401 -9 -279
7112 -279 17 400 316 -139 -234 125 428 115 -209 -182 270 392 22 -306 -28 300 249 -78 -279 -27 376
7133 376 216 -274 -273 121 350 89 -344 -231 245 271 -127 -338 -48 318 211 -233 -347 61 276 21 -382
7154 -382 -245 220 224 -107 -428 -199 270 157 -259 -384 40 259 23 -326 -262 151 216 -117 -431 -253 213
7175 213 197 -246 -379 -52 251 126 -299 -321 76 305 -73 -368 -270 160 262 -176 -395 -74 243 199 -269
7196 -269 -375 93 285 37 -286 -235 243 446 -81 -340 -109 294 228 -99 -295 55 374 112 -229 -212 242
7217 242 345 50 -271 -105 325 357 -113 -269 6 323 250 -182 -191 160 404 96 -185 -129 272 357 -35 -292
7239 -292 2 368 294 -93 -235 157 389 202 -219 -118 227 379 52 -240 -56 316 320 -87 -250 11 362
7260 362 176 -202 -204 201 283 40 -323 -213 259 263 -89 -361 25 285 82 -272 -284 25 345 21 -334 -198
7282 -198 196 278 -83 -315 -72 272 100 -273 -367 32 318 33 -308 -215 143 238 -94 -408 -154 181 193 -259
7304 -259 -385 -25 238 123 -356 -287 68 238 -70 -330 -207 170 191 -181 -424 -43 289 110 -235 -352 38
7325 38 304 71 -279 -248 191 271 -94 -370 -97 324 226 -180 -304 66 328 86 -205 -186 171 337 25 -333
7347 -333 -97 342 307 -118 -265 15 384 166 -183 -162 176 341 91 -265 -129 303 365 -26 -268 50 354
7368 354 215 -123 -229 190 382 125 -218 -153 272 342 14 -273 -10 324 253 -209 -277 94 429 130 -189
7389 -189 -229 230 359 52 -263 -136 220 202 -127 -319 -9 295 110 -215 -226 137 301 4 -264 -197 200
7410 200 263 -156 -379 -84 279 93 -288 -328 24 215 4 -284 -232 90 175 -97 -407 -154 225 151 -256 -375
7432 -375 -49 287 24 -283 -272 138 299 -70 -336 -132 128 169 -155 -357 -133 262 175 -268 -316 70 309
7453 309 107 -321 -262 166 283 -131 -359 -52 301 202 -162 -260 28 319 147 -253 -185 193 300 -49 -334
7474 -334 -80 282 253 -91 -229 72 357 181 -169 -167 186 380 112 -226 -133 324 333 -57 -235 -16 367 220
7496 220 -110 -203 149 383 87 -284 -128 261 366 -27 -259 -63 335 305 -97 -220 128 344 126 -227 -207
7517 -207 193 260 27 -347 -68 232 302 -140 -270 -17 194 97 -235 -261 148 262 -15 -314 -164 194 278 -176
7539 -176 -337 -71 227 113 -267 -334 36 241 -30 -287 -266 155 233 -55 -345 -152 167 219 -189 -388 28
7560 28 222 60 -243 -288 82 192 -72 -345 -166 147 159 -107 -245 -65 187 107 -290 -327 100 241 15 -362
7582 -362 -168 172 211 -94 -324 -107 244 173 -205 -255 37 348 8 -273 -176 182 292 1 -269 -95 284
7603 284 267 -77 -185 115 369 151 -185 -117 194 375 69 -239 -106 351 360 -61 -236 28 379 249 -96
7624 -96 -170 142 389 159 -209 -103 208 245 -39 -330 43 308 275 -146 -255 115 316 127 -215 -132 131 308
7646 308 -85 -267 10 282 212 -97 -225 0 348 63 -190 -225 118 316 -32 -301 -133 198 256 -147 -380
7667 -380 0 215 146 -199 -308 62 295 -42 -251 -194 154 183 -85 -421 -191 236 141 -259 -329 20 262 45
7689 45 -331 -197 143 211 -97 -337 -116 179 154 -212 -345 -3 169 89 -292 -305 55 282 61 -289 -176 138
7711 138 193 -141 -282 -75 330 161 -143 -271 26 323 113 -240 -199 192 299 -30 -304 -59 293 200 -139
7732 -139 -255 73 305 149 -225 -177 224 335 89 -203 -19 330 231 -142 -190 70 311 170 -202 -167 124
7753 124 369 105 -211 -70 260 325 -5 -244 6 286 183 -117 -259 130 310 83 -245 -172 253 236 -55
7774 -55 -224 -8 278 204 -128 -277 19 259 111 -226 -224 143 284 -17 -240 -117 178 229 -88 -288 -43 241
7796 241 107 -241 -239 38 240 -51 -271 -142 205 159 -138 -306 -81 205 90 -311 -311 25 249 7 -288 -290
7818 -290 87 226 -76 -349 -81 216 138 -188 -308 33 228 99 -240 -250 31 245 -40 -322 -128 225 236
7839 236 -124 -335 -79 238 96 -183 -188 12 288 21 -279 -208 188 258 -78 -188 6 254 236 -163 -163 67
7861 67 291 75 -218 -84 205 311 1 -194 -66 262 267 -122 -189 89 303 204 -215 -108 214 316 74 -241
7883 -241 -64 238 271 -6 -174 41 261 177 -164 -205 195 323 64 -184 -118 247 212 35 -241 -20 274 170
7905 170 -122 -189 94 273 83 -229 -156 188 246 -46 -216 -62 187 233 -154 -334 18 191 161 -262 -254 113
7927 113 221 -74 -284 -175 183 179 -76 -269 -106 196 88 -280 -298 -30 183 -13 -405 -206 120 124 -110 -359
7949 -359 -97 232 206 -204 -312 -39 147 15 -255 -244 41 252 -56 -330 -168 199 179 -131 -273 2 293
7970 293 78 -252 -229 89 257 8 -254 -99 177 188 -90 -238 36 264 196 -231 -223 38 277 63 -281 -132
7992 -132 184 275 -26 -194 -87 246 219 -115 -277 97 347 100 -192 -154 233 318 51 -163 -22 208 307 -90
8014 -90 -160 13 303 183 -183 -149 142 334 68 -214 -65 225 262 -22 -243 -5 282 210 -148 -202 -5 253
8036 253 38 -219 -196 196 226 38 -257 -76 275 95 -140 -262 13 235 156 -223 -212 109 241 -27 -274
8057 -274 -145 168 158 -162 -272 -82 200 91 -224 -252 -15 227 -3 -276 -193 112 148 -120 -309 -62 160
8078 160 141 -212 -284 11 199 59 -312 -239 146 224 -51 -286 -118 145 186 -153 -223 21 215 82 -180 -202
8100 -202 116 268 60 -279 -99 129 225 -102 -166 31 267 174 -144 -149 51 270 163 -254 -55 204 343 -6
8122 -6 -242 13 238 199 -106 -163 47 322 141 -185 -112 179 289 -1 -174 -77 284 233 -49 -169 92 290
8144 290 216 -85 -127 256 317 57 -176 -25 215 262 -42 -199 16 244 146 -149 -231 54 288 121 -202 -142
8166 -142 89 195 -1 -229 -113 166 158 -150 -233 11 244 41 -257 -249 69 180 -64 -293 -162 191 238 -176
8188 -176 -259 -44 208
8191B08
##END NTUPLES=NMR FID
##END=
