##TITLE=1H_TG-2281-4
 CDCl3, 8 sc, 
 6.2.2020
##JCAMPDX= 6.0         $$ Bruker NMR JCAMP-DX V2.0
##DATA TYPE= NMR FID
##DATA CLASS= NTUPLES
##ORIGIN= UXNMR, Bruker Analytische Messtechnik GmbH
##OWNER= root
$$ XWIN-NMR		Version 3.5
$$ Thu Feb  6 14:04:39 2020 Russian Standard Time (UT+4h)  she@DPX200
##.OBSERVE FREQUENCY= 200.1315
##.OBSERVE NUCLEUS= ^1H
##.DELAY= (6, 6)
##.ACQUISITION MODE= SIMULTANEOUS
##.ACQUISITION SCHEME= undefined
##.AVERAGES= 8
##.DIGITISER RES= 18
##SPECTROMETER/DATA SYSTEM= spect
##.PULSE SEQUENCE= zg30
##.SOLVENT NAME= CDCl3
##.SHIFT REFERENCE= (INTERNAL, CDCl3, 0, 15.7039)
##AUDIT TRAIL= $$ (NUMBER, WHEN, WHO, WHERE, WHAT)
$$ ##TITLE= Audit trail, XWIN-NMR		Version 3.5
$$ ##JCAMPDX= 5.01
$$ ##ORIGIN= Bruker BioSpin GmbH
$$ ##OWNER= she
$$ F:/spectra/data/she/nmr/H-F/1/audita.txt
$$ ##AUDIT TRAIL=  $$ (NUMBER, WHEN, WHO, WHERE, WHAT)
(   1,<2020-02-06 14:03:42.60 +0400>,<she>,<DPX200>,
      <created by zg, POWCHK disabled, PULCHK disabled
       configuration hash MD5:
       00 E9 B6 7A A2 85 ED C7 34 08 36 98 17 FE 4E 26
       data hash MD5: 16K
       88 46 AC 14 F7 0C 71 A4 5B 8E 7E 1A 55 53 1A 8D>)
$$ ##END=
$$ 
$$ hash MD5
$$ C9 D2 F8 88 A5 A7 84 2B E2 04 70 93 DB 56 14 89
##$RELAX= 
##$RELAX= 
##$RELAX= 
##$RELAX= 
##$RELAX= 
##$RELAX= 
$$ Bruker specific parameters
$$ --------------------------
##$DU= <F:/spectra>
##$EXPNO= 1
##$NAME= <H-F>
##$PROCNO= 1
##$TYPE= <nmr>
##$USER= <she>
##$AMP= (0..31)
100 100 100 100 100 100 100 100 100 100 100 100 100 100 100 100 100 100 
100 100 100 100 100 100 100 100 100 100 100 100 100 100 
##$AQSEQ= 0
##$AQ_mod= 1
##$AUNM= <au_zg>
##$AUTOPOS= <>
##$BF1= 200.13
##$BF2= 200.13
##$BF3= 200.13
##$BF4= 200.13
##$BF5= 200.13
##$BF6= 200.13
##$BF7= 200.13
##$BF8= 200.13
##$BYTORDA= 1
##$CFDGTYP= 0
##$CFRGTYP= 5
##$CHEMSTR= <none>
##$CNST= (0..31)
1 1 145 1 1 1 1 1 1 1 1 1 1 1 1 1 1 1 1 1 1 1 1 1 1 1 1 1 1 1 1 1 
##$CPDPRG= <>
##$CPDPRG1= <>
##$CPDPRG2= <>
##$CPDPRG3= <>
##$CPDPRG4= <mlev>
##$CPDPRG5= <mlev>
##$CPDPRG6= <mlev>
##$CPDPRG7= <mlev>
##$CPDPRG8= <mlev>
##$CPDPRGB= <>
##$CPDPRGT= <>
##$D= (0..31)
0 1.2 0 0 0 0 0 0 0 0.06 0 0.03 0 0 0 0 0.0002 0 0 0 0 0 0 0 0 0 0 0 0 
0 0 0 
##$DATE= 1580983421
##$DBL= (0..7)
120 120 120 120 120 120 120 120 
##$DBP= (0..7)
150 150 150 150 150 150 150 150 
##$DBP07= 0
##$DBPNAM0= <>
##$DBPNAM1= <>
##$DBPNAM2= <>
##$DBPNAM3= <>
##$DBPNAM4= <>
##$DBPNAM5= <>
##$DBPNAM6= <>
##$DBPNAM7= <>
##$DBPOAL= (0..7)
0.5 0.5 0.5 0.5 0.5 0.5 0.5 0.5 
##$DBPOFFS= (0..7)
0 0 0 0 0 0 0 0 
##$DE= 6
##$DECBNUC= <off>
##$DECIM= 24
##$DECNUC= <off>
##$DECSTAT= 4
##$DIGMOD= 1
##$DIGTYP= 9
##$DL= (0..7)
0 120 120 120 120 120 120 120 
##$DP= (0..7)
150 150 150 150 150 150 150 150 
##$DP07= 0
##$DPNAME0= <>
##$DPNAME1= <>
##$DPNAME2= <>
##$DPNAME3= <>
##$DPNAME4= <>
##$DPNAME5= <>
##$DPNAME6= <>
##$DPNAME7= <>
##$DPOAL= (0..7)
0.5 0.5 0.5 0.5 0.5 0.5 0.5 0.5 
##$DPOFFS= (0..7)
0 0 0 0 0 0 0 0 
##$DQDMODE= 0
##$DR= 18
##$DS= 0
##$DSLIST= <SSSSSSSSSSSSSSS>
$$ [...]
##$SUBNAM2= <"">
##$SUBNAM3= <"">
##$SUBNAM4= <"">
##$SUBNAM5= <"">
##$SUBNAM6= <"">
##$SUBNAM7= <"">
##$SUBNAM8= <"">
##$SUBNAM9= <"">
##$SW= 24.9337058887773
##$SWIBOX= (0..15)
0 0 2 0 0 0 0 0 0 0 0 0 0 0 0 0 
##$SW_h= 4990.01996007984
##$TD= 16384
##$TD0= 1
##$TE= 0
##$TE2= 300
##$TE3= 300
##$TEG= 300
##$TL= (0..7)
0 120 120 120 120 120 120 120 
##$TP= (0..7)
150 150 150 150 150 150 150 150 
##$TP07= 0
##$TPNAME0= <>
##$TPNAME1= <>
##$TPNAME2= <>
##$TPNAME3= <>
##$TPNAME4= <>
##$TPNAME5= <>
##$TPNAME6= <>
##$TPNAME7= <>
##$TPOAL= (0..7)
0.5 0.5 0.5 0.5 0.5 0.5 0.5 0.5 
##$TPOFFS= (0..7)
0 0 0 0 0 0 0 0 
##$TUNHIN= 0
##$TUNHOUT= 0
##$TUNXOUT= 0
##$USERA1= <user>
##$USERA2= <user>
##$USERA3= <user>
##$USERA4= <user>
##$USERA5= <user>
##$V9= 5
##$VALIST= <valist>
##$VCLIST= <CCCCCCCCCCCCCCC>
##$VD= 0
##$VDLIST= <DDDDDDDDDDDDDDD>
##$VPLIST= <PPPPPPPPPPPPPPP>
##$VTLIST= <TTTTTTTTTTTTTTT>
##$WBST= 1024
##$WBSW= 4
##$XGAIN= (0..3)
0 0 0 0 
##$XL= 0
##$YL= 0
##$YMAX_a= 139505
##$YMIN_a= -77768
##$ZGOPTNS= <>
##$ZL1= 120
##$ZL2= 120
##$ZL3= 120
##$ZL4= 120
##$ABSF1= 10
##$ABSF2= 0
##$ABSG= 5
##$ABSL= 3
##$ALPHA= 0
##$AQORDER= 0
##$ASSFAC= 0
##$ASSFACI= 0
##$ASSFACX= 0
##$ASSWID= 0
##$AUNMP= <proc_1d>
##$AZFE= 0.1
##$AZFW= 0.1
##$BCFW= 1
##$BC_mod= 2
##$BYTORDP= 1
##$COROFFS= 0
##$CY= 11.3945322036743
##$DATMOD= 1
##$DC= 2
##$DFILT= <>
##$DTYPP= 0
##$F1P= 16.9975609425685
##$F2P= -3.02152046262296
##$FCOR= 0.5
##$FTSIZE= 0
##$FT_mod= 4
##$GAMMA= 1
##$GB= 0.15
##$INTBC= 1
##$INTSCL= 1
##$ISEN= 128
##$LB= 0.24
##$LEV0= 0
##$LPBIN= 0
##$MAXI= 10000
##$MC2= 0
##$MEAN= 0
##$ME_mod= 0
##$MI= 1.114404
##$NCOEF= 0
##$NC_proc= 0
##$NLEV= 6
##$NOISF1= 3.799351
##$NOISF2= 2.8
##$NSP= 1
##$NTH_PI= 0
##$NZP= 0
##$OFFSET= 15.70392
##$PC= 1
##$PHC0= -9786.729
##$PHC1= 16.20081
##$PH_mod= 1
##$PKNL= yes
##$PPARMOD= 0
##$PSCAL= 0
##$PSIGN= 0
##$REVERSE= no
##$SF= 200.130013532006
##$SI= 16384
##$SIGF1= 3
##$SIGF2= 2
##$SINO= 400
##$SIOLD= 16384
##$SREGLST= <1H.CDCl3>
##$SSB= 0
##$STSI= 0
##$STSR= 0
##$SW_p= 3612.71676300578
##$SYMM= 0
##$S_DEV= 0
##$TDeff= 0
##$TDoff= 0
##$TI= <>
##$TILT= no
##$TM1= 0
##$TM2= 0
##$TOPLEV= 0
##$USERP1= <user>
##$USERP2= <user>
##$USERP3= <user>
##$USERP4= <user>
##$USERP5= <user>
##$WDW= 1
##$XDIM= 8192
##$YMAX_p= 0
##$YMIN_p= 0
$$ End of Bruker specific parameters
$$ ---------------------------------
##NTUPLES= NMR FID
##VAR_NAME=  TIME,          FID/REAL,        FID/IMAG
##SYMBOL=    X,             R,               I
##VAR_TYPE=  INDEPENDENT,   DEPENDENT,       DEPENDENT
##VAR_FORM=  AFFN,          ASDF,            ASDF
##VAR_DIM=   8192,          8192,            8192
##UNITS=     SECONDS,       ARBITRARY UNITS, ARBITRARY UNITS
##FACTOR=    0.0002004,     1,               1
##FIRST=     0,             0,               0
##LAST=      1.6414764,     0,               0
##MIN=       0,             -77768,          0
##MAX=       1.6414764,     139505,          0
$$ Real data points
##PAGE= N=1
##DATA TABLE= (X++(R..R)), XYDATA
0@%%%%%%%%%Qj6J6j6J6k3L1l2M0m8N6o6P4q8J04j20J38j58J82k07K31k60K95l33
$$ 0 0 0 0 0 0 0 0 0 0 8 -8 8 -8 8 -15 16 -16 24 -24 32 -34 40 -48 56 -64 74 -84 98 -109 122 -138 157 -176
33a76L74m18M66n19N76o40P10p87Q70r61J066j182J308j449J611j796K008k255
$$ -176 198 -220 246 -273 303 -337 373 -414 456 -505 561 -621 687 -762 849 -947 1061 -1194
51a194K546k897L331l881M604n604P093r566J4675m5321R4352L0039j63054N496
$$ -1194 1352 -1545 1786 -2095 2509 -3095 3998 -5568 9107 -36214 58138 88177 -74877 -69381
65f9381J22806l713j27480P363R8502J221p4593J9504O2533j3392n2779R287K3452
$$ -69381 53425 49712 -77768 -70405 28097 29318 -45275 -25771 36762 23370 -29409 -20122 3330
78C330j7420j9359J8804J8880O098L651j3087l2131K811L2442m182l0087J6261
$$ 3330 -14090 -33449 -14645 4235 10333 13984 897 -31234 -28423 4019 -163 -30250 -13989
91a3989L6502j5622k8793K0020J6786l2202j3705L6408Q038l1457Q067M1058j1226
$$ -13989 22513 6891 -21902 -1882 14904 -17298 -31003 5405 13443 -18014 -9947 31111 19885
104A9885m6588L944L1550q044j4620K4766R981l5301o109M1435r07m9940L366
$$ 19885 -26703 -22759 8791 747 -13873 10893 20874 -14427 -20536 20899 19992 -29948 -26582
117b6582N2956m523m9402J1135M4523j4850l7359J5018J9593k2102j045L8132
$$ -26582 26374 21851 -27551 -16416 28107 13257 -24102 -9084 10509 -11593 -12638 25494
129B5494m954m7302N184M3410j2144l9177K1570L9505k5326l6141K6757K9514
$$ 25494 20540 -26762 -21578 21832 9688 -29489 -7919 31586 6260 -29881 -3124 26390
141B6390l2422k5383L2059K0178k9163j0808K9366O545k5094m901O652r595P413
$$ 26390 -6032 -31415 644 20822 -8341 -19149 10217 16762 -8332 -13233 -6581 -16176 -8763
154h763L1303q531m0901J2251M3080k2599n0307K6212N1832k6825m4955L4577
$$ -8763 22540 14009 -26892 -14641 28439 5840 -44467 -18255 33577 6752 -38203 -3626
166c626M1912m0528l8870M0407K7659n0387k1885O2621L1122n8088l3038M6495
$$ -3626 38286 -2242 -41112 -705 26954 -23433 -45318 17303 48425 -9663 -42701 3794
178C794K2380m5408j7778M1830J8354k8805r278K0808L014j6098n979M966L264
$$ 3794 26174 -19234 -37012 4818 23172 -5633 -14911 5897 8911 -7187 -13166 -8200 -4936
191d936L840O00k506J0778R301k1536k6350J8626L2162j5130k8245K0645L1194
$$ -4936 -1096 -496 -3002 7776 17077 -4459 -30809 -12183 19979 4849 -23396 -2751 28443
204B8443k2612l1156K1187K3954k7717j9407L4103J8549l3948q958L9374J979
$$ 28443 5831 -25325 -4138 19816 -7901 -27308 6795 25344 -8604 -17562 21812 23791
216B3791m8260n575M4059N965l0245M838K3061j4189j6996J8645O975k6255O11
$$ 23791 -24469 -30044 14015 19980 -10265 -5427 17634 3445 -13551 5094 12069 -14186 -13575
229a3575L2692l322l4580R288L6789j3594l9494J2583L4615j5033k6040K4661
$$ -13575 19117 15795 -18785 -9497 27292 13698 -25796 -13213 21402 6369 -19671 4990
241D990K3928l1037k5708K9693K1831k7407j4487K5048Q393k1210j751J5593o386
$$ 4990 28918 -2119 -27827 1866 23697 -3710 -18197 6851 15244 -5966 -7717 7876 1490
254A490j1346J1682O412j6116j555K0801M51k2185j821J4666j566p545J0816N462
$$ 1490 -9856 1826 8238 -7878 -9433 11368 11819 -10366 -12187 2479 913 -6632 4184 9646
268I646j8072n374K0822J418k5088J516K8895k869k8779N821K6568j0479k4065
$$ 9646 -8426 -13800 7022 8440 -16648 -15132 13763 10894 -17885 -12064 14504 4025 -20040
281b0040J3107J7490j8905j1223K7314J2351k9183j4661K2869J0039j8992m769
$$ -20040 -6933 10557 -8348 -19571 7743 20094 -9089 -23750 -881 9158 -9834 -14603
293a4603J7009L878j1027j182L912l300o31M728m135n835J0884Q822j2732o766
$$ -14603 2406 6284 -4743 -5925 -2013 -5313 -5944 -1216 -5351 -11186 -302 8520 -4212 -10978
307a0978J7105j024k8714K465L9717N72m1371J161M2932m194m5017L690M1539
$$ -10978 6127 5103 -23611 -21146 18571 19143 -22228 -21067 21865 17671 -27346 -23656 17883
320A7883m377l5096Q973L1100j0117k4103J2282J5619j9109j3591K3851J4428
$$ 17883 13506 -21590 -12617 18483 8366 -15737 -3455 12164 -6945 -20536 3315 17743
332A7743j9421q098J6062N04j7354M793J5628r412j2260J7072J1649k0369r621
$$ 17743 -1678 -9776 6286 6790 -10564 -5771 9857 445 -11815 5257 16906 -3463 -13084
345a3084K1323O227k3738m676K1664M856j4279J532J0108q043j1208R555J0266
$$ -13084 8239 14466 -9272 -13948 7716 12572 -1707 -175 9933 1890 -9318 237 10503
358A0503q576n803Q349L804p637j281M915l161l223P614P09j1162K414J6618l823
$$ 10503 1927 -3876 4473 8277 640 -641 4274 1113 -2110 5504 6213 -4949 -2535 14083 10260
373A0260k0283K831J7490m699j2439J0615R344j6665p480K0217L458k2762m56
$$ 10260 -10023 -7192 10298 5599 -6840 3775 13119 -3546 -11026 9191 12649 -10113 -10569
386a0569K5425j616k6294K870K5426m563k4248N624K0401q518j6274J3250J5470
$$ -10569 14856 13240 -13054 -10184 15242 10679 -13569 -7945 12456 3938 -12336 914 16384
399A6384j7016j6255J5436J3098j3213p616J2525K362r834J507M856p353j674
$$ 16384 -632 -16887 -1451 11647 -1566 -9182 3343 5705 -4129 -2622 2234 -5119 -6793
412f793J2021m91j5817L800J8711n143j9828M957J5823q451j3010J4568J4084
$$ -6793 5228 4737 -11080 -7280 11431 6288 -13540 -8583 7240 -1211 -14221 347 14431
425A4431j7415j4345J7564J2232j9973j1421K1128J1248j9010q046J6936M519
$$ 14431 -2984 -17329 235 12467 -7506 -18927 2201 13449 -5561 -13607 3329 7848
437G848j4681j142R692m068o838J0083P385j0000o158P641R72p021K686O785l783
$$ 7848 -6833 -7975 1717 -2351 -9189 894 8279 -1721 -7879 -238 734 -6287 -3601 3184 -599
452e99m107O938L076j0307k432J1396J544j2531k21J3137J158j0288J954O433
$$ -599 -4706 2232 5308 -4999 -7431 3965 5509 -7022 -7243 5894 7052 -3236 -1282 5151
466E151p969o391J2475O909j3041m164J3782J254j3885N25J1935k827q695O288
$$ 5151 -2818 -9209 3266 10175 -2866 -7030 6752 8006 -5879 -5354 6581 3754 -4941 1347
480A347O068q729k688J2134n49j5230m48J6667M21j4169K813J3185p262j3499
$$ 1347 7415 -1314 -4002 8132 7583 -7647 -8095 8572 8993 -5176 -2363 10822 3560 -9939
494i939R805J2820j2769j1078J6179R988j8441q614J8376O963j8008n262J5112
$$ -9939 -134 12686 -83 -11161 5018 15006 -3435 -12049 6327 13290 -4718 -9980 5132
507E132K609j1542J561R207n874r265P034P920o236n678O608L067p478j076N788
$$ 5132 7741 -3801 -2240 6967 1093 -8172 -1138 6782 546 -5132 1476 4543 -2935 -4011 1777
522A777j581m817N142M070q305m131J1058L730j2950m184J1446K728r148J363
$$ 1777 196 -4621 521 4591 -3714 -7845 3213 6943 -6007 -10191 1255 3983 -5165 -3802
536c802Q073n333q001O330N896p385l715Q723L123q825k275O889L54n579J134
$$ -3802 4271 -1062 -9063 -2733 3163 -4222 -7937 786 3909 -4916 -7191 -302 52 -5527 -4393
551d393L897l506j918P639J924r700k647Q751K45p836K378R368m659q436P327
$$ -4393 -496 -4002 -5920 1719 3643 -6057 -8704 47 292 -7544 -5166 4202 -457 -8893 -1566
566a566N950j0671m661J3090L822j3943k509J5136K215j3892j296J0374j480q585
$$ -1566 4384 -6287 -10948 2142 5964 -7979 -10488 4648 6863 -7029 -8325 2049 569 -8016
580h016N154R022n460q593O494O485p452n762Q636M937p919j593P431j328o388
$$ -8016 -2862 6160 700 -7893 -1399 5086 -2366 -8128 508 5445 -2474 -4067 3364 2036 -4352
595d352M703M584q161m114J1112M791j0532l397R304R24r052Q29Q764j587o912
$$ -4352 351 4935 -3226 -7340 3772 8563 -1969 -5366 3938 4862 -4190 -3361 5403 3816 -3096
610c096L207O374m882o395O134N756o561m459O063M074m907j189L819k600m599
$$ -3096 111 6485 1603 -4792 1342 7098 537 -3922 2141 6215 1308 119 3938 1338 -3261
625c261N317M666n646l254O555J327p084m96O120j260m226L287K969n403j974
$$ -3261 2056 6722 1076 -2178 4377 5704 -1380 -1876 4244 2984 -1242 2045 5014 -389 -2363
640b363P130J047q191j834Q200J278o395P4N949k666o749L787O081n004n158O856
$$ -2363 4767 5814 -2377 -4211 3989 5267 -1128 -1054 4895 2229 -4520 -733 5348 344 -4814 2042
656B042M815q575l970P736K480p176r38O098j354m503M908K752p484l166O996
$$ 2042 6857 -1718 -5688 2048 4528 -2648 -3586 2512 1158 -3345 1563 4315 -3169 -6335 661
671F61K951p183r73P474M21q467P14P005k169o725L994P106n338p119O504O701
$$ 661 3612 -3571 -4544 2930 3351 -5116 -4402 2603 434 -6291 -2297 4809 -529 -7648 -1144 5557
687E557p159o118N903M105m288r13M607j543m464K423L078l741k099N133K011
$$ 5557 -1602 -7720 -1817 2288 -2000 -2913 1694 151 -4313 -1890 1188 -2553 -4652 481 2492
702B492m273j495L373M37l575J064L004k520k370M439L396m647l981M149K513
$$ 2492 -1781 -3276 97 534 -3041 -1977 1027 -1493 -3863 576 3972 -675 -4656 -507 2006
717B006m041k98M434n97l999K482K758m238k218N353K247n431j874O123J375n120
$$ 2006 -2035 -2333 2101 1504 -2495 -13 2745 -1493 -3711 1642 3889 -1542 -3416 2707 4082 -1038
733a038n03L548j908k675L735L019l565k910L889K057m796j622N375Q32m435N07
$$ -1038 -1541 2007 99 -2576 1159 4178 613 -2297 1592 3649 -1147 -2769 2606 3438 -997 -490
749d90M249k560m114M198L836n695m345O974M383o418l458N516J274n138n22N142
$$ -490 3759 1199 -2915 1283 5119 -576 -4921 2053 6436 18 -3440 2076 3350 -1788 -2310 2832
765B832o39l486J348L123l002l147L196K832l483k267L228J360k963j32L152k523
$$ 2832 2193 -1293 55 3178 176 -2971 225 3057 -426 -2693 535 1895 -1068 -1200 1952 -571
781e71l898L345M840m087l837M519K643m807k282L555J422l137N93K283j563k224
$$ -571 -4469 -1124 3716 -371 -4208 311 2954 -1853 -4135 -580 842 -2295 -1702 581 -982 -3206
797c206K195J771k958j801K731J517j528n65J416p31k481J016K387j710k154L372
$$ -3206 -1011 760 -2198 -3999 -1268 249 -1279 -1844 -428 -1159 -3640 -2624 -237 -1947 -4101 -729
813g29K120m152j751L526J205l284L46K508j560j963L420K092m600k439M450J688
$$ -729 1391 -2761 -4512 -986 219 -3065 -2719 -211 -1771 -3734 -314 1778 -2822 -5261 -811 877
829H77l957n22M428M77m022j72K708l54k867J952L384k313l038K623L337l234
$$ 877 -3080 -3602 826 1303 -2719 -2891 -183 -537 -3404 -1452 1932 -381 -3419 -796 2541 -693
845f93k528K991Q65k363P74L312k108l206L159K504m004j539L961K263l479j808
$$ -693 -3221 -230 635 -1728 -954 2358 250 -2956 203 2707 -1297 -2836 1125 3388 -91 -1899
861a899L227P14k915J88K438n98k161J102L325j746k868J101J980j297j323K557
$$ -1899 1328 2042 -873 -685 1753 1155 -1006 96 3421 1675 -1193 -92 1888 591 -732 1825
877A825M8k029O85J652j884j877K935J533k772j492K802J086k262n0R95r21r57
$$ 1825 1873 -156 529 2181 297 -1580 1355 2888 116 -1376 1426 2512 250 200 1195 274 -683
894f83J365J651j521j305J057J375k212j255J996J026j747j05J841j064k796K305
$$ -683 682 2333 812 -493 564 1939 -273 -1528 468 1494 -253 -358 1483 419 -2377 -72
910g2J964k616k200K574K639k790j510J985j37j890O13J938j196j067J774P01
$$ -72 1892 -724 -2924 -350 2289 -501 -2011 -26 -163 -2053 -1440 498 -698 -1765 9 710
926G10k314j639K368J383k136r36J805P45k107J49K291j110l084J648L008j435
$$ 710 -1604 -3243 -875 508 -1628 -2564 -759 -14 -2121 -1972 319 -791 -3875 -2227 781 -654
942f54k361J944J839k200j321J446K40q49Q64J243j331j395J780J129j564j383
$$ -654 -3015 -1071 768 -1432 -2753 -1307 -1067 -1916 -1052 191 -1140 -2535 -755 374 -1190 -2573
958b573J347J401j063j40Q23K39j826Q7J758o4j984J439J951j381j914J603J161
$$ -2573 -1226 175 -888 -1028 -205 34 -1792 -1705 53 -11 -1995 -556 1395 14 -1900 -297 864
975H64j214r6P76k25j088J675J291j938j198J382J006j038m14J480K28r14m32
$$ 864 -350 -446 330 105 -983 692 1983 45 -1153 229 1235 197 -217 1263 1491 577 145
992A45M31j47n40R13J046q33j192R87J237j123j032J344M68j617Q58J837j521
$$ 145 576 429 -111 802 1848 1015 -177 810 2047 924 -108 1236 1704 87 945 2782 1261
1009A261j910J764J517j992j264J793J269j140q71N44J72m79k6M69n8q45L53J386
$$ 1261 -649 1115 2632 640 -624 1169 2438 1298 427 971 1143 664 638 1107 1049 204 557 1943
1027A943q05j584N60Q98r67o00J456L80j515J70J341r21k051J316J692j094j020
$$ 1943 1138 -446 114 1012 45 -555 901 1281 -234 -64 1277 356 -1695 -379 1313 219 -801
1044h01L83Q28m16m11Mm58k2K87N95l72o63L37N38m96q00M60Q00n08m44N49o8
$$ -801 -418 410 -6 -417 -413 -871 -893 -606 -11 -383 -1046 -709 -171 -667 -1467 -1007 -207 -715 -1159 -610 -678
1065f78j003K01J482j201q12R82O82m16p13N44r9n68J66Q40q85L02L68Q48j255
$$ -678 -1681 -1480 2 -1199 -2011 -1029 -347 -763 -1476 -932 -1031 -1599 -1433 -593 -1478 -1176 -808 40 -1215
1084a215o09M69J161l89j044P01M36k16n52O72M09j239K10J523n13n15J80R40
$$ -1215 -1824 -1355 -194 -583 -1627 -926 -490 -706 -1258 -586 -177 -1416 -1206 317 -196 -711 -531 409
1102D09p15m60N96n1m48R71L76q17n41J031N94p25p80K52J064Nn25K67J03j37
$$ 409 -306 -766 -170 -221 -669 302 678 -139 -680 351 945 220 -560 -308 756 761 236 503 606 469
1122D69l90K47N29m36j77J305m72j046L62O44k60l36O63k89n65N31Q20o47p96
$$ 469 79 326 855 419 242 1547 1075 29 391 1035 775 439 1102 813 248 779 1599 952 156
1141A56L55N13p4l54j4K54N13n72m28K25J8j59L00L35o90k76M29K03o04J86R9
$$ 156 511 1024 950 596 582 836 1349 777 349 574 592 433 733 1068 378 102 531 734 130 316 415
1162D15n61J92R02j87r39L40K79p94j85P4O03J7j79n19L3l4N42l35m95J64L50
$$ 415 -146 46 948 761 -178 162 441 -353 -538 -464 139 156 -23 -542 -509 -543 -1 -336 -831 -667 -317
1183c17K41j95p02m0Q36o50l44K03N61n41j58N85l5j037Q8R94n28r9J5L74k3M47
$$ -317 -76 -271 -973 -1013 -177 -827 -1171 -968 -407 -948 -1106 -521 -556 -1593 -1505 -511 -1039 -1138 -1123 -749 -772 -325
1205c25o04m54N18L67k82j52L08j44L00k54l77l91R31N76q17J63L04k35k17K42
$$ -325 -929 -1383 -865 -498 -780 -932 -624 -768 -468 -722 -1099 -1490 -559 17 -800 -637 -333 -568 -785 -543
1225e43L17o88LQ14j2R6j58r8j43N16P0o12O25J58j00j92O3l85N71O18o44l23
$$ -543 -226 -914 -911 -97 -109 -13 -171 -269 -412 104 174 -438 187 345 245 53 116 -269 302 920 276 -47
1247d7N80L34m03P4j5j50k85M03N59l06J0Q3R8l08j81j03K67N45j49k86j07J43
$$ -47 533 867 464 538 523 373 88 491 1050 744 754 837 935 627 446 343 610 1155 1006 720 613 756
1269G56J48n0m0q57M48R33j02r89Q7O82m53m17M16k34j24P74O0q67J62Q6k8R4
$$ 756 904 854 814 -43 405 1338 1236 247 334 1016 563 146 562 328 204 978 1038 171 333 419 391 485
1291D85k48k3l00M65J01k40p0l64O2N17k84p85M26L77Q2n90k17L52k20j69M80
$$ 485 237 214 -86 379 480 240 170 -194 -132 385 101 -684 -258 119 201 -389 -606 -254 -474 -643 -163
1312a63K57j115N44L13l71k03K9m8K06p3K61k18l76L70k41N3L3j95J63O01j300
$$ -163 94 -1021 -477 -164 -535 -738 -709 -757 -551 -624 -363 -581 -957 -587 -828 -775 -742 -937 -774 -173 -1473
1333a473J37J034M4p04J08M26j74k47O53k34n58J26N55j87n61R08K7l17j38L30
$$ -1473 -1336 -302 -258 -962 -854 -428 -602 -849 -196 -430 -988 -862 -307 -494 -1055 -147 -120 -437 -575 -245
1353b45j57m44Q25k32m2K07k73M6O00l99j44M65j5j17M2L99m42L2Q60n08p05M05
$$ -245 -402 -846 -21 -253 -295 -88 -361 -315 285 -114 -258 207 192 75 117 516 74 106 966 458 -247 158
1375A58P03k77l52N56m6m79K41L39J42p04K15N90J17k64j85k33K67k24j90M27
$$ 158 861 584 232 788 742 263 504 843 985 281 496 1086 1203 939 754 521 788 564 374 801
1395H01L53n64K02l9l69l17J009P7r84K25Q17k49q79N16K11m53k03O67l09L0P7
$$ 801 1154 590 792 753 384 67 1076 1153 169 394 1211 962 83 599 810 357 154 821 512 542 619
1416F19j06J09k18l69L94J77k66r7O7k31n11L89M66o89l11O76L74p97j50P67n08
$$ 619 513 622 404 35 429 606 340 243 310 79 -432 -43 423 -266 -577 99 473 -324 -474 293 -215
1437b15l79L58j17k24K69L28j40o76K00L02M7o41M56J42j28o35K53M23n86j10
$$ -215 -594 -236 -353 -577 -308 20 -120 -796 -596 -294 -247 -888 -432 -290 -418 -1053 -800 -377 -963 -1073
1457a073N97J57n82k59P21K90p42l68R37j47l60L56J4k60oO74m32n83N88J30l24
$$ -1073 -476 -319 -901 -1160 -439 -149 -891 -1259 -322 -469 -829 -473 -459 -719 -725 -51 -483 -1066 -478 -348 -672
1478f72J26K98L91n45j49J89J35J94q08Q74L16n42l66P80K93p35j60O53r3o35
$$ -672 -546 -248 143 -402 -551 -362 -227 -33 -841 33 349 -193 -559 221 514 -221 -381 272 179 -456
1498d56P94M77n86k80P71m54k53N04M26k64k80K20M8q7m21M02K37k51J86Q1L36
$$ -456 338 815 229 -51 720 266 13 517 943 679 399 619 667 580 159 561 798 547 733 814 1150
1519A150n47j72L84k28o3n2N96m43j11N59K82j360K50R39j20n63r2N54m00l74
$$ 1150 603 431 815 587 524 472 1068 625 514 1073 1355 -5 245 1184 1064 501 409 963 563 189
1539A89L91n1j83l13P93j44k93j50j72K31j77k6J85J89p09M53L54p01k71O66N9
$$ 189 580 529 346 33 826 682 389 239 67 298 121 95 280 469 -240 213 567 -134 -405 261 320
1560C20q34K3Q54J0q62K77L78m86o26R09l26l82L84J71k35l32K61j48L47k70J42
$$ 320 -514 -491 363 373 -489 -212 166 -320 -946 -37 -363 -745 -361 -190 -425 -757 -496 -644 -297 -567 -425
1581d25K18o72O4K26K94m72m15R04J79o09k59J028n75n28L77K96m61j45P40k74
$$ -425 -207 -879 -815 -589 -295 -767 -1182 -278 -99 -708 -967 61 -514 -1042 -665 -369 -830 -975 -235 -509
1601e09k75J94L19k75j05kM91k90m1K50q0J39k69M62p7l85l37J072L01p96j36
$$ -509 -784 -590 -271 -546 -651 -653 -162 -452 -493 -243 -323 -184 -453 9 -68 -453 -790 282 583 -213 -349
1622c49O55l22k07O01j31k27o5N88k13m40J86M46k25p2J60J03o2j27k2L28j41
$$ -349 306 -16 -223 378 247 20 -45 543 330 -110 76 522 297 225 385 488 426 299 277 605 464
1643D64l32M92M38o52l12M21J7j62j70P33n11j47N80k50m00l9P70j41o06M30J70
$$ 464 132 624 1062 410 98 519 536 374 204 937 426 279 859 609 209 170 940 799 193 623 793
1664G93l88l39J81L76n51N37L0l94L8k49N17p0m5m61L24K9p17M02N54n62k71O72
$$ 793 405 66 247 623 72 609 639 245 283 34 551 481 436 -25 299 328 -389 13 567 5 -266 406
1686D06o3n78l96L94P06j044N03MJ04l35j41L68k95j16M06L2j79k11J41L0k0k08
$$ 406 343 -235 -631 -237 469 -575 -72 -68 36 -299 -440 -72 -367 -483 -77 -45 -224 -435 -294 -264 -284 -492
1708d92N6J09l57L0P41q35o5L95K51p15M7P75l34k29P1O46p61J93LK3l2k3J09
$$ -492 -436 -327 -684 -654 87 -748 -813 -418 -167 -882 -835 -60 -394 -623 -552 94 -667 -474 -471 -448 -480 -503 -394
1731c94l8N6j42L52k32K06p9M31k89l63M58L69o59l60N99M49q10m2O98j46m10
$$ -394 -432 -376 -518 -166 -398 -192 -271 160 -129 -492 -34 335 -324 -684 -85 364 -446 -488 210 64 -346
1752c46J39M09k34j66P89l29j24k73K90K73K7k62J7J87J7j37L50l14l91N49K25
$$ -346 -207 202 -32 -198 591 262 138 -135 155 428 455 193 210 397 414 277 627 313 -78 471 696
1773F96l43p1J78P18j088K68M58k96l31Q74k76q39L90K38J67n72M20R3J64m92
$$ 696 353 282 460 1178 90 358 816 520 189 1063 787 -52 338 576 743 171 591 684 848 356
1793C56J57k40J00j08K13r4j06l38M10K08l34l17L04K72m95L04K40k72n45N49
$$ 356 513 273 373 265 478 384 278 -60 350 558 224 -93 211 483 -12 292 532 260 -285 264
1813B64L26p19n1L96J5n78L4M10m74k6K60M35m47k77J72n4m1M9o4M20p87J37K47
$$ 264 590 -129 -180 216 231 -347 -313 97 -377 -403 -143 292 -155 -432 -260 -314 -355 -306 -370 50 -737 -600 -353
1836c53L28o35K95Q1J11o12L93M27p35j22P23K90p10k12O82l46k43L34K64n81
$$ -353 -25 -660 -365 -284 -173 -785 -392 35 -700 -822 -99 191 -519 -731 -49 -395 -638 -304 -40 -621
1856f21J94N8J59l51Q5J29L70p3o14M48jj68L84L07o24l52N52L49m09n4M91l92
$$ -621 -427 -369 -210 -561 -476 -347 23 -50 -664 -216 -217 -385 -1 306 -318 -670 -118 231 -178 -232 259 -133
1878a33j79K17K69j07j26J51N31p50j56O67j88p4j67J77M58m35J23M1K79n44L43
$$ -133 -312 -95 174 67 -59 92 623 -127 -283 384 196 122 -45 132 590 155 278 319 598 54 397
1899C97K28k37l31K02L17l20M7L80l47J87j11M79o19m3M56m26J98m7J54n1j98
$$ 397 625 388 57 259 576 256 303 683 336 523 412 891 272 229 685 259 457 410 564 513 315
1920C15Q8R1R3k7j49K07l30n60L72N22q3n14L90K95p90N6M15j78q6j75L90k36
$$ 315 403 494 587 560 411 618 288 -272 100 622 539 25 415 710 -80 -24 391 213 127 -48 342 106
1942A06m14M27K4l39J78K64l0l63J68M5k37j22P7M9J67n54L71K02r4n16l6M78
$$ 106 -308 119 143 -196 -18 246 216 -147 21 66 -171 -293 -216 -167 0 -554 -183 19 -75 -591 -627 -149
1964a49k16j90N43l74L7L6K6l39j05N01j21j10O0L86j46k07m09M33Q4m07K89o1
$$ -149 -365 -555 -12 -386 -349 -313 -287 -626 -731 -230 -351 -461 -401 -15 -161 -368 -777 -344 -260 -667 -378 -439
1986d39rk69N11j72K17k88J37L20m58K98L56l02k94L33L43l29j28L27J04m90m6
$$ -439 -448 -717 -206 -378 -161 -449 -312 8 -450 -152 204 -98 -392 -59 284 -45 -173 154 258 -232 -278
2007b78J41J90k18R0L68l48j6N61m47J20k15J16L28k0m54L25K71k33M4N0m8n38
$$ -278 -137 53 -165 -75 293 -55 -71 490 43 163 -52 64 392 372 -82 243 514 281 325 375 327 -211
2029b11L68L64j55j09K60K9j30m3L10n76K69K28Q8k00k00O08l90k69N92m59J84
$$ -211 157 521 366 257 517 546 416 373 683 107 376 604 692 492 292 900 510 241 833 374 558
2050E58k95J58NM6k21J09R2q3m81Q2J80J00l52Q8L51l31K59N3l12k00N26k24j60
$$ 558 263 421 426 472 251 360 452 369 -112 -30 150 250 -102 -14 337 6 265 318 6 -194 332 108 -52
2073e2J02J16k93J90j9k41m9J63l7J14r4k79r8M80K6l25K04K81k95k21R9n0j61
$$ -52 50 166 -127 63 44 -197 -246 -83 -120 -6 -100 -379 -477 3 29 -296 -92 189 -106 -327 -228 -278 -439
2096d39K76m3K11q15N78M10n23l1R2o8N0k66K35L6L00m15K66j23l60J29K66k03
$$ -439 -163 -206 5 -810 -232 178 -345 -376 -284 -352 -302 -568 -333 -297 3 -412 -146 -269 -629 -500 -234 -437
2118d37l03N12L17m89Q3J28l07J3M4M50k48L7K76j46q5Q8n2R6J43k83P8J31r9
$$ -437 -740 -228 89 -400 -317 -189 -496 -483 -439 11 -237 -200 76 -70 -155 -67 -119 -23 120 -163 -85 46 -53
2141e3p2j61J91J34j06P4K97j45J44K08m42l4rN96o81L02L37k35m59L03P5L2k03
$$ -53 -125 -286 -95 39 -67 7 304 159 303 511 69 35 26 622 -59 243 580 345 -114 189 264 296 93
2164I3J82j44K2oK19j58K18p1L1J8k09P5K23o8l09N25l24o4j37O03n48j67J51
$$ 93 275 131 153 147 366 208 426 355 386 404 195 270 493 425 116 641 317 253 116 719 171 4 155
2187A55L70l58o7L21j74j9J21o4j55n7j7J37lk44J97j01r0M10l40J18j22l56K48
$$ 155 525 167 100 421 247 228 349 285 130 73 56 193 190 -54 143 42 -48 362 22 140 18 -338 -90
2210i0J26O8j65K12l06j08J27K41k64r6o1K03n05J95M20j64l15L89J05m88O1J28
$$ -90 36 104 -61 151 -155 -263 -136 105 -159 -255 -316 -113 -618 -423 -3 -167 -482 -93 12 -476 -415 -287
2232b87J05j90N2o8N2o3K65r0K64k56p7J17k9n2k4J67m12L67q9j7K63k21L27k53
$$ -287 -182 -372 -320 -388 -336 -399 -134 -224 40 -216 -293 -176 -205 -257 -281 -114 -526 -159 -248 -265 -2 -223 104 -149
2256a49j65K20K66n25mM42p0n7j87k7j75K11J41M9K35K0k21J6K62j27MK90l49
$$ -149 -314 -94 172 -353 -357 85 15 -42 -229 -256 -431 -220 -79 -30 205 225 4 20 282 155 159 449 100
2279A00R8K05k84K5r9K52k16j51K19L28R3l67J87k09K8K70k34L5l50M66m0J0J93
$$ 100 198 403 119 144 45 297 81 -70 149 477 570 203 390 181 209 479 245 280 -70 396 356 366 559
2302E59l83K76k05M0K07j87Q7j73L1M8l06J81P9K36l88M4j04J14R0J77l27r3N99
$$ 559 176 452 247 287 494 307 394 221 252 300 -6 175 254 490 102 146 42 156 246 423 96 3 602
2325F02j77ql54k50J75J27K28l74k4M4n3l33L80L3k37M11M5k78j83p2K21q5k73
$$ 602 425 417 63 -187 -12 115 343 -31 -55 -11 -64 -397 -17 16 -221 190 235 -43 -226 -298 -77 -162 -435
2348d35K96K7l91M61j27j90KK95l52K92j86j71K65N2k70L97n2j57k37mr7J09M48
$$ -435 -139 -112 -503 -42 -169 -359 -357 -62 -414 -122 -308 -479 -214 -162 -432 -35 -87 -244 -481 -485 -582 -473 -25
2371b5p9k13N7J19n6k76L16j49k2K44j07J64m54J72K08j12k8J33P4k28K27J84
$$ -25 -104 -317 -260 -141 -197 -473 -157 -306 -328 -84 -191 -27 -481 -309 -101 -213 -241 -108 -34 -262 -35 149
2393A49k33N2j9j54J51J03l03N21q2m22J56J96K22J5p7n3k93J63J48K1j27K49
$$ 149 -84 -32 -51 -205 -54 49 -254 267 185 -237 -81 115 337 352 275 222 -71 92 240 261 134 383
2415C83k20j8J66n6N7r0J64k27L3j65Q1K60K5m13K24K42r1l3Jn9j4k16M99m28
$$ 383 163 145 311 255 312 222 386 159 192 27 108 368 393 -20 204 446 355 322 323 264 250 34 533 105
2439A05J33J06O6k74k23L59p9j41L31j88%k23O7K29k26k8l7l6J85j47n4M15k16
$$ 105 238 344 410 136 -87 272 193 52 383 195 195 -28 39 268 42 14 -23 -59 126 -21 -75 340 124
2462A24J7k80K69J61l35P5J74m19j06L37K45n86J63K40L1l19L15l03Kk7j01Q9
$$ 124 141 -139 130 291 -44 31 205 -214 -320 17 262 -324 -161 79 110 -209 106 -197 -195 -222 -323 -234
2484b34j13K85q1q4j36j04K36p7J45LL30j22j84l40K91k26l3K51l4j73O0K09N
$$ -234 -347 -62 -143 -227 -363 -467 -231 -308 -163 -160 170 48 -136 -476 -185 -411 -444 -193 -227 -400 -340 -131 -126
2507a26l51K08L96m98K46l9J02J44n18L93J36k50k86N2N85r1J0j35k33j37L56
$$ -126 -477 -269 127 -371 -125 -164 -62 82 -436 -43 93 -157 -443 -391 194 103 113 -22 -255 -392 -36
2528c6l9K71j79J58Mk04J56J80j79q3J37k3k49K41q7K8L03n2m4K38m90O7k4K73
$$ -36 -75 196 17 175 179 -25 131 311 132 49 186 163 -86 155 68 96 399 347 303 541 51 118 94 367
2552C67j00L9O2J04j32R4k13L6K4nK25m04K56J7k13K12j17l44K36jJ60m2l8m3
$$ 367 267 306 368 472 340 434 221 257 281 276 501 97 353 370 157 369 252 -92 144 143 303 261 223 180
2576A80l6J52O8m43pQ3J72JK27k84L7o7K01k35j89J51Qk92L78L4k05j72J69J09
$$ 180 144 296 364 -79 -86 -3 169 170 397 113 150 83 284 49 -140 11 19 -273 105 139 -66 -238 -69 40
2600D0j43j84j2J84q4R8n1r8j71N09k00P6J55n66L32r7j0j06K4j2j2JQ6M3j62
$$ 40 -103 -287 -299 -115 -199 -101 -152 -250 -421 88 -112 -36 119 -447 -115 -212 -222 -328 -304 -316 -328 -327 -241 -198 -360
2625c60P2J00j58K98m7j51l2p0L1J43M6K3k04K27Q5k29m2k63L67Q1L2r0K82k45
$$ -360 -288 -188 -346 -48 -95 -246 -278 -348 -317 -174 -128 -105 -309 -82 3 -226 -268 -531 -164 -83 -51 -141 141 -104
2649a04K05m85N7L49j39R5K05k84Q7O1N5j37o3m8L71j10j01J83j49k7L55r4k0
$$ -104 101 -384 -327 22 -117 -22 183 -101 -14 47 102 -35 -98 -146 225 115 14 197 48 21 376 282 262
2672B62m13m3L62rQ1J4j12J47q3J02P3k23J88j73j36p8L74J40l01K58K54k83l6
$$ 262 -151 -194 168 159 240 254 142 289 206 308 381 158 346 173 37 -41 333 473 172 430 684 401 365
2695C65Q9l25J70Jj10K47j16k45J76l30M02l4j70L07n04L06r2n1l03P23k46k25
$$ 365 454 129 299 300 190 437 321 76 252 -78 324 290 120 427 -77 229 137 86 -217 506 260 35
2717C5k71Q9K11o7K84p8k40R2k44J63K11m90Q5K85k60P0L08l37r8j9j19L86k77
$$ 35 -236 -147 64 -3 281 203 -37 55 -189 -26 185 -305 -220 65 -195 -125 183 -154 -252 -271 -390 -4 -281
2740b81K21PO4j78k37M04m3k42K31J23l15K0L73l89k4J50J8L5N4P0j50nj06L43
$$ -281 -60 -53 11 -167 -404 0 -43 -285 -54 69 -246 -226 147 -242 -266 -116 -98 -63 -9 61 -89 -94 -200 143
2764A43l56L27l36p8M5R2J2l2L65k91QP2J34m8J45r0l33J49J77q9l73J85J1Q2
$$ 143 -213 114 -222 -300 -255 -163 -151 -183 182 -109 -101 -29 105 57 202 112 -221 -72 105 16 -357 -172 -161 -79
2788g9K85k39p6L86k10k74L05j13N7l5J56k15J77R4lpk79K89p7m3R4j03K12O4
$$ -79 206 -33 -109 277 67 -207 98 -15 42 7 163 -52 125 219 216 209 -70 219 142 99 193 90 302 366
2812C66j80o9j03M87l1m33L22qJ69l96J0j46J55J82k55M29k33L5j91n6Q6q7m6
$$ 366 186 117 14 501 470 37 359 351 520 124 134 -12 143 325 70 499 266 301 110 54 140 53 7
2835GJ03J78q8j02K11L8l86Q0P7n3j86K60j4k78J96k03J96j41Q1M2m96Q01l18
$$ 7 110 288 200 98 309 347 -39 41 118 65 -121 139 125 -153 43 -160 36 -105 -24 18 -478 323 5
2858Eo0p3L41j47%k3k22J22l24N22m81K52j24R7L85k62k4j23K05k48K24j27p4
$$ 5 -55 -128 213 66 66 43 -179 -57 -381 141 -340 -88 -212 -115 270 8 -16 -139 66 -182 42 -85 -159
2881a59o2M1q4K01l0J0k67J65r6P0J87l46L99k40K35j20L9j83m3Rj7Q1K8k07J64
$$ -159 -221 -180 -264 -63 -93 -83 -350 -185 -281 -211 -24 -370 29 -211 24 -96 -57 -240 -283 -274 -291 -210 -182 -389 -225
2906b25J40l71K56O1Q2k57L69K6m3j60P8mj79M04j61rK86k69j54L67k52q8M51
$$ -225 -85 -456 -200 -139 -57 -314 55 81 38 -122 -44 -48 -227 177 16 7 293 24 -130 237 -15 -103 348
2929C48j02n42L74p7k5j25L59j3n0k43L67l0N9p5m8j52J82Q8k97Q1M53j76l23
$$ 348 246 -296 78 1 -24 -149 210 197 147 -96 271 241 300 225 177 25 207 295 -2 79 532 356 33
2952C3j4K56P1R9k00o2KJ34j57j01J89n9j98J12K09J89l13l2k49L48k49L4j53
$$ 33 19 275 346 445 245 183 185 319 162 61 250 191 -7 105 314 503 190 158 -91 257 8 42 -111
2975a11J18J25M5j45Q8q5M2n4J99n00K32K16k20K1M0q2k11K27M8J2j14p2j3j12
$$ -111 7 132 177 32 120 35 77 23 222 -278 -46 170 -50 -29 11 -71 -282 -55 -7 5 -109 -181 -194 -306
2999c06K47J52m54L52m06L2n7L90j6l89L24k01L66l5j5Lk39J39j36K14No8l1m3
$$ -306 -59 93 -361 -9 -415 -383 -440 -50 -66 -455 -131 -332 34 -1 -16 -13 -252 -113 -249 -35 -30 -98 -129 -172
3023a72j55J82k3P1j79J1L44j11j35K1K29k19L8L43n58P5J63mk49M78L8j21l51
$$ -172 -327 -145 -168 -97 -276 -265 79 -32 -167 -146 83 -136 -98 245 -313 -238 -75 -79 -328 150 188 67 -284
3046b84M06n0M2p9K85l44J52r6j36L87j78L3M7j44L0R5j63P4J84Q9j73Q3j85J
$$ -284 122 72 114 35 320 -24 128 32 -104 283 105 138 185 41 71 166 3 77 261 350 177 260 75 76
3070G6Mo2J02J9j21J28k24L20j8J28j13k55L08J11k25J35j96j0O4Q8j70j13l9
$$ 76 80 18 120 139 18 146 -78 242 224 352 239 -16 292 403 178 313 117 107 171 259 89 -24 -63
3093f3P7J1K40j56r0J28j84K40k66M30m02j5k50N14j18K64j32r1k84K99r5m41
$$ -63 14 25 265 109 19 147 -37 203 -63 367 -35 -50 -300 214 96 360 228 137 -147 152 57 -384
3115c84L70M4j20N7J29k52K86J12l11M27m43K83k78l49M35j35j31K34k84J69L7
$$ -384 -14 30 -90 -33 96 -156 130 242 -69 358 -85 198 -80 -429 6 -129 -260 -26 -310 -141 -104
3136a04p4M8j61L3K84k62k58M34l37m5L01jk28K37L46n88K01K25j21j87K03j64
$$ -104 -178 -130 -291 -258 26 -236 -494 -60 -397 -442 -141 -142 -370 -133 213 -375 -174 51 -70 -257 -54 -218
3158b18K3K7L66j52k82M10j62l00K84j00K22p8k08P9K7J38j35r5L02j06J28Mm06
$$ -218 -195 -168 198 46 -236 174 12 -288 -4 -104 118 40 -168 -89 -62 76 -59 -154 148 42 170 174 -232
3181b32J21K27j93K27n0j90K17RO6j21K06j2j07L04l86l9m9J73l3pj82R5j20J48
$$ -232 -111 116 -77 150 100 -90 127 136 202 81 287 275 168 472 86 47 -2 171 138 131 -51 44 -76 72
3205G2K8k04L95K7O8l40J78j10K40k35l4Q8r5M3J08j30J61m97N33j0j66k0J15
$$ 72 100 -104 291 318 386 46 224 114 354 119 85 173 78 121 229 99 260 -237 296 286 120 100 215
3228B15r6j0j12N5j5K26j28k17K66l33J31J0J48k01Q5j43J79j59L70n21J26K33
$$ 215 119 109 -3 52 37 263 135 -82 184 -149 -18 -8 140 -61 24 -119 60 -99 271 -250 -124 109
3250A09Rj95k31O3J14j95J63J28j63P7j58L43l14N17m85J59j40M6Kl7j69K49L9
$$ 109 118 -77 -308 -245 -131 -326 -163 -35 -198 -121 -279 64 -250 267 -218 -59 -199 -153 -151 -188 -357 -108 -69
3273f9n1k64M76k90j83J55J30J56P4k05j39J44k47j84L45j8m5J54M8k86K74N3
$$ -69 -120 -384 92 -198 -381 -226 -96 60 134 -71 -210 -66 -313 -497 -152 -170 -215 -61 -13 -299 -25 28
3295B8n1Q0j65J72p9J51j52q2J72K2P3K0l6k42q2J92M68m07K58K4l49j87L5J56
$$ 28 -23 57 -108 64 -15 136 -16 -98 74 96 169 189 153 -89 -171 21 489 82 340 364 15 -172 -137 19
3319A9p2P4j34j04M43j15k94L06K3k48J97J01n4J04j22J07k23P9J02m4J14j1L1
$$ 19 -53 21 -113 -217 226 111 -183 123 146 -102 95 196 142 246 124 231 8 87 189 145 259 248 279
3342B79j34n3J41J10q0P2l33N5j5J22J61O2k79j08k74K63K27J30r7q6j82l00N33
$$ 279 145 92 233 343 263 335 2 57 42 164 325 387 108 0 -274 -11 216 346 249 163 -19 -319 214
3365B14l78J39L29m44K34Jk05Q3J1K74O3m20J63k76L09J3k45K19j29k6j21J34
$$ 214 -164 -25 304 -140 94 95 -110 -27 -16 258 321 -99 64 -212 97 110 -135 84 -45 -71 -192 -58
3387e8P7M9m52J06J18K87l16Q5l6K2K7L0l34K65Q4j46n3j43M8M48l68J4K2J41
$$ -58 19 68 -384 -278 -160 127 -189 -104 -140 -118 -91 -61 -395 -130 -46 -192 -245 -388 -340 108 -260 -246 -224 -83
3411h3Ok05K7K37K56k25L19m39N8l1l2j76p5K81J73j13j32J13q9K21M7j70K19
$$ -83 -77 -282 -255 -18 238 13 332 -107 -49 -80 -112 -288 -363 -82 91 -22 -154 -41 -130 91 138 -32 187
3434A87k08J15K6k16J20L04l96R8J38j42O9j27l8J60l14L38k25J30l4J90J87K07
$$ 187 -21 94 120 -96 24 328 -68 30 168 26 95 -32 -70 90 -224 114 -111 19 -15 175 362 569
3456E69m68J44k63K33j92L70j3j28m4k01J75k45K76K2m12K83j2k25M01j50j42
$$ 569 101 245 -18 215 23 393 380 252 208 7 182 -63 213 235 -177 106 94 -131 270 120 -22
3477b2P1J14m2J5k20K25J6o0j59J11M7o2O7l0j81L95l27M3j33Q5K15k19O2J94
$$ -22 49 163 121 136 -84 141 157 97 -62 49 96 34 101 71 -110 285 -42 1 -132 -47 168 -51 11 205
3501B05k14J01j50L67m17k35L40j22l4O8J34k66K33j96P7O6j7K37j69l21J30j
$$ 205 -9 92 -58 309 -108 -343 -3 -125 -159 -91 43 -223 10 -186 -109 -43 -60 177 8 -313 -183 -184
3523a84K34k54J81j67K46p8j87j79J63J6J15JK2n5J15k10K25N0l72M00r1R8j82
$$ -184 50 -204 -23 -190 56 -22 -209 -388 -225 -209 -94 -93 -71 -126 -11 -221 4 54 -318 82 -9 89 -93
3546i3M9j24p1J52jp6J04K7j0j07K04J5J53q1n2k81L91l65K32K7L5J6n8j82O4
$$ -93 -44 -168 -239 -87 -88 -164 -60 -33 -43 -150 54 69 222 141 89 -192 199 -166 66 93 128 144 86 -96 -32
3571c2L47j27l27L81k42j8L2j03Q4m6K51k96K41j11m5J65P4Q3P6k74R8p5j52K65
$$ -32 315 188 -139 242 0 -18 14 -89 -5 -51 200 -96 145 34 -11 154 228 311 387 113 211 136 -16 249
3595B49J6j61m0p4L8M8L37k09rq7k85N27j19j2N5m32J17K23j54Q9J2k29J93m9
$$ 249 265 104 64 -10 28 76 413 204 195 108 -177 350 231 219 274 -158 -41 182 28 117 129 -100 93 44
3619D4J03L5J11k01qp2O9j38P3j85K36J61k46k33J59n7RR0N4PL3J00k18L22j91
$$ 44 147 182 293 92 84 12 81 -57 16 -169 67 228 -18 -251 -92 -149 -140 -50 4 11 44 144 -74 248 57
3644E7l17L25K03l00k04K50k71J04qJ24j82M0J92K28o28L04P6l34K33J09j02Q
$$ 57 -260 65 268 -32 -236 14 -257 -153 -161 -37 -219 -179 13 241 -387 -83 -7 -341 -108 1 -101 -93
3666i3J19k26J17J7k97O0k2K00L90m90K06kJ0o6k34J67M1J49q8J75n74L09J79
$$ -93 26 -200 -83 -66 -363 -303 -325 -125 265 -225 -19 -21 -11 -77 -311 -144 -103 46 -42 133 -441 -132 47
3689D7J08j77J71l43m4M51j71J76j97m2m10N31J3L2l91N59j56j39k1K34j78L7
$$ 47 155 -22 149 -194 -238 213 42 218 21 -21 -431 100 113 145 -246 313 157 18 -3 231 53 90
3711I0j8J80j35P0J54k30N0J15R8m52P9J04PM3j80j31L19j80R1J53j7k64j71L05
$$ 90 72 252 117 187 341 111 161 276 374 -78 1 105 112 155 -25 -156 163 -17 74 227 210 -54 -225 80
3735H0N4J32m67K52O9j93L26j07k72M6J85m9o5K72j44k80K42K12j54m7j0j45J80
$$ 80 134 266 -201 51 120 -73 253 146 -126 -80 105 56 -9 263 119 -161 81 293 139 92 82 -63 117
3758A17l0k16K22j28P6k81J54N0J92l48O73m44q7K05m13M2K48k97r2K97n3O7j27
$$ 117 87 -129 93 -35 41 -240 -86 -36 156 -192 481 37 -50 155 -258 -216 32 -265 -357 -60 -113 -46 -173
3781a73J08j45J02j79L7o1M49K5j87r0L92Pl55m9K38k35k95M77l05N9R3j49R0
$$ -173 -65 -210 -108 -287 -250 -311 138 163 -24 -114 278 285 -70 -119 119 -116 -411 66 -239 -180 -87 -236 -146
3804a46J83j34K46j63p1K23l49K35k94K25Q4j6Nq4K2J28L6R4j21l90J32K13j55
$$ -146 37 -97 149 -14 -85 138 -211 24 -270 -45 39 23 28 -56 -34 94 130 224 103 -287 -155 58 -97
3827i7m4K12O8k19K53M5m35J98q0J60j74OJ80k00K58K24k89p9K00q9P3J92k61
$$ -97 -141 71 139 -80 173 218 -217 -19 -99 61 -113 -107 73 -127 131 355 66 -13 187 98 171 363 102
3850A02M7n8n5K34K6l88J69j33K24r0QJ80r9j00m3J97l7k19O9K78q3N8q9j88M42
$$ 102 149 91 36 270 296 -92 77 -56 168 78 86 266 167 67 24 221 184 -35 34 312 229 287 198 10 452
3875D52r11M66K03k40J36j16j44M2J33j90K16M0J32o0j27J14j90J59k41p6K17
$$ 452 -459 7 210 -30 106 -10 -154 -112 21 -169 47 87 219 159 32 146 -44 115 -126 -202 15
3896A5Pk34K45q2k02L8N3K72k91J82k48J6J66j30L1L48m32j66K20R0J51m1q8j18
$$ 15 22 -212 33 -49 -251 -213 -160 112 -179 3 -245 -229 -63 -193 -162 186 -246 -412 -192 -102 49 8 -80 -198
3920a98J54%L0k43J27l2J16J87l80L83l84J10K82l31N8O2J77j80J9j06J0J4J57
$$ -198 -44 -44 -14 -257 -130 -162 -46 141 -239 144 -240 -130 152 -179 -121 -59 118 -62 -43 -149 -139 -125 32
3943C2l15J53K38j40j19L39o77M73l8J52J0Qk8j67J16p3J43N4k25J6N01J3l05
$$ 32 -283 -130 108 -32 -151 188 -489 -16 -54 98 108 116 88 -79 37 -36 107 161 -64 -48 453 466 161
3966A61j3n7j90L07J07l04O3mM6j18Q6L1O2J96j95k18J61j16j70J4K46k11K16
$$ 161 148 91 -99 208 315 11 74 70 116 -2 84 115 177 373 178 -40 121 5 -165 -151 95 -116 100
3989A00J32K7k07J23P7p0N8j24j47J07P3m30K74K76r0J59j31m13J06J81L2L7j92
$$ 100 232 259 52 175 252 182 240 116 -31 76 149 -281 -7 269 179 338 207 -206 -100 81 113 150 -42
4012d2L4J41k35J8K22j17J57j08p4k06L83q8k93K26j65R2k90N41p2k65J84J7l16
$$ -42 -8 133 -102 -84 138 21 178 70 -4 -210 173 85 -208 18 -147 -55 -345 196 124 -141 43 60 -256
4035b56J44j17J35j56J78n9K3j30K00j26Q4l6m9j58L89l08J25j58J27k3J8L22
$$ -256 -112 -229 -94 -250 -72 -131 -108 -238 -38 -164 -80 -116 -165 -323 66 -242 -117 -275 -148 -171 -153 169
4057A69m20J99L63m52j53K91n6J04j46k7P8j89J74K49k50j40K25J22j72p7L4o4
$$ 169 -251 -52 311 -141 -294 -3 -59 45 -101 -128 -50 -239 -65 184 -66 -206 19 141 -31 -108 -74 -138
4079a38K82l48R9k0J64r9j19J66P6o2j6M57l42j21J73j14o1PK71j89M18o10M29
$$ -138 144 -204 -105 -125 39 -60 -179 -13 63 1 -15 442 100 -21 152 38 -23 -16 255 66 484 -126 303
4102C03l56M34j06J05l27j5M4m39L76O2l3J47n3J51j22M3J5j4J06k13J71k16p8
$$ 303 -53 381 275 380 53 38 82 -357 19 81 48 195 142 293 171 214 229 215 321 108 279 63 -15
4125a5k8j77L05N6J9k60j17L27j10J83K03m14k37K33M30l30k43L21m10L64l0k50
$$ -15 -43 -220 85 141 160 -100 -217 110 0 183 386 -28 -265 -32 398 68 -175 146 -264 100 70 -180
4147a80j51L30p4O4j15P3k11JK63q6j5j36L60k0j26K42k09j76J15J03n4k53J77
$$ -180 -331 -1 -75 -11 -126 -53 -264 -263 0 -86 -101 -237 123 103 -23 219 10 -166 -51 52 -2 -255 -78
4170g8l6k27K37k0O7P8k89J47j3J50j70J27k27L6O2K83j07rK23j66j35k22J54
$$ -78 -114 -341 -104 -124 -57 21 -268 -121 -134 16 -154 -27 -254 -218 -156 127 20 11 234 68 -67 -289 -135
4193a35l6K47Pk4k15L3J77R7j48k10K25k41L56j66j47M25m36K68Q7j86j97J56
$$ -135 -171 76 83 59 -156 -123 54 151 3 -207 18 -223 133 -33 -180 245 -191 77 164 -22 -219 -63
4215f3j27J69Q7j19L2Q6%p9M17j88m42M30j74r0M3K5o0J86k34J79J67n76K75L60
$$ -63 -190 -21 66 -53 -21 65 65 -14 403 215 -227 203 29 -61 -18 7 -53 133 -101 78 245 -331 -56 304
4239C04k3L7m64M5K58j9K3j32J46j72J45J4J51k30J53k82n6K62L3k24P5K6k70
$$ 304 281 318 -146 -101 157 138 161 29 175 3 148 162 313 83 236 -46 -102 160 193 -31 44 70 -200
4262b00J85j03L25L4r4J10l47K34j34r9L6l1L34n2n34N29j03o5k3k20L14l27K77
$$ -200 -15 -118 207 241 147 257 -90 144 10 -89 -53 -84 250 198 -336 193 90 25 2 -218 96 -231 46
4285D6N5j78r0NN4R1M8K0k08Q5J48l0J24k04k64L09j53M55j3m11l1L4K59m42K88
$$ 46 101 -77 -167 -162 -108 -17 31 51 -157 -72 76 46 170 -34 -298 11 -142 313 300 -111 -142 -108 151 -291 -3
4310cj98P2o5k28L42Q3K62m76J92N4J42l53N9l6R7J77k12J5l82J31K96O6j58L32
$$ -3 -201 -129 -194 -422 -80 3 265 -211 -19 35 177 -176 -117 -153 -56 121 -91 -76 -458 -327 -31 35 -123 209
4334B09r2j35k77L20K64o21L26J98l10p5K05K21j5l71K74p6R8o2N4Q9K2l17K75
$$ 209 117 -18 -295 25 289 -332 -6 192 -118 -193 12 233 218 -153 121 45 143 81 135 224 246 -71 204
4357B04%N5n2k19K62j75J88j10M6j78L03k52k70K59J4k8l1L6K49L9J49l78q0J64
$$ 204 204 259 207 -12 250 75 263 153 199 21 324 72 -198 61 75 47 16 52 301 340 489 111 31 195
4381A95k07j11L02jj25Q2j95K64J31l59J61j62n2J89K93o10M13j51j32K39k41
$$ 195 -12 -123 179 178 53 135 -60 204 335 -24 137 -25 -77 112 405 -205 208 57 -75 164 -77
4402g7j92L60J78l94K24k59L31n7j79m1O1k57L49k22L10J24k27j59K43r9o1k22
$$ -77 -269 91 269 -125 99 -160 171 114 -65 -106 -45 -302 47 -175 135 259 32 -127 116 17 -44 -266
4424b66K83oK42l41J28J26Q3m84K44l07M96k56k3j66L36l46J69j88j66M31Q5o5
$$ -266 17 11 253 -88 40 166 249 -235 9 -298 198 -58 -81 -247 89 -257 -88 -276 -442 -11 74 9
4446IJ79j36k11l6J89J22pj26K04n0j38L26j87k21K53j74J63l6J6j21l19M72j88
$$ 9 188 52 -159 -195 -6 116 109 -17 187 137 -1 325 138 -83 170 -4 159 123 139 18 -301 171 -17
4469a7R2K66l43J07k91K09K8Lj78L66j65j45O4j30J75K3r8K6J97l77M36l38K57
$$ -17 75 341 -2 105 -186 23 51 54 -124 242 77 -68 -4 -134 41 64 -34 -8 189 -188 248 -90 167
4492A67l29L16Rl14K87k1k38K66M9j14k09J45K09r8K3P6j64N6K60k21r5J91j72
$$ 167 -162 154 163 -151 136 115 -123 143 192 78 -131 14 223 125 148 224 60 116 376 155 60 251 79
4515G9l6l09L41l84L15J12rp9J62j95j44m2K09M01o97K16o5J28j5K2Q9j43j11
$$ 79 43 -266 75 -309 6 118 109 30 192 -3 -147 -189 20 421 -276 -60 -125 3 -12 10 99 -44 -155
4538a55K24l9m22N56j76j7K80j3k56L48j77l83M60j02l45J77J84l93J97j43J37
$$ -155 69 30 -392 164 -12 -29 251 238 -18 330 153 -230 230 128 -217 -40 144 -249 -52 -195 -58
4559e8rl96J08L60k69K68pl3L36n18J13J61k23K32O6k99N2M5p2n6J64R3j95K46
$$ -58 -67 -463 -355 5 -264 4 -3 -36 300 -218 -105 56 -167 65 131 -168 -116 -71 -143 -199 -35 58 -137 109
4583A09L9l44P1q5Q0K99k0j09R1k73R2J73r4j24n5O3r9j15K70jj5L24j0r2j46
$$ 109 148 -196 -125 -210 -130 169 149 40 131 -142 -50 123 29 -95 -150 -87 -186 -301 -31 -32 -47 277 267 175 29
4608B9j28J29R8oMk11K41Q5m84L89p5l9j42J63k9J06k9j02K45k85J51n6r5J68
$$ 29 -99 30 128 122 126 -85 156 241 -243 146 71 32 -110 53 24 130 101 -1 244 -41 110 54 -41 127
4632A27j41J76k45J52J77j26k19L14j8K9j9j61M93k12l22K75k14R6j9nk36J07
$$ 127 -14 162 -83 69 246 120 -99 215 197 226 207 46 539 327 5 280 66 162 143 138 -98 9
4654Ik24L53M2o8j47j51M4K6K83j02q8j46K43j43n4J12J15L3q4m9o5J05Pj18M9
$$ 9 -215 138 180 112 -35 -186 -142 -116 167 65 -23 -169 74 -69 -123 -11 104 137 53 4 -61 44 51 -67 -18
4679a8k20K34j05j25k35N99m68M30m31K66L01m06n6Q5R7l7%r8p8J14J94k43J68
$$ -18 -238 -4 -109 -234 -469 130 -338 92 -339 -73 228 -178 -234 -149 -52 -89 -89 -187 -265 -151 43 -200 -32
4702c2k56q6L43j24J40j11L8m7j64J91K49j77N9j5j97L53l3j61j4J25Q6N2m08
$$ -32 -288 -374 -31 -155 -15 -126 -88 -135 -299 -108 141 -36 23 8 -189 164 131 -30 -44 81 167 219 -189
4725a89R7j02J51O1%j11Kj4L13k52m2J74j0j36K22Q4k01r8q5j51N05k57K70k5
$$ -189 -92 -194 -43 18 18 -93 -91 -105 208 -44 -86 88 78 -58 164 248 47 -51 -136 -287 218 -39 231 206
4749B06j04K30l91o5O3nJ84j65K2K63k75K1J69j43j5k40N50K6j37N7n08J98R0
$$ 206 102 332 -59 -124 -61 -66 118 -47 -25 238 -37 -16 153 10 -5 -245 305 331 194 251 -257 -59 31
4772C1J83m85N98l68j4m8P0O5k68O5K16K7m3J18m18K64K52l78J73m6j75L13l33
$$ 31 214 -271 327 -41 -55 -103 -33 32 -236 -171 45 72 29 147 -271 -7 245 -133 40 -6 -181 132 -201
4795b01M72Q4m16R4J58j61j15M9j34L24k75K0n4j5J63N6j21n4J4k15J67j25P9
$$ -201 271 355 -61 33 191 30 -85 -36 -170 154 -121 -101 -155 -170 -7 49 -72 -126 -112 -327 -160 -285 -206
4818b06K03P6o3J0m9J10J53l71r1R0Q3J05l8J13l46J31l0J12M8N0l6k98J20Pk90
$$ -206 -3 73 10 20 -29 81 234 -137 -228 -138 -55 50 12 125 -221 -90 -120 -8 40 90 54 -244 -124 -117 -407
4843d07L44K76m83K96k69L8K16K04n62O21m07J74j5J99k62J47k35L41k38k10L82
$$ -407 -63 213 -270 26 -243 -205 11 215 -347 274 -133 41 26 225 -37 110 -125 216 -22 -232 150
4864A50j88K22l17J47J51l4o5l20K61L18l31j3J72O5K09m82K28k37q9K26k27M9
$$ 150 -38 184 -133 14 165 131 66 -254 7 325 -6 -19 153 218 427 -55 173 -64 -153 73 -154 -105
4886a05L39l81l3J00r2M39l3l14K60p5k32J38r4p1L98l7j56K30k37R3kl57J11
$$ -105 234 -147 -180 -80 -172 267 234 -80 180 105 -127 11 -83 -154 244 207 51 281 44 137 135 -222 -111
4909a11K07l33K25J33l20J42Q6K9j19Q8r5J83j46J33j33O3j64L26J2k86J12k33
$$ -111 96 -237 -12 121 -199 -57 29 58 -61 27 -68 115 -31 102 -31 32 -132 194 206 -80 32 -201
4931b01J2M6p5P8M3k05L55q8K00k49O0l01K90J14O0jk08J19q9j55J32L08l27R6
$$ -201 -189 -143 -218 -140 -97 -302 53 -35 165 -84 -24 -325 -35 79 139 138 -70 49 -40 -195 -63 245 -82 14
4955A4j6K43j32Rk40l61N81j75j24J1J13J30N0n4k25J18K60j76J35j38K94m93
$$ 14 -2 241 109 118 -122 -483 98 -77 -201 -190 -77 53 103 49 -176 -58 202 26 161 23 317 -176
4977a76j78M60J31j80J0J69j01l82P3K90q9j10N2J46r2q5M4K2k9J63j13Q9j84
$$ -176 -354 106 237 57 67 236 135 -247 -174 116 27 -83 -31 115 23 -62 -18 4 -25 138 25 114 -70
5000g0m6m5K09J58J30j97p8k52L26M3k55J48M6J14k49K93m8k83j6L6L03j73L2
$$ -70 -116 -161 48 206 336 139 61 -191 135 178 -77 71 117 231 -18 275 227 -56 -72 -36 267 94 126
5023A26K6L6l11N43l96J61k65K19j4r0K20l88K9J48J62k03K8j61P1l3J56k72L07
$$ 126 152 188 -123 420 24 185 -80 139 125 35 255 -133 -104 44 206 3 31 -130 -59 -92 64 -208 99
5046I9ol24J75Pk3l59L38K26m59M12q8Qj33L63m46K19M7q5j21K03j09M1K23k47
$$ 99 93 -231 -56 -49 -72 -431 -93 133 -326 86 -2 6 -127 236 -210 9 56 -29 -150 53 -56 -15 208 -39
5070c9k66M00j30j09P2N5m28L76P0j07M0k36L75j57l22L88J51j87j20L83n7O2
$$ -39 -305 95 -35 -144 -72 -17 -445 -69 1 -106 -66 -302 73 -84 -406 -18 133 -54 -174 209 152 214
5092B14l42K46l80J75j28L69j45j67J52k9j10J14L6K5K1j44J28J82l10J72rj48
$$ 214 -128 118 -262 -87 -215 154 9 -158 -6 -35 -145 -31 5 30 51 -93 35 217 -93 79 70 -78
5114g8N4r4K8J6L9K21l88K14P4J8nr1k2J53k26L09J9j77J22j49K53m09J09Q5K8
$$ -78 -24 -118 -90 -74 -35 186 -202 12 86 104 99 8 -14 139 -87 222 241 64 186 37 290 -119 -10 75 103
5139A03n2J87k46J23N6j23K05J8l88K38j2o6j98K41j18J93r7k77K67j71M01l12
$$ 103 51 238 -8 115 171 48 253 271 -117 121 109 43 -155 86 -32 161 64 -213 54 -117 284 -28
5161b8L2J94j31j48N08l18k06R8n5o5j67K56K00o8k49K28k5R2j99N7k1J95k64
$$ -28 4 198 67 -81 427 109 -97 1 -54 -119 -286 -30 170 102 -147 81 56 148 -51 6 -15 180 -84
5184h4K0k7O5o8P6k34LP4K61j54L0j48M27j23j92j74P2K5J02K0L45j36L6l56O9
$$ -84 -64 -91 -26 -94 -18 -252 -249 -175 86 -68 -38 -186 241 118 -74 -248 -176 -151 -49 -29 316 180 216 -140 -71
5209g1j25J52n0p2J57R9l26M8L06j96J7n9j01M7K33Jl53N2o8K33R9j6q7o3n0K70
$$ -71 -196 -44 -94 -166 -9 90 -236 -188 118 -78 -61 -120 -221 -174 59 60 -293 -241 -309 -76 23 7 -80 -143 -193 77
5235G7m6J69l72N13k44J2k2j34m1q1L37n24M28Jo8m3k43N31L9k53J71j28pJ8k91
$$ 77 31 200 -172 341 97 109 87 -47 -88 -169 168 -356 72 73 5 -38 -281 250 289 36 207 79 72 90 -201
5260b01K31K17l83R1M8K83k97R0J98Qm56J65j0Q4k7K1q5r8L46m3q9l39K85O0o1
$$ -201 30 247 -136 -45 3 286 -11 79 277 285 -171 -6 -16 68 41 62 -23 -121 225 182 93 -246 39 99 38
5285C8l7j37Q4J18j66M48n4l61K80m32N35k72K0l4M6k14K77N0q8r3n2J45l34K9
$$ 38 1 -136 -52 66 -100 348 294 -67 213 -219 316 44 64 30 76 -138 139 189 101 8 -44 101 -233 -204
5309b04O29o13L71l51J94k8o7J56rr3l05P2K11l34K77Q0Q6l73J87k2J92j8l18
$$ -204 425 -188 183 -168 26 -2 -69 87 78 -15 -320 -248 -37 -371 -94 -14 72 -301 -114 -136 56 38 -280
5332b80J05J35l8P3m4m3K52o9nk30J13j92K79j39j6l6K2M6m65O49r3j11K16K35
$$ -280 -175 -40 -78 -5 -49 -92 160 91 86 -144 -31 -223 56 -83 -99 -135 -113 -67 -532 117 24 -87 129 364
5356C64k72qj53M08j75r7l19N2K11r9L14r0k17J77r8J10j34n0j2K49nm9j13J23
$$ 364 92 84 -69 339 164 67 -252 -200 11 -88 226 136 -81 96 -2 108 -26 -76 -88 161 156 107 -6 117
5380A17r7j13L25k63K45j21j0q8j66L17N9l76L60j48r9k2M9J77O6j2j27R2r9k2
$$ 117 20 -93 232 -31 214 93 83 -5 -171 146 205 -171 189 41 -58 -80 -31 146 212 200 73 165 66 44
5404D4K47k12K7J8j10K34l22L30p2j61r2K48j71j20m2J6L07r6q4R6j72J77j05
$$ 44 291 79 106 124 14 248 -74 256 184 23 -69 179 8 -112 -154 -138 169 73 -11 85 -87 90 -15
5427a5r7j3K44j77j03K70l27J85J28j37j71l1K69J80Oj64j75J51k23p5n5K53J00
$$ -15 -112 -125 119 -58 -161 109 -218 -33 95 -42 -213 -244 25 205 211 47 -128 23 -200 -275 -330 -77 23
5450B3L6j18j49J07p3RJ16j64J60L8r5j87j8L72K14k64j91j82L47j8L7k28J88
$$ 23 59 -59 -208 -101 -174 -165 -49 -213 -53 -15 -110 -297 -315 57 271 7 -184 -366 -19 -37 0 -228 -40
5473d0J4r1J6L51l27k2J74J8m5R0n7j13K56l5k15o3J05o6k35J93J25j77k9J51
$$ -40 -26 -117 -101 250 -77 -99 75 93 48 138 81 -32 224 189 -26 -89 16 -50 -285 -92 33 -144 -173 -22
5497b2r5K52l40M16l98p1L07J13k96J30J4K09k48q7O9K60l51k50J44K67r8J70
$$ -22 -117 135 -205 211 -187 -258 49 162 -134 -4 10 219 -29 -116 -47 213 -138 -388 -244 23 -75 95
5519I5J39l65M6J56L5j45R1j25r3K29k40L19k83K50j22J16j55j01K35J1q8K23
$$ 95 234 -131 -85 71 106 -39 52 -73 -166 63 -177 142 -141 109 -13 103 -52 -153 82 93 5 228
5541B28O9j39l2j59K51j2j21J07p8j82K24j21k08L94j25n7K65k99K88k38L1j03
$$ 228 297 158 126 -33 218 206 85 192 114 -68 156 35 -173 221 96 39 304 5 293 55 86 -17
5563a7j4j87%K17J53j74K9j69J03J98j55M0J53k12k3N2J08j25J02k90j3K28j51
$$ -17 -31 -218 -218 -1 152 -22 7 -162 -59 139 -16 24 177 -35 -58 -6 102 -23 79 -211 -224 4 -147
5586a47p8J24j10j21M90k59j50L3J52M4R3R5o6k63J99p5l31L71j66j49K68p5J73
$$ -147 -225 -101 -211 -332 158 -101 -251 -218 -66 -22 71 166 100 -163 36 -39 -370 1 -165 -314 -46 -121 52
5609E2k18K69m9m11L85j42J56J41k38j15K17o8k77K43J14j28R1J81l38M11k62
$$ 52 -166 103 54 -357 28 -114 42 183 -55 -170 47 -21 -298 -55 59 -69 22 203 -135 276 14
5630A4NJ13oj9J00m32n5M42R3j15j41P9k14J71R0j95j57J49R9j11K28j8J50k88
$$ 14 19 132 126 107 207 -225 -280 162 255 140 -1 78 -136 35 125 -70 -227 -78 21 -90 138 120 270 -18
5654a8R6J42q8j91MK51k66LJ69l60K29Q9J55J78l11k74K46L10j92j67k02J01K22
$$ -18 78 220 132 -59 -55 196 -70 -67 102 -258 -29 60 215 393 82 -192 54 364 172 5 -197 -96 126
5677A26k03L50j90J35j65r1o1km1K80j79N5k4P8O0j09kj07J56l0N3j09l3K48p3
$$ 126 -77 273 83 218 53 -38 -99 -101 -142 138 -41 14 -10 68 128 19 17 -90 66 36 89 -20 -53 195 122
5702A22j34p2J41j39j04K13m88O08O6j51k41P7J47J37K62l74j91O4K10k61P4L7
$$ 122 -12 -84 57 -82 -186 27 -461 147 213 62 -179 -102 45 182 444 70 -121 -57 153 -108 -34 3
5724CK03j22j1k58L17o9o7n76N00J70j67p2J74r4L08l96j93L92K8j48J22l5k69
$$ 3 206 84 73 -185 132 63 -4 -580 -80 90 -77 -149 25 -69 239 -157 -350 42 70 -78 44 9 -260
5747b60M14n0k18m0K88j64L9j79j12P8P4J33j35K25J44k07j27L40j59j61N7J58
$$ -260 154 104 -114 -154 134 -30 9 -170 -282 -204 -130 3 -132 93 237 30 -97 243 84 -77 -20 138
5769A38m28M1K73qK61m92N25j58K37l61p8L09k78m7J56J81k93O0J76j49l03K60
$$ 138 -290 -249 24 16 277 -215 310 152 389 28 -50 259 -19 -66 90 271 -22 38 214 65 -238 22
5791B2m7O2J20r4l0L85k88J31n57M35j07j03J76l52K4J21K25l0j40j05L16j03
$$ 22 -25 37 157 63 33 418 130 261 -296 139 32 -71 105 -247 -223 -102 123 93 -47 -152 164 61
5813F1mJ99j42Qk22NJ48j26J95j96J06j21lo3M13l96n9L18j29J49k89K09L5j72
$$ 61 57 256 114 122 -100 -95 53 -73 122 -74 32 -89 -92 -155 258 -138 -197 121 -8 141 -148 61 96 -76
5837g6J43j77J18r4J37j67K64k57l5L50j97j48J81l6j32o2K74j91j40M66j88j10
$$ -76 67 -110 8 -86 51 -116 148 -109 -144 206 9 -139 42 6 -126 -188 86 -105 -245 221 33 -77
5859g7j18L83k19L5J72l22K67j23K9k08Q5l9j57L49q0J56o2o5K6J61k9j07l1j79
$$ -77 -195 188 -31 4 176 -146 121 -2 27 -181 -96 -135 -292 57 -23 133 71 6 32 193 164 57 26 -153
5883a53Q7k4J80k70K49o9j9J8KO3j69J13j15K62j16j01L29r0o5j07j92L25J40
$$ -153 -66 -90 90 -180 69 0 -19 -1 1 64 -105 8 -107 155 39 -62 267 177 112 5 -187 138 278
5906B78j61J41l88L28l00K04qj2k10J46J47qn9K38l81L18j33j11J45k22l6j93
$$ 278 117 258 -130 198 -102 102 94 82 -128 18 165 157 98 336 -45 273 140 29 174 -48 -84 -277
5928b77O00j95q6j74K26OL06m04K11r4j53J10J24j64k84J79K01k05J74r5l1M6
$$ -277 323 128 42 -132 94 100 406 2 213 119 -34 76 200 36 -248 -69 132 -73 101 6 -25 21
5950B1k08L06k94K20R6k76L11Lnl15R3k8ml4j34N06k29j07j44K17l5j96M35l34
$$ 21 -187 119 -175 45 141 -135 176 179 174 -141 -48 -76 -80 -114 -248 258 29 -78 -222 -5 -40 -236 199 -135
5974a35K55k07N4j27J48j96L60k87K22j74J26K7k47J98J29r8q2J37m6l54M37j35
$$ -135 120 -87 -33 -160 -12 -208 152 -135 87 -87 39 66 -181 17 146 48 -34 103 57 -297 140 5
5996En6n9J49J9l4j56L11J0k47K26j17r7lJ41k33K02l18M94j78l31J80N24l65
$$ 5 -51 -110 39 58 24 -132 179 189 -58 168 51 -46 -49 92 -141 61 -257 237 59 -272 -92 432 67
6019F7m08K84J31j29K03l3Pl52J14R7K3J6J58k98M15k2m79J99k4k2l2K17q6j63
$$ 67 -341 -57 74 -55 148 115 122 -230 -116 -19 4 20 178 -120 295 273 -206 -7 -31 -53 -85 132 46 -117
6043a17L97j80K9j1J66j66m29L00J34%j78p4Q7J49j99K21JQN1l7n9L4j04kl0%
$$ -117 280 100 129 118 284 118 -311 -11 123 123 -55 -129 -42 107 -92 129 130 138 189 152 93 127 23 21 -9 -9
6069ip3J5JJ78N8j69K47k71J31j8R4l21J14K82k79r5k7j14p7J94J14P9J66l73
$$ -9 -82 -67 -66 112 170 1 248 -23 108 90 184 -137 -23 259 -20 -115 -142 -256 -333 -139 -25 54 220 -153
6093a53L9K7L06n19J69J24K29m52Q7L3rJ98j82J60j64K45k76K96k26q4J44j0L21
$$ -153 -114 -87 219 -300 -131 -7 222 -230 -143 -110 -119 79 -103 57 -107 138 -138 158 -68 -152 -8 -18 303
6116C03m29J27l2Q7k46K67Q1l80M85r4j50J77k8k75J31l73L64J85nj92rK02n0
$$ 303 -126 1 -31 56 -190 77 158 -222 263 169 19 196 168 -107 24 -349 15 200 195 3 -6 196 146
6139A46k22L11j44j29j23m7L32m6k74K23K34n57p3K71k5J00l31K34K1j7O9j44
$$ 146 -76 235 91 -38 -161 -208 124 78 -196 27 261 -296 -369 -98 -123 -23 -354 -120 -99 -116 -47 -191
6161a91K85r8j25L6l8Q5K00K7j71R0k52J32M5k05J53L12j45J59M9j91j24k0J48
$$ -191 94 -4 -129 -93 -131 -46 154 181 10 100 -152 -20 25 -180 -27 285 140 299 348 157 33 13 161
6184A61m3j89K45j1l09K11n5J28k50l6L01m1m89L06N6j98J88N9R4J79o13K44K71
$$ 161 118 -71 174 163 -146 65 10 138 -112 -148 153 112 -377 -71 -15 -213 -25 34 128 307 -306 -62 209
6207B09j48l0k74l6K43P7k36K34L22m48J43j89J58l14K24K2K1j72M59m36K38N6
$$ 209 61 31 -243 -279 -36 41 -195 39 361 -87 56 -133 25 -289 -65 -43 -22 -194 265 -171 67 123
6229A23l08J26M0n0j50K31p7K05m40K95m0k03J36L05j23j24J08K4k85J03J00o0
$$ 123 -185 -59 -19 -69 -219 12 -65 140 -300 -5 -45 -248 -112 193 70 -54 54 78 -207 -104 -4 -64
6251f4L8k25N22n43K74J49k52K76J21k57j65o7r6J34L95l76K7K28k04j4k1R0j15
$$ -64 -26 -251 271 -272 2 151 -101 175 296 39 -126 -193 -289 -155 240 -136 -109 119 -85 -99 -120 -30 -145
6274a45K14rK13l79L84m18L31k08K50k44N6j23J79l6l5L1l10L99J01J01m78J61
$$ -145 69 60 273 -106 278 -140 191 -17 233 -11 45 -78 101 65 30 61 -249 150 251 352 -126 35
6296C5p1j40K18n0n4K95k32j81J01K08j04n2J3j21K16J21j85O1r1K26m56L36k0
$$ 35 -36 -176 42 -8 -62 233 1 -180 -79 129 25 -27 -14 -135 81 202 17 78 -13 213 -243 93 73
6319G3q5n6J15K26j45k62K86j09Q3k80L70j93p7j08J70p0R3Q2k57j01K45k2mk4
$$ 73 -12 -68 47 273 128 -134 152 43 126 -154 216 23 -54 -162 8 -62 31 113 -144 -245 0 -22 -26 -50
6343e0J28j76L8L7J82j75j34q9K04J96k25rK9J27j83j89J63J9k9k46J93K18K80
$$ -50 78 -98 -60 -23 159 -16 -150 -239 -35 161 -64 -73 -44 83 -100 -289 -126 -107 -136 -382 -189 29 309
6366C09n10K51J3k31%j34K45pK8%J46l24N72m06J14j83R8P5j34K4qJ46J03j90
$$ 309 -201 50 63 -168 -168 -302 -57 -64 -36 -36 110 -214 358 -48 66 -117 -19 56 -78 -54 -62 84 187 -3
6390ck00J28O2o2LR8m6J05J49J29m18R4L0M5n0m6J02j00q5J79j69J62N8k41M74
$$ -3 -203 -75 -13 -75 -72 26 -20 85 234 363 -55 39 69 114 64 18 120 20 -65 114 -55 107 165 -76 398
6415C98m71J05J22r1op2J55k01j52J71R5M9k77K18J30j94j38K24J25j7k96M62
$$ 398 -73 32 154 63 57 -15 140 -61 -213 -42 53 102 -175 43 173 -21 -159 65 190 173 -123 339
6437C39k83j3p7r7J35K36l75J90k15L84k99K61j17k24J06j95K50Q7k82J44J92
$$ 339 56 43 -34 -131 4 240 -135 55 -160 224 -75 186 69 -155 -49 -244 6 93 -189 -45 147
6458A47j48K3P3k63K92m8j2k98K29j67J60j19J99q1J23K5k61k9M66l53N68l59
$$ 147 -1 22 95 -168 124 76 64 -234 -5 -172 -12 -131 68 -13 110 135 -126 -155 311 -42 526 167
6480A67k87j8J27j27j25J81j2J49l26L18k75K35r3Jj45j9M55k58k7j74J43p7o
$$ 167 -120 -138 -11 -138 -263 -82 -94 55 -271 47 -228 7 -86 -85 -230 -249 206 -52 -79 -253 -110 -187 -193
6503a93QL64j96J09p5k26l8J20P1j06J62k56K45j12Pj93L07K84l25j15n4J75o4
$$ -193 -185 179 -17 92 17 -209 -247 -127 -56 -162 0 -256 -11 -123 -116 -309 -2 282 -43 -158 -212 -37 -101
6526a01N3jj58L25J5j93k21M93k60K18k68J01j1M5l0K92k9m05J37k13J48n1L63
$$ -101 -48 -49 -207 118 133 -60 -281 212 -48 170 -98 3 -8 37 7 299 270 -135 2 -211 -63 -114 249
6549B49J9k72J44J82l18P3k1J05J2Ok37lN1J1L89j21q5o1L1o9n6J07l14L65k90
$$ 249 268 -4 140 322 4 77 56 161 173 179 -58 -61 -10 1 390 269 184 123 154 85 29 136 -178 187 -103
6574a03J58j94K66k39l5L14j8J30j81N8l84J04Ro4L97j40O9l8n9l44M01j28m7
$$ -103 55 -139 127 -112 -147 167 149 279 98 156 -228 -124 -115 -179 218 78 147 109 50 -294 107 -21 -68
6597f8k13M84J52q9l17K17l41nL36j28q4k5L04m08l70N57J16m8R7m05J61Q8Q1
$$ -68 -281 203 355 266 -51 166 -175 -180 156 28 -56 -81 223 -185 -555 2 118 70 167 -238 -77 11 92
6620I2l65N63l30K60j41j75oQ0K17k29K24j08j27k91L71j05qj19j32M86k20K40
$$ 92 -273 290 -40 220 79 -96 -102 -22 195 -34 190 82 -45 -336 35 -70 -78 -197 -329 157 -63 177
6642A77k86K52l93K01N72m11n0m90M58l22M19k39O2J99j89J61j9R4j76Q3k44J69
$$ 177 -109 143 -250 -49 523 112 62 -428 30 -292 127 -112 -50 149 -40 121 102 196 20 103 -141 28
6664B8LK4q4K63k92J28J3l69O71n68L04k24J61r4j7K02j86QJ05K0J34r5J00j53
$$ 28 31 55 -29 234 -58 70 83 -286 385 -183 121 -103 58 -36 -53 149 -37 -29 76 96 230 135 235 82
6688H2k23M98k66J34q1J68j70k67J57J5l3K35ll40R7J42q9r9N1J98k62J8N0O1
$$ 82 -141 357 91 225 144 312 142 -125 32 47 14 249 246 -94 3 145 56 -43 8 206 -56 -38 12 73
6712G3n8P7P7M2j35K1j51j07J78J49k90L85j69j42k28M16p5k13P8K84m08O5K03
$$ 73 15 92 169 211 76 97 -54 -161 17 166 -124 261 92 -50 -278 138 63 -150 -72 212 -196 -131 72
6735G2J47l11P7K1k1J74j31j09l46N53m62L92J23p2j54J85j80K1j34R2K7O6J48
$$ 72 219 -92 -15 6 -15 159 28 -81 -427 126 -336 56 179 107 -47 138 -42 -21 -155 -63 -36 30 178
6758A78j50j14k48K32R0J56j5J77j12j71l12J66K03k09J4j16M13j03k84L72m73
$$ 178 28 -86 -334 -102 -12 144 129 306 194 23 -289 -123 80 -129 -115 -231 182 79 -205 167 -306
6779c06L58j74LK25j63K65l25o0K11j64K22L4j20l6Q9k04K35q2O6L80n05oL44
$$ -306 52 -122 -119 106 -57 208 -117 -177 34 -130 92 126 6 -30 59 -145 90 8 74 454 -51 -57 287
6802B87l94J47r4j04L40k30J37J21O0k01o6K58m05K37j50j94K98k87M13k99kk5
$$ 287 -107 40 -54 -158 182 -48 89 210 270 69 3 261 -144 93 -57 -251 47 -240 173 -126 -128 -153
6824a53L5l2K33j67J37J33m01N8q3L63l3l7J24m1j32Q0j22MK18r8j96R2J03l6
$$ -153 -118 -150 83 -84 53 186 -215 -157 -240 123 90 53 177 136 4 84 -38 -34 184 86 -110 -18 85 49
6848D9J68l32k5n5Nn9L44j40L82l61j82j42M94Mk50M4n2J10K28j87p4P6j03m4
$$ 49 217 -115 -140 -195 -190 -249 95 -45 337 -24 -206 -348 146 150 -100 -56 -108 2 230 43 -31 45 -58 -102
6872a02L23j80k30J83j26J28J3Q7k08p4N3OK37k37J02L18m16nJ09P9jNJ6j16n9
$$ -102 221 41 -189 -6 -132 -4 9 96 -112 -186 -133 -127 110 -127 -25 293 -123 -128 -19 60 59 64 80 -36 -95
6897i5M9j68L01m6k8Q0k59J88j64K82k16N7N7J12j09j49j5K68r6Q9J2l03J43P7
$$ -95 -46 -214 87 41 13 93 -166 22 -142 140 -76 -19 38 150 41 -108 -123 145 49 138 150 -153 -10 67
6921F7Qj97M3K11j64p4R1K7N7L18k39k4l37L09n1l01M20oN7l18Q1J75P3m08L04
$$ 67 75 -122 -79 132 -32 -106 -15 12 69 387 148 124 -213 96 45 -256 164 158 215 -103 -22 153 226 -182 122
6946A22J0j56J42N9K18n81J98L08l29j03N9J20k97M95j72nm23Q5L14j71j2J34
$$ 122 132 -24 118 177 395 -186 12 320 -9 -112 -53 67 -230 265 93 88 -335 -250 64 -107 -119 15
6968A5n1kJ94l0j3k36K59q2J11k43K71j87m4M8J0j82J60NM2P8k80K5Q5j59J5K10
$$ 15 -36 -38 156 126 113 -123 136 54 165 -78 193 6 -38 10 20 -162 -2 3 45 123 -157 -132 -47 -206 -191 19
6994A9k10K41n3j44J27p1J29k85j34K93M22l46q0K52j98Q6j17J81j27j4nj7K23
$$ 19 -191 50 -3 -147 -20 -91 38 -247 -381 -88 334 -12 -92 160 -38 48 -69 112 -15 -29 -34 -51 172
7017A72k40j22m4Q6J3Q5k72K93K20q6q9k09J79J44J81j45j49M7K5j62J81r1k23
$$ 172 -68 -190 -234 -148 -135 -50 -322 -29 191 105 16 -193 -14 130 311 166 17 64 89 -73 108 17 -206
7040b06J98J6j50L02LJ39m44J26O3r0Q7n5j39K65j01k7K0J8j56J79l49J91J01
$$ -206 -8 8 -142 160 163 302 -142 -16 47 -43 44 -11 -150 115 14 -13 7 25 -131 48 -301 -110 -9
7063ij04L56k23M9j11J17N7M28o05%n7J30M5J17j68R3k5p7L84j05l55Q2K9L3R3
$$ -9 -113 243 20 69 -42 75 132 560 -45 -45 -102 28 73 190 22 115 90 13 397 292 -63 19 48 81 174
7088A74r9k93L65m80J76K01n7j19m5J64L01n86J54L7L98k97J91j54j09q8K34p5
$$ 174 75 -218 147 -333 -157 44 -13 -132 -177 -13 288 -298 -144 -107 291 -6 185 31 -78 -166 68 -7
7110gk4J9Q9J08l56K17n2n0K20k4k27M5P9j04n1K14l5k54K1L15l03K44j16k39
$$ -7 -31 -12 77 185 -171 46 -6 -56 164 140 -87 -42 37 -67 -118 96 61 -193 -172 143 -160 84 -32 -271
7134b71K06K2j28J55J12k54L3n2J66J82k49M2j50J82N9l04Q0K64m15L02J2J6k85
$$ -271 -65 -43 -171 -16 96 -158 -125 -177 -11 171 -78 -36 -186 -4 55 -249 -169 95 -320 -18 -6 10 -275
7157b75K01L7K70q9l0j7m0K24l91J40l1J4J36l15J08L05k01p9j01Pr2N0J18%J65
$$ -275 -74 -37 233 144 114 97 57 281 -110 30 -1 13 149 -166 -58 247 46 -33 -134 -127 -219 -169 -51 -51 114
7182A14j46j67N25n99K16O1P7k44K44j86N09m22Q9k2J91l69K94k92J83O5j0Q0
$$ 114 -32 -199 326 -273 -57 4 81 -163 81 -105 404 -18 71 49 240 -129 165 -127 56 121 111 191
7204A91J38k01k35K74k75j0J8L3j22R0J71k0p5L89l09j4j41M0J10j38J18J72m28
$$ 191 329 128 -107 167 -108 -118 -100 -67 -189 -99 72 52 -23 366 57 43 -98 -58 52 -86 32 204 -224
7227b24J13J47J67l84J09l05L90J09l95M13j68o9N2jJ11k3j20l8Jo7J3K24o1K44
$$ -224 -111 36 203 -181 -72 -377 13 122 -273 140 -28 -97 -45 -46 65 42 -78 -116 -115 -182 -169 55 -6 238
7251B38l58K21j29J38J1j0j23r4L38k54L39k78j32o2R9j15l3J91Rk59K16M9m7
$$ 238 -120 101 -28 110 121 111 -12 -106 232 -22 317 39 -93 -155 -56 -171 -204 -13 -4 -263 -47 2 -45
7274d5o2P2J04j00K97n4q3l03J78r2K0Q1j92K9J76L5P7l26Q0O0q4m0j82K09J00
$$ -45 -107 -35 69 -31 266 212 129 -174 4 -88 -68 13 -179 -150 26 61 138 -188 -108 -48 -132 -172 -354 -145 -45
7299d5O7j29O9J03J87m31J48R1j39K12n3j5r5r6Q7j1R4p1O6K9o5q5K0J93k93Q5
$$ -45 22 -107 -38 65 252 -179 -31 60 -79 133 80 65 -30 -126 -39 -50 44 -27 39 68 3 -82 -62 131 -162 -77
7325g7K62j36P8j17L98m68j3J85j48J03o0K00n49N00j27o3o0J48j8j26j1K18N3
$$ -77 185 49 127 10 408 -60 -73 112 -36 67 7 207 -342 158 31 -32 -92 56 38 -88 -99 119 172
7348A72j01k32J80J61o7k35J11j94P0K15J5j3j21m41M67L17m37L48l68K54o4j44
$$ 172 71 -161 19 180 113 -122 -11 -205 -135 80 95 82 -39 -480 -13 304 -133 215 -153 101 37 -107
7370a07LK57k6J42k40j35M8J52k31P4k71M3J76L13l19K28j19k05K76kO2j59M6
$$ -107 -104 153 127 269 29 -106 -58 94 -137 -63 -334 -291 -115 198 -121 107 -12 -217 59 57 119 -40 6
7393Fj50L47l31J96j04p3R4J19k20o9Q1n9J56J31J37l48Q1j5K9J89m97K6J07L25
$$ 6 -144 203 -128 68 -36 -109 -15 104 -116 -185 -104 -163 -7 124 261 -87 -6 -21 8 197 -300 -274 -167 158
7417A58m2k64R9R7J44p1l11P5J1J16p3K06M4p1q5p3J08J3m7q0K38m90M00m3oj89
$$ 158 116 -148 -49 48 192 121 -190 -115 -104 12 -61 145 189 118 33 -40 68 81 34 -46 192 -298 102 59 53 -136
7443a36R3J32O3l78N99m32K2K6kq7K18J14j24m80M46K90m51R3r2j73L38m6j93
$$ -136 -43 89 152 -226 373 -59 -37 -11 -13 -100 118 232 108 -372 74 364 -87 6 -86 -259 79 33 -160
7466a60Q3j2PJ82j25o9N4k6K21j54m7J73q3J43j4k27q5j39n7L82J63l58M30j71
$$ -160 -77 -89 -82 100 -25 -94 -40 -66 155 1 -46 127 44 187 173 -54 -139 -278 -335 47 210 -148 282 111
7490A11n3m6J4o0J13J0j06J16p9q2k38M55k40J83j86J06p5O8R3l17N3K05J50n27
$$ 111 58 12 26 -34 79 89 -17 99 20 -62 -300 155 -85 98 -88 18 -57 11 104 -213 -160 45 195 -332
7514c32K5J98L2oJ50l1j16K21j04j57N1k8M47n41L85m83J34M56k61K2r9J00j81
$$ -332 -307 -109 -77 -83 67 36 -80 141 37 -120 -69 -97 350 -191 194 -289 -155 301 40 62 -37 63 -118
7537a18J39M1L53m69r8K92j61L4k16r6L49j5K5k53J79o2O5Q3lj60L29l78O7l7
$$ -118 21 62 415 -54 -152 140 -21 13 -203 -299 50 35 60 -193 -14 -76 -11 72 69 -91 238 -140 -73 -110
7561a10m4L52k16nN6j7k05L77l05M25k42o0k10P7J66n06M81J21nk19K86k15m7
$$ -110 -154 198 -18 -23 33 16 -189 188 -117 308 66 6 -204 -127 39 -467 14 135 130 -89 197 -18 -65
7584f5J76J83l60k01N11k7l14K3J87k40J1K24P6l09J64J40m31J26PJ03J51j16
$$ -65 111 294 -66 -267 244 217 -97 -74 113 -127 -116 108 184 -125 39 179 -252 -126 -119 -16 135 19
7606A9m0j10L43j05k99J48L09k38nr4r1M83j54p3j13r5R9Q9l01J82O3m4J20P0
$$ 19 -21 -131 212 107 -192 -44 265 27 22 -72 -163 320 166 93 -20 -115 -16 73 -228 -46 17 -27 93 163
7630A63l18J86n23M66J78k32K07j34j41J37K10k34J51p1k37J88J2j1k31Q6M08
$$ 163 -155 31 -492 -26 152 -80 127 -7 -148 -11 199 -35 116 45 -192 -4 8 -3 -234 -148 260
7651B60Q0l23j66k4Q5m4k18L55j88LJ51r3j14K99O3j91j46K53j37K04r0j18J47
$$ 260 340 17 -149 -173 -88 -132 -350 5 -183 -180 -29 -122 -236 63 126 -65 -211 42 -95 109 19 -99 48
7674D8j38l6L6j53K53j1p0L3j38M6P4l4kk53L97kK7k55L2o8J12J67K4l43K68N5
$$ 48 -90 -126 -90 -243 10 -1 -71 -38 -176 -130 -56 -90 -92 -345 52 50 77 -178 -146 -214 -102 65 89 -254 14 69
7700F9k13J88J4N6n3l32M98q4q2o8pL46k26j69L5J11r9J22j16m1K12r7J02k70
$$ 69 -144 44 58 114 61 -271 227 143 61 -7 -14 332 106 -63 -28 83 -16 106 -10 -51 161 64 166 -104
7724a04J6J83k0j35j11R6J86R6n9j40k89K29N1j0n4J12O1k68L65J7l62M81m20
$$ -104 -88 95 75 -60 -171 -75 111 207 148 8 -281 -52 -1 -11 -65 47 108 -160 205 222 -140 341 -79
7747g9K16j44j49J85k1k88K75J68k65M60o9k24N1j73K56l61rM6J52j33J34L5j38
$$ -79 137 -7 -156 29 8 -280 -5 163 -102 358 289 65 116 -57 199 -162 -171 -125 27 -106 28 63 -75
7770g5K67j49J55k27J0m7j02K24J72m00J57k52M41j82k4p3J20j0j34L68m11j36
$$ -75 192 43 198 -29 -19 -66 -168 56 228 -172 -15 -267 174 -8 -32 -105 15 5 -129 239 -172 -308
7792c08L89n4J05n12O83l94j54J09J1K37K3j09j9M2k07L16Kk26N1L2n4K08q8J7
$$ -308 81 27 132 -380 303 -91 -245 -136 -125 112 135 26 7 49 -158 158 160 -66 -15 17 -37 171 83 100
7816A00j50K19l04L08k25J66j2q3k79J03J68p9J89K6J0m5m9k8J43j98J57k41K69
$$ 100 -50 169 -135 173 -52 114 102 19 -260 -157 11 -68 121 147 157 112 63 35 178 -20 137 -104 165
7839A65O6j58J70o4m22N56k91k75J54j54L47p5q7l7R5J65q6k37l1M28l08J30l9
$$ 165 231 73 243 179 -243 313 22 -253 -99 -253 94 19 -68 -105 -10 155 69 -168 -199 229 -79 51 12
7862A2N8L5M2j17N6J54Q4m50K28m35O26m02K31l12J54NJ59k32K1j17L34j4J33
$$ 12 70 105 147 30 86 240 324 -126 102 -333 293 -109 122 -190 -36 -31 128 -104 -83 -200 134 120 253
7885B53l69L69k57m04M82j61N0l01M33k79J8K59Q1n7k17Q5k4j92K87k2j92p2J00
$$ 253 -116 253 -4 -408 74 -87 -37 -338 95 -184 -166 93 174 117 -100 -15 -39 -231 56 34 -158 -230 -130
7908a30k1j8J64o7L06j31k42k0M4P4J84j10j13kL56l88l94M29p9J57m3j38J29
$$ -130 -151 -169 -5 -72 234 103 -139 -159 -115 -41 143 33 -80 -82 274 -114 -508 -79 -158 -1 -44 -182 -53
7931e3j12RK7J06r6K00j33J7k34L98l32K56J82o03M05J43j09J48n9j25K74n05
$$ -53 -165 -156 -129 -23 -119 81 -52 -35 -269 129 -203 53 235 -368 37 180 71 219 160 35 309 -196
7953a96J64N9k61P0R9LN28o24J50m8m2L7o2J68L66m65j61K29q3n4J63k84K60j06
$$ -196 -32 27 -234 -164 -65 -62 466 -158 -8 -56 -98 -61 -123 45 411 -54 -215 14 -69 -123 40 -244 16 -90
7977i0l3KJ26r0o7pQ5l32Q40k30k49J50J93j17l32L4J48k7o0j16M46k67J01m8
$$ -90 -123 -121 5 -85 -152 -159 -74 -406 434 204 -45 105 298 181 -151 -117 31 4 -56 -172 274 7 108 60
8001F0j55j7J24M2j18K92l41k0K24P8K8o2M8k42J45l18M02l7r7N3m37K91J45j23
$$ 60 -95 -112 12 54 -64 228 -113 -133 91 169 197 135 183 -59 86 -232 170 133 36 89 -348 -57 88 -35
8025c5j87J57L62l75K55j03K1l78M56l87P4J34k8j38J16J43j0k06o8L20m45N19
$$ -35 -222 -65 297 -78 177 74 95 -283 173 -214 -140 -6 -34 -172 -56 87 77 -129 -197 123 -322 197
8047A97l6M4k71j06q5K03J01l6J56l19K28j50j25k7R0M0p9j77K81K59j86j75K73
$$ 197 161 205 -66 -172 -257 -54 47 11 167 -152 76 -74 -199 -226 -136 -96 -175 -352 -71 188 2 -173 100
8070A00l3o2k00M40j90Qr0J63r5Q4k66N03k52j26j6J40j19j44J55K55l0l97R0
$$ 100 67 5 -195 245 55 63 -27 136 41 125 -141 362 110 -16 -32 108 -11 -155 0 255 225 -172 -82
8093h2K47J66m00N1M3P8r5q1j10K93Q0l02K9K12k43J01Q2k34K54o4R8K21l24q8
$$ -82 165 331 -69 -18 25 103 8 -73 -183 110 190 -112 -83 129 -114 -13 69 -165 89 25 123 344 20 -68
8117f8J51j5J96p1j69j69J04Q2J12l9L30k66q7k24K42Qj0k14JJ9K03j63K23K59
$$ -68 83 68 264 193 24 -145 -41 41 153 114 444 178 91 -133 109 117 107 -107 -106 -87 116 -47 176 435
8141D35p84L05j48m6K11l47J28K5K16J13r6l4J51J7j26k04J82q3O3K9j03l4O9
$$ 435 -349 -44 -192 -238 -27 -374 -246 -221 -5 108 12 -22 129 146 20 -184 -2 -85 -22 7 -96 -130 -61
8164f1J77J05m19K63m4m8K85k86j09L7J8J57j25M1L45l40o5J90j05k90L71k27
$$ -61 116 221 -198 65 21 -27 258 -28 -137 -100 -82 75 -50 -9 336 -4 -69 121 16 -274 97 -130
8186a30O5K81k22K59J32
$$ -130 -65 216 -6 253 385
8191C85
$$ Imaginary data points
##PAGE= N=2
##DATA TABLE= (X++(I..I)), XYDATA
0@%%%%%%%%Qj6J6j6J9k7L2l8M6n5O3p2Q8j04J20j37J58j82K07k35K66l02L42l84
$$ 0 0 0 0 0 0 0 0 0 8 -8 8 -8 11 -16 16 -22 24 -31 32 -40 48 -56 64 -73 85 -97 110 -125 141 -161 181 -203
32b03M31m83N40o03O70p44Q27r17J014j121J242j376J524j691J879k090K334k617
$$ -203 228 -255 285 -318 352 -392 435 -482 532 -589 653 -723 801 -890 989 -1101 1233 -1384
50a384K948l347L831m435N222o289P820j0220J4546k4737Q9771O5779j90593K248
$$ -1384 1564 -1783 2048 -2387 2835 -3454 4366 -5854 8692 -16045 73726 139505 -51088 -48840
64d8840J27549J844j33123J2720J10796L569q8687J1333O3422j7837o2873J0765
$$ -48840 78709 80553 -52570 -39850 70946 74515 -14172 -2839 60583 42746 -20127 -9362
76i362L5381j0823j9957K2974J9643p041j1844j2723k1262Q898L3789K6l0094
$$ -9362 26019 15196 -4761 18213 37856 30815 18971 6248 -15014 -6116 27673 27699 -2395
89b395J1174L2918j6914l4970J5980K1493k6249j4627L5970J2289l3002q11L4524
$$ -2395 8779 41697 24783 -10187 5793 27286 1037 -13590 22380 34669 1667 856 35380
102C5380j3054m6350O736M0701l668k2460J5563J0801l1472r510L7846K406m6023
$$ 35380 22326 -24024 -17288 23413 19745 -2715 12848 23649 -7823 -17333 20513 22919 -23104
115b3104K567N2210l566n1826P304M6715j3947m2619J4642K9599j7551r389K9761
$$ -23104 -20537 31673 28107 -23719 -16415 30300 16353 -26266 -11624 17975 424 -8965 20796
128B0796l999m4817M531M5846p488m0690J7269L9402k5128l9173K6017L2618k9474
$$ 20796 16797 -28020 -23489 22357 14869 -25821 -8552 30850 5722 -33451 -7434 25184 -4290
141d290k7242L2999K3514l0452j5959K9063P931k9337o355J6991k59K169K1407
$$ -4290 -31532 1467 24981 -5471 -21430 7633 15564 -13773 -20128 -3137 -3396 -1227 20180
154B0180r333l7660R419M1045j7166m6000K5565N2714k5700m8833L0409M2236
$$ 20180 10847 -26813 -17394 23651 6485 -39515 -13950 38764 13064 -35769 -5360 36876
166C6876l8534m1249M0155L4095m3277k2785N7878K6108o2757l4513N2373K8057
$$ 36876 -1658 -42907 -2752 31343 -11934 -34719 23159 49267 -13490 -48003 4370 32427
178C2427m5024j8413M5483J8538l5492j4487K3696M967j9227l973J1494N884J191
$$ 32427 -12597 -31010 14473 33011 -2481 -16968 6728 11695 -7532 -11505 -11 5873 7064
191G064k10l533L712L727j7389j8206K1523L1412j5217l0112J7415K8867k2797
$$ 7064 6854 3321 7033 10760 -6629 -24835 -3312 28100 12883 -17229 186 29053 6256
204F256l1999K1322K7845k3322k0932L2115J9523l4501j4849L5564L926m4690
$$ 6256 -25743 -4421 23424 102 -20830 11285 30808 -3693 -18542 17022 20948 -23742
216b3742k804M8279P104l7230q47K5287j0555k0631J6215J2110k1913k428K9932
$$ -23742 -26546 21733 28837 -8393 -9240 16047 5492 -15139 1076 13186 -8727 -11155 18777
229A8777k087l4136O055L4672j2171l8355J3281L7988j3192k9786J9357K3985
$$ 18777 16690 -17446 -11391 23281 11110 -27245 -13964 24024 10832 -18954 403 24388
241B4388k9042k5448L1439K4486k8718j8745K6635J1134k3567n295J8295k790
$$ 24388 -4654 -30102 1337 25823 -2895 -21640 4995 16129 -7438 -12733 5562 2772
253B772j3521R526Q457j3418l606J8805J40k2702j512J9466J170j0854O007N723
$$ 2772 -10749 -1223 7234 -6184 -9790 9015 9155 -13547 -15059 4407 5577 -5277 730 6453
267F453j4950n505J9307L878k2745M65K7672k429k9138L663K8021q315k5553J1678
$$ 6453 -8497 -14002 5305 9183 -13562 -13097 14575 12146 -16992 -13329 14692 6377 -19176 -7498
281g498K1523j5073j3831K3407J0887k9857j3717K6547J3137k0183o300J7776
$$ -7498 14025 -1048 -14879 8528 19415 -10442 -24159 2388 15525 -4658 -10958 6818
293F818M479j4435l128P167j033k045M736j042m829P610Q208j2595q841J4162
$$ 6818 11297 -3138 -6266 901 -132 -2177 2559 1517 -3312 4298 12506 -89 -8930 5232
307E232K616k1802L081L5409j206m0947o27M2294l065m4169L916M4699l477l8222
$$ 5232 7848 -13954 -10873 24536 23330 -17617 -18244 24050 20985 -23184 -19268 25431 21954 -16268
321a6268P145L2769r733k8509J0746J9880j5736j3449K2294J4647k2031j2438
$$ -16268 -9123 23646 13913 -14596 -3850 16030 294 -13155 9139 23786 1755 -10683
333a0683J6936M173j6615K403J7341o659j4017J3174J2005j9516j1162K1165P294
$$ -10683 6253 10426 -6189 -3786 13555 6896 -7121 6053 18058 -1458 -12620 8545 15839
346A5839k2756m891K3444N577j8421k252J0794n105j0259R282J0742q699q448
$$ 15839 -6917 -11808 11636 17213 -1208 -3460 7334 2229 -8030 1252 11994 3295 -5153
359e153Q375M736q601k889O176q33m045N472K187r426P80J3408l648j9041L357
$$ -5153 3222 7958 -643 -3532 2644 1811 -2234 3238 5425 -4001 -3221 10187 6539 -12502 -9145
374i145J9614l246j5021P347J0503j4615q396J8876N362k1328k162K4358o92k5960
$$ -9145 10469 7223 -7798 -451 10052 -4563 -12959 5917 11279 -10049 -12211 12147 11455 -14505
388a4505K221K5904m096k5131M833K2844o457j8535J0784J5727j6196j5674J6797
$$ -14505 -12284 13620 9524 -15607 -10774 12070 5613 -12922 -2138 13589 -2607 -18281 -1484
401a484J5317j4304j0164J2237N224j1407j190Q038m063l584J0425R07j4670K669
$$ -1484 13833 -471 -10635 1602 6826 -4581 -5771 2267 -1796 -5380 5045 5952 -8718 -6049
415f049J7085m814j9554M638J8044n798j3254J1387J3178j6300j4649J7522J3845
$$ -6049 11036 6222 -13332 -8694 9350 3552 -9702 1685 14863 -1437 -16086 1436 15281
428A5281j8983j1261K1086J1186k0263r583J8079O193j6235k734J2617j066p915
$$ 15281 -3702 -14963 6123 17309 -2954 -12537 5542 11735 -4500 -7234 5383 4317 -3598
441c598P481P071j0594p294Q451L836o682J100P415l360n620N401L184r232k695
$$ -3598 3883 10954 360 -6934 1517 5353 -1329 -229 7186 3826 -1794 3607 6791 -2441 -5136
456e136J1331K188j2126r37J3584P33j2280j83P913m701o289J0847O787j2679
$$ -5136 6195 8383 -3743 -4680 8904 9637 -2643 -2826 5087 386 -5903 4944 11731 -948
470i48n870J2754K783j4417k47J3062j687j0159M547P633p850m449R759J313j3952
$$ -948 -6818 5936 8719 -5698 -5945 7117 5430 -4729 -182 7451 -399 -4848 4911 6224 -7728
485g728k57J6519L07j5289J003J2940m984j3478Q466J3403j1585j1829J4079J0594
$$ -7728 -7985 8534 8841 -6448 -5445 7495 2511 -10967 -2501 10902 -683 -12512 1567 12161
499A2161j7369r299J8055P851j8220o665J7212M274j3732q63R706l483r340O533
$$ 12161 -5208 -14507 3548 11399 -6821 -13486 3726 8000 -5732 -6595 3111 -372 -9712 -3179
513c179Q802o635p024O535L960o849k574O526L52n356L441M449o674m281R912
$$ -3179 5623 -1012 -8036 -1501 2459 -4390 -6964 -438 -86 -5442 -2001 2448 -4226 -8507 1405
528A405L511j1877m066J2633L924j0359n47Q491m083p805O069P049o666m702Q499
$$ 1405 4916 -6961 -11027 1606 5530 -4829 -5376 3115 -968 -8773 -2704 4345 -2321 -7023 1476
543A476L560r319k569P817J525o281N36N243k144k628N618J697r042k410R354
$$ 1476 5036 -4283 -6852 965 2490 -3791 -3255 1988 -156 -2784 2834 4531 -4511 -6921 2433
558B433K086p732R78Q566l452q825N669P462r024m932J2201M417j3622k859J4382
$$ 2433 4519 -3213 -2235 6331 2879 -5946 -277 7185 -1839 -6771 5430 9847 -3775 -6634 7748
573G748K491j4502k133J2040N76r301L628R209n681r354N787P450o534o074Q514
$$ 7748 10239 -4263 -6396 5644 6220 -3081 547 9756 4075 -5279 508 7958 1424 -4650 3864
588C864N256q528k984P377L50o823K816N319o272m446J0265M454j1069m839R658
$$ 3864 9120 592 -2392 4985 5335 -1488 1328 6647 375 -4071 6194 10648 -421 -5260 4398
603D398K323r084N02Q794j311p987K985N932m507o142N732N827o270n492O591
$$ 4398 6721 -2363 -1861 6933 5622 -2365 620 6552 2045 -4097 1635 7462 1192 -4300 2291
618B291M333n905k486L781o49l995L956M781n578m129N643K202o852q18O525k78
$$ 2291 6624 719 -1767 2014 1365 -2630 1326 6107 529 -3600 2043 4245 -2607 -3425 3100 2822
634B822n680K469L785m571k542N799J673p570j510Q318J729p379n73N753j435
$$ 2822 -2858 -389 3396 -1175 -3717 2082 3755 -3815 -5325 2993 4722 -2657 -3230 2523 1088
649A088o672L708O807m771n729O152M908q046m586Q362L591p414j800O519p65
$$ 1088 -5584 -1876 4931 160 -5569 583 5491 -2555 -7141 1221 4812 -2602 -4402 2117 1352
664A352m647L500L075o137l081P962L096p420j417P132M48q346O67P390r55o582
$$ 1352 -3295 205 3280 -2857 -5938 2024 5120 -2300 -3717 3415 3863 -4483 -3816 3574 2619 -3963
680c963L103P094m579p265N768O834o697o752P152N630m914k794M469m43m415
$$ -3963 -860 6234 1655 -5610 158 6992 295 -6457 695 6325 1411 -1383 3086 2643 -1772
695a772J797L948k776k170M377J868m659k000M421L81l666M52L631j569k472L435
$$ -1772 25 3973 1197 -973 3404 5272 613 -1387 3034 3415 -251 201 3832 2263 -209 3226
711C226L071m806l698M220L206l803j442M668K29m892J322L156l189k304N035
$$ 3226 6297 1491 -2207 2013 5219 1416 -26 4642 4871 -21 1301 4457 1268 -1036 3999
726C999K387n965k020O347J106o021o56M261q93k672K422K800l486k848L559J680
$$ 3999 6386 421 -1599 4748 5854 -167 -823 3438 2545 -127 2295 5095 1609 -1239 2320 4000
742D000m133j375M966J315n155m13M764k012m419L290M298n307m314O904M286
$$ 4000 -133 -1508 3458 4773 -382 -795 3969 1957 -2462 828 5126 -181 -4495 2409 6695
757F695o888m039N391K451n124j234N170K27m367R14L232k668k912L183K811k926
$$ 6695 -193 -4232 1159 3610 -1514 -2748 2422 2649 -1718 -804 2428 -240 -3152 31 2842 -84
773h4k906L435J771l365p65K962j266l429L090M515l702m389L932L151m349l041
$$ -84 -2990 445 2216 -1149 -1914 1048 -218 -3647 -557 3958 256 -4133 -201 2950 -1399 -4440
789d440M927J851l483l4K039q75k271K222J717k548j719K892J938j622j525J447
$$ -4440 487 2338 -1145 -1179 860 -15 -2286 -64 1653 -895 -2614 278 2216 594 -931 516
805E16j0k351J070K937j555k064K403K134l745k306M326J492l432k47L415j084
$$ 516 506 -1845 -775 2162 607 -1457 946 3080 -665 -2971 1355 2847 -585 -832 2583 1499
821A499j975K321J805m390j914N075J693m172p47L964L58l756q22M041k58k895
$$ 1499 -476 1845 3650 -740 -2654 2421 4114 -58 -805 3159 3517 -239 -1061 2980 2722 -173
837a73J327L196k456l435K554L346l021k539K860K041k568k10K796j679l307K399
$$ -173 1154 4350 1894 -1541 1013 4359 1338 -1201 1659 3700 1132 922 3718 2039 -1268 1131
853A131L046l127k202L816J895l832j860K898J186k703l79K217j32k121P10K493
$$ 1131 4177 1050 -1152 2664 4559 727 -1133 1765 2951 248 -131 2086 1954 -167 543 3036
869C036j471l358J232K557j010j666J732R90k491J08J537j276j641J953K249k867
$$ 3036 1565 -1793 -561 1996 986 -680 1052 2042 -449 -341 1196 -80 -1721 232 2481 -386
885c86j863K429J396k351p67J351k72o76R59J061j571j310J128J196j963p63K019
$$ -386 -2249 180 1576 -775 -1542 -191 -463 -1139 -180 881 -690 -2000 -872 324 -1639 -2402 -383
902c83J237k180m05J514k33k133J320K347k381k283L025K383k714k235K355P57
$$ -383 854 -1326 -1731 -217 -450 -2583 -1263 1084 -1297 -3580 -555 1828 -886 -3121 -766 -9
918ij755K97J805q59j105J591L01j858j030K325J687k097j151J932R92j728q90
$$ -9 -1764 -1467 338 -521 -1626 -35 266 -1592 -2622 -297 1390 -707 -1858 74 1066 -662 -1552
935a552J980l60k118J216L184j571k414J576J907k125j421K021R95j088L76J367
$$ -1552 428 68 -2050 -834 2350 779 -1635 -59 1848 -277 -1698 323 1318 230 606 1973
951A973j523j267J622J033j806j042K181J233j243p89R03L87j366j34J909j52
$$ 1973 450 -817 805 1838 32 -1010 1171 2404 1161 372 1275 1662 296 162 2071 1919
967A919j411O34J664j276j743R68J757j390m80J162j64r07Q13R83j741j376J894
$$ 1919 508 1142 2806 1530 -213 755 2512 1122 642 1804 1640 733 1546 2529 788 -588 1306
984A306J110j373m19J212l1j078p08N71M49m29L12R07p39j541J100J090j233j495
$$ 1306 2416 1043 624 1836 1805 727 19 590 1039 610 922 1829 1090 -451 649 1739 506 -989
1002i89J350Q25j420L88J280q53k162J263J349j865j038K138J013j328j061Q64
$$ -989 361 1186 -234 154 1434 581 -1581 -318 1031 -834 -1872 266 1279 -49 -1110 -246
1018b46j19m63j14N67j80n05K27J010q13j346M66J363o83q73J074P83j622j40
$$ -246 -365 -828 -942 -375 -555 -1060 -833 177 -636 -1982 -1516 -153 -836 -1709 -635 148 -1474 -1614
1036a614J326n08j536J077J807j509j116Q21J156j055m84J17K76K2O04M12m63
$$ -1614 -288 -796 -2332 -1255 552 -957 -2073 -1252 -96 -1151 -1635 -1518 -1242 -1220 -616 -204 -667
1053f67l17k28O91o55o79P67J302n65o20L20L95o15K16Q88n65j196J158J069q91
$$ -667 -984 -1212 -521 -1176 -1855 -1088 214 -351 -971 -651 -256 -871 -655 233 -332 -1528 -370 699 -192
1072a92p40P62K39o72Q76L17l77j11Q04J59j486m70J013R93m23o15M14N17j79
$$ -192 -932 -170 69 -603 273 590 213 102 906 1065 -421 -891 122 1115 692 77 491 1008 829
1091H29m90L92Ro09M4J543k27j070O30M49o60p05Q11N30n49K28O32j045o12J220
$$ 829 339 731 740 131 175 1718 1491 421 1051 1500 840 135 946 1476 927 1155 1787 742 130 1350
1111A350M46j043p43P22O11J93r65J32L35k49o93O08L08l01k66N46R7j214j01
$$ 1350 1796 753 10 732 1343 1536 571 703 1038 789 96 704 1012 711 445 991 1088 -126 -227
1130b27Q83m7o43P08n2n92J35R86j030q83M01P09k67k37L71ll9p79k85N2N93j37
$$ -227 656 609 -34 674 622 30 165 1151 121 -762 -361 348 81 -156 215 212 173 -606 -891 -839 -246 -383
1152c83M9J40o65J31K27j24n83L21K19Nk19N64m8r87N93M59p89k76O71L69l69
$$ -383 -334 -194 -859 -728 -501 -625 -1208 -887 -668 -663 -882 -318 -366 -1353 -760 -301 -1090 -1366 -695 -326 -695
1173f95l66k56K22L44K64l00k69M05K63n7m0o88K54N27j01n82N62J013p98n23
$$ -695 -1061 -1317 -1095 -751 -487 -787 -1056 -651 -388 -445 -485 -1173 -919 -392 -493 -1075 -513 500 -298 -821
1193h21N09J34o00L53Q46K30j191L65lO30m07j52l38M41M08k8k58N45m55J54N0
$$ -821 -312 -178 -778 -425 421 651 -540 -175 -178 452 45 -107 -445 -4 404 376 118 663 208 362 412
1214D12k08j36N55M08n33k30L38n5r4N49k14j97L46J13k35n7m0m31J58O45j2j75
$$ 412 204 68 623 1031 498 268 606 551 457 1006 792 595 941 1054 819 762 722 291 449 1094 1082 907
1236I07R0Q5o6q49M00j34J83M67n26l31M31O78o40l87K07Ol29M42K75m49j17R0
$$ 907 997 1082 1016 167 567 433 616 1083 557 226 657 1335 695 308 515 521 192 634 909 460 343 433
1258D33k31Nk18L17j65L0L98m35l37J79J39k06o5k45J68O61n16l51Q8M40n07m51
$$ 433 202 207 -11 306 141 171 569 134 -203 -24 115 -91 -156 -401 -233 428 -88 -439 -351 89 -418 -869
1280h69P8M92k71K47po57o7K84L58p66N38O2O7l39L84k01k94K90l80K92L36o99
$$ -869 -791 -299 -570 -323 -330 -987 -1054 -770 -412 -1178 -640 -578 -511 -850 -466 -667 -961 -671 -1051 -759 -423 -1122
1302a122j36Q22Q4j283M18R57m11l07N27J56m50O9L50k48m63O59L55k30k73O19
$$ -1122 -1258 -436 -352 -1635 -1217 -260 -671 -978 -451 -295 -745 -676 -326 -574 -1037 -378 -23 -253 -526 93
1322I3k85j88J76J36k76M2P5N91J95p19l55P38K50o83k06Q34j12k41M88k4j86
$$ 93 -192 -380 -204 -68 -344 -302 -227 364 559 -160 -515 223 473 -210 -416 418 306 65 553 529 343
1343C43j26M44j89m42O97K3j75j49M28j93k60R6M55o1P0m05K05L25l46m53Q6M09
$$ 343 217 661 472 30 727 750 575 426 854 661 401 497 952 891 961 556 761 1086 740 287 373 782
1365G82M2K01l1l00R8j6P0l51q8P67o02l12M05M54r67M6M27j2j85l6J17j20o7
$$ 782 824 1025 994 694 792 776 846 495 407 1174 572 260 665 1119 152 198 625 613 428 392 509 389 322
1388C22p31M58M55j88n51O44Q7m82Q7k03n5o3O60J11j098m0R03j93n72O0N31o83
$$ 322 -409 49 504 316 -235 409 496 14 101 -102 -157 -220 440 551 -547 -587 316 123 -449 -389 142 -541
1410e41J90oK43o79L13R7q6m78L76M6L02j67m43K43K03j75J48K68n99k25Q79J70
$$ -541 -351 -357 -114 -793 -480 -383 -469 -947 -571 -525 -223 -390 -833 -590 -387 -562 -414 -146 -745 -970 -91 79
1432G9r37k30Q80l56m25L22K15k32j5O29l08l26K7Q21o26J51j9L25j17L1J99l10
$$ 79 -858 -1088 -208 -564 -989 -667 -452 -684 -699 -70 -378 -704 -677 144 -482 -331 -350 -25 -142 -111 88 -222
1454b22OL7N95m28j86k95Q68K43q97j13R69Q0m18P7K68l14j2L73Np50N38M99j46
$$ -222 -216 -179 416 -12 -198 -493 375 618 -279 -392 577 657 239 316 584 270 258 631 636 -114 424 923 777
1477G77n84K10N44l49j85L27J20j83P8L57J5m53l75K32R36p84oM56m3n01M49k32
$$ 777 193 403 947 598 413 740 860 677 755 1112 1127 674 299 531 1467 683 677 1133 1090 589 1038 806
1499H06o26J78O88o5p94N63J33J6o41N33j44l48J28k29O11k56k69J57K54j58p40
$$ 806 180 358 1046 981 187 750 883 899 258 791 647 299 427 198 809 553 284 441 695 537 -203
1520b03K92L01l57J4L15j64m04M42o6n32j61J051l31p84R7P40n98k69K66rN6k72
$$ -203 89 390 33 47 362 198 -206 236 170 -362 -523 528 197 -587 -490 250 -348 -617 -351 -360 -304 -576
1542e76N60k59k43j88ML42K0n37L75L95p37L05M18p06l14O75M53j081J36O94K39
$$ -576 -16 -275 -518 -706 -702 -360 -340 -877 -502 -107 -844 -539 -121 -827 -1141 -466 -13 -1094 -958 -264 -25
1563b5p92O0N02o71N2M76M54r50N65K9J84o41J60J99M05l23j83N33m16r6M28K79
$$ -25 -817 -757 -255 -926 -874 -398 56 -894 -329 -300 -116 -757 -597 -398 7 -316 -499 34 -382 -478 -50 229
1585B29n38m38J083K36q33k66P42Q6n41M55M6j33j26L64k03l10K62O48j25m11
$$ 229 -309 -747 336 572 -261 -527 215 301 -240 215 261 128 2 366 163 -147 115 763 638 227
1605B27k21N87j35j47O5J34q7k99K41N30m05k66M25M97p92j2M66jk98J06N16p31
$$ 227 6 593 458 311 376 510 423 124 365 895 490 224 649 1146 354 342 808 807 509 615 1131 400
1627D00O8M18l42j89M6N57n62k86K67J22K00n51K78p5k95Q0K90L24m32l44L39
$$ 400 468 886 544 355 401 958 396 110 377 499 699 148 426 351 56 136 426 750 318 -26 313
1648C13L47o49m37Q95j74o39M93K82p51k54R09P9r02Q3Q67m63p73N79J83n36m6
$$ 313 660 11 -426 469 295 -344 149 431 -320 -574 335 414 -488 -405 462 -1 -774 -195 -12 -548 -594
1669e94K41M73m66j68K92J95o76k00L68K81n57N7K54j96l01N51L86n57l76Q55
$$ -594 -353 120 -346 -514 -222 -27 -703 -903 -535 -254 -811 -754 -500 -696 -997 -446 -60 -617 -993 -138
1689a38L2o89rO51j94k31qL5o9J08N49k71j1m9j3j84J52l69O30j01l35L76L20
$$ -138 -106 -795 -804 -153 -347 -578 -586 -551 -620 -512 37 -234 -245 -294 -307 -491 -339 -708 -78 -179 -514 -138 182
1712A82l39k30K43L73o00k58R43M09r66J42K68m9j42K59j44p5Q9M78k38k55k61
$$ 182 -157 -387 -144 229 -371 -629 314 723 -243 -101 167 118 -24 235 91 16 105 583 345 90 -171
1733a71M60N33k76k09n5N9p4J75L93l63o0K42Q8k25l06O14l07k54J63L29o82L1
$$ -171 289 822 546 337 282 341 267 442 835 472 412 654 742 517 211 825 518 264 427 756 74 105
1755A05O37l25j12j33P78m26k36N0K18r3j88L32k75Lk33K40J58l14p7J44M16k83
$$ 105 742 417 305 172 950 524 288 338 556 463 275 607 332 335 102 342 500 186 109 253 669 386
1777C86m81K77j7n42N33J36j08m66N72Jj154M49M00K38l49Q1n5Q5o64L78L10n98
$$ 386 -95 182 165 -377 156 292 184 -282 290 291 -863 -414 -14 224 -125 -44 -99 -14 -678 -300 10 -588
1799e88L3J76L11m18k83M32K82n60Q5J33K93k36j34K29l63l2L54Q5l24j35M19
$$ -588 -555 -379 -68 -486 -769 -337 -55 -615 -530 -397 -104 -340 -474 -245 -608 -640 -286 -201 -525 -660 -241
1820b41L2k68l39N97m97P4K00roK23l12M75p2l63L37J48m66K13M40l63j60J97
$$ -241 -209 -477 -816 -219 -716 -642 -442 -451 -457 -234 -546 -71 -143 -506 -169 -21 -487 -274 166 -197 -357 -160
1842a60N19n30l52O10M5k48j6K04K50l69K51k70K41k28L51j42L5k85M30N7k39
$$ -160 359 -171 -523 87 132 -116 -132 72 322 -47 204 -66 175 -53 298 156 191 -94 336 393 154
1863A54J82l2L53l68j35L38J45p72M72J24k46l28P83K7o49Q3L28M8l67L14J50
$$ 154 336 304 657 289 154 492 637 -135 337 461 215 -113 670 697 48 131 459 507 140 454 604
1884F04m14K55Q8K46m82k39L51k45J5j08O15l64j28J29J82M6m85N1M12m95j38
$$ 604 190 445 533 779 297 58 409 164 179 71 686 322 194 323 505 551 66 117 529 34 -104
1905a04J99M1m34K38J02J64l11J32J03m60K01o2J87l64M1q0J48M7k1K29k35r5
$$ -104 95 136 -298 -60 42 206 -105 27 130 -330 -129 -191 -4 -368 -327 -407 -259 -212 -233 -4 -239 -334
1927c34j23L83k60n70N36L44o16L96q4J6l46R6J4q4j43O40j07k05j85L06N4j82
$$ -334 -457 -74 -334 -904 -368 -24 -640 -244 -328 -312 -658 -562 -548 -632 -775 -135 -242 -447 -632 -326 -272 -454
1949d54kJ31n8k30M54k71k3K83l06qL2Q2NK24j51j82K30j15l2J25L99o08J71K62
$$ -454 -456 -325 -383 -613 -159 -430 -453 -170 -476 -484 -452 -370 -365 -141 -292 -474 -244 -359 -391 -266 133 -475 -304 -42
1973d2K44l92nK91j92o5O5L75k77N1K8J14l68o3L94J63O6k38L54j70m7J43j39
$$ -42 202 -190 -195 96 -96 -161 -96 279 2 53 81 195 -173 -236 158 321 387 149 503 333 286 429 290
1996B90J25l48J57N70n33j02K70N07p28j3L58l35o0K56L2j88j51K00l6QO6j4L37
$$ 290 415 67 224 794 261 159 429 936 208 195 553 218 158 414 446 258 107 307 271 279 345 331 668
2019F68l93j09L67l01p4L23P1o67J96j56M07ll85K54j16p1J70K76q0p25N78p2
$$ 668 275 166 533 232 158 481 552 -115 81 -75 332 329 -56 198 82 11 181 457 377 -348 230 158
2041A58n31K52M38l38J13nk41M9K71l74j59J24l5J47Pj39l29K66N02k56n23K58
$$ 158 -373 -121 317 -21 92 87 -154 -105 166 -208 -367 -243 -278 -131 -124 -263 -592 -326 176 -80 -603 -345
2063c45K92n78K42K59m51P8L42N4l54j9L15Q3n45M50k35J9J94n23L09K29m84M4
$$ -345 -53 -631 -389 -130 -581 -503 -161 -107 -461 -480 -165 -82 -627 -177 -412 -393 -199 -722 -413 -184 -668 -624
2085f24L63j68J38k02K11K25m41M85L7n41jN49j30m29K09N34k50r1N9r1k3K85
$$ -624 -261 -429 -291 -493 -282 -57 -498 -13 24 -517 -518 31 -99 -528 -319 215 -35 -126 -67 -158 -181 104
2107A04k04L19j98k56J73J5K03l6p3L2j17J6M38k47K11J58Ql61J38K46n10mM52
$$ 104 -100 219 21 -235 -62 -47 156 120 47 79 -38 -22 416 169 380 538 546 185 323 569 59 55 507
2130E07P9l65j11J76J26k63K81p0k41L24r1lP6k14M3R5L11o54L1K86L5m9j90K29
$$ 507 586 221 110 286 412 149 430 360 119 443 352 349 425 211 254 349 660 6 37 323 358 309 119 348
2154C48j4o09J040o33k22L80K4M5k40J53j69j01L71j35k14r9Q4K72j08m76N19
$$ 348 334 -275 765 132 -90 290 314 359 119 272 103 2 373 238 24 -75 9 281 173 -303 216
2175B16k1l88O5O3o6j20R3P8K06p19m9Q75m34r7R8J13k20n0K07l60J92K29k82
$$ 216 195 -193 -128 -65 -131 -251 -158 -80 126 -593 -642 233 -201 -298 -200 -87 -307 -357 -150 -510 -318 -89 -371
2198c71j47J56l8L4O6J05l15M6qK83j51p9j06J02K49k9j45j31L19l29J0J79L04
$$ -371 -518 -362 -400 -366 -300 -195 -510 -464 -472 -189 -340 -419 -525 -423 -174 -203 -348 -479 -160 -489 -479 -300 4
2221Dl94K78Mj16qj60N19m78L44N9J66k9l6L2m5Q1o0k73R3J12k60j4L55l1j27
$$ 4 -390 -112 -108 -224 -232 -392 127 -351 -7 52 218 189 153 185 140 221 161 -112 -19 93 -167 -181 174 143 16
2246A6J21K21k59K18j43RLK3J48m39J83J52O6n4r9J73j32L51l85J34K3j50l3L52
$$ 16 137 358 99 317 174 183 186 209 357 -82 101 253 319 265 166 339 207 558 173 307 330 180 147 499
2270D99j64K14K7k55k86o8M33J12l52N5L93n63J72M05j03m76J43K2q1j74L10K31
$$ 499 335 549 576 321 35 -33 400 512 160 215 608 45 217 622 519 43 186 208 127 -47 263 494
2292D94o83M40Qo30M23J05K11l05q8k7j17L15l66l4L63k09J4Q2j65l84J87M18
$$ 494 -189 251 259 -371 52 157 368 63 -25 -52 -169 146 -220 -254 109 -100 -86 -4 -169 -553 -366 52
2314E2J3k57r4m6K3j77K30L29k81J14j07j8k63rK50oj90K96m7O6k10l67M04K6
$$ 52 65 -192 -286 -332 -309 -486 -256 73 -208 -94 -201 -219 -482 -491 -241 -247 -437 -141 -188 -122 -332 -699 -295 -269
2338b69l16N32k08J82j08J16k55k37K75J69qm75M33K39l89J29J93p6j85K49P6
$$ -269 -585 -53 -261 -79 -187 -71 -326 -563 -288 -119 -127 -602 -169 70 -319 -190 3 -73 -258 -9 67
2359F7j88NR0k10J13M47m26l7J15j63P6K12p5k1K1J78k25J3M74m53L3N06l86J8
$$ 67 -121 -116 -26 -236 -123 324 -102 -139 -24 -187 -111 101 26 5 26 204 -21 -8 466 13 46 552 166 184
2383A84j30K54j1R9m93O22k80K62o25M53m3j57R8k75N23n6k67K59k62K09L34l01
$$ 184 54 308 297 396 -97 525 245 507 -118 335 292 135 233 -42 481 425 158 417 155 364 698 397
2405C97j10q3J50J61m97J71K13l56K82j38o4K7J62J69j63l60K13j30O3o4m4j67
$$ 397 287 204 354 515 18 189 402 46 328 190 126 153 315 484 321 -39 174 44 107 43 -1 -168
2427a68O1J80L18k77m23K91K10k58k17J05J29k14K7L6J63j34o1K59j62l37K92
$$ -168 -107 73 391 114 -309 -18 192 -66 -283 -178 -49 -263 -236 -200 -37 -171 -232 27 -135 -472 -180
2448a80J5l4L28l05k8k01n1K29j63M39l42J91n25K89j88J49m3j18L6L52k20L6
$$ -180 -165 -199 129 -176 -204 -405 -456 -227 -390 49 -293 -102 -627 -338 -526 -377 -420 -538 -502 -150 -370 -334
2470c34J35j07L7J21J20j70l2m29M04o4oL19k77J79r4j16L3R8r1N0M16j27j55
$$ -334 -199 -306 -269 -148 -28 -198 -230 -659 -255 -319 -325 -6 -283 -104 -198 -314 -281 -183 -274 -224 192 65 -90
2493i0O7l5j36K19K1Q4j44J52l04K08n4J83J11j18L4J29l05k4K56P4l62K34n4
$$ -90 -23 -58 -194 25 46 130 -14 138 -166 42 -12 171 282 164 198 327 22 -2 254 328 -34 200 146
2516A46r3J67oK45o2q1j56J83k38J56J38l4k75K25J20m35K74J25kk37J9n5J07
$$ 146 53 220 214 459 397 316 160 343 105 261 399 365 90 315 435 0 274 399 397 160 179 124 231
2539B31j58L07j2k5k04j16K88q2k09L23m05J29k2j59p5L28r9J59l62r0O67m19
$$ 231 73 380 368 343 139 23 311 229 20 343 -62 67 45 -114 -189 139 40 199 -163 -253 414 -5
2561eL6j05M7R2l44O7L10j46j71l06L87R8r3J29j77J22k40K40j14J0j81k5J71
$$ -5 31 -74 -27 65 -279 -212 98 -48 -219 -525 -138 -40 -133 -4 -181 -59 -299 -59 -173 -163 -344 -369 -198
2584a98j03R6R2J73q5k16j34J53n3L7K6r5l11L78M66m19j19K88J9j65j15r9K39
$$ -198 -301 -205 -113 60 -25 -241 -375 -222 -275 -238 -212 -307 -618 -240 226 -193 -312 -24 -5 -170 -285 -384 -145
2607a45K29m06K19k27K88P7j73mj04J10J89j60k5J20LJ95k65j04K16J7P9p8p7
$$ -145 84 -322 -103 -330 -42 35 -138 -142 -246 -136 53 -107 -132 -12 -9 186 -79 -183 33 50 129 51 -26
2630b6Q8L27m83K02L28m62N9r7L09n5N8N7l14K71j57R7j4J97Q9l81k6QJ72l83
$$ -26 62 389 -94 108 436 -26 33 -64 245 190 248 305 -9 262 105 202 188 385 474 93 67 75 247 -136
2654a36N28m0k17K5K06l31P6J55l5Q3m1M1l00J29J08k73J95m3J70L50o59K2J72
$$ -136 392 352 135 160 366 35 111 266 231 314 273 314 14 143 251 -22 173 130 300 650 -9 13 185
2677A85J80l2l49J56K00m40K08J7j77j15K42K11n82L23L46l13j00L1j39L0j57
$$ 185 365 333 -16 140 340 -100 108 125 -52 -167 75 286 -296 27 373 60 -40 -9 -148 -118 -275
2698b75J95p4k26J82r0K3L96j61j03J62j02p4j47K58r8j74l8K31k62J57J45j89
$$ -275 -80 -154 -380 -198 -288 -265 131 -30 -133 29 -73 -147 -294 -36 -134 -308 -346 -115 -377 -220 -75 -264
2720b64O1J50j90L6k01J47K23k57Q2RJ51o2J8o8J34k50L34P8Om48J25N7N5k63
$$ -264 -203 -53 -243 -207 -408 -261 -38 -295 -213 -204 -53 -115 -97 -165 -31 -281 53 131 137 -311 -186 -129 -74 -337
2744c37K64J12k3R9M0k10J11k10kL46o4q2J84k88L8j21P03o28K5J38K8n3J41k1
$$ -337 -73 39 16 115 155 -55 56 -154 -156 190 126 44 228 -60 -22 -143 560 -68 -43 95 123 70 211 190
2768A90q3K05J09k44k41M01R6k55j92J49K54j83k78M18K18m12J04P3j94o0J54
$$ 190 107 312 421 177 -64 337 433 178 -14 135 389 206 -72 346 564 152 256 329 135 75 229
2789B29Q6L2K6m16J32J98l7p3q1K26l63K58J71l10l0L28m99n6J58pK00q3J23J37
$$ 229 315 347 373 -43 89 287 250 177 96 322 -41 217 388 78 48 376 -123 -179 -21 -28 172 89 212 349
2813C49k50j35J83p7J20k55P4j14m0m4K48k24Q6J91j68j00O4K66j55j23k45L13
$$ 349 99 -36 147 70 190 -65 9 -105 -145 -189 59 -165 -79 112 -56 -156 -92 174 19 -104 -349 -36
2835c6k08L9K88l42j11K4K93j12k20L94r6k88L77o4j0l39Q8K43r4J1N2j32M2j9
$$ -36 -244 -205 83 -259 -370 -346 -53 -165 -385 9 -87 -375 2 -62 -72 -411 -323 -80 -174 -163 -111 -243 -201 -220
2859b20mj33N12o4k11j09n7K52l08L2L93k88K27J3j06j6m1J25j90K37p1R0j69
$$ -220 -224 -357 155 91 -120 -229 -286 -34 -342 -310 83 -205 22 35 -71 -87 -128 -3 -193 44 -27 63 -106
2882a06K36r3k72L92P0l58J34L10k69J55k69O0J96J76m40M4Q2J28q8k31N38k53
$$ -106 130 37 -235 157 227 -131 3 313 44 199 -70 -10 186 362 -78 -34 48 176 88 -143 395 142
2904A42j00J23M6l55L02L08l75J96J05j23q6j90K36l10L33N8l77M56j22k7k43
$$ 142 42 165 211 -144 158 466 91 287 392 269 183 -7 229 -81 252 310 -67 389 267 240 -3
2925cl2R0Q2j6K58l56K82q1p5j87J76k04oM17p2l61J25K98k87m5J39j22k26L4
$$ -3 -35 55 137 121 379 23 305 224 149 -38 138 -66 -72 345 273 -88 37 335 48 3 142 20 -206 -172
2949a72j11K79k89K03L06l45m3Q2J2K28M2k26j85K15k17Q1J25lk0n6l0k35Q8M4
$$ -172 -283 -4 -293 -90 216 -129 -172 -90 -78 150 192 -34 -219 -4 -221 -140 -15 -18 -38 -94 -124 -359 -271 -227
2973b27P9J26j92J93k21L99L50q49O6j30R0J66K16k56K08J1j69K89j03k58n8r6
$$ -227 -148 -22 -214 -21 -242 157 507 -342 -276 -406 -316 -150 66 -190 18 29 -140 149 46 -212 -270 -366
2995c66J86j18p9K70K16l49n2J97N0q6J01M8j06j00R6Q1O0P9Rj0q4j9Q0p8q6K78
$$ -366 -180 -298 -377 -107 109 -240 -292 -95 -45 -131 -30 18 -88 -188 -92 -11 49 128 137 127 43 24 104 26 -60 218
3021B18j69J0M2j00L37k63j69%J58J45m9j22M20m26J93k14K13n5q5L8j7K21L3
$$ 218 49 59 101 1 338 75 -94 -94 64 209 160 38 458 32 225 11 224 169 84 122 105 326 359
3044C59l60M95k56j00j53J10K74l31J90k86L51j5k21J34L20m18J66j28q8N2j89
$$ 359 -1 494 238 138 -15 95 369 38 228 -58 293 278 57 191 511 93 259 131 43 95 -94
3065i4L26j52k70M27J91n05J31P2j66%L01k26k37K84l86J59J49J06k73J66k29
$$ -94 232 80 -190 237 428 -77 54 126 -40 -40 261 35 -202 82 -304 -145 4 110 -163 3 -226
3086b26K43j1r1K63n83K71m8M09o15K62K8l3J9m65O27l62J41m7p9J46K32j51q8
$$ -226 17 6 -85 178 -405 -134 -182 227 -388 -126 -98 -131 -112 -577 50 -312 -171 -218 -297 -151 81 -70 -158
3109a58N2o9j69K8L8m7J75j43O9J28o3O6k27K99k13j87J02L10k48K39Q7n0j62
$$ -158 -106 -175 -344 -316 -278 -325 -150 -293 -224 -96 -159 -93 -320 -21 -234 -421 -319 -9 -257 -18 69 19 -143
3132a43k0K1J7J1oJ24l6J06j59P3k3j02j08N25j29j82M47p20K21L1l1K5LQ0J79
$$ -143 -163 -142 -125 -114 -120 4 -32 74 -85 -12 -35 -137 -245 280 151 -31 416 -304 -83 -52 -83 -58 -55 25 204
3157B04j38k16L63N0l11L15p0k6L29q0k32l66M51l20K11q5K44m39K55K37l03L73
$$ 204 66 -150 213 263 -48 267 197 171 500 420 188 -178 273 -47 164 79 323 -116 139 376 73 446
3179D46j65j20j34Q2j5M4J98j26O2j65K04j09j96O3Q4k45O0L42j84k56P5M96l61
$$ 446 281 161 27 109 94 138 336 210 272 107 311 202 6 69 153 -92 -32 310 126 -130 -55 441 80
3202H0k22j06K51J84J2j78M9o4J57k27J23q5o4J32k0l16K94K2M5j69mk9kl90M05
$$ 80 -142 -248 3 187 199 21 70 6 163 -64 59 -26 -90 42 22 -294 0 22 67 -102 -106 -135 -137 -527 -122
3227a22J46j79Q7o0l5J35j22q2l1M9J3nM6n7Q2J3k18J39jP6k23K07J02l60K15
$$ -122 24 -155 -68 -128 -163 -28 -150 -232 -263 -214 -201 -206 -160 -217 -135 -122 -340 -201 -202 -126 -349 -142 -40 -400 -185
3252a85N15p50J90j96K85o2Q6J71j4j37P8n7k36J46L02n93L10N05l76r5K57J1
$$ -185 330 -420 -230 -426 -141 -203 -117 54 40 -97 -19 -76 -312 -166 136 -457 -147 358 -18 -113 144 155
3274A55j64j82K21q8J48r5R1L5l13j4K03L85l63J89r3nK65l8j66l35O06j51k0
$$ 155 -9 -191 30 -58 90 -5 86 121 -192 -206 -3 382 19 208 115 110 375 337 171 -164 442 291 271
3297B71l2j90L20k88m6J23k09J44k09N42n56L12j61K65Q7l27J76Pn2p2no4L66
$$ 271 239 49 369 81 35 158 -51 93 -116 426 -130 182 21 286 373 46 222 229 177 105 100 36 402
3320D02j39m75K56o9k6L10p0N8l49k3K22o6J28j08q1k53J74J66j92L27j03j37
$$ 402 263 -212 44 -25 -51 259 189 247 -102 -125 97 31 159 51 -30 -283 -109 57 -135 192 89 -48
3342d8L0K52k39j86j24J79n5O8K13K7k95J80j76j13M2J90l66N60j13k31J02J32
$$ -48 -18 234 -5 -191 -315 -136 -191 -123 90 117 -178 2 -174 -287 -245 -55 -421 139 26 -205 -103 29
3364B9k76P8J4J74j78L46n0n13K62Q1k53K95l00Rl3j28K76J02j38j41j89M54p2
$$ 29 -247 -169 -155 19 -159 187 137 -376 -114 -33 -286 9 -291 -282 -315 -443 -167 -65 -203 -344 -533 -79 -151
3387a51N0k6M3J20p8k22K20K15j98O6Q8j17k75L66r0j60L9J04j63M74j87k4l4
$$ -151 -101 -127 -84 36 -42 -264 -44 171 -27 39 127 10 -265 101 11 -149 -110 -6 -169 305 118 94 60
$$ [...]
8191A60
##END NTUPLES=NMR FID
##END=
