##TITLE=1H_TG-2281-3
 CDcl3, 8 sc, 
 30.1.2020
##JCAMPDX= 6.0         $$ Bruker NMR JCAMP-DX V2.0
##DATA TYPE= NMR FID
##DATA CLASS= NTUPLES
##ORIGIN= UXNMR, Bruker Analytische Messtechnik GmbH
##OWNER= root
$$ XWIN-NMR		Version 3.5
$$ Thu Jan 30 14:06:48 2020 Russian Standard Time (UT+4h)  she@DPX200
##.OBSERVE FREQUENCY= 200.1315
##.OBSERVE NUCLEUS= ^1H
##.DELAY= (6, 6)
##.ACQUISITION MODE= SIMULTANEOUS
##.ACQUISITION SCHEME= undefined
##.AVERAGES= 8
##.DIGITISER RES= 18
##SPECTROMETER/DATA SYSTEM= spect
##.PULSE SEQUENCE= zg30
##.SOLVENT NAME= CDCl3
##.SHIFT REFERENCE= (INTERNAL, CDCl3, 0, 15.7039)
##AUDIT TRAIL= $$ (NUMBER, WHEN, WHO, WHERE, WHAT)
$$ ##TITLE= Audit trail, XWIN-NMR		Version 3.5
$$ ##JCAMPDX= 5.01
$$ ##ORIGIN= Bruker BioSpin GmbH
$$ ##OWNER= she
$$ F:/spectra/data/she/nmr/H-F/1/audita.txt
$$ ##AUDIT TRAIL=  $$ (NUMBER, WHEN, WHO, WHERE, WHAT)
(   1,<2020-01-30 14:05:39.67 +0400>,<she>,<DPX200>,
      <created by zg, POWCHK disabled, PULCHK disabled
       configuration hash MD5:
       00 E9 B6 7A A2 85 ED C7 34 08 36 98 17 FE 4E 26
       data hash MD5: 16K
       8C 68 D6 92 84 5E 59 29 23 F7 12 AB DF E5 00 15>)
$$ ##END=
$$ 
$$ hash MD5
$$ 75 3F 3D 00 DF 33 62 7E 93 6F F3 A2 66 D2 24 53
##$RELAX= 
##$RELAX= 
##$RELAX= 
##$RELAX= 
##$RELAX= 
##$RELAX= 
$$ Bruker specific parameters
$$ --------------------------
##$DU= <F:/spectra>
##$EXPNO= 1
##$NAME= <H-F>
##$PROCNO= 1
##$TYPE= <nmr>
##$USER= <she>
##$AMP= (0..31)
100 100 100 100 100 100 100 100 100 100 100 100 100 100 100 100 100 100 
100 100 100 100 100 100 100 100 100 100 100 100 100 100 
##$AQSEQ= 0
##$AQ_mod= 1
##$AUNM= <au_zg>
##$AUTOPOS= <>
##$BF1= 200.13
##$BF2= 200.13
##$BF3= 200.13
##$BF4= 200.13
##$BF5= 200.13
##$BF6= 200.13
##$BF7= 200.13
##$BF8= 200.13
##$BYTORDA= 1
##$CFDGTYP= 0
##$CFRGTYP= 5
##$CHEMSTR= <none>
##$CNST= (0..31)
1 1 145 1 1 1 1 1 1 1 1 1 1 1 1 1 1 1 1 1 1 1 1 1 1 1 1 1 1 1 1 1 
##$CPDPRG= <>
##$CPDPRG1= <>
##$CPDPRG2= <>
##$CPDPRG3= <>
##$CPDPRG4= <mlev>
##$CPDPRG5= <mlev>
##$CPDPRG6= <mlev>
##$CPDPRG7= <mlev>
##$CPDPRG8= <mlev>
##$CPDPRGB= <>
##$CPDPRGT= <>
##$D= (0..31)
0 1.2 0 0 0 0 0 0 0 0.06 0 0.03 0 0 0 0 0.0002 0 0 0 0 0 0 0 0 0 0 0 0 
0 0 0 
##$DATE= 1580378739
##$DBL= (0..7)
120 120 120 120 120 120 120 120 
##$DBP= (0..7)
150 150 150 150 150 150 150 150 
##$DBP07= 0
##$DBPNAM0= <>
##$DBPNAM1= <>
##$DBPNAM2= <>
##$DBPNAM3= <>
##$DBPNAM4= <>
##$DBPNAM5= <>
##$DBPNAM6= <>
##$DBPNAM7= <>
##$DBPOAL= (0..7)
0.5 0.5 0.5 0.5 0.5 0.5 0.5 0.5 
##$DBPOFFS= (0..7)
0 0 0 0 0 0 0 0 
##$DE= 6
##$DECBNUC= <off>
##$DECIM= 24
##$DECNUC= <off>
##$DECSTAT= 4
##$DIGMOD= 1
##$DIGTYP= 9
##$DL= (0..7)
0 120 120 120 120 120 120 120 
##$DP= (0..7)
150 150 150 150 150 150 150 150 
##$DP07= 0
##$DPNAME0= <>
##$DPNAME1= <>
##$DPNAME2= <>
##$DPNAME3= <>
##$DPNAME4= <>
##$DPNAME5= <>
##$DPNAME6= <>
##$DPNAME7= <>
##$DPOAL= (0..7)
0.5 0.5 0.5 0.5 0.5 0.5 0.5 0.5 
##$DPOFFS= (0..7)
0 0 0 0 0 0 0 0 
##$DQDMODE= 0
##$DR= 18
##$DS= 0
##$DSLIST= <SSSSSSSSSSSSSSS>
$$ [...]
##$SUBNAM2= <"">
##$SUBNAM3= <"">
##$SUBNAM4= <"">
##$SUBNAM5= <"">
##$SUBNAM6= <"">
##$SUBNAM7= <"">
##$SUBNAM8= <"">
##$SUBNAM9= <"">
##$SW= 24.9337058887773
##$SWIBOX= (0..15)
0 0 2 0 0 0 0 0 0 0 0 0 0 0 0 0 
##$SW_h= 4990.01996007984
##$TD= 16384
##$TD0= 1
##$TE= 0
##$TE2= 300
##$TE3= 300
##$TEG= 300
##$TL= (0..7)
0 120 120 120 120 120 120 120 
##$TP= (0..7)
150 150 150 150 150 150 150 150 
##$TP07= 0
##$TPNAME0= <>
##$TPNAME1= <>
##$TPNAME2= <>
##$TPNAME3= <>
##$TPNAME4= <>
##$TPNAME5= <>
##$TPNAME6= <>
##$TPNAME7= <>
##$TPOAL= (0..7)
0.5 0.5 0.5 0.5 0.5 0.5 0.5 0.5 
##$TPOFFS= (0..7)
0 0 0 0 0 0 0 0 
##$TUNHIN= 0
##$TUNHOUT= 0
##$TUNXOUT= 0
##$USERA1= <user>
##$USERA2= <user>
##$USERA3= <user>
##$USERA4= <user>
##$USERA5= <user>
##$V9= 5
##$VALIST= <valist>
##$VCLIST= <CCCCCCCCCCCCCCC>
##$VD= 0
##$VDLIST= <DDDDDDDDDDDDDDD>
##$VPLIST= <PPPPPPPPPPPPPPP>
##$VTLIST= <TTTTTTTTTTTTTTT>
##$WBST= 1024
##$WBSW= 4
##$XGAIN= (0..3)
0 0 0 0 
##$XL= 0
##$YL= 0
##$YMAX_a= 200149
##$YMIN_a= -125297
##$ZGOPTNS= <>
##$ZL1= 120
##$ZL2= 120
##$ZL3= 120
##$ZL4= 120
##$ABSF1= 10
##$ABSF2= 0
##$ABSG= 5
##$ABSL= 3
##$ALPHA= 0
##$AQORDER= 0
##$ASSFAC= 0
##$ASSFACI= 0
##$ASSFACX= 0
##$ASSWID= 0
##$AUNMP= <proc_1d>
##$AZFE= 0.1
##$AZFW= 0.1
##$BCFW= 1
##$BC_mod= 2
##$BYTORDP= 1
##$COROFFS= 0
##$CY= 11.3945322036743
##$DATMOD= 1
##$DC= 2
##$DFILT= <>
##$DTYPP= 0
##$F1P= 16.9975609425685
##$F2P= -3.02152046262296
##$FCOR= 0.5
##$FTSIZE= 0
##$FT_mod= 4
##$GAMMA= 1
##$GB= 0.15
##$INTBC= 1
##$INTSCL= 1
##$ISEN= 128
##$LB= 0.24
##$LEV0= 0
##$LPBIN= 0
##$MAXI= 10000
##$MC2= 0
##$MEAN= 0
##$ME_mod= 0
##$MI= 1.114404
##$NCOEF= 0
##$NC_proc= 0
##$NLEV= 6
##$NOISF1= 3.799351
##$NOISF2= 2.8
##$NSP= 1
##$NTH_PI= 0
##$NZP= 0
##$OFFSET= 15.70392
##$PC= 1
##$PHC0= -9790.276
##$PHC1= 16.80081
##$PH_mod= 1
##$PKNL= yes
##$PPARMOD= 0
##$PSCAL= 0
##$PSIGN= 0
##$REVERSE= no
##$SF= 200.130013532006
##$SI= 16384
##$SIGF1= 3
##$SIGF2= 2
##$SINO= 400
##$SIOLD= 16384
##$SREGLST= <1H.CDCl3>
##$SSB= 0
##$STSI= 0
##$STSR= 0
##$SW_p= 3612.71676300578
##$SYMM= 0
##$S_DEV= 0
##$TDeff= 0
##$TDoff= 0
##$TI= <>
##$TILT= no
##$TM1= 0
##$TM2= 0
##$TOPLEV= 0
##$USERP1= <user>
##$USERP2= <user>
##$USERP3= <user>
##$USERP4= <user>
##$USERP5= <user>
##$WDW= 1
##$XDIM= 8192
##$YMAX_p= 0
##$YMIN_p= 0
$$ End of Bruker specific parameters
$$ ---------------------------------
##NTUPLES= NMR FID
##VAR_NAME=  TIME,          FID/REAL,        FID/IMAG
##SYMBOL=    X,             R,               I
##VAR_TYPE=  INDEPENDENT,   DEPENDENT,       DEPENDENT
##VAR_FORM=  AFFN,          ASDF,            ASDF
##VAR_DIM=   8192,          8192,            8192
##UNITS=     SECONDS,       ARBITRARY UNITS, ARBITRARY UNITS
##FACTOR=    0.0002004,     1,               1
##FIRST=     0,             0,               0
##LAST=      1.6414764,     0,               0
##MIN=       0,             -125297,         0
##MAX=       1.6414764,     200149,          0
$$ Real data points
##PAGE= N=1
##DATA TABLE= (X++(R..R)), XYDATA
0@%%%%%%%%qJ6j6J6j7K5l2L7m5N6o6P4q8J05j23J43j66J90k16K46k81L18l58M04
32B14m55N10n70O36p10P91q76R72j078J192j321J463j620J797j992K213k467K756
50A455l092L491l973M562n306O284p630R619j2891J9517n8435J46078K6939k45589
64a18971K3664J87881k4582j93289L0063J50517k0092j16067N0635R9694m1537
75B7916q5801L3823M5432m1545l7985M2816L8753m960j1039j2269k7258N887K9393
88C163j2061k8161L1678L6146l3758k9273M0508J1388n8530q225O7255M187n9903
101c5586J6689P0278k2920p6892J1439N7397j5707l0408L7228K0884m9096j1196
113b7890N6992k639o9244J0327P4038j3991o9368K3204O4758k9835n7625K8071
$$ plain form
0 0 0 0 0 0 0 0 0 0 -8 8 -8 8 -9 16 -16 21 -24 32 -34 40 -48 57 -66 77 -89 101 -115 131 -150 168 -190 214
32 214 -241 269 -301 335 -375 416 -460 512 -566 626 -695 768 -852 945 -1047 1166 -1301 1455
50 1455 -1637 1854 -2119 2443 -2863 3421 -4209 5410 -7481 12036 -46399 99679 126618 -118971
64 -118971 -95307 92574 67992 -125297 -95234 55283 35191 -80876 -30241 69453 27916
75 27916 -57885 -24062 21370 -20175 -58160 -15344 23409 18449 7410 -4859 -32117 -26230 3163
88 3163 -8898 -37059 -5381 30765 -2993 -32266 8242 19630 -38900 -47125 20130 24317 -35586
101 -35586 -18897 51381 28461 -48431 -36992 20405 4698 -25710 11518 32402 -16694 -27890
113 -27890 29102 26463 -42781 -32454 41584 27593 -41775 -18571 46187 16352 -41273 -13202
125a3202L7180l4476j3120N1478M377o0906m401N1945n356m1601K1264L8754k8439
138C497l1741L3633K1096m2983j6928M3285J0434l9071L922M1035q874l6453P148
151a2000J3065k2570O163M5561p733n4464J2865N3100k6091n6603L0960N1527
163C3780l5506l8067N0231L2677n9203k8279O0771J2523p3952m978Q9794J4728
175E4519q6046j6369P4443N855p2767k926O8174M194n4689K004M8219j702m2690
188a9781p812K6600J0514j4664j1159J2752K7053k294m0916j7289L8757K5190
200B6951l5420k1342M0564K0834m2279j6801M3568P570n2393l205N8264J478n6371
213b8582Q620O0312j5730o5423J3053N8084j2355m1130K1501K8927l1223j9228
$$ plain form
125 -13202 23978 -10498 -23618 27860 32237 -28669 -33070 18875 13519 -28082 -6818 31936 3497
138 3497 -28244 5389 26485 -16498 -33426 9859 20293 -18778 -14856 26179 17305 -19148 -12000
151 -12000 1065 -21505 -15342 30219 22486 -31978 -19113 33987 7896 -48707 -17747 33780
163 33780 -1726 -39793 10438 43115 -16088 -44367 16404 28927 -45025 -50003 39791 54519
175 54519 -31527 -47896 26547 32402 -40365 -43291 24883 29077 -25612 -23608 24611 22909 -19781
188 -19781 -27593 -993 9521 -5143 -16302 -3550 23503 21209 -19707 -36996 1761 26951
200 26951 -8469 -29811 10753 31587 -10692 -27493 16075 23645 -28748 -31953 26311 27789 -28582
213 -28582 -19962 40350 24620 -40803 -27750 30334 17979 -23151 -1650 27277 -3946 -23174
225b3174L6630J0781m0570m169M0357j841l5573J0542L1387j8121k8353K2315
237B11K1928k6582j2271L6019O243m3892o721M1289N883l3458K356K5963j2139
250D829j9373K0396J2257k8552p522L3655M151l3983K96L2882l259l0577K468
263a2332J9242n252o274J6197K70k5424Q59K6746n796k7633J1128K8032j3924
276E839k4205J9491J8690k7963j5302L0851Q683l4830k64M1970P72m2711m430
289b3409L2681j288k4480Q948K1536j1350j5721J2789J0965j5729r137J1342M434
302A581n498K805L595n378M203Q841j7380k0840K4639L1573k4719l4409K7940
315c047L3944l2395l2620L5696K7465l9673k1862M4908J9202m5761j4645M4154
$$ plain form
225 -23174 13456 24237 -16333 -20502 19855 18014 -17559 -7017 24370 6249 -22104 211
237 211 22139 -4443 -16714 19305 25548 -18344 -25065 16224 22107 -11351 -8995 16968 4829
250 4829 -14544 5852 18109 -10443 -17965 15690 19841 -14142 -13846 19036 15777 -14800 -12332
263 -12332 6910 1658 -4616 11581 11851 -13573 -12714 14032 8236 -19397 -8269 19763 5839
276 5839 -18366 1125 19815 -8148 -23450 7401 16084 -18746 -19010 22960 23732 -18979 -23409
289 -23409 9272 7984 -16496 -7548 13988 2638 -13083 -294 10671 -5058 -14195 -2853 1581
302 1581 -3917 -1112 2483 -2895 1308 10149 -7231 -28071 -3432 28141 3422 -30987 -3047
315 -3047 30897 -1498 -34118 1578 29043 -10630 -32492 12416 31618 -14143 -28788 15366
327A5366R055m5890n587M5678O177l7942k983K9133n511k3992J2104K0432j5222
340H18j5392J8756J1707j9154o654J5907n34j3742O441J0897r762m819J5885j15
354A0239k2214l02K3450K202j9761k37J4850m016j1400P609Q141j0480m992J3296
368F385K539j4994R79J4415n250j5188P286J1796p565l733J3012k121k1151L269
382a0321K1448n271j9806R609J8183j2305j4264J5593R569k1101q545K2480P006
395A2275k3413k315K6239R05k8622k646K3605R55j7025M895J2905r516r603J2148
409G87N314j5128k835J4572k0j0906N656P758r931n726J1695q67j5465N810K2188
424A2902n656k3996M974K2382p553k1566J0711J8833j2936j5361J8060J4138k0880
$$ plain form
327 15366 24421 -21469 -27056 18622 24799 -13143 -16126 13007 7496 -16496 -4392 16040 818
340 818 -14574 4182 15889 -3265 -9919 5988 5454 -8288 -1847 9050 -712 -5531 10354 10239
354 10239 -11975 -12277 11173 13375 -6386 -6623 8227 4211 -7189 420 8561 -1919 -6911 6385
368 6385 8924 -6070 -5091 9324 4074 -11114 -3828 7968 403 -3330 9682 7561 -13590 -10321
382 -10321 11127 5856 -13950 -4341 13842 1537 -12727 2866 12435 -8666 -17211 5269 12275
395 12275 -11138 -13453 12786 13691 -14931 -17577 6028 6983 -10042 -5147 7758 -1758 -11361 787
409 787 6101 -9027 -11862 2710 2690 -8216 -2560 5198 -4733 -10459 1236 369 -15096 -9286 12902
424 12902 7246 -16750 -11776 10606 3053 -18513 -7802 11031 -1905 -17266 794 14932 -5948
437e948j4089K1754J0520k2111q066K3040P904j7905o658J1020J689o353L936
450a267M064o716k301Q242J958p351r87M905j737j808N010N2o268K886Q892o582
466I92j3181P710J6394o347j4623O807J0823r652o730J3130L245j5589l6J7364
480A0307j135j7106K727J5238n186j3490O435J0906o001o050Q611Q36j3015J216
494e707J5389j734j5656L462J4812n588j3161Q477R542j1977o987J5253M886j7500
508f489j344J8358j381j9683Q94J8540j029j3512L133R588o480q310Q007N930
522F222q967m319R477L639q844j103P274k710o489L945L653n755K90R925k233
537D005j2711J175J2619k465j0460L956Q117n862n574Q250L124r622k504R814
$$ plain form
437 -5948 -20037 1717 12237 -9874 -17940 5100 13004 -4901 -11559 -539 1150 -5203 -1267
450 -1267 2797 -3919 -6220 2022 3980 -3371 -4358 547 -1190 -2998 2012 2064 -4204 -1318 7574 992
466 992 -12189 -4479 11915 5568 -9055 -2248 8575 -1077 -7807 5323 8568 -7021 -7057 10307
480 10307 9172 -7934 -5207 10031 4845 -8645 -2210 8696 2695 -3355 5256 6092 -6923 -5707
494 -5707 9682 7948 -7708 -4246 10566 4978 -8183 294 9836 -2141 -9128 6125 11011 -6489
508 -6489 -7833 10525 9144 -10539 -9645 8895 7866 -5646 -2513 7075 595 -7715 292 6222
522 6222 -2745 -7064 2413 6052 -2792 -3895 3379 669 -5820 -1875 1778 -3977 -3687 6238 4005
537 4005 -8706 -7531 5088 2623 -7837 -3881 4236 -1626 -7200 1050 4174 -5448 -7952 1862
551A862J296q853J95Q530q38p365O58M168k157o79N842j435p956K359Q868l931
567E64q765N794P248p237m582J0458K729j2541j098J3514j925j4110M037J5774
581I860l802j4838L695J2172m930r832P517P983q862o498J1039N355j1189m574
595f904J0898K685r682j94Q908j296o562L279K458n850n20R102O76q768J49P106
611E485j651o093L260M036n120k369P990K556q598k595Q629P38r259r11R529J723
627G350p311J68M426l106l370N240J625o213r41O488M91n070P6K598k262q67L956
644C278q26m655K655O102l990r000L288Q512k201o864L160N023m487l758N500
659A737J248q075l66R133N02q611J056P765k655p225K186M306l281n19N603j299
$$ plain form
551 1862 3158 -5695 -5500 3030 2192 -5173 -4515 -347 -2504 -3183 2659 1224 -6732 -4373 4495 564
567 564 -8201 -2407 4841 -2396 -6978 3480 6209 -6332 -7430 6084 4159 -9951 -5914 9860
581 9860 6058 -8780 -5085 7087 2157 -7675 -158 7825 -1037 -7535 3504 8859 -2330 -6904
595 -6904 3994 6679 -3003 -3197 5711 4415 -2147 1132 3590 -2260 -2780 6322 6998 -1770 -1621 5485
611 5485 3834 -2259 1001 5037 -83 -2452 5538 8094 -504 -3099 5530 6268 -2991 -3902 5627 7350
627 7350 39 207 4633 1527 -1843 3397 5022 -1191 -2132 4356 4847 -223 -147 2451 189 -678 3278
644 3278 2452 -2203 452 6554 2564 -6436 -3148 5364 3163 -3701 -541 4482 -5 -3763 1737
659 1737 2985 -5090 -5456 3677 4179 -4432 -3376 4389 1734 -5491 -3305 1001 -2280 -2799 2804 1505
675A505p403J154Q129j775q322J973P270k181n716L508M294n050m352O530K665
690B229o931j280R083K02r190j320P387N40m769J596L001k702j305L662N13n149
706d433k93M274J77k582J290K070j624j159J705j164k410K081M666j719n326J849
722b598M919k233m101L304J999m292q6N701l96o745J262O716k355o472L378N773
738C774k539m099K249K034l942j12M854k17n031P57N428j216n004J346L708k787
754g97k793M123K143m554o89N698j567p356K454P545k276o426L043M433m055l415
770d489N189J956o504q22O779N06o178l44N700j059n004J417M402j700l364K714
786h01J851m873j146N915L39n391M16M501j164l509K465J661l887j078M651P79
$$ plain form
675 1505 -5898 -4744 3385 1610 -6712 -4739 2531 350 -5366 -1858 2436 -2614 -6966 -436 2229
690 2229 -4702 -5982 3101 3303 -5887 -7207 180 720 -4049 -2453 548 -2154 -3459 203 716 -4433
706 -4433 -4726 -452 -275 -2857 -1567 503 -1121 -2280 -575 -1739 -4149 -2068 2598 879 -4447 -2598
722 -2598 2321 88 -4013 -709 1290 -3002 -3088 2613 2217 -4528 -3266 3450 1095 -5377 -1999 3774
738 3774 1235 -2864 -615 1419 -2523 -2635 2219 2002 -3029 -2272 3156 1940 -3064 -1718 1990 -797
754 -797 -3590 533 2676 -1878 -2567 3131 1564 -5792 -3338 4207 1931 -4495 -1452 2981 -1074 -4489
770 -4489 700 2656 -3848 -4670 2109 2615 -3563 -3907 1793 734 -4270 -2853 1549 -151 -3515 -801
786 -801 1050 -3823 -4969 946 1285 -4106 -3690 811 -353 -3862 -1397 264 -3623 -4701 -50 729
802G29m695K02M645p23m890N90L723l79k552J905J699l390j025M305Q39m881o01
819d499M643L19m036J095L189k675j489L362L18l931R35N498j601o060J091N307
835A466p50l750J523L265k624k029L929J390n071j425O159J410n698j032O207
850B970Q71n664r26M127n58k391K928J485l554r90M160P57m290l19L245n4j688
867A09R15J149k038p09K435P81l422P8M104N48m494j018L400M74k993J156K628
884C103k138k215L654J051l922j443L385J240l177n0K528J41j395Q9k58j160J2
901e55J997L02k363n5J426P97j790m22J203o78q59J654P41k499p33K742J14l325
919b303M55L105k65k081L61P25j784k8J893L31k284L23K132L60k261l51J062j60
$$ plain form
802 729 -3966 -3764 881 158 -4732 -4142 -419 -798 -3350 -1445 254 -3136 -4161 144 983 -3898 -4499
819 -4499 144 463 -3573 -2478 711 -1964 -3453 -91 227 -3704 -2769 2729 1128 -4932 -3841 1466
835 1466 716 -3034 -1511 1754 -870 -2899 1030 2420 -2651 -4076 2083 3493 -2205 -3237 2970
850 2970 3841 -1823 -2749 1378 820 -1571 1357 2842 -712 -1702 2458 3215 -1075 -1394 1851 1797 109
867 109 1024 2173 135 -574 1861 2642 -780 -702 3402 3950 -544 -1562 1838 2312 -681 475 3103
884 3103 965 -1250 2404 3455 -467 -1910 1475 2715 -462 -512 2016 2157 762 851 593 -567 -555
901 -555 1442 1744 -619 -674 752 1549 -241 -663 540 -138 -997 657 1398 -1101 -1834 908 1022 -2303
919 -2303 -1848 1257 992 -1089 -728 -3 -1787 -1815 78 409 -1875 -1552 580 940 -1321 -1672 -610 -770
937g70j157O00J309r53k26J725J67l057q00L330Q13l100N22K200o06j677J081
954e99R52j946r45K729N64j861m35J486K28j162q5Q05L97j39N26J2j274l08J171
973A16O77j572k7J505O03j179N81K92j527n22J919O13k115N97K397Kk026n02J313
992A145o16m52Q68K95q33L5J401K79j393q28R90J134r05m72P61n8q53P24L32j461
1012I3k3K317K50k340m90J454K71j355J09P13j107N62J602J31k683Q0J519K70
1030A373j840q2J906J09j267k30N79p27o99J557Q95k510j176L024J179k820j178
1047a907J687Q23j213k59Q89m36k30L77J93j117o40J723M74q26j215O72M68o8
1065f05o80M13n01o7J276L65j057j067J241O06j826j54J425J50l03j00M75o97
$$ plain form
937 -770 -1927 -1327 -18 -971 -1197 528 695 -2362 -3162 168 981 -2119 -1597 603 -3 -1680 -599
954 -599 353 -1593 -2538 191 755 -1106 -1541 -55 173 -989 -1074 -269 128 -11 515 527 -747 -1055 116
973 116 793 -779 -806 699 1302 123 704 996 -531 -1053 866 1479 -636 -39 2358 2360 334 -168 1145
992 1145 529 77 945 1240 407 442 1843 2122 729 -99 891 2025 1120 648 1409 1351 498 1222 1554 93
1012 93 70 2387 2637 297 -193 1261 1532 177 286 999 -108 454 2056 2187 -496 -416 1103 1373
1030 1373 -467 -549 1357 1466 199 -31 548 -179 -878 679 1574 -936 -2112 912 2091 -729 -1907
1047 -1907 -220 603 -610 -869 20 -416 -646 -269 -76 -1193 -1833 -110 364 -462 -1677 -1005 -537 -605
1065 -605 -1285 -872 -1373 -1440 -164 201 -856 -1923 -682 -76 -1902 -2056 -631 -481 -784 -884 -409 -1106
1083a106l73R23N13r57q05J187P26l69r16K28M12j10M2M27l65k06P21Q25j249
1102d52j127J236J518j051q57P43L23o58J1J011q92o05J086R20n33p68M54L79
1120G38j44k17l25L99J47J69L27n46m90L09J060k93j550P55J245p40m30O62m41
1139F35p75P20J134j224q29J070J095j197q80O41N44n2n39M76J17o98n51Q74K72
1158H33j219j33J536R6j159o47J536m26j033R5P32m64k38R14j45q01j63N24k25
1177c87J79m86O0l39O19k51J66n68Q9J90N44q11l94Q73O8p33N5O78o99nO10O64
1199A22j712r3J341oj318J69Q97N9k28L80J86m48o46P06M53j117n63J383J145
1218G10j301r27Q73P66n67n45Q90l62m64R68O31j058p47J168K12l33m62L91M98
$$ plain form
1083 -1106 -1479 -556 -43 -1000 -1805 -618 108 -261 -1177 -949 -537 -647 -605 -178 -543 -749 -28 797 -452
1102 -452 -1579 -343 1175 124 -733 10 333 -325 -314 697 -195 -800 286 1206 673 -95 359 738
1120 738 594 377 52 451 598 767 1094 548 58 367 1427 1134 -416 339 1584 844 414 1076 635
1139 635 -140 580 1714 490 -339 731 1826 629 -251 390 934 882 343 819 936 238 -313 561 833
1158 833 -386 -519 1017 1113 -46 -693 843 417 -616 -521 211 -253 -491 423 278 -523 -686 -162 -387
1177 -387 -208 -694 -634 -973 -354 -605 -439 -1007 -918 -728 -184 -995 -1389 -516 -448 -1181 -1126 -448 -1147 -1152 -542 122
1199 122 -1590 -1683 -342 -348 -1666 -1497 -600 -541 -769 -389 -203 -651 -1297 -591 -138 -1255 -1818 -435 710
1218 710 -591 -1518 -645 121 -446 -991 -101 -463 -927 41 672 -386 -1133 35 247 -86 -548 -157 341
1237C41o08M99k87l03L08O52M1m80n96J248K52q25q18P42N90o98L2J102n58o85
1257e1P88Q62j570n91J428N86r97l87Q03P9l37N6P0n48q9O45O69p54r56P87O76
1278A169r36l53Q53l7r00M06O56m65r05Q45Q26j132n50Q44J19q3k13J1q64K11
1298d98P00K8l32l40Q02j88p17j59J14J33k34K58M10o89l66Q98P60j463j147J793
1318b37M96j077n98J448j85j145P72L46p70l28P31P99j118n25Q16M57n73n60O77
1337e74K98n41L67L61q48m65Q44M89o98k66J091L14r52j54R61r22o22J192P56
1356F31j158m67J511L15j136m56J041M4q99K96J201n41r53O46P60o22o58O72J114
1375A341j232k73R63Q0p08J50J051r64q14J055J029j023j101J316Q5j055M86J126
$$ plain form
1237 341 -267 232 -55 -358 -50 602 643 163 -433 815 1067 242 -576 166 756 58 90 1192 634 -51
1257 -51 737 1599 29 -562 866 1452 455 68 871 950 613 669 739 191 102 747 1416 662 -294 493 1169
1278 1169 233 -120 733 696 -204 202 858 393 -512 333 1159 27 -523 321 440 357 144 155 -709 -498
1298 -498 202 230 -102 -442 360 172 -545 -704 -590 -457 -691 -433 -23 -712 -1078 -180 580 -883 -2030 -237
1318 -237 259 -818 -1416 32 -153 -1298 -526 -180 -950 -1278 -547 252 -866 -1391 -575 -118 -691 -1251 -574
1337 -574 -276 -817 -450 -89 -937 -1402 -558 -69 -767 -1033 58 372 -580 -734 227 -695 -1317 -125 631
1356 631 -527 -994 517 832 -304 -760 281 325 -574 -278 923 382 -571 75 835 213 -445 227 1341
1375 1341 109 -164 799 879 171 321 1372 408 -406 649 1678 655 -446 870 955 -100 386 1512
1393A512p17p69P46N89q21j112R17J330j166j020J168O59r49m18R52l18j093P19
1411B09J317q76j563J345J147j540q74J272N11j202L8R30r25p63J184Q17j087
1428f0j019R97J101r03j196Q37M41r65N4R04l20j127P09J279r78j834J290J363
1446E73j328o05J165L11j425M83J161q80j115M95J505q35j028J388M50j127n00
1463a312J220m0q49l11J311q5j553O35J746j066j192J068J094j666j2J133j8j320
1481a217K18J783r57p88O73J038p29p40K79Q87q27j48O57L90q89J62J220q00q54
1500f42O19J097r17o85R53N41r84L66Q98r11j045J045J008j023q88J044Q25r44
1518C57q12J117M27j033J05J151o56p72K89Q66l41q20O90L68j99p24P20L34j436
$$ plain form
1393 1512 795 26 772 1361 540 -572 345 1675 509 -511 657 1316 367 -51 901 583 -510 209
1411 209 1526 650 -913 432 1579 39 -835 437 948 -254 -216 714 -211 -974 210 1027 -60
1428 -60 -1079 -82 1019 116 -1080 -243 198 -767 -713 191 -129 -1256 -547 732 -246 -2080 -790 573
1446 573 -755 -1360 -195 116 -1309 -826 335 -545 -1660 -1165 340 -495 -1523 -135 315 -812 -1312
1463 -1312 -92 -132 -981 -1292 19 -66 -1619 -984 762 -304 -1496 -428 666 -1000 -1012 121 103 -1217
1481 -1217 -999 784 -173 -961 -288 750 21 -719 -440 447 -380 -528 129 519 -370 -208 1012 212 -642
1500 -642 -23 1074 157 -528 425 966 -18 348 1246 335 -710 335 1343 320 -568 476 1301 357
1518 357 -455 662 1089 56 161 1312 656 -116 173 1039 698 -122 568 936 737 13 733 1067 -369
1537c69K34J216o54q80R44N47n06p59M64K88r02J47P06m54p69M90R83q92n42M33
1557b75P27m92p41N38M32o21m96J239m08r54M00J124o70j186J001O51r23l76Q10
1576b20r7n67p3J027p74r74J046N08n56r68J283K58n48r8N41j50n80k64J369m56
1596b93j095P73J067p02r13Q11M86p04J21N90n71q08J300M65r33p60J095N79q50
1615c42l2R75m67q43L60R96o50m60L86J052q97n85Q24N86o72j008J133M13j108
1634c39L05J369q68r48O67J136j076p53R26R33j129j04Q80l02q87N20Q00n35n76
1653A9M20N00n42p08P50N69r37q3O91r5o31J57J178j041j019J133J139j477m93
1672d70J509o5j433L00J064m81j476J081R38o44o02K00R55j011o40O35M16o33
$$ plain form
1537 -369 -135 1081 427 -453 491 1038 532 -227 237 525 -377 -230 476 22 -747 -257 726 -166 -708 -275
1557 -275 452 -40 -781 -243 189 -432 -928 311 -97 -1051 -651 473 -197 -1383 -382 269 -654 -1030 -220
1576 -220 -317 -884 -957 70 -704 -1678 -632 -124 -680 -1648 -365 -107 -655 -753 -212 -362 -942 -1206 163 -293
1596 -293 -1388 -615 452 -250 -1163 -352 134 -570 -449 141 -430 -1238 62 527 -406 -1166 -71 508 -342
1615 -342 -374 601 134 -709 -349 647 -3 -463 -77 975 78 -507 317 903 231 -777 356 769 -339
1634 -339 -34 1335 467 -481 186 1322 246 -507 419 1352 223 119 999 697 -190 330 1130 595 19
1653 19 439 939 397 -311 439 1008 71 -12 679 584 -47 110 1288 247 -772 361 1500 23 -470
1672 -470 1039 974 -459 -159 905 424 -1052 29 967 323 -279 -79 876 -135 -775 -140 276 -357
1690c57r2O95R0r20J40J345j117j035J145M20q26j20N40M6q64L18J082o68j054
1709a232J018P05j037n45O94M44p32J82M27oo76N3P51lj278P08R94m93j082Q85
1729b23N79j020k98Q44k3r18P14P58m13q32O49O74o06l28N32L04r12J07Q46k72
1749A62o06M40N31j69o12L95O36n60n81R59o6o87J97O78n2j163Q50N66o88n23
1769b93O70N18p70K16O87k85r35M74J044o99o27K28N38n23k6L96J33o37j61Q76
1789H24oj080K00O55M7p67J37R97o31m34O44j13n53K08N64o60l50J87R14q94k07
1810c18O72J1l76l09N66k08k77J79M26m4j212P81Q61j242m64Q23N67j102p7Q90
1830A47l13n56M88L73m16q98Q88L66p20k2M43R5n89J52N94k89o52N31M48j44r29
$$ plain form
1690 -357 -449 246 336 -584 -444 901 -216 -1251 -106 314 -512 -632 -92 -46 -910 -592 490 -178 -1232
1709 -1232 -214 491 -546 -1091 -397 47 -685 -503 -76 -82 -758 -705 46 43 -1235 -527 467 -26 -1108 -223
1729 -223 356 -664 -962 -118 -141 -1059 -345 413 0 -832 -183 491 -115 -443 89 393 -519 -412 434 162
1749 162 -444 -4 527 358 -254 141 777 217 -364 595 529 -158 39 717 665 -498 352 918 230 -293
1769 -293 377 895 125 341 1028 743 -192 282 1326 627 0 228 766 243 217 613 746 109 -52 824
1789 824 818 -262 -62 593 640 -127 10 1007 376 -58 586 473 -80 128 692 32 -318 -131 783 -111 -318
1810 -318 354 365 -11 -320 246 38 -239 -60 366 322 -890 -109 752 -490 -954 -131 436 -666 -743 147
1830 147 -166 -722 -234 139 -277 -1175 -287 79 -641 -663 -220 -125 -714 -562 32 -257 -909 -378 70 -74 -1003
1851a003Q13L52p69k82M53M10o81K68N27l96m89Q00N35n78n66N76K41o07j86R24
1871C42k49p98N80N66m36n01M42O01m32l85M83M57p74l86J029j59n58N43K35l05
1891B95r26R91M71r08l3Q19j15n68J14Q41p15k76N65M36o49p45O38Q00n49n82
1911i6Q80j72k82l4M33l07p18N96N49n10n84Q06P07j172k9L73L6q79O77M79p09
1932D4n82O52N05o43j89M03N1n35j65R03j12q97J63P23k20r11N17Q24o39p46J115
1953B61j20r91M47P48m73o59L70O61n23r06R47L01m47n07Q74l39k21O3N33j81
1973a62q78N26Q76o43n95P06K34m42l90O51J81r77L85O71k58q08N84Q02o86m54
1993f77P53M15j067k6P02p7m06l0Q35k72q82N28O71l39k13J01L65m69k63N86P6
$$ plain form
1851 -1003 -190 162 -607 -889 -436 -26 -707 -439 88 -308 -797 3 538 -40 -606 -30 211 -396 -582 342
1871 342 93 -705 -125 441 5 -496 -54 547 115 -270 213 670 -104 -490 539 380 -178 365 600 295
1891 295 -631 360 831 -77 -110 709 594 26 140 981 266 -10 555 991 342 -403 235 1035 486 -96
1911 -96 784 612 330 296 729 422 -296 300 849 339 -245 561 1268 96 67 440 476 -403 274 753 44
1932 44 -538 114 619 -24 -213 190 241 -294 -459 444 332 -565 -402 321 101 -810 -293 531 -108 -854 261
1953 261 141 -850 -403 345 -128 -787 -417 244 -279 -1185 -238 63 -384 -891 -17 -356 -577 -514 19 -162
1973 -162 -1040 -514 362 -281 -876 -170 64 -378 -768 -117 64 -913 -528 143 -115 -923 -339 463 -223 -677
1993 -677 76 491 -576 -602 100 23 -383 -413 422 150 -732 -204 467 128 -85 16 381 -88 -351 235 311
2014C11r21O89R06p27p29P30P19p61o97O06L92p02L55N91n39P5J97J09j59m86
2034d1N73K3m84P5L08L8l95K51L89k33m86N01N03n33o29P11O4p71J89M39k44o92
2056d44P68K20o09o0N03J10n67q0M25J53m29j79L07r8n35K20N25l16k87Q2P07
2077D16n44m87P41r0m73j02Q84l58n03L14P24j219j39P34J62o24J04M16j37k37
2097d18K28L73k10o64M76K73k05m83K79L29l44l8P50l97r84O42N97n52o83Q63
2117a68N58p49Q3L35N4o42lR76m02o72M99N34m90n65P90M18p57l65R21j5p24K65
2139a19N75j95p78O03N93p16n2O7Q18p21j84Q30J7r74L65L56j10k20M44M9k98
2160C50l76N03j21m25j95J175k68q18K77P06o85m73N20O99o48n07R22k5l84j25
$$ plain form
2014 311 -610 79 985 258 -471 259 978 217 -480 126 518 -184 171 762 223 298 495 604 445 -41
2034 -41 532 555 71 146 454 492 97 348 737 504 18 519 1022 489 -140 571 635 -136 53 492 248 -444
2056 -444 324 544 -65 -125 378 488 -79 -159 266 419 -10 -189 118 20 -515 -295 230 -86 -373 -291 416
2077 416 -128 -615 126 36 -437 -539 345 -13 -516 -202 522 -697 -836 -102 60 -564 -460 -44 -181 -418
2097 -418 -190 183 -27 -691 -215 58 -147 -630 -351 -22 -366 -404 346 -51 -1035 -393 204 -348 -1031 -168
2117 -168 390 -359 -276 59 113 -529 -532 444 42 -630 -131 403 -87 -652 138 556 -201 -566 355 340 -384 -119
2139 -119 456 261 -517 86 679 -37 -89 -22 796 75 -109 721 738 -236 129 485 375 155 599 648 350
2160 350 -26 477 356 -69 -264 911 643 -175 102 808 123 -350 170 869 221 -286 636 611 227 102
2180A02N37k08o50L51P67p70k72M59N38j053l1P41l57j85j90P00l51o34K90R15
2200F99m37q03N72J27m47l30N90R5p22L89N69o73j58N18Q6j55o69N58L98r60J55
2221e98Q13j11m75k74J010m35n44M64M51o50j63N20K69n83j09K66J28m22J75J58
2241a10m32M5L10K31l03j49N73P4o64K01J91Q7q43O19N39l89m79J37Q75o40k25
2262c52N32M27q17m6N42P8k77k93P91m90l76M94L09n24j17O44l49j74J37N19k94
2283C64l77K83K87k49l12L30K33j34k94M92Q2o27J75L40om45N40Q8n86l93L12
2304A03L29n14j60P39k76n00M03L02j88m15M93J37m43k42M22K15n79N1N14m90
2324i9k36L42L06m56j40J96J33l64O9L50L1p21L75M22k74n20M07Q4L5m70M95o2
$$ plain form
2180 102 639 431 -219 132 899 129 -143 316 854 -199 -230 511 154 -31 -221 479 128 -506 -216 699
2200 699 262 -541 31 158 -289 -619 -29 66 -656 -267 302 -371 -529 -11 75 -80 -749 -191 207 -753 -598
2221 -598 215 104 -371 -645 365 -70 -614 -150 301 -349 -512 8 277 -306 -415 -149 -21 -443 -268 -110
2241 -110 -542 -497 -187 44 -259 -408 165 239 -425 -224 -33 54 -789 -170 369 -20 -499 -362 513 -127 -352
2262 -352 180 607 -210 -256 286 364 87 -206 585 95 -281 213 522 -2 -119 525 176 2 139 658 364
2283 364 -13 270 557 308 -4 326 559 425 131 623 705 78 253 593 587 142 682 770 184 -209 103
2304 103 432 -82 -242 497 221 -279 124 426 238 -177 316 453 10 -232 190 405 -174 -123 391 -99
2324 -99 -335 7 313 -143 -283 -87 46 -318 -249 101 132 -589 -214 208 -66 -586 -179 -95 -60 -530 -35 -97
2346i7n43J93J59J35l69L20J7k1m21K27K33l48j1R4N07m82L9N07j62l48K07M59
2368B95n73l01N03J40o71M5O49j97m21J63L68j14r5K25J62k77p5K38K49l19J89
2389A83j99K72m88L64M62k36m94L07L85n43j89L48K83m40k75O23L5n84K34N40
2409E88l95l67N66J28l42m3J79j38j56l6K72M19o87M12L06m32j68J08O53q09L5
2430I3K54K80m10M9K67l92k85M61K14m86k46M30K11o12m8M82J47o16K45K09j31
2451A16o49O39K55l92l5J21M14n42l02M07j2j90k48O62o0n01L66L36o73j70L13
2472a45L05k20l89K41Pj39Q7K31j38l90L85M62o06R3o0L33k84m44Q32o83k95J160
2494C43l99N92r97K05O5o8O31r06l51P9M35K71L55n37J24k33o6N84K39J10q88
$$ plain form
2346 -97 -640 -447 -288 -153 -522 -202 -185 -206 -627 -400 -167 -515 -526 -432 75 -407 -368 139 -23 -371 -164 295
2368 295 -278 -579 -76 64 -607 -562 87 -110 -531 -368 0 -114 -209 16 178 -99 -174 64 313 -6 183
2389 183 -16 256 -232 132 594 358 -136 171 556 13 -176 172 455 15 -260 363 398 -186 48 588
2409 588 193 -174 392 520 178 135 314 176 20 -16 256 675 -12 400 706 274 106 214 867 58 93
2430 93 347 627 217 266 533 141 -144 317 531 45 -201 229 440 -172 -220 262 409 -207 38 247 116
2451 116 -533 106 361 -31 -66 55 469 -73 -375 32 20 -170 -418 244 184 -317 49 385 -288 -458 -145
2472 -145 160 -60 -449 -208 -201 -340 -253 -22 -160 -550 -165 297 -309 -216 -276 57 -227 -671 161 -522 -817 343
2494 343 -56 536 -461 -256 -191 -259 372 -534 -885 -806 -371 -100 255 -282 -158 -391 -457 127 366 476 -412
2515d12O08q07J157j033J97L30J01n34L37K73J91n48J78L69m69j43O79j44k45
2534H5K01m2J07m24L74J60k64p2l55K98p3L60Q2k01j15J82J99k23J77p07J44k73
2556c80L94M77J7m49k14K98J24k82J51K71k65k51K03K3J70k42J93r5j65K10J35
2577C23l32j2j20L04p4j36p1J10j39J4K35k01J7L59l4m22l17N16o5j37j61J80
2599a63O5j00K11m2j45K9j57N54k66o47M11K2K11l68Q9L96o67L49JP1j69K90J56
2622A31n04O3n3M64k85R0J06k28N6O4N6j9l03M65j41k23J78o5K19j44lO1J58m12
2646b69R9L57k10k65N65j57J21l85L91l19J15o0L86l31j34N41j74J96l23O39l59
2667D24j75q0J44k42J7K17L64Q5p22m5N55l45k13K25L48p51N38j4Q7j69m2L23
$$ plain form
2515 -412 196 -611 546 -487 -290 40 141 -393 -56 217 408 -140 38 407 -62 -205 474 330 85
2534 85 286 244 351 -73 301 461 197 125 -230 68 -5 355 437 236 121 303 502 279 456 -251 -107 -380
2556 -380 14 491 508 59 -155 143 267 -15 136 407 142 -109 94 117 287 45 238 143 -22 188 323
2577 323 -9 -21 -141 163 89 -47 -118 -8 -147 -133 102 -99 -82 277 243 -179 -496 20 -45 -182 -343 -163
2599 -163 -98 -198 13 -29 -174 -145 -302 252 -14 -661 -250 -228 -17 -385 -296 100 -567 -218 -217 -146 -315 -25 131
2622 131 -373 -310 -363 101 -184 -94 12 -216 -160 -96 -40 -59 -362 103 -38 -261 -83 -148 71 -73 -76 -15 143 -269
2646 -269 -170 187 -23 -288 277 120 241 -144 247 -72 43 -17 369 38 -96 445 271 467 144 783 424
2667 424 249 169 313 71 88 305 669 754 32 -13 542 197 -16 209 557 -194 344 330 417 248 206 529
2689E29n10j39M32L31l63K07p9M74k27r83j09o2J72M96o79J090p37K99m44O35
2709C33p6j96J59K81j047O27N99o38P4P41j056l60L76o7j88j5P01n75K04j51K6
2730b48J20m97M20K13Q0j31k3L5n40P80l20K48p13J75L24k41N91J26n90J39m16
2751d68K90J31k93L65K10j38l34K45l51J04m6J4k1j8L00k89L04l35M04j37j4L65
2773B88l14j46L22k71P6J45q8L6k84M03k03L48l34o6K86k8Q7k24J26l3J78m04
2795a00O01l55q2m1K28J33j76O2p6K62k59j30l6K6J61K02k27J5k81L02P2J6j02
2818B15N3j05j56L6N31m60j8P1N1l47K82k81L36K77m31j8p6m1P4J87l8r8l28K14
2842g0j41j26M20r6j24J61k0J35q86J035r4j70j53L11k56K66k59J70l06J40k49
$$ plain form
2689 529 19 -120 312 643 280 487 408 882 655 -328 -437 -499 -327 169 -510 580 -157 142 -302 333
2709 333 257 61 220 501 -546 81 680 42 116 857 -199 -559 -183 -250 -438 -453 248 -327 -123 -274 -248
2730 -248 -128 -625 -205 8 88 -43 -66 -31 -571 209 -111 137 -576 -401 -77 -318 273 399 -191 -52 -468
2751 -468 -178 -47 -340 25 235 97 -237 8 -343 -239 -285 -271 -292 -310 -10 -299 5 -330 74 -63 -77 288
2773 288 -26 -172 150 -121 -45 100 12 48 -236 167 -36 312 -22 -88 198 170 257 33 159 126 304 -100
2795 -100 501 146 64 23 251 384 208 270 194 456 197 67 31 57 218 420 193 208 -73 229 301 317 215
2818 215 268 163 7 43 574 114 96 167 218 -129 153 -128 208 485 54 36 -40 -81 -7 180 142 44 -284 -70
2842 -70 -211 -337 83 -13 -137 24 4 139 -747 288 194 24 -129 182 -74 192 -67 103 -203 -63 -312
2863c12l4J5J86J20m00K42j91L82j14j02P1q0j73m4J77M0P3J18k58J88j45j12
2885c53M80m34j41J7K06J43m3L3j71J09k1J24l1L2r0L39n7k07O1J06k02N3L9K35
2909B27r8K7j35L63k25k35K89l6L4O0j4q2k55K53j81J27K7O0j21K50j76j18J25
2932A66K7l67J42OK63r4j02%r7Q2K06j03m6M72k27j46M6O1j28j39J23K25l84J17
2956A03O8j77o8J09R7O6j42J12L7j11k86K37j94K1PJ84J48m61L68k69Q9O5m3P0
2980C0j32r6J91k27M93n48L90j84K6k24j49N78j19l67K01J89j79j73L0R4j57J30
3002b03J63r1l12J94P5jj02L77l08J41j77K67m80L35p8O7k49M50P7l04j30J73
3024a16L44m02k60N7M28O6j41m8L39l23j85M23j63k01j30L25m8R3n9N4J50K77
$$ plain form
2863 -312 -346 -331 -145 -25 -425 -183 -374 8 -106 -208 -137 -217 -390 -434 -257 -217 -144 -26 -284 -96 -241 -353
2885 -353 127 -307 -448 -431 -225 -82 -125 -92 -263 -154 -175 -51 -82 -50 -140 199 142 -65 -4 102 -100 -47 -8 227
2909 227 129 156 21 384 159 -76 213 177 211 271 257 175 -80 173 -8 119 146 206 85 335 159 41 166
2932 166 193 -174 -32 -26 237 143 41 41 -56 26 232 129 83 555 328 182 228 289 161 22 145 370 -14 103
2956 103 171 -6 -74 35 132 198 56 168 205 94 -192 45 -149 -128 -121 63 211 -250 118 -151 -62 3 -40 30
2980 30 -102 -198 -7 -234 259 -289 101 -83 -57 -281 -430 148 29 -338 -137 52 -127 -300 -270 -176 -333 -203
3002 -203 -40 -131 -443 -249 -174 -175 -277 100 -208 -67 -244 23 -457 -122 -200 -133 -382 68 145 -159 -289 -116
3024 -116 228 -174 -434 -377 51 117 -24 -72 267 -56 -241 182 19 -182 -312 13 -35 58 -1 53 203 480
3046D80l33j6l69kM21Nnj67O2l52N42l65L72rj10J08P7j54j73M2K82j38J0Q1j19
3071A70j21N4J37l35K37j4l57K70P1R2j19Qk14k35M50N1Q7j08K61k19j32j16J42
3094F0k11K41l40o2J02R3J17l41M02o1K3k17K57k04j44K58p1j6kP5M4k09J07K4
3118g5l84O77m16K20j97k4M3J10K40l26o6K60l69j4p5m2J12N15m78J76MJ26j9
3141bl33K67o9K51k95j38L19j44M0K01k62P3j20K0J64K7k9J48R5k42K19j07j79
3164i6J15pK59j05j7L4J10l22J46k0K4p7M0K97K8j99k02K11q8J8m0O9J26k38j85
3189a19L62o9O9j58M29q36M68L30l68M6j42K74k16J65K7l9l3k61K50j62L11k78
3211E0L11k57M6j1J17n0lk99K40k21J40n9N2qM4P1k69R2l5m2k92L24rQ9j25P%
$$ plain form
3046 480 147 131 -238 -240 181 186 181 14 76 -276 266 -99 273 264 154 262 339 185 12 54 336 198 208 289 170
3071 170 49 103 240 -95 142 128 -229 41 112 204 85 93 -121 -356 94 145 232 124 385 166 34 -82 60
3094 60 -151 90 -250 -312 -210 -117 0 -341 61 0 23 -194 63 -141 -285 -27 -98 -114 -116 -41 3 -206 -99 -75
3118 -75 -459 218 -198 22 -175 -199 -156 -46 194 -132 -198 62 -307 -321 -396 -438 -326 189 -289 -113 -109 17 -2
3141 -2 -335 -68 -137 114 -181 -319 0 -144 -104 97 -165 -92 -212 -192 -28 -1 -30 118 213 -29 190 83 -96
3164 -96 19 12 271 166 149 183 293 -29 117 97 121 44 84 381 409 210 8 219 131 149 109 178 304 66 -119
3189 -119 243 174 243 85 514 -322 146 476 108 154 12 286 70 235 262 223 190 -71 179 17 328 50
3211 50 361 104 150 139 256 206 203 -96 144 -77 63 4 56 48 92 163 -106 -14 -49 -91 -383 -59 -68 21 -104 -97 -97
3238i7K0Q8l24J37o3R4N5N4M5l16R7K24k77j3%K40k07p3M14j22k38r0MK6K19O1
3264d2k31J48J71q5k21J61q6q0R9n6j7K10R9l5k36K75j91l7J84J38j19J5n7L39
3288C46k6l06j70K55o4n6J07M1J49k59K76L5Mk19k1j16k0L2J51L25k54k03J83
3311A90l4j73K45j30r8l8J17j72j21L49j01L49k81J09k9n9j20J22j11l1k06J87
3333c6J9K34k77RJ56K33k60O2K24j44q5J49j74J36k11J7j56L07j73j6M4l1k3M4
3357D8j23K10j10R2l21N5jN9n7r5K49k31K55j90J33p6R6j67J22k42L75k32M3J9
3381h9j19R7Pn3j17J45J00j39J56l6p3k77Q6O7n7L55j82j01J12l66L10K15J8l11
3405b52J75J71m24R6K62N9l14R7K6k0R1m0J95j71r9K20L8j80M33j64l20J54k1
$$ plain form
3238 -97 -77 11 -313 -176 -239 -145 -90 -36 9 -307 -210 14 -263 -276 -276 -36 -243 -316 98 -24 -262 -352 -348 -322 -103 -42
3264 -42 -273 -125 46 -39 -260 -99 -185 -265 -166 -222 -239 -29 70 35 -201 74 -117 -154 30 168 49 64 7 346
3288 346 320 14 -156 99 35 -21 86 127 276 17 293 328 332 113 92 -24 -44 -12 139 464 210 7 190
3311 190 156 -17 228 98 0 -38 79 -93 -214 135 34 383 102 211 182 123 3 125 14 -17 -223 -36
3333 -36 -17 217 -60 -51 105 338 78 140 364 220 135 284 110 246 35 52 -104 203 30 14 58 27 4 48
3357 48 -75 135 25 117 -204 -149 -150 -91 -148 -243 6 -225 30 -160 -27 -103 -7 -174 -52 -294 81 -151 -108 -89
3381 -89 -208 -111 -104 -157 -274 -129 -29 -168 -12 -48 -121 -398 -312 -245 -302 53 -129 -230 -118 -484 -174 41 59 -252
3405 -252 -77 94 -330 -234 28 87 -227 -130 -104 -124 -33 -73 122 -49 -148 72 110 -70 363 199 -121 33 12
3428A2PK19k01j42L55J38n38k22R03m22M3Q0k38J23P1j9o6r6O5K75l23j76J34
3451a8q6K41j48L37k22M9n3r5J14q2M3p8J38j16QJ20k12m6J07J17k6J8j27J77
3475A60k18M11j67J55l47pk93M05k36K47Q1m68M37n39M30m51P4M37k82o9K52N
3497A7j53j87K18K24l06K38L2om3k45M53l75N1n7j25K57j51N6m2j03L9J8P9Q8
3521b3l28L07Lm08O63m25J51n4J78k57J01P9o7J51k24k0J36k5m0K91k69L91k84
3544B7k14J38o5J55n0J50l37O2k23N10j09j1j00Q5Q1k4R7j57j03Q7K13m16J00
3567a04R2L11k39N8L9r9J92l38K15K05k48N6L5k62L34j74K55n99K39K87m6n3l00
3590a44P13n49j91K15Q5K2j18J80n6o6q0J98k02L70j65n5l7j16N3j73K21J79m38
$$ plain form
3428 12 19 238 37 -105 250 388 -150 -372 531 109 152 232 -6 117 188 169 103 7 72 347 24 -152 -18
3451 -18 -104 137 -11 326 104 153 100 5 119 37 80 2 140 24 32 152 -60 -106 1 118 92 110 -17 160
3475 160 -58 353 186 341 -6 -13 -306 99 -137 110 191 -277 160 -379 51 -400 -326 111 -171 -240 12 17
3497 17 -136 -323 -105 119 -187 51 83 77 34 -211 242 -133 -82 -139 -264 -7 -158 -102 -144 -247 -208 -190 -111 -23
3521 -23 -351 -44 -41 -449 214 -211 -60 -114 64 -193 -92 -13 -80 71 -153 -173 -37 -62 -102 189 -80 311 27
3544 27 -187 -49 -114 41 -9 141 -196 -134 -357 153 44 33 -67 18 99 75 172 15 -88 -1 212 -204 -104
3567 -104 -12 299 60 118 157 58 250 -88 127 332 84 140 175 -87 247 73 328 -271 -32 255 209 156 -144
3590 -144 569 20 -171 44 129 151 33 213 157 91 11 209 7 377 212 157 120 4 57 -116 105 284 -154
3613a54K12j67J16J41k5j37P2l6l08L62k37J92k53J70m2k23m2K11Q2m0k69L64
3635a1j54MQ2Po3j68J83J49n6k47J61K57j92o8k52L08j29K9K56l37Q0K01Ql24
3659b76M6K06j46pJ10k57J75K02k34K91j86p3K02k93L93K88m79K07N6m27J67L3
3681bJ04J92k08P6k2Oj72K30O4l14P7k24L27K41j72K27l11r8J28k17M37j72k60
3704f3O7L76r6p3l6j98j6K01k71L26j28J9j03j11J28P9l10M28L7k26P9k62O7m0
3728a26J19Q5O5j77J23M4k39J52P4L6Q9j83j8k39l2J53m6Q2j63J07Q0j06L6J79
3752I5pj69o3K11j02j11n2K14k15J01J16j34j60K77j90K85l19R5j47M0J81l4p5
3775a63J54k35J46L6j41K00j79k91N49l93L89m7m11N91l93kj2J37J11k03m0K87
$$ plain form
3613 -154 58 -109 7 148 123 -14 58 22 -286 76 -161 31 -222 -52 -94 -317 -359 -148 -66 -106 -375 -11
3635 -11 -165 -161 -79 -72 -135 -303 -120 29 -27 -274 -113 144 -48 -116 -368 -60 -189 -160 96 -241 -161 40 48 -276
3659 -276 -230 -24 -170 -177 -67 -324 -149 53 -181 110 -76 -149 53 -240 153 441 -38 169 225 -202 -35 -2
3681 -2 102 294 86 162 140 146 -26 204 268 -46 31 -193 134 375 203 430 119 21 149 -68 369 197 -63
3704 -63 4 380 284 211 175 -23 -39 162 -109 217 89 108 5 -106 22 101 -209 219 256 30 109 -153 -86 -126
3728 -126 -7 78 143 -34 89 133 -106 46 120 156 245 62 44 -195 -227 -74 -120 -38 -201 -94 -14 -120 -84 95
3752 95 88 -81 -144 67 -35 -146 -198 16 -199 -98 18 -116 -276 1 -189 96 -223 -128 -275 -235 -54 -88 -163
3775 -163 -9 -244 -98 -62 -203 -3 -182 -473 76 -317 72 25 -386 205 -188 -190 -202 -65 46 -157 -197 90
3797I0l41M65j25k24M05m44K74l9O0j60K03K16k57k69J88k05L05R9n22L92Oj36
3819a9K69rp2n8J06m31K34K01n59M21R2k17L61k57q2J84j85JM14l66j62K22K78
3842C66k19J23r2k02J33K11m6l34K4M1J01p3O6n8k45K11o6J37N3k13J11j33L73
3865B69m11J87j22j49K25O7l3k69o04Q04J56k49K28n9o6r3P9K6q8K30j25l47N09
3888A65k08k80J99p5J53j75K43L3l57K25J4j22r8J61j57o0M14k79K71Nq5R3j52
3911g2J64l88J56k0J82L1l5n0j56K28J61l78K84Q4k48J28m8k8J10k74O6L35j16
3934A16k88N27m24P3J53j50J62J43k64j10K53P0J0j08R1k57J61j4l04j65L96k20
3956a49k2K39%kj35K87m0L6k08K18j20l7J74j34J62j18j79J15J59j56j46J1P1
$$ plain form
3797 90 -251 214 89 -135 270 -174 100 61 121 -39 164 380 123 -146 42 -163 142 241 -281 111 117 -19
3819 -19 250 241 169 111 217 -214 20 221 -338 83 175 -42 319 62 -20 164 -21 -20 394 28 -134 88 366
3842 366 147 270 178 -24 109 320 274 -60 -36 5 106 33 99 41 -204 7 -59 78 131 -82 29 -104 269
3865 269 -142 45 -77 -226 -1 66 33 -236 -840 -36 120 -129 99 40 -26 -119 -40 -14 -102 128 3 -344 165
3888 165 -43 -323 -124 -199 -46 -221 22 55 -302 -77 -63 -185 -283 -122 -279 -339 75 -204 67 72 -13 80 -72
3911 -72 92 -296 -140 -160 22 53 18 -32 -188 40 201 -177 107 191 -57 71 23 -5 105 -169 -103 232 116
3934 116 -172 355 -69 4 157 7 169 312 48 -62 191 261 271 163 254 -3 158 144 -160 -325 71 -149
3956 -149 -171 68 68 66 -69 218 178 214 6 224 104 67 241 107 269 151 -28 87 246 90 -56 -45 26
3979B6K27m83J6K60o5K29j98K7n6J47j09P0J45k89K52n4k21L2K60l2k59J7L00
4002B42j58k11J94l12J85J33pm73L94J45J17j77o40P14m43N37m53K26j57j66J74
4023a36p1P01p07K43k82J76j83l44P50k80o3l2K57j04K25k74J06p2J17k81J8M38
4045B02l38J1M1L8l48N9J26M30m84N4J13J67k59J47qK63k58j07JK23%l02K43J83
4069A97k54P6p8M31j05k68j70KJ08R6O6n4p8L49j97k23J34J80P1j25N8j86K03
4092B33P7l37N2K07j99k35L41m5r7L59l45j83J28J06M6l3nk8j6oJ01r7j15J79
4116H8j25k7J16J95n9k79L26k64j66j6M40n37J41K14%k44op7K93k18R1O0J56o0
4140D2j51k77M09r7L02l56n3n1J79L4j59n8N6KO1J44j39J74n7l1j31o2j08L95
$$ plain form
3979 26 253 -230 -214 46 -19 210 12 39 -17 130 21 91 236 -53 199 145 -76 -44 216 184 -75 -58 242
4002 242 84 -127 67 -245 -60 73 66 -407 -13 132 249 72 -568 146 -297 240 -213 13 -144 -310 -136
4023 -136 -207 494 -213 30 -252 -76 -259 -603 147 -133 -196 -228 29 -75 150 -124 -18 -90 27 -254 -236 202
4045 202 -136 -125 -84 -46 -394 -335 -209 221 -263 -209 -96 71 -188 -41 -49 214 -44 -151 -150 73 73 -229 14 197
4069 197 -57 19 -59 372 267 -1 -171 -169 -61 35 101 47 -31 318 121 -102 32 212 283 158 216 30 233
4092 233 310 -27 25 232 33 -202 139 94 -3 356 11 -172 -44 62 108 75 70 42 26 20 121 24 -91 88
4116 88 -37 -64 52 247 188 -91 235 -29 -195 -211 229 -308 -167 47 47 -197 -203 -280 13 -205 -114 -54 102 42
4140 42 -109 -386 23 -74 228 -128 -181 -232 -53 -19 -178 -236 -180 -178 -117 27 -112 62 5 -26 -157 -219 -327 68
4164F8j24J13l2j23J58j95J14M9j09q6M6j69L76j78O0k04J16K02m6l61L54n5Q8
4187F2J21j70p3M3L2J48j27oj06J82q5M11l32n1m9J46j87N3k67Q5K34L04k95p6
4211cL01r9J54k19j65j10k1L41j7j29J61k8Q2j11p7k2k6N3j16R3L17n1j67j11
4235C0K83k35r7K0J48k58K00j74N9N2J31J13Lk5l23J32p2j99K03J62p8R0l73L59
4259A51j85k96L34N7k32J27l3OJ31Q6p9J2mj30J09J20k91J82j8J57K09o90J17
4282a60K09l74J45L62m14L5K81j99j5L04k02N1j72J93o8j50L8K62m20J94k37L28
4304iJ19p39M53k7J17oL3j56m4N25k0j95J4k25L49j29M3l6l74M86n25M55n9O8
4328A18k31N03l23j35M02j95m2j90L25j29J57j80K05k81J47rj34j29K90j95L96
$$ plain form
4164 68 -56 57 25 -98 60 -135 -21 28 -81 -167 -121 -290 86 -92 -32 -236 -120 82 36 -325 29 -26 62
4187 62 183 13 -60 -17 15 163 36 30 -76 106 21 432 100 49 0 146 -41 12 -255 -170 64 368 73 -3
4211 -3 298 199 353 134 -31 -141 -162 179 162 33 194 166 248 137 60 38 12 65 -51 42 359 308 141 30
4235 30 313 78 -19 1 149 -109 91 -83 -24 28 159 272 275 250 -73 59 -13 -212 -9 153 75 165 -208 151
4259 151 -34 -330 4 61 -171 -44 -77 -71 60 146 67 79 75 -55 54 174 -117 65 47 204 413 -277 -160
4282 -160 49 -325 -180 182 -232 -197 84 -115 -130 174 -28 23 -149 44 -24 -174 -136 126 -294 -100 -337 -9
4304 -9 110 -629 -176 -203 -86 -92 -59 -215 -259 266 246 51 65 -160 189 60 103 67 -307 179 -346 109 50 118
4328 118 -113 390 67 -68 334 139 97 -93 232 103 260 80 285 4 151 142 8 -121 169 -26 370
4349C70j93l46J9L53k18J42J78k07m3k21M36l59J85K62p2k93K14r0K3j36j9q5
4371a00L51k71j92M04k14o3j4J82l4pj83K53k36L0K12J08j43k09K51K3k83J2j28
4394b51K55J50j91p8J83j61J09j46pK10j53M3K77k16J5j41K76n92J99m67N38Q82
4416G34o43l86j06P16k41p36O05K41m53j03P01m68L4J20K22p92N19Q01p76J13
4436A02mk44K7QJ15K03N5k58j23r8L00M2q6J04j88RK76k57J12P5p8p1j49K49j03
4461A8q6J31p4J07mj02l8j4R0R6J13k58L60m66J80j00K1L7O8J1K61m58K46k23
4485h4L7J0j22K93q8J99o3l23K90O0k17J24n0j63J87m22K67L1L34n73K24J19P7
4508A47j52L17m67J53K46j17Q9k36n9j40M22J3k81o7P7J46l64K51j06J56M6l14
$$ plain form
4349 370 177 -169 -150 203 -15 127 305 98 55 -166 270 -89 96 358 286 -7 207 117 140 4 -15 -100
4371 -100 251 -20 -212 192 -22 -85 -99 83 49 42 -141 112 -124 -94 118 226 83 -126 125 148 -135 -123 -251
4394 -251 4 154 -37 -115 68 -93 16 -130 -137 73 -80 -37 240 24 39 -102 174 -418 -219 -686 -148 734
4416 734 91 -295 -401 315 74 -662 -57 184 -269 -372 329 -139 -105 15 237 -555 -36 765 -11 102
4436 102 98 -146 -119 -111 4 207 262 4 -119 -217 83 125 39 143 -45 -36 240 -17 95 170 92 21 -128 121 18
4461 18 -68 63 -11 96 92 -10 -48 -62 28 124 237 -21 339 -127 53 -47 -26 11 79 90 351 -107 139 -84
4485 -84 -47 -37 -159 134 46 245 182 -141 149 209 -8 116 66 -97 90 -332 -65 -34 300 -273 -49 70 147
4508 147 -5 312 -155 -2 244 127 216 -20 -79 -219 203 216 -65 -132 -55 91 -273 -22 -128 28 74 -240
4530b40K04j32K22j62K63k26J35l69K46J98j16p9j94K35P4k0J43k13n0o1k7m7
4552b16J84O4l59J70Q6R0k32L4K84p0j90M19j23l86K26lJ9k1l14J52K44n06J25
4575c23L95k54J08k1J12R8o3l1l2j48J24j6L3J69j62J35j56n4J30o1P2k2O0M1
4599A34J8l15j98M96%j27J57P8p8k25K28r7j25K12J82k72O2J5l22P8J52J06j90
4622c1J3K17j28J65l17L38j52j29K90k64K2J0K45j38O8k28J7p4M04n31K94J47
4644B38j38N1m28K19k09O6J34K7J97k88r6K17k1k2j59j49K97r2L6J92j35qJ67
4667I6k33Q9R8k19J47J2J52l2j92K39k17j79K09j31m9K62M7qJ87l90J75m2j00
4690g9J47k35K77j09N3j24K34j77M5k69L14k69j14L55j02n4K43l4j26j83L44r6
$$ plain form
4530 -240 -36 -168 54 -108 155 -71 64 -305 -59 139 23 -56 -250 -15 59 39 182 -31 -81 -142 -169 -216
4552 -216 -32 32 -327 -157 -71 19 -213 -179 105 35 -155 264 141 -245 -19 -22 -3 -24 -338 -186 58 -448 -323
4575 -323 72 -182 -74 -95 17 115 52 21 -11 -159 -35 -51 -18 151 -11 124 -32 -86 44 -17 55 33 93 134
4599 134 152 -163 -361 135 135 8 165 243 165 -60 168 71 -54 158 340 68 130 145 -177 -99 53 159 -31
4622 -31 -18 199 71 236 -81 257 105 -24 266 2 24 34 279 141 209 -19 -2 -76 328 -203 91 238
4644 238 100 151 -277 -58 -267 -201 -67 -40 157 -131 -227 -10 -31 -53 -212 -361 -64 -156 -120 72 -63 -71 96
4667 96 -137 -48 50 -169 -22 -10 142 110 -82 157 -60 -239 -30 -161 -210 52 99 91 278 -112 63 21 -79
4690 -79 68 -167 110 1 54 -70 164 -13 32 -237 77 -192 -306 49 -53 -107 136 102 -24 -207 137 41
4712D1n4J41j71K92m02M5L27j15J48q4mJ75L4o33K81O8j90J16p0p9o8J96M9j85
4736a42Q5N0J32J22j10K33j8o0j05k54q2J41O9k43J62K19k82K47m1o3o2lj30O5
4760g0MK5l0J6K15j28J12j48j74Q2L23j15pJ14k85K48l52j03M99o35K45N31n15
4783a48P7j1R4j81J47k46L2J76j05J14K51n7l93L9J59o2Q7K47k88l45L92J18k09
4806a12j96K76J20m20o0L31j34R7L1K48k80J8n9L45m10K13j95J94l71K83J68k00
4828a13j46J45J52n5R2k39N0M6n9P2l9K08j3j62p0O1K30l39N30j04j69m9J50j22
4852E7k29K26J56l20M32j95o1j03L19j12k93L32k50K35k32K25n5M1j82K5O3j61
4874h2K77o9j15J56j00K5J20q8o4q2j42L09j75j00K68q1L02k29l27L20j54l2P8
$$ plain form
4712 41 -13 128 -43 249 -153 -108 219 104 252 168 164 339 373 -260 21 89 -101 15 -55 -134 -202 -6 43 -142
4736 -142 -57 -7 125 247 137 370 352 292 187 -67 -149 -8 61 -182 -20 199 -83 164 123 60 -2 -5 -135 -70
4760 -70 -66 -41 -71 -55 160 32 144 -4 -178 -96 227 112 105 219 -66 182 -170 -273 226 -409 -164 367 -148
4783 -148 -71 -82 12 -169 -22 -268 -236 -60 -165 -51 200 143 -250 -211 -52 -114 -27 220 -68 -413 -21 97 -112
4806 -112 -308 -32 88 -332 -392 -61 -195 -98 -67 181 -99 -81 -140 205 -205 8 -187 7 -364 -81 87 -113
4828 -113 -259 -114 38 -17 75 -164 -114 -68 -127 -55 -94 114 101 -61 -131 -70 160 -179 351 247 78 29 179 57
4852 57 -172 54 210 -110 322 127 66 -37 282 170 -123 209 -41 194 -38 187 132 173 -9 16 79 -82
4874 -82 195 126 11 167 67 92 212 124 60 -22 -164 145 -30 -130 138 57 359 130 -197 123 -31 -63 15
4897A5m28N24j7j95K04J35P6m28j65M29J59n41L03l05K68j84J46J91l61lo4J62
4919g9k06K45j59J95j44q0L19p0p1k33J28K13Pk24J89M9l5l0q4l6L5k3j20J19
4943i5j4M3k06J16J20l07L67K12m55L57j72K95l99J94o1j00k6J07j97l0K27j67
4965a91K28j62J31M55o59K31K39p8k81P2P5k40J45r4R7O2M06o15L79k6N2l55L8
4988i1K00R3k42m9J81k02K97k47P9J62j09l32K91K44k99j56K70j82j79K45q8J28
5010A4J99m78K86L7k4mk14L60pl16J65j86K38R8n4j85m0Q7j42Q0K4J64k10P7J2
5035a9K03k97L24l72J70K9k14K36j28J15l89M07j84K77l22J12R4j68R2j76OL58
5057A54l02l8n2J90L26j29j90K8j12n8K31k46L5J67r2J13J1R8k65r0K11N6l24
$$ plain form
4897 15 -413 111 94 -101 103 238 314 -114 -279 150 309 -232 71 -234 34 -150 -4 187 -174 -177 -241 -79
4919 -79 -285 -40 -199 -4 -148 -228 91 21 -50 -283 -155 58 65 -159 30 79 44 14 -70 -106 -71 -94 -214 -95
4943 -95 -109 -66 -272 -156 -36 -343 24 236 -219 138 -34 261 -138 56 -5 -105 -131 -24 -221 -251 -24 -191
4965 -191 37 -125 6 461 -198 33 272 194 -87 -15 60 -180 -35 -129 -32 30 436 -179 200 174 226 -129 -91
4988 -91 109 202 -40 -89 92 -110 187 -60 19 181 72 -260 31 275 -24 -180 90 -92 -271 -26 -114 14
5010 14 213 -265 21 58 34 30 -184 176 169 -147 18 -168 70 168 114 -71 -111 -24 -166 -86 -62 102 -108 -31 -19
5035 -19 184 -113 211 -161 9 38 -176 60 -68 47 -342 65 -119 158 -164 -52 42 -126 -34 -210 -204 154
5057 154 -148 -186 -238 -48 278 149 -41 -13 -125 -183 48 -198 -163 4 -88 25 36 134 -131 -221 -10 46 -278
5080b78P4K81k23J73J39Q1l10L8q8j76M59k43K9j82m6M0L91k12M7J88l69R5K18
5103A26j01o5K95j76oQ8k9K93l60k58K69J39p1l20K30J54k93k10L95k31K25k8
5125F6j3J39j37M0J87k57q3K59j24j56P9m1k17M22k06J03j56J33M2j75j98J99
5147i4J60J38m39N83l17l1K31m02K00k10K02J64k14Q8n3k7P2k95L62Jj76K13o26
5170d70N66o6J30m27M48k39j02K43Q1k37K3Q9k7Q0k33J81k9pj86J76O0r0k3L0
5194b9J12N3o11N02jj32P5j12J79j19J0l5K72l23L40n9p6%j88K39r3K14o57L55
5218h4J3R9n1J54k58q0N55l50O7j58K36l1l09K70KL0K52k72j79K96k60L15l73
5241a16L8J50j49r7Q7J03k8k88M06q4p1rJk0J52k5J1R0j24m4J01m7r9M37l14n9
$$ plain form
5080 -278 -204 77 -146 27 166 247 -63 -25 -113 -289 170 -73 -44 -226 -272 -232 159 -53 -6 182 -187 -92 126
5103 126 25 -40 255 79 73 161 132 425 65 -193 76 215 144 -176 54 208 -85 -295 100 -131 94 66
5125 66 53 192 55 95 282 25 -58 201 77 -79 0 -41 -258 164 -42 61 -95 38 80 -95 -293 -94
5147 -94 66 204 -235 348 31 0 231 -171 29 -181 21 185 -29 59 6 -21 51 -244 118 119 -57 156 -470
5170 -470 96 30 160 -267 181 -58 -160 83 164 -73 -50 39 12 92 -141 40 11 4 -182 -6 54 -36 -59 -29
5194 -29 83 136 -475 27 26 -106 -31 -143 36 -83 -73 -108 164 -159 181 122 46 46 -142 97 4 218 -439 -84
5218 -84 -71 28 -23 131 -127 -207 348 -2 65 -93 143 112 -197 73 75 105 357 85 -94 202 -58 257 -116
5241 -116 -78 72 -77 -174 -87 16 -12 -300 106 22 -49 -58 -57 -77 75 50 61 151 27 -17 84 37 -62 375 61 2
5267BJ20k03K88l39K81k08N19n93K64j01l5R8m51L70J0l1k39K99K0J35n27l6M30
5290G3R7j35j31J64j02n7J24k89L7J69L36k83J27k41Q3L1j28J84R3j54j24J1N5
5313f0J55l8p2o4l4R8J82N8l09O5j9k90J54p6J48J94N1l17J44j1k2r0QK90rp6
5339F0k19K31l6q2O4j2r1j12K89L9k73K51ql1k51J69J11k26K34j49K03k33mK55
5363A79j53m02L31J1J43J76l96pQQ1j08K26J51j84Q0j07k2L39n27N07j41k10k43
5386b68K88k70N53m96J46j3J8J26l4L14l69Po9J88j98J1J11j09L5L39k36j98n8
5409a82L47k33j57K19J59m4l1k34K11j20j07K02LM1k5r9K78l5l26L88j05L0j70
5432A0J78m8m75N86m43L21j04J50l82Jj5M71l24J73k07J51pl17J10k02L35N4j76
$$ plain form
5267 2 122 -81 207 -132 149 -59 460 -133 131 30 -5 93 -358 12 22 -9 -248 51 71 206 -321 -357 73
5290 73 170 35 -96 68 -34 -91 33 -256 -219 -50 286 3 130 -111 -28 3 -125 59 152 -2 -126 -115 -60
5313 -60 95 57 -15 -79 -113 -15 167 225 -84 -19 -38 -328 -174 -250 -102 92 143 -174 -30 -41 -63 -153 -145 145 136 60
5339 60 -159 72 36 -46 18 6 -85 -197 92 131 -142 109 101 70 -181 -12 99 -127 107 -42 161 -72 -76 179
5363 179 26 -376 -45 -34 109 285 -111 -118 -110 -29 -137 89 240 56 136 29 7 346 -181 326 185 -25 -268
5386 -268 20 -250 303 -193 -47 -60 -42 84 50 364 -5 2 -67 121 -77 -66 45 -64 -29 310 74 -124 -182
5409 -182 165 -68 -225 -6 153 109 78 -156 55 -65 -172 30 33 74 49 -50 228 193 -133 255 150 180 10
5432 10 188 140 -335 251 -192 129 25 175 -207 -206 -221 250 -74 99 -108 43 36 -281 -171 -373 -38 16 -160
5455a60K79j42r9K05K3m7J11k58L3q4l2R4J24o8K13k13j12L28j86j2J05q3m6J74
5479A47j32K5J81j41J21l06J76l6R9q3J92l19o9L36j28p3P9N7M1j19k58L06j21
5502b5J12N8l0q8p0J27k33r7N56m87J31K8R8r2K57k73qK50k43j0J55j93n1J45
5526A7J28J53r1k21j85J25J47p4J21J45m63J03K5J0m6L89l38L19J2n27K99Jj94
5549a45M39n34J05n8J26j60K00k10J01j32K46j17J90k35K68j67K8J02j7j9N9k78
5571b08L12j49p9Q5J25k77m1P7J69m6J26q1J3J81l01K22j36K04p8k47J27J63j83
5594b2L52l45J27l50J53L62l87J15j46J21m1J19j71K38j76J47k03N4J4q4K85k84
5616a22J04j11j07N65m30J16n0N3k85L1K40p3mJ41j02J47rk66L44o4J5K53l16
$$ plain form
5455 -160 119 -23 -122 83 106 59 170 -88 -55 -139 -171 -77 47 -21 192 -21 -133 195 9 -3 102 19 -27 147
5479 147 15 40 221 80 201 -105 71 35 134 51 243 -76 -145 191 63 -10 69 126 167 48 -210 96 -25
5502 -25 87 145 115 27 -43 84 -149 -246 310 -177 -46 -18 80 -12 245 -28 -36 214 -29 -39 116 -77 -128 17
5526 17 145 298 207 -14 -199 -74 73 -1 120 265 -198 -95 -70 -60 -106 283 -55 264 276 -251 48 49 -145
5549 -145 294 -240 -135 -193 -67 -227 -27 -237 -136 -268 -22 -139 51 -184 84 -83 -55 47 30 11 70 -208
5571 -208 104 -45 -124 -39 86 -191 -232 -155 14 -32 94 13 26 207 -94 128 -8 196 118 -129 -2 161 -22
5594 -22 330 -15 112 -238 -85 277 -110 5 -141 -20 -61 58 -113 125 -51 96 -107 -53 -39 -123 162 -122
5616 -122 -18 -129 -236 329 -101 15 -35 18 -267 -236 4 -69 -73 68 -34 113 104 -162 182 118 133 386 70
5639G0j38J04k80J92L5L6R7l5k37J91l25K97K60j42l02L6K42k9j10J34k86K65
5661G5q0J55k22q5N1O5L2j17P2j97J07J07J7l25N36l42R0q7K9J56j3k4n8k79L99
5686F2q3K65m67J46J05M5k5k48L79j45K03k30j52K16Q9k03m3K03k15k8j49L83
5708A08j43J96l08L15k89P8R9j34O3j81K25m6J89j93M8J30J5j32k36J10J79n3
5730D0L8P3P6J70m34nj46K23k27M61l48L49l79j29M26l49L63j3k81K8R5J6R4k23
5754h2J58J32j68J65k46L3j09P0K09l77J45J18j19Q9L25k98K7o0M4k29L46J58
5776C31j92k72j41P7pM58K7m71J65K4q2K28j69L5J01r0J20k7K62o44K50l3J53
5799A03p6k39M03l96L68k11l2J43j40K3Q7j83J17p1j6qL21j52j17J05j92K39j42
$$ plain form
5639 70 -68 36 -244 -52 -17 19 116 81 -156 35 -290 7 267 125 -177 -141 101 72 -38 96 -190 75
5661 75 -5 150 -72 -157 -106 -41 -9 -126 -54 -251 -144 -37 -20 -345 191 -151 -61 -148 -119 37 24 0 -58 -337 62
5686 62 -21 244 -223 -77 28 73 48 -200 179 34 237 7 -145 71 160 -43 -86 117 -98 -126 -275 108
5708 108 -35 161 -147 168 -121 -43 56 -78 -15 -196 29 -17 172 -21 27 157 172 40 -196 -86 93 40
5730 40 78 151 227 397 -37 -42 -188 35 -192 269 -79 270 -109 -238 188 -161 202 189 -92 -64 31 47 141 -82
5754 -82 76 208 40 205 -41 -8 -117 -47 162 -215 -70 48 -71 18 343 45 72 12 56 -173 173 331
5776 331 139 -133 -274 -197 -204 254 281 -190 -25 -1 -83 145 -24 11 112 22 142 115 377 -267 -17 -50 103
5799 103 27 -212 191 -205 163 -48 -80 63 -77 -54 33 -150 -33 -104 -120 -128 193 41 -76 29 -163 76 -66
5822f6J1j0J72j96K4k04L06m0r0J22k50J76j17Q5K60j92l4L74m40K32k18j39L37
5845A03l71M1K60K05j52j5m17L58J47j11j60l0L15n1k18q1L09n0o5J01m35N49
5867B32l32K24j3l3L5r4P7j76J29J1Q0m9k42K39p9j1r4P5n3J04Q2j5O7K32o76
5892b80L13%k6L5J02J23j63j20j51Q0j13L55l67J70M99m18k6j1j02J11j27L3P
5915g6o4K87k46J93J74j91k42J14J79Qm70K31K05m08M99m13K28N9l2q3J07q2J22
5938I9j56K12j45L8p6J8K9L7j48j17K58K81m14k7K24r2N1J65q6k18j24L38k60
5961a13K43j17k31L86k15m9k3k3J19R3J12r1L1l2k56J34NN6K9j91M8R5r8RK46
5986A67p89R00j19l70P7L40qk23K62J89m50k4K12j4o6P8j37l34K67J10k06K05
$$ plain form
5822 -66 -55 -65 107 -89 -65 -269 37 -3 -93 29 -221 -45 -162 -77 183 -9 -43 331 -109 123 -95 -234 103
5845 103 -268 -227 33 238 86 71 -346 12 159 48 -112 -142 173 122 -96 -177 132 82 17 118 -317 232
5867 232 -100 124 111 78 113 19 96 -80 49 60 140 91 -151 88 9 -2 -96 -21 -74 30 112 97 164 396 -280
5892 -280 33 33 7 42 144 267 104 -16 -167 -87 -200 155 -212 -42 457 39 13 2 -100 11 -116 -83 -76
5915 -76 -140 147 -99 94 268 77 -165 -51 128 136 -334 -103 102 -306 193 -220 8 67 35 -48 59 -23 99
5938 99 -57 155 10 48 -28 -10 19 56 -92 -209 49 330 -84 -111 113 21 72 237 151 -67 -191 147 -113
5961 -113 130 13 -218 168 -47 -96 -119 -142 -23 70 182 91 122 90 -166 -32 -27 29 58 -133 -85 10 -88 -79 167
5986 167 -622 278 159 -211 -134 206 198 -25 237 426 -24 -48 164 150 84 162 25 -309 -42 68 -138 67
6008F7M44m49j74J2K92k17J66J5k92K03J52o1l1m03J06M04j56k39J65j87K40j18
6030f1k6j2K68k72J63k19L85r1l03M9lK34j04Q9j56j3L8m1J83j51n4r4J63k21
6054b49J76j5K60m00K3L02k54K7J01L2P0k52J13r2J84q6n2NK08r9j6K07j53L1
6078G1J78m05L11o9j95J39k11J47j67J18jj55K58j39J41K32k5n29M09L19m22q5
6100h0J46k14J90J21J13m70L42N2l54j08J18L13l95J40J62q2J09m5o9O2o4k56
6122b69M70k28Mp9J79K38j83k62J93J4q1j37P6K46j03q0Q5K51m1M2m38k1L52m32
6146b04J37M00j57j18J70k99Q9K21j97N4k28J05k70L01n4L9k6o0k3J61l31N11
6168B21n04L36k4k9j08M8J82j53J55Q7j26j18j56J27k9J30kj60J70r0m0O3J44
$$ plain form
6008 67 511 62 -112 -100 192 -25 141 156 -136 67 219 158 127 -276 -170 234 78 -161 4 -183 57 -61
6030 -61 -87 -99 169 -103 60 -159 226 135 -168 -119 -122 112 8 97 -59 -72 -34 -75 108 -43 -97 -191 -28 -249
6054 -249 -73 -88 172 -228 -205 97 -157 -130 -29 3 73 -179 -66 -158 26 -60 -112 -107 101 2 -14 193 40 71
6078 71 249 -156 155 86 -109 30 -181 -34 -201 -83 -84 -239 19 -120 21 253 228 -301 108 427 5 -80
6100 -80 66 -148 42 163 276 -194 148 200 -154 -262 -144 169 -226 -86 76 -6 103 58 -11 51 -13 -269
6122 -269 201 -27 -23 -102 77 315 132 -130 63 77 -4 -141 -65 181 78 -2 83 334 293 335 -103 -124 228 -204
6146 -204 -67 333 176 58 228 -71 18 239 42 96 -132 -27 -297 4 -50 -11 -37 -97 -120 41 -290 221
6168 221 -283 53 29 0 -108 -60 122 -31 124 211 85 -33 -189 -62 -91 39 37 -123 47 -43 -83 -20 124
6191A24j15L8pj80r8L82j89p4k1L34K2r2M9J53k79k13K82j76n9K72M2k00j96L35
6215A34l68J95K44l67K59n9j71P6J36l94K69M0o8P1j21Rj89L00j14J33j82J00
6237f7q3J04j53J74K01o9K4l46J07j15L77k7k25j14K15k18L54K5k65K85k37J12
6259E9l2Q2l15J80q9r9J49M5j33R3J54j18K80l11j43K4M66n83L48j1J37j54o5
6282c6p4N4kJ03j63K6OJ14k14N6j36J94P0j23L08j14j44J2K0O6J4P8K94l56k2
6307C1l9K03k17J23k00K12Pl62L45l5J18k98O9J12j13j37K38q2k37P4M50k65O8
6330F5o8j05N1M8J02k62K5L01l34J63J01k16K20j71R4l7k07N9K92J61nK1j99j27
6354b8o6J5J88j63K59m27M23l18L40l70nJ22J09p4j62L05l46L19J38m04J9JJ63
$$ plain form
6191 124 9 47 40 -140 -238 144 -45 -119 -140 194 216 124 173 326 47 -166 116 -60 -119 153 195 -5 -201 134
6215 134 -234 -39 205 -162 97 38 -133 -57 79 -315 -46 -6 -74 -3 -124 -115 -304 -4 -118 15 -167 -67
6237 -67 -150 -46 -199 -25 176 107 131 -215 -108 -223 154 127 -98 -212 3 -215 139 164 -101 184 -53 59
6259 59 27 109 -206 -26 -115 -214 -65 -20 -153 -60 94 -24 256 -55 -198 -174 292 -291 57 46 183 29 -36
6282 -36 -110 -56 -58 45 -118 -92 -86 28 -186 -130 -266 -72 -2 -125 183 69 -75 -63 -43 23 37 115 409 53 31
6307 31 -8 195 -22 101 -99 113 120 -242 103 68 186 -112 -43 69 -44 -181 57 -25 -262 -188 262 -3 65
6330 65 -3 -108 -57 -9 93 -169 -144 157 -177 -14 87 -129 91 -80 14 -23 -230 -171 121 282 277 298 99 -28
6354 -28 -94 -79 109 -54 205 -222 201 -117 223 -147 -152 -30 79 5 -157 148 -198 121 259 -145 -126 -125 38
6377C8n7m0J04K01j52n5J75k52J18M59n48J60j39p7K36j18L12m19K07j8m5J01
6399A91l70N18n09K03k7J1k17K78k42K20n4M58j45j44j82k38L91P6k67l4j6n4
6421a53Q0p2J74p4n7J34j6k08L79m27M58J48l52l9L2K30m61K24O7k76J7K60pP8
6445A39mJ41l80R3j34K36o6rq2O2J02k8r1NP3k97M96j40k18K4n5k8K69J62m18
6470a48R2O5l2mk39J47L4P3N0j99J48j07M4L09l16J35J6J33Pk48J43K24m51K93
6494A69j79K7J57k44J34k37M1r1L84J0m4r5r9J60k6m6k02K68j70K94j39k04k4
6517a56J20l6K82l40j0J95K21m94L19J6k69R0m2J80lJ1p7p4K09k00N6J91l5K29
6541C83l25k29K16k74J54k7J12K13k78J27K79l67L5N7J14j51J10j73QN8m58L44
$$ plain form
6377 38 -19 -59 45 246 94 39 214 -38 80 539 -9 151 12 -65 171 53 365 -54 153 135 90 191
6399 191 -179 339 -170 33 6 17 -200 78 -164 56 2 460 315 171 -11 -249 142 218 -49 -83 -99 -153
6421 -153 -73 -145 29 -45 -102 32 16 -192 187 -240 218 366 14 -25 7 237 -224 0 67 -209 -192 68 61 139
6445 139 135 276 -104 -11 -145 91 25 16 -66 -4 98 70 -21 -16 57 -240 256 116 -102 -78 -133 -161 108 270 -148
6470 -148 -56 9 -23 -27 -266 -119 -85 -12 38 -161 -13 -120 -76 233 -83 52 68 201 208 -40 103 327 -124 169
6494 169 -10 17 174 -70 64 -173 -132 -223 161 171 127 32 -67 93 67 21 -181 87 -83 211 72 -132 -156
6517 -156 -36 -72 210 -130 -140 55 276 -218 101 117 -152 -62 -104 76 73 84 7 -67 142 -58 -2 189 154 383
6541 383 58 -171 45 -229 -75 -102 10 223 -55 72 351 -16 19 76 190 39 149 -24 -16 42 -416 -72
6563g2L97n67L26j06k29r2K83j88P0K47j10R6J05l70L14mq3K85k18k03l49L13
6585a55L57o1k73L19j00k4p7Pp7P0p6l6l4K89k72N24n93o5K21M78n93J45J3o2
6609g5M60n44J05q9L67k98J01p7J13MQ6k9J18j76k47P52n85m8J75k27K14j07J43
6632A36k21L05qk65j80M5J03j2P5j20J58j92K80j25N2M2k58J87k44J05K70k02
6654f9l3rp8L42j05n1R4m4k55K19M7KJk32J02K8qP4j85L80o76N45M2K13k73o5
6680FR5k9QN4o0j77N5O9r5P2Q6K2j56r9L11k15j4P7J21R4k58J58j53J57r0j64
6706a25M62k09o0J07j66K22m90M8oK75j93r0Q0q4J78k11L15j24K65j93k05J10
6728i4K1n1j40J22K90M2k98j32M09k35p5J36j73K46k78K06M0P2J8j51M4m7R9N2
$$ plain form
6563 -72 325 -242 84 -22 -251 -343 -60 -248 -178 69 -41 55 160 -210 104 100 17 302 84 -119 -468 -155
6585 -155 202 141 -132 187 87 63 -14 -7 -84 -14 -90 -126 -160 129 -143 381 -212 -277 -56 422 -171 -26 -13 -75
6609 -75 385 -159 -54 -143 224 -74 27 -50 63 67 153 124 242 66 -181 571 -14 -62 113 -114 100 -7 136
6632 136 -85 220 212 -53 -233 -188 -85 -97 -22 -142 16 -176 104 -21 31 73 -185 2 -242 -137 133 -69
6654 -69 -102 -111 -189 153 48 -3 91 47 -208 11 58 60 61 -171 -69 -41 -49 25 -160 220 -456 89 131 344 71 6
6680 6 101 72 80 134 74 -103 -48 21 -74 -2 84 106 -50 -149 162 -53 -67 10 131 225 -33 125 -28 129 39 -125
6706 -125 337 128 68 175 9 231 -259 -211 -217 58 -135 -225 -145 -229 -51 -262 53 -71 194 1 -204 -94
6728 -94 -73 -124 -264 -142 148 190 -108 -240 169 -66 -141 -5 -178 68 -210 -4 36 108 126 -25 19 -28 71 123
6752A23o1l06N73k54p2p8M67k93J82k20j22j21%K39K29l96M91m15K27j35Q0k66
6774a28K32Pm5k3j41M3l6J2K61N1j62O2K9j25Ko3j98M3j47O51j45K00l19J9K03
6799B83l21M9K17l05j38L6JJ70J41j25m1L6N7r2J34j84o4J01O1j52K12R3l16O3
6823h4J14k58O1J22R1j66J09M5q5K1K7j60O4o4K12k12K72r3j39J77j16k11j11
6846c84M88k08M00k24k21K31l1k37K03j35J80j05j09L84l12j03K18r1RJ8n9K35
6868A47j32J18k97K57l2m6o2J33J31j81q2J80P7m93L32j4j50K80o8k45L94l30
6890h3J69j06k14J1J34k7J52J68k87J59k42K74j26QK7J78k55K14j13j50J41J41
6912A73k83K90k81K05J1q8P5k26L08r4K18m15p4J51q1J25K12l26J77j29l1J46
$$ plain form
6752 123 62 -244 329 75 3 -75 392 99 281 61 -61 -182 -182 57 286 -110 381 -34 193 58 138 -128
6774 -128 104 111 66 43 -98 -55 -91 -79 182 233 71 133 162 37 39 -24 -222 -179 -326 325 180 380 61 80 283
6799 283 -38 11 228 -77 -215 -179 -178 -8 133 8 -33 3 60 -32 102 -82 -146 -45 16 -136 76 169 -147 -84
6823 -84 30 -228 -167 -45 46 -120 -11 34 -51 -30 -3 -163 -99 -163 49 -163 109 16 -123 54 -62 -273 -384
6846 -384 104 -104 296 72 -149 82 51 -186 17 -118 62 -43 -152 232 -80 -183 35 -56 -47 -29 -88 147
6868 147 15 133 -164 93 61 15 -47 86 217 36 -46 134 211 -282 50 36 -114 166 98 -147 247 -83
6890 -83 86 -20 -234 -223 -89 -116 36 204 -83 76 -166 108 -18 -10 17 195 -60 154 41 -109 32 173
6912 173 -110 180 -101 104 115 27 102 -124 184 90 308 -107 -181 -30 -111 14 226 -100 77 -52 -83 63
6934F3M8o6p6k06L14k37K02n8J20J39o49O57k46j2j02j1K61r1o4j38K31m6j44
6957a11L26j21nk42N20l08j37J96J14m29Q3J80m04K99K0L03j2l32K40j07q0j02
6979a09jL57k62k28K29R4j63k9R6J71k83j1K30rM7m65J75K29N0k90L34j50j39
7002a27K31j21l18L84K24n7m17P6N1q4r1l7M65j79oK2R2RK68m80K11J52n23K91
7026C6J0Oj47J67K06k41N9j16K17K7k00j53o7J14L07r4p3p8p9l07K06J22N2K87
7050B61j41k39MK47K5J41m67P2P8j22j1K13l44M7Q6J73K00k52N1M3q5r9J51j02
7074g0K26p7J81k06j47K14l48K08r3O2Qj1jM9k45K96j10J72l1l56J72O3j74J04
7098a14K89k19J66J21k89o8J70q8o6K41q6j56j42K69l51L51j97K10K56l47L90
$$ plain form
6934 63 111 45 -31 -237 77 -160 42 -16 104 243 -406 251 5 -7 -109 -120 141 50 -14 -152 79 33 -111
6957 -111 215 94 89 -153 367 59 -78 118 232 -197 -114 66 -338 -39 -19 284 272 -60 180 73 -7 -109
6979 -109 -110 247 -15 -243 -14 80 -83 -112 -16 155 -128 -139 91 82 129 -336 -161 68 118 -172 162 12 -127
7002 -127 104 -17 -335 49 273 216 -201 -125 -74 -158 -249 -286 179 0 -6 16 108 117 385 -95 116 268 -255 36
7026 36 46 52 -95 72 278 37 96 -20 197 224 24 -129 -196 -82 225 131 58 -20 -99 -406 -200 -78 -26 261
7050 261 120 -119 -115 132 157 298 -169 -97 -19 -141 -152 61 -283 -236 -150 23 223 -29 22 65 -20 -119 32 -70
7074 -70 156 79 260 54 -93 121 -227 -19 -112 -50 -42 -53 -54 -5 -250 46 -64 108 77 -279 -107 -44 -218 -114
7098 -114 175 -44 122 243 -46 -114 56 -32 -98 143 57 -99 -241 28 -323 28 -169 41 297 -50 340
7119C40m86J59j13M7L15n06L16k2k36O7K42j11j70J20r2q7M27m90K36J37o7J05
7141A31m2m3k32l5N63l74M71l29R3r3j2N7K29l39m4Q9oj23J17J93j96j23J61n
7165A08k1k38K62J8r9l0J02J7j01j03L58l46j17L30m42L90P6j41P5j17R6j98R0
7188c1J05N0J35N5O6k1j61m38K44L2l22L32j62j05M8j1P3L80j30j16K11k81l0
7211g7O3p0R4K6K41j07j58m6j49J50j80N7K5J1J56Q5j24j96K68k34K17k68J46
7234g0j6J29J7M1k07J19K59k32qL1l55J19J12P1p7K09R6K3Ok38j14J74K60k99
7258E0P9k63M17o59N31j12J04j91J99l28L64K7l27n2m0J64K3l7j14K28j4k92P5
7281a68K70j93J79k07L81m23K04m1J25j18r5K55k06j12K2L28k23L7k95N04l73
$$ plain form
7119 340 -146 13 -100 -53 262 -244 72 50 -186 -119 123 12 -158 -38 -130 -217 210 -280 -44 93 26 131
7141 131 89 46 -186 -221 342 -32 439 110 203 110 98 155 384 45 1 90 84 -39 78 271 75 -48 113 108
7165 108 87 -151 111 129 30 0 102 119 18 -85 273 -73 -190 140 -302 88 164 23 98 -19 77 -121 -31
7188 -31 74 124 259 314 380 359 198 -240 4 36 -286 46 -116 -221 -173 -184 -111 269 139 23 234 -47 -77
7211 -77 -14 -84 10 36 277 170 12 -34 -183 -33 -213 -156 -131 -120 36 121 -3 -199 69 -165 52 -216 -70
7234 -70 -86 43 60 101 -106 13 272 40 32 63 -292 -173 -61 10 -67 142 238 261 267 29 -85 89 349 50
7258 50 129 -134 283 -376 155 43 147 -44 155 -173 191 218 -109 -161 -201 -37 -14 -51 -165 63 49 -243 -168
7281 -168 102 -91 88 -119 262 -161 43 2 127 9 -86 169 -37 -149 -127 201 -22 15 -280 224 -149
7302a49l0K18j75J33rj5K5J6mK81k09m8J74o28O84j22q3K57q8k88J20n7j77O4
7326a10J4k01L6L24L0j34k19K63j73L70q0m4R6l65J90n0J43r9j89K34j35j41L55
7349A15j57P2J53m65J56l22M70J60m11J64K26r4n3K5K9j69Q4K1J4p5K57j95j6
7372a1k69M69k29l2K91J2r6J5J2L9k36R1K04l99M87k17J32K6l12M9L2j93q1Q3
7396a33J36J95K07m84J57J34m6j99l6J74m7j22l5j58L21Rj33K3l4J11j23j74L65
7419A08j80L08L5l56K3J23k51J15M8L8L22m54Q8P7j11q2J09o7K77j85R5r4l00
7442c14M48m31K74k40O3L41j84K22Q8m07J84j95M25k74k17L12Pr0J08o4R9j99
7464d4R4o9K00m68L34j17K36k60m2k00J0M34l30K29j45Q7L51n71L45j71J1N13
$$ plain form
7302 -149 -179 39 -136 -3 -12 -27 -2 14 10 291 82 34 208 -420 264 142 59 316 228 -60 60 3 -174 -110
7326 -110 -96 -297 -261 63 93 -41 -260 3 -170 200 120 76 172 -193 -3 -53 90 -9 -198 36 -99 -240 115
7349 115 -42 30 183 -282 -126 -448 22 182 -229 -65 161 67 14 39 68 -101 -17 4 18 -57 200 5 -11
7372 -11 -280 189 -40 -72 219 231 135 150 162 201 -35 56 260 -139 348 131 263 289 -23 26 58 -135 -216 -133
7396 -133 3 198 405 -79 78 212 166 -33 -69 105 58 -64 -99 -257 64 73 -60 -37 -71 40 -83 -257 108
7419 108 -72 236 271 -85 -62 61 -190 -75 -27 11 333 -121 -33 44 -67 -149 -40 -107 170 -15 80 -14 -314
7442 -314 134 -297 -23 -263 -200 141 -43 179 267 -140 44 -151 274 0 -217 95 102 12 120 56 155 -44
7464 -44 50 -19 181 -287 47 -70 166 -94 -136 -336 -326 108 -222 7 -138 -51 300 -271 74 -97 -86 427
7486D27o98K19jM0o5m9J61j01L31j33k50l58M11j68K40j47K43j47j05K23k08J45
7508A0k05K28mj50rJ60P1j15Q1j38mQj55J51M0j34M8K95k39J61j54J29R1J04l77
7533a07K26l88K58j55m4L94K5l73K81j05k8M0r3O2J79m86K52m9J91N4Q9n3k11
7556d1K55j84J83n0J29m46K01j6M8n1j87J58J93k24j13K76R7K4k40j19J42J73
7578B08o0k53k14M82j80L03m13L25k15k11K98K05Om03NP2j0J19r1j2R7q0K90k15
7602E3l21L28l1n8k6j44K00L7%K09k85J68k07J9J26l3q7p3J00P1J42k72LK2Q1
7627B2M11j96J08r8k22k4j19j2K55j23j86K24M0k35K01J8j64m1J02J24k18L0n5
7650a58J72J79j79K76j96j3k71J86r7L37k96K32j29O1j67r7J38j44L79j34K8j15
$$ plain form
7486 427 -271 -52 -53 -13 -78 -127 34 -67 264 131 -119 -477 -66 -234 6 -141 102 -45 -150 73 -135 10
7508 10 -195 33 29 -121 -130 30 101 -14 67 -71 -75 -67 -222 -71 -31 -165 -117 178 -61 100 -54 75 166 270 -107
7533 -107 119 -269 -11 -166 -210 184 209 -164 117 12 -16 24 -69 -7 172 -314 -62 -111 80 134 223 170 -41
7556 -41 214 30 213 163 292 -154 47 31 79 28 -159 -1 192 -32 -145 131 228 252 12 -107 35 208
7578 208 148 -105 -319 163 -17 286 -127 198 -17 -228 70 275 281 -122 -117 -45 -55 64 -27 -39 58 -22 268 53
7602 53 -268 60 29 -29 -55 -199 1 38 38 247 -38 130 -77 -58 68 35 -52 -125 -25 46 188 -84 -81 -59 22
7627 22 433 237 345 247 25 1 -118 -130 125 2 -184 40 80 -155 46 64 -100 -141 -39 85 -133 -103 -158
7650 -158 14 193 14 290 94 81 -190 -4 -101 236 -60 172 43 104 -63 -160 -22 -166 213 79 107 -8
7672hj93J45Q5J66M3j98J21J4l26q6K92J6K00l36p0K94l42Q0J57Qr8N6M4j73J01
7697hl4K7q1k28K93K27j59K2k5Q6m1n5l0J94p0P9l62N3M29l02K57m82K95Q7n0
7722A22r3j66K71k7j76J69n1j54L0k73J96Q1l06P27Oo36K79Q4k8Q5r1k06K56r5
7746DJ0j62K27k24Q6R4l40K19J26J43J33k58kj6l47L51N1m5j06J09j4l80M61j25
7770ej1O3K80k7j09Q2j80l36M47m56L62j46J4j4J62j37n8L8J30j68J55N7k6l34
7794b17L95j78OK50m18K09j16o3K35k17L8J08J06k76L12j91j2N8q2P6L1Lp3p6
7818i2R0O4M8k40K43j8Rq7j34J48k05J19m6Jo1r3K71K09o2j9J33j72K1m11M55
7843A71l76j3M07kn5j07n7j41K23j15K2J4o8K20j43M5n4K26m43J53K80m62R8L71
$$ plain form
7672 -8 -201 -56 29 195 238 40 161 175 -151 -237 55 71 271 -65 -135 159 -183 -103 54 62 -36 20 64 -109 -8
7697 -8 -42 -15 -96 -324 -31 196 37 59 34 120 79 24 -6 188 118 197 -165 -112 317 15 272 -210 85 172 122
7722 122 29 -137 134 107 -69 100 49 -105 -75 -348 -152 -71 -377 350 356 -280 -1 83 55 140 49 -157 99 4
7746 4 14 -148 79 -145 -59 35 -305 -86 40 183 316 58 56 40 -307 44 95 50 -56 53 39 -341 120 -5
7770 -5 -16 47 327 300 191 273 93 -243 204 -252 110 -36 -22 -36 126 -11 -69 -31 99 -69 86 143 117 -217
7794 -217 178 0 6 256 -162 47 -69 -132 103 -114 -76 32 138 -138 174 -17 -29 29 -53 23 54 57 -16 -92
7818 -92 -2 62 110 -130 113 95 104 17 -117 31 -174 -55 -101 -100 -161 -254 17 226 164 145 278 106 127 -284 171
7843 171 -205 -218 189 187 132 25 -32 -173 50 -65 -43 -29 -97 123 -20 25 -29 197 -246 -93 187 -275 -177 194
7867A94j84o3Km8j49L72n9K09k93k66L07j34j4j49N4M9L68k05j97M18l78l8K81
7890G7j68J6K08q5m0O8l63M21Pk01K21j28n5J40o3J16j25j40N7J31R4m51M82p6
7914A43l98Q5k13L61j9J2K6q7R8j37N3m0J75K7p2j69N11m73K42j44j87J16K16
7937A26k19J56N9p9j25l6K08P4p9K64k21Q4m32J2K63k28K46M4k34K14l33L75j52
7960a3J14j0k06M2J20k6k10L65m49N84l48j64J66J17k76J48K20k39J57l19m2K55
7982a4J45j35J78k71P1O6O5N3Q7o2k77J43J0p9QJ8J28J2J08l72J88r0lj36R7m8
8008a10l1o4o5M61M4k97K57k98J60L0n4p5K75n5j73j45K24l65K62k10P2K5J35
8031CK11l39K08j78J62j3K25k44j40k73M52m3k57K96j40QL5k27K69q1m5j31L45
$$ plain form
7867 194 10 -53 -51 -99 -248 124 65 274 -19 -285 22 -112 -126 -275 -221 -172 196 -9 -206 212 -166 -204 77
7890 77 -91 -75 133 48 8 76 -287 134 141 -60 161 33 -22 118 55 171 46 -94 -37 94 188 -263 219 143
7914 143 -255 -170 -383 -22 -41 -29 -3 -90 8 -129 -76 -116 59 86 14 -155 356 -117 125 -19 -206 -90 126
7937 126 -93 63 122 43 -82 -118 90 164 85 349 128 212 -220 -208 55 -173 73 117 -117 97 -236 139 -13
7960 -13 101 91 -115 -73 47 21 -189 176 -273 311 -37 -201 -35 82 -194 -46 174 -65 92 -227 -269 -14
7982 -14 131 -4 174 -97 -26 40 105 158 245 183 -94 49 59 -20 -12 6 134 146 254 -118 70 -20 -23 -159 -62 -110
8008 -110 -141 -205 -270 191 235 -62 195 -103 57 87 33 -42 233 178 5 -140 84 -281 -19 -229 -157 -132 3
8031 3 214 -125 83 -95 67 54 279 35 -105 -378 74 31 -226 70 -70 -62 -27 -254 15 -66 -111 -242 103
8054A03q3O2j61j87M39m0k7p2o0n3J75r6M1L1N4j21K3J85l95L36k76k30K65J34
8078D7K27l09M25n36n6K41q0j20J37M1o1K22j23l54K16L69r3J8o0J37k53o6M2
8101A1O4q7L5j62O9j75R1K40R6l82K40n3r6K14lj54k5L42k52j66J5k0J75J54m2
8126A29J14k8m37J28Oo8J16J68p0k8j93J17K3O4r9n1Q8l1J06j78K89p5N3J21l19
8151e5j06L4K26j20J55j93rK03j07j9J81m6J59P7l72R7k97K99j00k9J99j80P3
8174G0j16j77K40j42L56k49L7K73m78N39k89n7k4K30j49J01j47
$$ plain form
8054 103 20 82 -79 -266 173 133 106 34 -26 -79 96 0 41 72 126 5 28 213 -182 154 -122 -352 -87 47
8078 47 274 -35 390 -146 -202 39 -41 -161 -24 17 -44 178 55 -299 -83 286 193 211 151 288 35 -31 11
8101 11 75 -12 23 -139 -70 -245 -154 86 182 -200 40 -13 -109 105 102 -52 -77 265 13 -153 -138 -158 17 171 129
8126 129 243 215 -222 -94 -88 -156 -40 128 58 30 -163 -46 -23 41 -58 -109 -21 -52 54 -124 165 90 143 264 -55
8151 -55 -161 -127 99 -21 134 -59 -68 135 28 9 190 144 303 380 8 105 -192 107 7 -22 177 -3 70
8174 70 -46 -223 17 -125 231 -18 19 292 -186 353 64 7 -17 213 64 165 18
8191A8
$$ Imaginary data points
##PAGE= N=2
##DATA TABLE= (X++(I..I)), XYDATA
0@%%%%%%%qJ6j6J6k4L2m0M8n6P2q7J02j19J36j59J83k08K40k76L16l60M08m63
30b47N23n87O59p37Q23r17J021j133J255j392J543j710J893k097K325k578K864
47A508l187L557l986M492n097N833o754P947r561J1878j5503K2016l7297J34431
61A10277Q9872k86479J9458J93185j4822k01675L7881J69012j5722j36352L9547
72D182J00103m7703j00229L7646O1412l3986l9786M8327L7916k4455l1404q105
84C918j2640J0722L0471n176k8249K3215L1569l4229l6033L4901J9013m9176q505
97b0199O5901P709o2771M450O3057k4163p6664J7093O9711j0831m2710K5289K4031
110C9903m5368j7698N1985L604o3558P035P3007j1820p3375J7548O6897k8373
$$ plain form
0 0 0 0 0 0 0 0 0 -8 8 -8 8 -16 16 -24 24 -32 40 -47 55 -64 72 -87 96 -112 128 -148 168 -192 216 -247
30 -247 276 -311 348 -389 434 -483 538 -595 660 -732 811 -899 994 -1103 1222 -1356 1508
47 1508 -1679 1878 -2108 2384 -2713 3120 -3634 4313 -5248 6630 -8873 13143 -24154 110277
61 110277 200149 -86330 -66872 126313 111491 -90184 -52303 116709 100987 -35365 4182
72 4182 104285 56582 -43647 -6001 55411 21425 -18361 29966 67882 43427 12023 3918
84 3918 -8722 2000 32471 27295 -954 22261 53830 19601 -16432 18469 37482 -11694 -20199
97 -20199 45702 53411 -9360 -4910 58147 33984 -42680 -25587 44124 33293 -9417 15872 39903
110 39903 -5465 -23163 28822 32426 -31132 -24097 48910 37090 -36285 -18737 48160 19787
122A9787o2694K8945M9178l0100k3965M2138O171n8604m291N7258Q30m5505J3650
135g202L9741k6324l6727L0413K5845l8418j8241M4744J4847m0901l195L9187
147B3769q469m1142P438K5873j2186r77L4846q251n2326Q895N3371j9633n4604
160d3396L0124N6557l2298m4632M2550L4216n6240l1997N9975K1190o5346n734
172c5031Q3415R221r0957j7420P9489J1519p2681k653P2150M133o1350j670N0607
185B8772l773m6292k855L5781J0231j8645j0363J4160J7726r792l5835p798M1873
198A3190K3388l5964k3093L7499K0375m1902k0611M2415J2095m6999m414N6585
210C2564K804n7642K894N7097j3729o3616J4996O3180j1250m9862J6084L3951
$$ plain form
122 19787 -42907 -13962 35216 5116 -18849 23289 29460 -29144 -33435 23823 24653 -20852 -7202
135 -7202 32539 6215 -30512 -99 25746 -12672 -30913 13831 28678 -12223 -15418 23769
147 23769 15300 -25842 -18404 7469 -4717 -5694 29152 20901 -31425 -22530 30841 11208 -43396
160 -43396 -13272 43285 10987 -33645 8905 43121 -13119 -45116 14859 36049 -29297 -35031
172 -35031 48384 57605 -33352 -50772 28717 40236 -32445 -35098 37052 41185 -20165 -21835 28772
185 28772 24999 -21293 -24148 11633 21864 3219 -7144 7016 24742 14950 -20885 -28683 13190
198 13190 36578 614 -22479 15020 35395 -6507 -27118 15297 27392 -19607 -24021 32564
210 32564 35368 -22274 -19380 37717 23988 -39628 -24632 38548 27298 -22564 -6480 27471
222B7471k7090k3918L3718J5140l8860p411M0883J393l8378N724L3225j4917l0498
235b3518K0438K5901k4416j7181L0812Q313m0964o320M3536P284l7846k497K9404
248A2946p662k2923J5959J6086k4647r902L1816O171l4470k300L2947k432l2371
261b0782L032K6112k527j2595J0141K120k1881K33K6853k828k6955Q750K8469
274A8142j2877k6817J6849K1053k3846j7176K9975J2772l1733l914L8371p87m3821
287b3809k700L8555K465k7577N686K3113j0702j8690J1630J3179j4624j0051J4357
300H32Q047p672o11M482m432p69N925j0426j3547K1803K7197k4481l3625K5868
314a409L4401l0645l3334L4252L0432l7366k4281M2461K0387m5601j7238M4818
$$ plain form
222 27471 381 -23537 10181 25321 -13539 -20950 19933 21326 -17052 -11328 21897 6980 -23518
235 -23518 -3080 22821 -1595 -18776 12036 20349 -20615 -26935 16601 23885 -13961 -16458 12946
248 12946 5284 -17639 -1680 14406 -10241 -20143 11673 17844 -16626 -18926 14021 11589 -20782
261 -20782 -17750 8362 5835 -6760 3381 5501 -16380 -16147 10706 7878 -19077 -10327 18142
274 18142 5265 -21552 -4703 16350 -7496 -24672 5303 18075 -13658 -17572 20799 20012 -23809
287 -23809 -26509 12046 14511 -13066 -7380 15733 5031 -13659 -2029 11150 -3474 -13525 832
300 832 8879 1207 596 5078 646 -123 5802 -4624 -18171 3632 30829 6348 -27277 -1409
314 -1409 32992 2347 -30987 3265 33697 -3669 -27950 14511 34898 -10703 -27941 16877
326A6877J1485m4330o829M6317O102m2145n548L3093r12k6170R072K2435j3761
339E686j7937J6910J3103j9344r503J7396L234j4445L795J2651q226p962J1752
352G110J677j9037J53K3572J206k1924j792J6716j755j3082N838R968q925p089
366g364J2437L376j4698r63J4327k840j4912O314J4190p147q263R703k48j7834
380a3922K866K2267l432k0941P521J8809j0691j6611J3102J1729j8762q748K2771
393E958P991k2885m562K4594R79k8288j478K6395K517j9852J899J4431p240j1407
407a0948J1182P346j3749l570J5586J082j2372K737Q829p954p083J0942K834j2396
421g534M215J9102o399k3943M991K3356n980k1750R536K0588j1193j7099J5151
$$ plain form
326 16877 28362 -15968 -22797 23520 29622 -12523 -18071 15022 14110 -12060 -2988 19447 5686
339 5686 -12251 4659 17762 -1582 -11085 6311 9545 -4900 -1105 11546 3320 -4642 7110
352 7110 8787 -10250 -10097 13475 14681 -7243 -9035 7681 5926 -7156 -1318 8650 -275 -7364
366 -7364 5073 8449 -6249 -7212 7115 4275 -10637 -4323 9867 2720 -5543 4160 3912 -13922
380 -13922 -11056 11211 7779 -13162 -5641 13168 2477 -14134 -1032 10697 -8065 -16813 5958
393 5958 13949 -8936 -13498 11096 12075 -16213 -17691 8704 11221 -8631 -6732 7699 459 -10948
407 -10948 234 7580 -6169 -9739 5847 6929 -5443 -2706 6123 -1831 -8914 2028 4862 -7534
421 -7534 -3319 15783 9384 -14559 -9568 13788 7808 -13942 -4406 16182 4989 -12110 3041
434C041J5317k0486j4204K1550J2190k1147q705K3125P733k0869q021J4507M167
447H198q031J588N251n522l590P874K224p945j448N900j45k982L038J436n634
462B12Q40P332m993j1177Q019J5345p736j5897O536J2958q748q838J1539N051
476A0443j4362j877J6888m01j8332J968J6427m104j4410N794J2328o289q770O642
490A945K969j0626M83J4602j322j5865K009J5333m499j4300O852J1212j0407q075
504i689J3940N944j6391l533J7528k28j9520J655J9899r21j6052J337J1457n091
518C35r012P413P136q378n150R582M188r605k577P866p76o905L021O069m378j997
534c168P906j772j1904K177J3059j747j1301L144R565n009o214O484M089q448
$$ plain form
434 3041 18358 -2128 -16332 5218 17408 -3739 -12444 10681 18414 -2455 -10476 4031 8198
447 8198 167 1755 7006 1484 -2106 5768 7992 47 -1401 4499 4354 1372 4410 5846 212
462 212 1052 8384 3391 -7786 233 15578 7842 -8055 -1519 11439 2691 -6147 5392 10443
476 10443 -3919 -5796 11092 10691 -7641 -5673 10754 6650 -7760 -1966 10362 4073 -4697 1945
490 1945 4914 -5712 -5229 9373 8051 -7814 -5805 9528 5029 -9271 -2419 8793 -1614 -9689
504 -9689 4251 10195 -6196 -9729 7799 7571 -11949 -10294 9605 8684 -7368 -6031 5426 335
518 335 -8677 -1264 5872 -2506 -7656 1926 6114 -3491 -6068 1798 1022 -5883 -2862 3207 -1171 -3168
534 -3168 4738 2966 -8938 -6761 6298 4551 -6750 -3606 5959 950 -5264 1220 5309 -3139
548c139k910J0131J625q479r45Q542p76p962R31O285j067k371M203n96p140K045
564a623Q656l188q816N106Q582o484n930Q794L520j1776j792J3244k69j3728L275
579b429J5284m281j5738L857J3201l882j0349O355Q478q411o982R803O049j1300
593c45n163J1334L991j0542j413R207j047p655K082M843m638j167P908m8r086
608a739n02P820j183o556K510N274l933l255O170K179q485k897Q791J491r332
623c647m85J0133R28q515j013N369k101l415M548K338n996j811O954N06n932m78
639b617L681j207j362K838L01m297J543N056l745p225M070Q663k433q039K485
654b288N903m031m109M622K336o540n82R011O41r492N43Q001k020p931K548O201
$$ plain form
548 -3139 -6049 4082 5707 -2772 -3717 4825 4049 -3913 -2982 3303 2236 -135 4068 3472 -3668 -1623
564 -1623 7033 3845 -4971 135 8717 2233 -3697 5097 8617 -3159 -4951 8293 8024 -5704 -2429
579 -2429 12855 8574 -7164 -3307 9894 6012 -4337 2018 10496 2085 -4897 4906 10955 -345
593 -345 -5508 5826 9817 -725 -2138 7069 6022 -1633 449 5292 654 -513 7395 7347 -1739
608 -1739 -2241 5579 4396 -2160 350 5624 1691 -1564 4606 6785 -1700 -4597 4194 5685 -3647
623 -3647 -4132 6001 6929 -1586 -2599 2770 669 -2746 1802 4140 -1856 -3667 3287 3793 -2139 -2617
639 -2617 1064 -143 -1505 1333 1634 -2663 -1120 3936 191 -7034 -2964 5699 3266 -4773 -2288
654 -2288 3615 -416 -4525 97 2433 -4107 -4689 4322 4963 -4529 -3986 4015 1995 -5936 -3388 2813
670B813k126k446M474l11o723Q97P973j637q047K098P941k105o469L039M833m228
686b4m137O017L381o802j675P867N03r049q67Q664J200n917N00L754k010k430
702a025L085J039m613P5M810K53l068Q30J932j438j808J159L96j803J588L703
718E115j878n254J935M898j875m703K857L066l188j850N125k26o602R35O607j636
734C326o200K759O076l205n366K608L088l408p72M469J72n491P12N227j297n659
750b961R37M882j835l186L334K392m480j533N218j012o643K595P456k521p033
765d390K734N542l914m041M531K667n853j366O901P51o736p24N731q1n308R18
781b638N255j691l695K120K223l761j243N279J021n752r1N202q32m286J951K612
$$ plain form
670 2813 687 -1759 2715 2404 -4319 -3422 4551 2914 -5133 -3035 4906 2801 -3668 -629 4204 -24
686 -24 -4161 1856 5237 -1565 -3240 4627 5130 -3919 -4786 3878 5078 -839 -339 3415 1405 -1025
702 -1025 2060 3099 -1514 -1439 3371 3624 556 1386 3318 1880 72 1231 1627 -176 1412 5115
718 5115 3237 -2017 -82 4816 2941 -1762 1095 4161 973 -877 4248 4022 -2580 -1645 4962 3326
734 3326 -2874 -115 5961 2756 -2610 -2 3086 -322 -1094 3375 3547 -1944 -1232 3995 2698 -2961
750 -2961 -2024 2858 1023 -2163 1171 3563 -917 -2450 2768 1756 -4887 -2292 5164 2643 -4390
765 -4390 -1656 3886 -28 -4069 462 3129 -2724 -4090 2811 3562 -3174 -3898 1833 1752 -3556 -2638
781 -2638 2617 926 -2769 -649 1574 -2187 -3430 1849 2870 -2882 -2973 2229 1397 -2889 -938 1674
797A674l373j048M587J173n034l89M964q04m975R29M677j49l204J039K144k651
813d40j024L415P65m266o53M896N28l926l1L233j083k584K839J493m002M45M583
830D188j035n910J195O026q77m564J148L782k767k185L208J447m265j516N919
845C794J324n705j286N670O90n677p15M771m5l211J971J782l317j151L957L84
861C236m149o03L755J23k568M78J571j535j219K466M66k980j53L983m23m626m68
878b646L939N93l127L14K510j520k119K523J441l731j493L718J530l321n21K881
894I71P5k366l59Q18p94O9J980O9k446J04J832M62k006m47J446o7p70J252N99
913D22k294p14K648M38k974K15L089K4k366j92J348r02m77K165J61k427M12K551
$$ plain form
797 1674 -1699 -2747 1840 3013 -2021 -2410 2554 1750 -3225 -2296 2381 2232 -972 67 2211 -440
813 -440 -1464 1951 2716 -1550 -2203 2693 3221 -705 -736 2497 1414 -1170 1669 3162 -840 -395 4188
830 4188 3153 -2757 -1562 4464 3587 -977 171 3953 1186 -999 2209 3656 -609 -2125 3794
845 3794 5118 -587 -1873 3797 4487 -1190 -1905 2866 2821 -390 1581 3363 46 -1105 2852 3236
861 3236 -913 -1516 2239 2362 -206 272 1843 308 -911 1555 2021 -959 -1112 2871 2448 -2178 -2646
878 -2646 1293 1886 -1241 -927 1583 63 -2056 467 1908 -1823 -3316 402 1932 -1389 -1910 971
894 971 1046 -1320 -1679 -861 -1655 -1586 394 463 -1983 -1879 -47 415 -1591 -2038 -592 -659 -1429 -177 422
913 422 -1872 -2586 62 500 -2474 -2259 830 854 -1512 -1704 -356 -1258 -1735 430 591 -1836 -1424 1127
931A127m98k264L80Q02O31r94O64J350r39o93J121M62k510l39L162J086l296k38
949i86K854m99j909Q54J129j423p39K537N94k315n48J855K54j900K94J414K10
966A676l68j63j72m90n20J279Q46j402m90J597K86j251j59P47j152q91J915Q54
984B142j929P5J931j40k941M22J423l0r80M95L83o35R3J167j11j594n75J304J008
1003A508j171o10M19M94j346M83P28j252j60J768r3k120o25J943K61j326J28M52
1021e19n24L53J080n70j748j15J986j65j563J04J632O15j771q46J165k90o74J363
1039d87N18j459j244K481J048k387j541K302J181j785r1Q31j03o27O78R0q93J07
1057a381J100Q36j256p57L97J130n13k37J78R3K16P09j10r77q56J729L97j051
$$ plain form
931 1127 629 -1635 -1255 -453 178 -816 -152 1198 259 -434 687 1149 -1361 -1700 1462 2548 -748 -986
949 -986 1868 1369 -540 314 1443 20 -719 1818 2412 97 -451 1404 1658 -242 52 1466 1676
966 1676 1308 1145 973 483 -37 1242 2088 686 196 1793 2079 828 669 1416 264 -627 1288 2142
984 2142 213 288 2219 2079 -862 -440 983 953 -27 468 851 216 309 1476 1365 -229 -804 500 1508
1003 1508 337 -273 146 640 -706 -223 505 -747 -907 861 768 -1352 -1977 -34 227 -1099 -971 -519
1021 -519 -1043 -690 390 -180 -1928 -2043 -57 -222 -1785 -1681 -49 566 -1205 -2051 -886 -1176 -1850 -487
1039 -487 31 -1428 -2672 -191 857 -1530 -3071 -769 412 -1373 -1464 -633 -736 -1363 -685 -595 -1488 -1381
1057 -1381 -281 555 -701 -1458 -1061 69 -444 -681 -503 -410 -194 515 405 -572 -1428 301 698 -353
1075c53n63J553N65r93k51N62n90n76J601K86j318k14R72P45o47q07J91O98k02
1094F59p0R1J07o31L53R79q55j215J409J299j044j102O90O5m23K59O35m81q49
1113a24J164M67r64n78L40N33k80n54L46N03k02m32N62o19m60L63R14n10j098
1132f29N31J193p06p29K34r9n17L28J270o42j249P14Q41j041r92R28J125r38k32
1151f10j20K80l08m02P48M51j323n6J387L16j532k47J000l45q50M29R99l93k97
1170h73O88j63r70P1J77N33m2m76K68K36K88n48j0j81J47O64m6o50J52O14l0o49
1192h00l11J063R0k99O43J49j455L33J165o4j316L42Q79N81n89k08pl64K5O56
1212E13K24m19m41J161P89j161j015O20J389j312l20P34M0k13O54L12j097m76
$$ plain form
1075 -353 -916 637 1202 209 -42 520 -70 -646 955 1241 -77 -291 681 1426 779 -28 163 861 659
1094 659 589 680 787 156 509 1488 633 -582 827 2126 1082 -20 670 735 312 571 1206 725 -124
1113 -124 1040 1507 543 -35 305 838 558 4 350 853 651 219 781 162 -298 65 979 469 -629
1132 -629 -98 1095 389 -340 -106 -205 -722 -394 876 234 -1015 -301 540 -501 -1493 -565 560 -378 -610
1151 -610 -730 -450 -758 -1160 -412 39 -1284 -1340 47 363 -1169 -1416 -416 -761 -1611 -1182 -183 -576 -873
1170 -873 -185 -348 -1318 -1247 -1070 -537 -579 -1055 -787 -551 -263 -811 -821 -1002 -855 -191 -237 -887 -735 -121 -151 -800
1192 -800 -1111 -48 42 -257 386 535 -920 -587 578 514 -802 -460 419 1000 411 203 196 -168 -143 513
1212 513 737 318 -123 1038 1827 666 -349 271 1660 348 28 762 802 589 1243 1555 458 -18
1230a8J003M53r41l6K73M01l18k85j97l63Q37N13J86j277j56R59M10j019o27J027
1250H25P4j27j27N22l43j234P15O74r11q21J646O07j156n15O31P5n97j06K37n87
1270e18O6R38J02q28k41L13M90m42o57N76L91p98J05L98n45m65O89J034j102o73
1290a167O34R52j138k26N25m49J88O17K37j006K4Q06k72m17m35O94K03M9k65M99
1310E3k41o13Q54N10j047j094J723P37j316o90J781j17j207K02Q09j73q58J018
1328C31N68r39m74R22M89n35l10N58K78n96J37N52o25n09R83O45j178j47R08N11
1348A569j256j99J165o65m67P73P23j028m95J249J46j286n04J031M21r86M93Q53
1366A537p27l93J66R44q21j059Q74R58p42j034Q32M26r36m5J329o18j101P68J042
$$ plain form
1230 -18 985 1438 497 461 734 1135 817 532 335 -28 809 1322 1508 231 75 1034 1444 425 -202 825
1250 825 899 772 645 1167 824 -410 305 979 68 -753 893 1500 344 -171 460 535 -62 -168 69 -518
1270 -518 -452 486 588 -240 -481 -168 322 -120 -777 -201 190 -608 -503 -105 -650 -1115 -426 608 -494 -1167
1290 -1167 -533 419 -719 -945 -420 -869 -681 -64 173 -833 -809 -3 -275 -692 -1127 -433 -230 -181 -446 53
1310 53 -188 -801 53 563 -484 -1578 145 882 -434 -1124 657 540 -667 -465 344 171 -687 331
1328 331 899 -40 -514 408 897 362 52 610 888 292 429 981 356 -153 830 1475 297 150 1058 1569
1348 1569 313 114 1279 614 147 920 1643 615 120 1369 1515 229 -275 756 1177 191 684 1537
1366 1537 810 417 583 1527 706 -353 521 1479 737 -297 535 961 25 -20 1309 691 -410 358 1400
1385A400j302q01J231N60j438J44J071m00j201Q35N63o94j304J218J170r18j108
1402i74P46J099j317n57P62J93j089M57J417j017j415J020J469j308j169J285
1418c98N44q49j38J083q04p64O93R98j010j137J293Q63r16j226J111N11q74k03
1436a223Q86J64j023J22J520r02j317J065J458j223q72J368N83j230r0J131o08
1453a91j093R81J350r00j297R50R30p20q67Q73M97r21J1J503r11r00J166R64r69
1472D56j190J129J244j551o45J230K25j181L85J356o12j252P85J253r34r87M28
1489A39R96n54l32L19M66p60K14N26k82j384K39J458n95q68P69R92j064k10Q63
1508I32l00r74L13J228q90j105J017J015j097r99R60O92r75k50Q64l35q41N35
$$ plain form
1385 1400 98 -703 528 1088 -350 -206 865 465 -736 99 662 -32 -1336 -118 1052 134 -974
1402 -974 -228 871 -446 -1003 -241 -48 -1137 -680 737 -280 -1695 -675 794 -514 -1683 -398
1418 -398 146 -703 -841 242 -562 -1326 -633 365 -645 -1782 -489 374 -542 -1768 -657 -146 -1020 -1223
1436 -1223 -337 -173 -1196 -1074 446 -456 -1773 -708 750 -473 -1345 23 606 -624 -714 417 -191
1453 -191 -1284 -303 1047 147 -1150 -200 730 10 -857 16 513 -408 -397 1106 195 -705 461 1425 456
1472 456 -734 395 1639 88 -557 673 898 -283 102 1458 846 -406 379 1632 698 -289 139
1489 139 1135 581 249 568 1034 274 488 1014 732 -652 -413 1045 450 -418 351 1343 279 69 932
1508 932 632 -342 -29 1199 309 -796 221 1236 139 -860 100 792 -183 -433 431 96 -745 -210
1526b10O07n41p74K96J415p66r94O69K19n36m58P95L95j232P71R03j126j029J179
1545d17L71r87J26O89M90j397O03N84o31p99Q83N25m21j053P30P41p36l71Q07
1564b63J94o95o3J053l90q87P50N01p71m40Q04L52p72L09P04m45j000O51R47o26
1584h7l86Q54Q8m98m21R54m27n47j0J001p9j190O51J101o84q47Q52N29j047J28
1604f5J004m74m96O29P76r21q48Q93M99n86l40P19l42m11L39P32k08j065P90M76
1624A101n41j022J058O09p53j020J405K05q72o2J147m21j132N85Q59q03n73Q60
1642F30L66p85l78Q25k51p89N27L98n46n70O05O67j010l76O05O58j136m22J063
1661H1K33j231N98P04l58j159R67J110j243p41J174K08j049j23R72l11j184P52
$$ plain form
1526 -210 397 -144 -918 -622 793 27 -967 -298 -79 -615 -1073 -278 117 -1115 -344 559 -567 -1596 -417
1545 -417 -46 -1033 -907 -218 272 -1125 -522 62 -569 -1368 -485 40 -381 -1434 -704 37 -699 -1070 -263
1564 -263 -69 -764 -827 226 -164 -1051 -301 200 -571 -1011 -207 145 -627 -318 386 -59 -1059 -408 539 -87
1584 -87 -473 381 469 -29 -450 504 77 -470 -480 521 442 -748 -97 1004 320 -527 325 854 -193 -65
1604 -65 939 465 -31 598 1374 453 -395 498 997 411 71 790 448 37 376 1108 900 -165 625 1101
1624 1101 560 -462 596 1205 452 -568 837 1042 170 108 1255 834 -298 287 1146 343 -230 630
1642 630 996 211 -167 658 407 -382 145 543 -3 -573 32 699 -311 -687 -82 576 -560 -982 81
1661 81 314 -917 -319 385 27 -1132 -165 945 -298 -1039 135 343 -706 -829 143 -168 -1352 -600
1679f00J217o39j265O53Q14m42r28Q85L17o77j76Q39L4j092J90J180m64r43Q07
1698b90J044j138m88R67J45r04j18J387n80j042R33J076j253l83O79P79r47k28
1716c61J024l6q38k63P97j64o40J16J473q25r16J009O45r32m45J112J71j239K77
1735c5J121m40j142Q87P70r23l49N94M68q37n7R21k48q21L46O74k33p18M43M63
1755H84n87m14N08N79r58l9Q85k42p87N32N73m90p88P42L30p46j23P32m70m06
1775b85j59R77k00r40L65N50n0r61P24L19p90j78R12k1j071R0J109o16m29L59
1795b95O88m35q85P09J97n88m1N44l79n19Q09M61q45l45O78J83k58k88L28k26
1815e07P0J04O99o54o67P39K59m63p20R19N61p66l5M55k02m73L51Q46q24m97Q87
$$ plain form
1679 -600 617 -22 -1287 -634 180 -262 -1190 -305 12 -665 -841 -2 32 -1060 -870 310 -154 -1097 -290
1698 -290 754 -384 -872 95 240 -664 -782 605 25 -1017 -84 992 -261 -644 35 814 -133 -361
1716 -361 663 627 -211 -474 323 159 -481 -365 1108 283 -633 376 1021 89 -356 756 927 -312 -35
1735 -35 1086 646 -496 391 1161 238 -111 483 951 114 57 978 730 -91 255 929 696 -22 421 884
1755 884 297 -117 391 970 12 -27 858 616 -171 361 934 444 -344 398 728 -18 -141 591 121 -285
1775 -285 -444 533 333 -607 -242 308 258 -703 21 340 -450 -628 284 263 -808 -718 391 -225 -654 -295
1795 -295 393 -42 -927 -218 -21 -609 -650 -106 -485 -1004 -195 266 -579 -924 -246 -63 -321 -609 -281 -507
1815 -507 -437 -333 366 -288 -955 -216 43 -420 -1140 -221 340 -426 -461 -6 -208 -681 -330 516 -308 -805 82
1836H2M93o32p41J124Q7n86R0L79j89n41N06M91o89l63P41M50n13l96P70K68j197
1857c66M06P58n02o22O31N40q31j94P85O2p04j33R26m08l96L19P75q98j95O28
1877E81L59n18n08Q42J92p96l41J229j71j163L86O95m18o18N71N26p02l65Q01
1896E82j68o77J2J152q38n72P19P48j115m45N21N93n12m18P33J74n96l60P41K1
1916B95q11J06P35o86m83P33N63r29m77Q76J30q48L66P53q23o22R98M73r64l58
1936i73N39O42r80k33J012r8o31J06Q41m56m97J07R20p32r23Q81P72p43l32J099
1956C21j13q94L04P81o88m00N31K02k32k07O34o6p43J84Q61m84n73M73M92k70
1976A13q09J010Q7l90l87Q89J66r17j27J213m27o53N18M53n98l60R27N6r68L26
$$ plain form
1836 82 575 -57 -798 326 413 -173 -83 296 107 -434 72 563 -126 -489 252 702 189 -207 563 831 -366
1857 -366 40 798 296 -326 305 845 14 -180 605 667 -37 -170 756 348 -48 271 1046 148 -47 581
1877 581 940 422 -86 756 948 152 -189 1040 869 -294 92 787 369 -249 322 848 146 -219 582
1896 582 414 -263 -251 901 63 -509 210 958 -157 -602 -81 512 0 -418 315 489 -107 -467 274 295
1916 295 -516 -410 325 -361 -844 -111 452 -477 -954 -78 52 -796 -430 323 -500 -1122 -124 349 -615 -973
1936 -973 -434 208 -772 -1005 7 -91 -722 -616 225 -231 -728 -621 299 -433 -1356 -475 297 -446 -778 321
1956 321 208 -686 -382 399 -289 -689 -158 44 -188 -395 239 173 -570 -386 475 -9 -582 -109 383 113
1976 113 -696 314 401 11 -376 513 679 -238 -365 848 421 -232 286 739 141 -219 708 764 -204 122
1996A22J02L67o09J15O61l74n71O33K84l27o97P56L77o91l21O03K96m94P4P52
2016A058m85r49N14Q50q06l77Q07k4r01M97N48l69m10K02L13n28l27M49O43o72
2036C3k62P57l34n21R1M61k01n70L04N05m55p13R33L08r02J30M93p4p46M74M77
2057A88n81k72M51N70p96k20M91J26o48M62p3j19l41M20L70q2p15M78O87q41l48
2078g93P74j06p70Q27L38l61p17P52N53r01k59Q46J56n82k24Q37l59l90M06K79
2098C06l52m21M32O5J8m99P48K24o06l10O62M5p77K90R37o54l97P55K64p94k65
2119c29Q21P4p90N81K87k40n21M38N20m77k29K41M02n18k73O46l00n56L46M11
2139E34j0o00K50O94m40o41P82L61r65n53J201n1q80M54N07n78j78J76O28m45
$$ plain form
1996 122 224 591 -18 97 758 384 -187 446 730 403 -294 462 839 148 -173 430 726 232 306 1058
2016 1058 573 -376 138 988 182 -195 612 588 -313 184 732 363 -47 155 468 -60 -387 62 705 33
2036 33 -229 528 194 -327 -236 225 24 -546 -242 263 -192 -905 28 336 -566 -436 57 -17 -763 -289 188
2057 188 -393 -665 -214 356 -440 -660 -169 -43 -691 -229 -302 -421 -762 -342 28 -54 -769 -291 396 -445 -793
2078 -793 -19 -125 -895 -68 270 -91 -808 -56 497 -404 -663 183 339 -243 -467 370 11 -379 27 306
2098 306 -46 -467 -35 30 48 -451 297 521 -85 -395 267 312 -465 -175 762 108 -289 466 730 -64 -329
2119 -329 492 566 -224 357 644 404 -117 321 841 364 135 376 778 260 -13 633 333 -223 123 534
2139 534 524 -76 174 868 428 -213 569 930 -35 -588 613 562 -318 136 643 65 -113 63 691 246
2159B46o09N41J55l75R3L57j27o57J44R77q37p17P13N38p69l46J008K30j026n3
2179e14R92n12o03L04O86m89m04K62P00o46l72N29j57l91KQ21l03o18K72Q07n57
2200a91m22N8P72n50m78N85K65m17l11J027l96p26N83O30p50l10N20K49l85o9
2220c16M39r2k95N7L30J02n67r5O73k73l84L37P06n99k58L77L24r88K23R11l08
2241C04p05P48J57m48k85L93P22j332M05P78k08o30N34M71m78n41M44K54l5q50
2261c02M58N60n45n62Q67j3l78L3N74n72j84K88L82l69m69N52P9p24O25K82m26
2282A56n81L91N66m46m87N06L36o08j48L93M0o91M13L65Qp51M60L14m64m07O59
2303B4L96q37J66L68j13n48M31j43J25k16J70K29l11k38K27j14R7j24K46L5l24
$$ plain form
2159 246 -363 178 333 -42 51 408 281 -376 -232 745 -92 -809 -96 442 -327 -673 335 565 -461 -514
2179 -514 478 -34 -637 -333 353 -136 -540 -278 422 -224 -596 -67 -224 -615 -613 208 -95 -713 -441 366 -191
2200 -191 -613 -555 217 -333 -811 -226 39 -378 -689 338 -58 -784 -201 429 -321 -631 -111 138 -247 -316
2220 -316 123 31 -264 -207 123 225 -342 -437 236 -37 -421 -84 622 23 -235 142 466 -522 -299 612 304
2241 304 -401 347 504 56 -229 164 886 -446 -41 737 529 -101 433 904 426 -115 329 583 548 -302
2261 -302 156 716 171 -391 476 463 85 118 692 120 -64 224 606 237 -232 320 399 -325 300 582 156
2282 156 -425 -34 532 86 -401 105 441 -167 -315 78 118 -573 -160 205 213 -538 -78 236 -228 -635 24
2303 24 420 -417 -251 117 4 -544 -113 -256 -131 -347 -177 52 -259 -497 -270 -384 -287 -411 -165 -130 -454
2324d54K64L3J44n60K48J71k70m69P40K5m27J08M99j89l99J9P18m85j88N10m3
2345en56L64K27o2j69n7M88l3o09K52K59k12o4L20N5m24n8L97J04n38OO44j46
2368A83m71L54M39k59k87M19j04j36N5M22m59k96O50l8K1l94K98L0p4k28N67J2
2390G04o16kJ52O8m41O76J03o52l28Q07P3l25j65O87l81k67K12R1m11j98M30L86
2412F03p29k69M92L93l95l5L80l75m64P5Q19n16k48K51N17p33k05O32jk69j92
2433b69M01j00l47K91J37l83m25O25K67k80m75O65k48j37k11M16q4k73j41O57
2453H6n80N3J51L05m40l77O69j03k17jP04l85m98N43jN0o12L71L26k94N3K91p7
2476A7n26K57L40J78o08K65K11j0n66O25J00k27m71J071n08J5M92m88j01m17R05
$$ plain form
2324 -454 -190 -157 -13 -573 -325 -154 -424 -893 -153 -128 -555 -447 52 -137 -536 -517 201 -284 -472 38 -5
2345 -5 -561 -197 30 -32 -201 -258 230 197 -412 -160 99 -113 -177 143 198 -226 -284 113 217 -321 -315 329 183
2368 183 -288 66 505 246 -41 378 274 138 193 615 156 -140 510 472 493 99 397 427 353 125 692 704
2390 704 88 86 238 306 -135 541 644 -8 -336 471 544 219 54 741 360 93 305 396 -15 -213 217 603
2412 603 -126 -395 97 490 95 60 440 65 -399 -324 495 -21 -269 -18 499 -234 -439 193 192 -77 -269
2433 -269 132 32 -315 -24 113 -270 -695 -70 197 -83 -558 107 -141 -278 -489 -73 -157 -430 -571 86
2453 86 -494 -441 -290 15 -425 -802 -133 -236 -453 -454 250 -135 -633 -90 -91 -41 -653 -282 44 -250 -197 94 17
2476 17 -509 -252 88 266 -342 -77 134 124 -442 183 283 56 -415 656 148 163 655 167 66 -351 554
2497E54om8m00J72J32l25j53P34K47j298Q13k74j95j35K24K95p36L73N56l90R9
2518B39k98N90J15j93j86L37o19m3L24K01m94O5J59P4k35J06K13L0n19J26J84
2539A76m5r3J73m22L63k01M5K01n0j30K81m48M14l07R60k46r49j42N34r97M72
2560d11O94m53J24Q7k12J84m13M67j40O5Q3l13M52l93o1j55M20m76M11q7o8j81
2582c76k66O40K6n31J31K6q6J97L46l05l80O2O21k91j26K0K26k37k8N26j78l26
2604c09L13k2J44j13k1P7l93J48K62N4n57K40N11j92k48Q6M34j85n65L10L69k34
2626A09J29K28k80l44K49J1R3j39M15J75m91o6L35p5j12q2J0N7j75R4L21n7j54
2649B51n4J06j62j58J94Jm10J16N80j06o12M71L89o70p06J333m65J85k87L61m22
$$ plain form
2497 554 548 500 100 272 404 79 -74 660 907 -391 422 148 -47 -182 42 337 -399 -26 530 140 239
2518 239 -59 531 646 453 267 604 -15 -58 266 467 -27 38 197 271 36 142 355 385 -134 -8 176
2539 176 131 38 211 -211 152 -49 -4 197 147 17 298 -150 264 -43 917 671 -278 -420 114 -883 -411
2560 -411 283 -170 -46 41 -171 13 -400 67 -73 -8 75 -238 214 -179 -240 -395 25 -451 -40 -127 -195 -376
2582 -376 -642 -2 24 -507 -376 -350 -436 -239 107 -198 -578 -516 105 -186 -312 -292 -66 -303 -331 195 17 -309
2604 -309 4 -18 126 13 -8 69 -324 -176 86 140 -417 -177 334 142 -106 -20 414 229 -336 -26 343 109
2626 109 238 466 186 -158 91 102 195 56 471 646 155 89 424 349 237 155 165 222 47 141 462 405 251
2649 251 197 303 141 -17 177 178 -232 -116 464 358 -254 217 606 -64 -770 563 98 283 -4 357 -65
2670f5K87k93q8j93q4P75k22K75q05L96K45k19k54j9K78j84L5K14j5l81K68Q8
2692C9n69J69P51n77K2L4j08M35k60j07M4N95l65n1j47q8J62O91j029R40j016
2713d35P10l53m83O51m07L05p08N75m51K56k61J21O89J46m48j15M56o47K88l19
2733d30M19m64j05K73L38M0j94M23K96j068P96q03M71m67K9J85j14L90k59L33
2753H9j71J73Rk87K99K1J20k48L34mL5k23k4K95k48M1N8J41k43k21L94K25p51
2776a86M11R4O5j24j10N3k69K08K84k65j99M27k58jo1P2K32k04q3K6J29O7l7k9
2800B42k33K31j26M8j69j84J77K63j01k18j7L03j74J13J7k15k05J80L1J26j10
2821b1K8rp5j75L10l77M30j31Q3p12qM58J28k28J35J99k90J39J45k10j24O6k64
$$ plain form
2670 -65 222 -71 -159 -352 -436 339 117 392 -413 -17 228 9 -245 -264 14 -170 -135 79 64 -317 -49 39
2692 39 -530 -361 390 -187 -165 -131 -239 196 -64 -171 -127 468 103 52 -95 -183 -21 670 -359 581 -435
2713 -435 275 -78 -561 90 -317 -12 -720 -145 -596 -340 -601 -480 209 355 -93 -208 248 -399 -111 -430
2733 -430 -11 -475 -580 -307 31 71 -123 300 596 -472 324 -479 -8 -475 -446 -261 -375 15 -244 89
2753 89 -82 91 100 -187 112 133 253 5 339 335 370 147 123 418 170 211 269 410 167 -54 340 565 -186
2776 -186 225 319 384 260 150 203 -66 142 426 161 -38 389 131 130 69 141 373 169 86 112 241 308 271 242
2800 242 9 240 114 162 -7 -191 -14 249 148 -70 -87 216 42 155 172 -43 -248 -68 -37 89 -21
2821 -21 7 -2 -77 -252 58 -319 111 -20 63 -649 -657 -199 -71 -299 -164 35 -255 -116 29 -181 -305 -239 -503
2844e03L84m1J69J29l03L53N19l70o84O1N10k58m5o2K27J3k21Nq2K98l8l1pl5
2868a2L9l2P5l3l67M16O2m4r8R5j78J5L51J20j81l06K15Q3j74M3M7J59j0n3n8
2893A74M4j07K7j05J65k49J37K59p2o0N2L45l78J05J41O5l53m3L60l60q8K51j3
2916B97j16k43O50k64l89K52K9l51M2P4N21n87J12Q2K26l62j54M30r2J02m22K97
2938A34J37n94K80P4k11P8j35P8J45q4L12k59r3r6oJ55k81J26J81j10r4J58K71
2961A66l52j0O7O8k41k53L73k63o7L90P8j4j21J59j57J69l94K96L44m10j11J32
2983a51K72n46K95n1K33n6J00k1Q7m56J18J0R9o1J53o6l2p0l2L75m15K43O7j11
3007a6M1J74k8k09R2j25l6K07J15k21O0J46o4O4J94k57m7J24p8J32N4O1k75p3
$$ plain form
2844 -503 -119 -160 9 138 -165 188 707 337 -347 -286 224 -34 -79 -141 86 99 -122 -117 -199 99 61 30 23 -12
2868 -12 27 -5 70 37 -330 86 148 104 6 101 -77 -62 289 409 228 -78 137 220 46 89 136 295 285 232 174
2893 174 218 111 138 33 198 -51 86 345 273 213 265 610 232 337 478 543 190 147 507 147 59 310 297
2916 297 181 -62 588 324 -65 187 216 -135 -93 -19 502 -85 27 109 335 -27 -181 249 157 259 -163 134
2938 134 271 -323 -43 31 -180 -102 -237 -159 -14 -98 214 -45 -138 -234 -240 -85 -366 -240 -59 -169 -263 -105 166
2961 166 -186 -196 -129 -61 -302 -555 -182 -445 -512 -122 -44 -58 -179 -20 -177 -8 -402 -106 238 -172 -283 -151
2983 -151 121 -425 -130 -181 52 -4 96 75 162 -294 -176 -166 -67 -128 25 -41 -73 -143 -175 200 -215 28 95 -16
3007 -16 25 199 171 -38 54 -71 -107 100 215 -6 54 200 136 200 394 137 90 214 136 268 322 383 108 35
3031C5L74o1n51L30P3j73m9J08m0l00L12J12j00j23L40l31J67R1l04k07M36J45
3053B84On57M53j4J5o1J11l50L29j76k89J59J75j52R8J38l01J26j00O9k91L33
3075EJ46j83j97L70l51j73N57l60L8N6k02K93k15l66M54o0M2p3J19J62j15l96
3097d49K22L44l11j61J06J58k68qM18l88L62J95j38k69K9J21o3q4J37O7QJ5k18
3120a75L58l09J88N1l4P9n58M67l8k01K35pJ51j17J19k08J97k72M88k43k36l3
3142i8K03j32J11j39K01j23P7l0q5K5J50J43q1P6J29p2j77K0m48O30R4l95j28
3165d9N70m36J5L62j85j77j80K45O1l6Q4l00Q4j70K54j14j4P7k02K29J6m14J80
3188a00J74J47l64K45q4k76N13j98j23J12j55J99j79j10K66kk48K43l50J13J09
$$ plain form
3031 35 409 348 -203 127 200 27 -22 86 46 -254 58 170 70 -53 287 -44 123 214 -90 -297 139 284
3053 284 290 -267 186 172 187 126 237 -113 216 40 -249 -90 85 -67 31 169 -132 -6 -106 -37 -328 5
3075 5 151 -32 -229 141 -210 -383 174 -186 -148 -92 -294 -1 -216 -582 -128 -188 -146 -219 -100 62 -53 -449
3097 -449 -227 117 -194 -355 -249 -91 -359 -367 51 -337 25 220 82 -187 -158 -37 -100 -184 -47 20 28 43 -175
3120 -175 183 -126 62 113 79 158 -400 67 29 -172 63 56 207 90 209 1 198 -74 414 171 -65 -98
3142 -98 105 -27 84 -55 146 23 100 70 -15 10 160 303 222 298 427 355 178 198 -250 380 474 79 -49
3165 -49 521 85 100 462 277 100 -80 165 226 190 274 -26 58 -112 142 28 14 91 -111 118 134 -280 -100
3188 -100 74 221 -143 102 18 -258 255 57 -66 46 -109 90 -89 -199 67 65 -183 60 -290 -177 -68
3209f8j00j10M6L9K2J54mk26J70N0l64K98Q2j72j98j44N78k60m6J86K11k08k96
$$ plain form
3209 -68 -168 -278 -232 -193 -171 -17 -21 -247 -77 -27 -391 -93 -11 -183 -381 -525 53 -207 -253 -67 144 -64 -360
$$ [...]
8191B15
##END NTUPLES=NMR FID
##END=
