##TITLE=1H_TG-2281-2
 CDcl3, 8 sc, 
 30.1.2020
##JCAMPDX= 6.0         $$ Bruker NMR JCAMP-DX V2.0
##DATA TYPE= NMR FID
##DATA CLASS= NTUPLES
##ORIGIN= UXNMR, Bruker Analytische Messtechnik GmbH
##OWNER= root
$$ XWIN-NMR		Version 3.5
$$ Thu Jan 30 14:00:31 2020 Russian Standard Time (UT+4h)  she@DPX200
##.OBSERVE FREQUENCY= 200.1315
##.OBSERVE NUCLEUS= ^1H
##.DELAY= (6, 6)
##.ACQUISITION MODE= SIMULTANEOUS
##.ACQUISITION SCHEME= undefined
##.AVERAGES= 8
##.DIGITISER RES= 18
##SPECTROMETER/DATA SYSTEM= spect
##.PULSE SEQUENCE= zg30
##.SOLVENT NAME= CDCl3
##.SHIFT REFERENCE= (INTERNAL, CDCl3, 0, 15.7039)
##AUDIT TRAIL= $$ (NUMBER, WHEN, WHO, WHERE, WHAT)
$$ ##TITLE= Audit trail, XWIN-NMR		Version 3.5
$$ ##JCAMPDX= 5.01
$$ ##ORIGIN= Bruker BioSpin GmbH
$$ ##OWNER= she
$$ F:/spectra/data/she/nmr/H-F/1/audita.txt
$$ ##AUDIT TRAIL=  $$ (NUMBER, WHEN, WHO, WHERE, WHAT)
(   1,<2020-01-30 13:59:15.82 +0400>,<she>,<DPX200>,
      <created by zg, POWCHK disabled, PULCHK disabled
       configuration hash MD5:
       00 E9 B6 7A A2 85 ED C7 34 08 36 98 17 FE 4E 26
       data hash MD5: 16K
       D4 F0 9F C7 95 67 98 ED 8B 95 61 3F 55 A7 FF B9>)
$$ ##END=
$$ 
$$ hash MD5
$$ 4E D0 D1 52 AD A9 59 D3 24 E3 B0 A3 E2 13 F4 DF
##$RELAX= 
##$RELAX= 
##$RELAX= 
##$RELAX= 
##$RELAX= 
##$RELAX= 
$$ Bruker specific parameters
$$ --------------------------
##$DU= <F:/spectra>
##$EXPNO= 1
##$NAME= <H-F>
##$PROCNO= 1
##$TYPE= <nmr>
##$USER= <she>
##$AMP= (0..31)
100 100 100 100 100 100 100 100 100 100 100 100 100 100 100 100 100 100 
100 100 100 100 100 100 100 100 100 100 100 100 100 100 
##$AQSEQ= 0
##$AQ_mod= 1
##$AUNM= <au_zg>
##$AUTOPOS= <>
##$BF1= 200.13
##$BF2= 200.13
##$BF3= 200.13
##$BF4= 200.13
##$BF5= 200.13
##$BF6= 200.13
##$BF7= 200.13
##$BF8= 200.13
##$BYTORDA= 1
##$CFDGTYP= 0
##$CFRGTYP= 5
##$CHEMSTR= <none>
##$CNST= (0..31)
1 1 145 1 1 1 1 1 1 1 1 1 1 1 1 1 1 1 1 1 1 1 1 1 1 1 1 1 1 1 1 1 
##$CPDPRG= <>
##$CPDPRG1= <>
##$CPDPRG2= <>
##$CPDPRG3= <>
##$CPDPRG4= <mlev>
##$CPDPRG5= <mlev>
##$CPDPRG6= <mlev>
##$CPDPRG7= <mlev>
##$CPDPRG8= <mlev>
##$CPDPRGB= <>
##$CPDPRGT= <>
##$D= (0..31)
0 1.2 0 0 0 0 0 0 0 0.06 0 0.03 0 0 0 0 0.0002 0 0 0 0 0 0 0 0 0 0 0 0 
0 0 0 
##$DATE= 1580378355
##$DBL= (0..7)
120 120 120 120 120 120 120 120 
##$DBP= (0..7)
150 150 150 150 150 150 150 150 
##$DBP07= 0
##$DBPNAM0= <>
##$DBPNAM1= <>
##$DBPNAM2= <>
##$DBPNAM3= <>
##$DBPNAM4= <>
##$DBPNAM5= <>
##$DBPNAM6= <>
##$DBPNAM7= <>
##$DBPOAL= (0..7)
0.5 0.5 0.5 0.5 0.5 0.5 0.5 0.5 
##$DBPOFFS= (0..7)
0 0 0 0 0 0 0 0 
##$DE= 6
##$DECBNUC= <off>
##$DECIM= 24
##$DECNUC= <off>
##$DECSTAT= 4
##$DIGMOD= 1
##$DIGTYP= 9
##$DL= (0..7)
0 120 120 120 120 120 120 120 
##$DP= (0..7)
150 150 150 150 150 150 150 150 
##$DP07= 0
##$DPNAME0= <>
##$DPNAME1= <>
##$DPNAME2= <>
##$DPNAME3= <>
##$DPNAME4= <>
##$DPNAME5= <>
##$DPNAME6= <>
##$DPNAME7= <>
##$DPOAL= (0..7)
0.5 0.5 0.5 0.5 0.5 0.5 0.5 0.5 
##$DPOFFS= (0..7)
0 0 0 0 0 0 0 0 
##$DQDMODE= 0
##$DR= 18
##$DS= 0
##$DSLIST= <SSSSSSSSSSSSSSS>
$$ [...]
##$SUBNAM2= <"">
##$SUBNAM3= <"">
##$SUBNAM4= <"">
##$SUBNAM5= <"">
##$SUBNAM6= <"">
##$SUBNAM7= <"">
##$SUBNAM8= <"">
##$SUBNAM9= <"">
##$SW= 24.9337058887773
##$SWIBOX= (0..15)
0 0 2 0 0 0 0 0 0 0 0 0 0 0 0 0 
##$SW_h= 4990.01996007984
##$TD= 16384
##$TD0= 1
##$TE= 0
##$TE2= 300
##$TE3= 300
##$TEG= 300
##$TL= (0..7)
0 120 120 120 120 120 120 120 
##$TP= (0..7)
150 150 150 150 150 150 150 150 
##$TP07= 0
##$TPNAME0= <>
##$TPNAME1= <>
##$TPNAME2= <>
##$TPNAME3= <>
##$TPNAME4= <>
##$TPNAME5= <>
##$TPNAME6= <>
##$TPNAME7= <>
##$TPOAL= (0..7)
0.5 0.5 0.5 0.5 0.5 0.5 0.5 0.5 
##$TPOFFS= (0..7)
0 0 0 0 0 0 0 0 
##$TUNHIN= 0
##$TUNHOUT= 0
##$TUNXOUT= 0
##$USERA1= <user>
##$USERA2= <user>
##$USERA3= <user>
##$USERA4= <user>
##$USERA5= <user>
##$V9= 5
##$VALIST= <valist>
##$VCLIST= <CCCCCCCCCCCCCCC>
##$VD= 0
##$VDLIST= <DDDDDDDDDDDDDDD>
##$VPLIST= <PPPPPPPPPPPPPPP>
##$VTLIST= <TTTTTTTTTTTTTTT>
##$WBST= 1024
##$WBSW= 4
##$XGAIN= (0..3)
0 0 0 0 
##$XL= 0
##$YL= 0
##$YMAX_a= 91751
##$YMIN_a= -48261
##$ZGOPTNS= <>
##$ZL1= 120
##$ZL2= 120
##$ZL3= 120
##$ZL4= 120
##$ABSF1= 10
##$ABSF2= 0
##$ABSG= 5
##$ABSL= 3
##$ALPHA= 0
##$AQORDER= 0
##$ASSFAC= 0
##$ASSFACI= 0
##$ASSFACX= 0
##$ASSWID= 0
##$AUNMP= <proc_1d>
##$AZFE= 0.1
##$AZFW= 0.1
##$BCFW= 1
##$BC_mod= 2
##$BYTORDP= 1
##$COROFFS= 0
##$CY= 11.3945322036743
##$DATMOD= 1
##$DC= 2
##$DFILT= <>
##$DTYPP= 0
##$F1P= 16.9975609425685
##$F2P= -3.02152046262296
##$FCOR= 0.5
##$FTSIZE= 0
##$FT_mod= 4
##$GAMMA= 1
##$GB= 0.15
##$INTBC= 1
##$INTSCL= 1
##$ISEN= 128
##$LB= 0.24
##$LEV0= 0
##$LPBIN= 0
##$MAXI= 10000
##$MC2= 0
##$MEAN= 0
##$ME_mod= 0
##$MI= 1.114404
##$NCOEF= 0
##$NC_proc= 0
##$NLEV= 6
##$NOISF1= 3.799351
##$NOISF2= 2.8
##$NSP= 1
##$NTH_PI= 0
##$NZP= 0
##$OFFSET= 15.70392
##$PC= 1
##$PHC0= -9792.362
##$PHC1= 18.00081
##$PH_mod= 1
##$PKNL= yes
##$PPARMOD= 0
##$PSCAL= 0
##$PSIGN= 0
##$REVERSE= no
##$SF= 200.130013532006
##$SI= 16384
##$SIGF1= 3
##$SIGF2= 2
##$SINO= 400
##$SIOLD= 16384
##$SREGLST= <1H.CDCl3>
##$SSB= 0
##$STSI= 0
##$STSR= 0
##$SW_p= 3612.71676300578
##$SYMM= 0
##$S_DEV= 0
##$TDeff= 0
##$TDoff= 0
##$TI= <>
##$TILT= no
##$TM1= 0
##$TM2= 0
##$TOPLEV= 0
##$USERP1= <user>
##$USERP2= <user>
##$USERP3= <user>
##$USERP4= <user>
##$USERP5= <user>
##$WDW= 1
##$XDIM= 8192
##$YMAX_p= 0
##$YMIN_p= 0
$$ End of Bruker specific parameters
$$ ---------------------------------
##NTUPLES= NMR FID
##VAR_NAME=  TIME,          FID/REAL,        FID/IMAG
##SYMBOL=    X,             R,               I
##VAR_TYPE=  INDEPENDENT,   DEPENDENT,       DEPENDENT
##VAR_FORM=  AFFN,          ASDF,            ASDF
##VAR_DIM=   8192,          8192,            8192
##UNITS=     SECONDS,       ARBITRARY UNITS, ARBITRARY UNITS
##FACTOR=    0.0002004,     1,               1
##FIRST=     0,             0,               0
##LAST=      1.6414764,     0,               0
##MIN=       0,             -48261,          0
##MAX=       1.6414764,     91751,           0
$$ Real data points
##PAGE= N=1
##DATA TABLE= (X++(R..R)), XYDATA
$$ [...]
1986i15P70Q4l21n91O12l94P08l23l56l63O12L47j50k85m07Q95J58l73m09M35
2006b66N21m78j67M7L42j1r2j21m19P35L97k15q21L80P34k42m91l05J087o07j52
2027a44K21J96R3L39j02p11J5O34r0k0m22N1Q53m18m74K5N26J81k25m14K06j7
2049C03L15N7o38N4O76J93q50j33O59M2k70n13K25K73K05m61k00K0L61L88l28
2070C78l37j75Q29Jj084J20M37M79r35l11Q10K9l75J73j19k50M6N81l84o21M83
2091b25N25j12q17K43J90L55o69l0J98M24m91L26j98k42J90K12l01o97O68N13
2111F2j40r76L01O99k28l54K3L5J39L86j77n34J45N32n8n85R3M93K00o23K77j54
2133d44M49j18m08K85j1l25Q26j13o56J00M85K01q35J24Q51l52n10K11K19K09
$$ plain form
1986 -915 -145 -61 -382 -973 -361 -755 -47 -370 -726 -1089 -477 -130 -280 -565 -972 -77 81 -292 -701 -266
2006 -266 255 -223 -390 -343 -1 -12 -104 -225 -644 91 488 273 -548 -168 566 324 -167 -472 615 8 -144
2027 -144 77 273 366 705 603 -108 -93 541 451 431 9 60 913 495 21 46 572 753 528 114 320 303
2049 303 618 675 37 91 767 960 110 -23 636 678 408 -105 120 393 598 137 -63 -43 318 706 378
2070 378 41 -134 695 696 -388 -268 169 648 -287 -598 212 241 -134 39 -80 -330 -284 297 -87 -708 -225
2091 -225 300 188 -629 -386 -196 159 -510 -540 -342 82 -409 -83 -281 -523 -333 -121 -422 -1119 -451 62
2111 62 -78 -1054 -753 -54 -282 -636 -613 -578 -439 -53 -230 -764 -619 -87 -145 -730 -637 -144 56 -567 -290 -444
2133 -444 5 -113 -521 -236 -247 -572 254 141 -515 -415 70 271 -564 -440 411 59 -451 -240 -21 188
2153A88K46o09L6M15N8K96n52p9J48L02J64r04J25O75L03o37k54N04L36m72n0
2174B39J70j16J55L55o95k84L78P23m64l83K97L40k36k20Q2J2Q9K56m03l19K49
2195B25L11m0l38p74Q99M14m65p09Q50K66m86l75J62J44l10M56k78l89N40M58
2215E61l01q35K44M03Jj20m77K73K04J47m68j73J74K57j63L3j35ML64k82o35L33
2237e91O70J52p48K6J57J02j74j32J19l40P70j47p98J29N42K92l42k39J35L20
2257i7Rm55l1L25L39n11r6K13K32Q1j34j5n89P02K21n39k91N62J75j69j49P0K76
2280A29K82k82l71P5L18M65n73j80K20O6J12k30m47P97K76l40k95K84L48k38K57
2301F73l17j39J20M03m09n88N70O78k30p07n9L90K8K3l01k5J93K73p4l72l4K11
$$ plain form
2153 188 434 -175 -139 276 334 630 78 -1 147 449 613 -291 -166 509 812 175 -79 425 761 289 239
2174 239 409 293 448 803 108 -176 202 925 461 78 375 715 479 259 341 353 442 698 295 -24 225
2195 225 536 496 158 -616 283 697 232 -477 373 639 153 -222 -60 84 -226 230 -48 -437 103 561
2215 561 260 -575 -331 72 73 -47 -524 -251 -47 100 -368 -541 -367 -110 -273 -240 -375 -371 -7 -289 -924 -591
2237 -591 79 231 -517 -491 -334 -232 -406 -538 -419 -759 11 -136 -934 -805 -263 29 -313 -552 -417 -97
2257 -97 -88 -543 -574 -249 90 -421 -517 -304 -72 9 -125 -140 -729 -27 194 -345 -636 -74 101 -68 -217 -147 129
2280 129 411 129 -242 -167 151 616 43 -137 83 149 261 31 -416 381 657 317 22 306 654 416 673
2301 673 356 217 337 740 331 -257 313 991 761 54 -5 385 413 436 135 110 303 576 502 130 96 307
2323C07J57J3p17L82M55l50k19JM79q5m21j23J06J77J71Ro38K43L88K1o79M9M36
2346A62L12l95n99M61J31J39l68m1lj59K27m5n28MP07Q2p56KP95L8n15q0P5J92
2370a62j73J43l57N9K35L42o99o3M25J52P8q11K14N21O3n14j11N8K23L18l50J05
2392c04j92K37N30q03j88N75O04m65n72L24L02q2jL3j59R4J11k45l16M97M32j85
2414B27l50m2q6Q63k22n27o7Q58p2n96j7K37n1J35nk29j00O72k12l63K10O2M56
2437G81o07j22J22M39j25k37K51l06j39Q40q93J41K92L00l32k79l39R50k44n34
2457d1r2N16l89k90J124q09L51k09J99m49j87L77N61r09l73M69N46k53m59n3L46
2478b4M76n77j30N2r7K46N6m17J0J98L98m60m69N16L51n45Q3j34J41j6N13n20
$$ plain form
2323 307 464 477 -240 142 597 247 28 29 508 423 2 -121 -15 162 333 342 -296 -53 335 356 -323 -274 162
2346 162 474 79 -520 -59 72 211 -157 -198 -201 -360 -133 -178 -706 -702 5 87 -669 -667 128 166 -349 -429 -354 -162
2370 -162 -335 -192 -549 -490 -255 87 -612 -675 -250 -98 -20 -831 -617 -96 -33 -547 -658 -600 -377 -59 -409 -304
2392 -304 -496 -259 271 -532 -720 -145 459 -6 -578 -254 48 -34 -35 -2 -161 -67 44 -201 -517 -20 412 227
2414 227 -123 -165 -251 612 390 -137 -204 654 582 -14 -31 206 155 290 285 56 -44 628 416 53 263 325 781
2437 781 174 52 174 613 488 251 502 196 57 897 4 145 437 737 405 126 -213 737 493 -41
2457 -41 -133 383 -6 -296 828 19 370 161 360 -89 -276 101 662 -247 -620 -151 395 142 -317 -370 -24
2478 -24 452 -125 -255 -203 -300 -54 2 -415 -405 -207 191 -269 -738 -222 129 -416 -333 -467 -326 -342 171 -349
2500c49l77L09Q6j4m7pL87ro54L82j04Q8K76o52Q7N55R1j01l90j04L10N89k14
2523A38q09K81O15l59L5p0PK24l27K90l71J57M30k73n1k75M29J98l4k90J52K57
2545C54J78n04j67N01J13j85n2k16J27K83O3l46j74N23J7n33J00M78K45l50l26
2566A29m6K23J41j6k82q5M17k11J12k69J4N45r2o60j37O22M64p98J09j4OL14j17
2589C69k66k61N35k49j63j68K20L93p5n52J17Q5L68j83n86Q9K41L43k20k78J09
2610a32M3K89l39p41P38J36K8n76P9N20k24j08K8l66K49K08j08k82L63J99k85
2631b81j26l15J024m70m42L7j08N76N52m35m12K62l83M38k02m41J10Q22l29n51
2651f74k4Q18j18n84L38p6K13J35j4k45k69P85r7m81k9M31O01n90k83m5M49L4
$$ plain form
2500 -349 -726 -417 -331 -345 -392 -399 -12 -21 -675 -293 -397 -309 -33 -685 -598 -43 48 -53 -443 -547 -237 352 138
2523 138 -671 -390 225 -134 -99 -169 -162 62 -265 25 -346 -189 241 -32 -83 -358 71 269 235 -55 97 354
2545 354 532 28 -139 362 475 290 238 22 149 432 495 149 -25 498 515 -18 82 560 805 455 129
2566 129 83 306 447 431 149 64 481 270 382 113 127 672 580 -80 -217 405 869 71 180 166 172 486 369
2589 369 103 -158 377 128 -35 -203 17 410 335 -217 -100 -15 353 170 -416 -327 -86 257 37 -241 -132
2610 -132 -89 200 -139 -880 -142 -6 22 -554 -475 45 -179 -287 -259 -625 -376 -168 -276 -558 -195 4 -281
2631 -281 -407 -722 302 -168 -610 -573 -681 -105 447 12 -400 -138 -521 -83 -285 -726 -616 206 -123 -674
2651 -674 -698 120 2 -582 -244 -320 -107 28 14 -231 -500 285 188 -293 -322 109 710 120 -163 -208 241 275
2673B75o07K91M73k63o7M45l85J12m4M09m61l09O48J80m89p6L3L78L8k53j02r
2695B17J63K3j34L5ON5o9l8l16L07M43n37j2m0L62l00j63J81J59J76m2l30j83
2718c7J08O09m66m03mN07O3l11l30J29L05j07j90j12M39J7l8k62l16L85K71l29
2740g2n47K29M95k7p85L28K06RK2k91L2R8J98J33m62l55M27M96l98k0j22M89K4
2763A07o37l98P24K96j82k37j0k43O80k11l64k53N07M77o00k94M37L28rr5o78
2784f55N27L24j10l08k38M14K23l06l59P8M79L45n40m52R21j63j25l58O97n64
2804a70M74J89m42l61K78L23k0m58K75M95k00l94J90R4J76j03j09j56L73J53j67
2825D40J15l04J90J42j78k21K22L23m26l48L68J6k12Q7p3j79K09M95l93n02K93
$$ plain form
2673 275 -332 -41 432 169 102 547 162 274 230 639 178 -131 517 697 208 132 165 543 581 328 226 217
2695 217 380 403 269 304 310 365 296 258 -58 249 692 155 143 103 465 165 2 183 342 518 476 146 -37
2718 -37 71 680 214 -189 -193 314 377 66 -264 -135 170 63 -127 -239 200 217 179 -83 -399 -14 257 -72
2740 -72 -619 -390 105 78 -707 -379 -173 -164 -142 -433 -401 -303 -105 28 -434 -789 -362 134 -264 -284 -406 83 107
2763 107 -530 -928 -204 92 -90 -327 -337 -580 100 -111 -475 -728 -221 256 -344 -638 -201 127 118 23 -655
2784 -655 -128 196 86 -222 -460 -46 177 -129 -488 -410 69 414 -126 -578 343 180 55 -303 394 -170
2804 -170 304 493 51 -310 -32 291 271 -187 88 583 383 -11 179 273 449 346 237 81 454 607 440
2825 440 555 251 441 583 405 184 406 729 303 -45 323 339 127 214 141 -38 171 666 273 -229 64
2846F4K14Q0n17PM03k2j15R9k48K43j7k42J63n55P03k3K0n75R4L20j08j85j25
2869c22L33K58m66k13L49k79M21j42l42J06K56Q1l30j55J52J60J14l31n79P69
2889a60O5j99rN8q0Q5L1j74l80O05k7j71k33M09N41l20m51K1J08L13o1j62j70
2912c61rM95k26k18j09L86O4k76k16M74N55p46j55J33M12N0m82P1J19R4J91j3
2934B33n02N50J28j00k92q1L84N4m11K16j52M51o2m6k05p0J92L6l73J53n8N18
2956E63o7l17k39N99k63j26j0J37J37p7J73j38j00MK26l58k90K90N4J52o01R6
2978a55N60J9l53k51L72J23l95P1k43J46R2K94n80l17P18R4l40m6L13K4K1k98
3000a31J56P9k15n5J23k11K99K6l39l5k4K84J53l21n94P75J29k93m64L78M5J48
$$ plain form
2846 64 278 358 -159 -152 251 229 114 213 -35 208 191 -51 112 -443 260 237 257 -318 -224 96 -12 -197 -322
2869 -322 11 269 -197 -410 -61 -340 81 -61 -403 -297 -41 40 -290 -445 -293 -133 -19 -350 -929 -160
2889 -160 -95 -294 -303 -245 -325 -240 -209 -383 -763 -158 -185 -356 -589 -180 361 41 -410 -389 -281 32 -29 -191 -361
2912 -361 -370 125 -101 -319 -428 -42 22 -254 -470 4 559 -187 -342 -209 203 253 -229 -158 -39 55 246 233
2934 233 -269 281 409 309 17 -64 320 374 -37 179 27 478 416 370 165 95 287 323 -50 103 45 563
2956 563 496 179 -60 539 276 150 140 277 414 337 510 372 272 276 502 144 -146 144 198 350 -251 -155
2978 -155 405 424 71 -180 192 315 -80 -9 -252 -106 -14 280 -300 -617 101 195 -145 -191 122 146 167 -131
3000 -131 25 104 -111 -166 -43 -254 45 71 -268 -303 -327 -43 110 -211 -805 -30 99 -194 -658 -280 -235 -87
3022h7k75j2j00L99l3k33j13J3N24J17l06k40K85R5l00kJ21m7L41k48m74lM23
3045a55L5l06P2J21N74j92n44L05J15L03j31q0l29J75K21R8m33m83Q35K44m48
3066cm7J69J55j89k20K66J04J48k33o2JJ98J27k32j23j91Q00j37q87kQ65J07j16
3089D98m47K41k09K05R9m44J1N3J61J58m20K92L62j8n67mJ71L26n07PJ53J7j13
3112B5J60j36m23M93N6k07n04K73L99l47k75K60J42l1K42j94k82M85J21m71m14
3133f28J87P48rm00k59J34L91m08l44J54K96J78n79M8J85J59Ko6l11J64M16m06
3155c48k34K52K43J37l96j0j60J28K69j93l24M20N10l65k7l08m5P27r3m61l8L99
3177H3Q5m34L08R0L0o1j69k5q2L38J22k00n10N61J83j66k68R7J41K18j9l90Q6
$$ plain form
3022 -87 -362 -374 -474 -75 -108 -341 -454 -441 83 200 -106 -346 -61 34 -266 -268 -147 -194 147 -101 -575 -578 -155
3045 -155 -120 -426 -354 -233 341 149 -395 -90 25 328 197 117 -212 -37 184 282 -151 -634 201 445 -3
3066 -3 -50 119 274 85 -135 131 235 383 150 88 89 287 414 182 59 -132 668 531 -356 -358 507 614 498
3089 498 51 292 83 288 387 -57 -46 7 168 326 -94 198 560 542 -25 -29 142 468 -39 -32 121 138 25
3112 25 185 49 -374 119 175 -32 -536 -263 136 -211 -486 -226 -84 -115 127 -67 -349 136 257 -214 -628
3133 -628 -441 307 298 -102 -361 -227 164 -244 -588 -434 -138 40 -539 -491 -306 -147 -145 -211 -522 -358 58 -348
3155 -348 -582 -330 -87 50 -346 -356 -516 -388 -119 -312 -636 -216 294 -71 -98 -406 -451 276 183 -278 -316 83
3177 83 168 -266 42 132 162 101 -68 -93 -175 163 285 85 -425 136 319 153 -115 -18 123 341 322 -68 18
3200A8K76M6Q9j72j68J11L32m41j62K53L16k47j74K83L30o38l3R1J99J88K2l37
3222A82o6j69N93k15j81k16M02M1j65k60K16L91l04N1l12K31m02K04O9k09j17
3243b36P42l15n10M30K08l01j04J50R6J53l07l11n9K23J4j81p6L09L13l01o9k13
3265c45j76K90J81k98K71r3J16p0j49k30j12J73L28m60K92J17Q5j08j17m2K13
3286a34m78K60J78k58L12M2k11PJ99J72k86M6j47L04O1k38n40N85J38k51J47j35
3308b27K26J16j33Q6l82K72K31k10l16L76J09l8k12J33m0L21J3n23K53O5J83j88
3330A15L45m36j02N49k12n43O19J26J01o13p2M53qk05J59j04k4J18k76q7L43K76
3352E22j03k65r8J43P8K29n64J26K57j49P1j48J0k5R1P4q5l54M75J13m84j60L20
$$ plain form
3200 18 294 340 429 257 89 200 532 91 -71 182 498 251 77 360 690 52 19 110 309 497 519 182
3222 182 116 -53 540 325 144 -72 330 371 206 -54 162 553 249 300 -12 219 -183 21 90 -119 -236
3243 -236 506 191 -319 111 319 18 -86 64 160 313 6 -305 -364 -141 -127 -308 -384 -75 238 -63 -132 -345
3265 -345 -521 -231 -50 -348 -77 -170 -54 -124 -273 -503 -615 -442 -114 -574 -282 -165 -80 -188 -305 -347 -134
3286 -134 -612 -352 -174 -432 -120 -78 -289 -282 -83 89 -197 -151 -298 6 67 -171 -711 -126 12 -239 -92 -227
3308 -227 -1 115 -18 68 -314 -42 189 -21 -337 39 148 110 -102 31 -9 312 325 -198 55 120 303 115
3330 115 460 24 -78 471 259 -284 335 461 562 -51 -123 330 322 117 276 172 148 266 -10 -97 246 522
3352 522 419 154 56 199 277 506 -58 68 325 176 247 99 109 84 175 249 164 -190 285 398 -86 -246 74
3375G4K82l27o2q0J91K91l16J70l15K10J43m92J12n3L81j69k59m67N48K16o38
3396e60L22QL7J91o9k19J07J6o9l52K92RK66l3l57P3L13j08j21l07L03N09m01
3419a50j89n2p9N56R6l82k26M70M1o9l58N8L89l59R6k35O01m92N70m35J09r4M16
3442B82m24rJ86O1M57o12o2k28O66p6l73O2L65j53J61l21K48r2L90mn33J95J31
3465C17K07l03p6R4p2J49K02n38O9K56l48J64P5L68l63P5l98k5P50j26m34O3M93
3488E99n28J55j41k30J46L1L87n10L5L26R5k36l96M36l01J43P1k49K97L65l47
3509A48l03Q9K60L7j07j99l2R1K06j90k45Q7K63l8n03K11m6K16M3k51m02P01j41
3532a05j73r7L67M2o1j53N5k01K57k5r9k36K16N47o43J09k10J63K55k3l79j06
$$ plain form
3375 74 356 29 -33 -113 78 369 53 223 -92 118 261 -231 -119 -172 209 40 -219 -686 -138 78 -560
3396 -560 -238 -230 -193 -2 -71 -290 -183 -167 -236 -588 -296 -287 -21 -54 -411 -338 -25 -133 -254 -561 -258 251 -150
3419 -150 -339 -391 -470 86 182 -200 -426 44 85 16 -342 -284 105 -254 -158 -393 208 -284 286 -149 -40 -134 282
3442 282 -142 -151 35 96 553 -59 -121 -349 317 241 -132 -70 295 142 303 -18 230 138 528 524 -9 186 317
3465 317 524 221 145 239 167 316 518 -20 49 305 -43 121 196 564 201 276 -122 -147 603 477 43 106 599
3488 599 71 226 85 -145 1 32 419 -91 -56 270 365 129 -267 169 -132 11 82 -167 130 495 148
3509 148 -155 -66 194 231 124 -75 -107 -16 190 0 -245 -158 105 67 -436 -225 -271 -55 -12 -263 -665 36 -105
3532 -105 -278 -375 -8 34 -27 -180 -125 -326 -69 -94 -193 -429 -213 334 -309 -200 -410 -247 8 -15 -394 -500
3554e00N53k00j19J70j36J65o5j24m0K6N21k4m53J29M7J25l33j48M52K07l92N0
3576h9j31K52L92k90k26k03L90J19q5j4j29J14N3j49J38Q8k3p6k08K54Q1N4K01
3599E13m07J28K61m99J35r5J07J90j43J68m92L89K18O4p39K37L70oJ57l11p9P6
3621B42R0l22j19K20R9k12K98j57R3n3k46K22l40L20j16j03j2J71jJ19k98j80
3643b85M21j8k07l38K88J03L12m01r9K52q3J11l1n21J98M88l02K4j25N5K52J3
3665A07k95j95J66L65k92j87k30M22n0kq5Q5j8j9l04L17P0J65j43j70R0L05k08
3688a06m2j38Q3K58p0j24J00j2K09q8M1m13Q5K49Q1o62O56J02k3o9m6j3j70K94
3712A82%l77J14L67j84l68N12P0Lr3k43J2L41O2l67J2L64K55n76j84J25K90L44
$$ plain form
3554 -500 53 -147 -266 -96 -232 -67 -132 -256 -296 -270 251 227 -226 -97 -50 75 -258 -406 46 253 -139 -89
3576 -89 -220 32 424 134 -92 -295 95 214 129 115 -14 100 153 4 142 230 207 131 -77 177 258 312 513
3599 513 106 234 495 -4 131 36 143 333 190 358 -134 255 473 537 -202 35 405 399 556 245 166 242
3621 242 332 10 -109 111 210 -2 296 139 232 179 -67 155 -185 135 19 -84 -96 75 74 193 -105 -285
3643 -285 136 118 -89 -427 -139 -36 276 -125 -224 28 -55 56 25 -496 -298 190 -112 -88 -213 -158 94 107
3665 107 -188 -383 -217 148 -144 -331 -561 -139 -189 -191 -276 -191 -209 -228 -532 -215 -145 20 -123 -293 -203 102 -106
3688 -106 -148 -286 -203 55 -15 -139 -39 -51 158 70 111 -302 -217 32 113 -549 107 209 186 117 71 58 -112 182
3712 182 182 -195 -81 286 102 -266 246 316 319 226 -17 -5 336 398 31 43 407 662 86 -98 27 317 661
3735F61m27k33L52q3L0k29n8J06L88m58J34p1J20J49j40j63j80K05L70l86O9j51
3757EK64l1l43j36J61M7Q1k46J06L46j20j56k74j8Q0L06j41j90J04L02L1j26k39
3780a87j09L13K42n03j16L95J12l86m6K03j53J23j41k64K65J33J77l54j3K39K0
3801e0lk46q8R7L02l06j0K1L26j36r7J34k52K65k1k85L7M96J46l27l22J41K98
3824A20O8k72k5n6J32M13o91L56k70K18L37k90q9K82lj0k86J29J57Q6l01K38j61
3847H2Q5K41m22k3L95o8n6j65M9J63Qo6k34J45N8L21n27l9K02L56n62k6M36j37
3871B16K86l76q0j04M00lm79J71L22l01j40L23O0L7l0l06k8J28K1l1k9k74L58
3894A41q1J56k23j14N13k35j70k25M1J77Pr0L5p6j31J13q0j71N74m48J06j22J19
$$ plain form
3735 661 234 1 353 270 300 71 13 119 507 49 183 112 232 381 241 78 -102 103 473 87 156 5
3757 5 269 238 -105 -241 -80 -33 48 -198 -92 254 134 -22 -296 -314 -234 72 -69 -259 -155 147 178 52 -187
3780 -187 -296 17 259 -244 -360 35 147 -239 -285 -82 -235 -112 -253 -517 -252 -119 58 -296 -309 -70 -50
3801 -50 -53 -299 -387 -290 12 -294 -304 -283 43 -93 -190 -56 -308 -43 -64 -349 -312 184 330 3 -319 -178 120
3824 120 188 -84 -109 -165 -33 380 -311 45 -225 -7 330 40 -49 233 230 220 -66 63 220 306 5 243 82
3847 82 167 408 -14 -37 358 290 234 69 118 281 289 223 -11 134 192 513 -14 -53 149 505 -57 -83 353 216
3871 216 502 126 46 -58 342 339 -140 31 353 52 -88 235 295 332 302 -4 -32 96 117 86 57 -217 141
3894 141 60 216 -7 -121 392 157 -13 -238 -197 -20 -13 -103 -68 -144 -275 -162 -242 -413 161 -287 -181 -303 -184
3917a84M2n4m4l02L85J44L9k19K42l69K80l12J71n23N06N15m19k00k60L60J18
3938h4l39Q2j77M51J86j45l07%M44j82p6k05K99j70J99l31lK75k7J5j94K19J01
3961C1ll48L26j17L55p6l2l81K21N11k78k01l0K89J22j09l18K8J17j04J85J11
3983B99n6Nl2k90j08N12k1k52k97L45K21j21l9l27L85K46k55k80MK42Q1k96j9
4006e3J08J83K46o6o06L03oJ25m51J36M45J5j91k23p6M09M3J6m31r4M21l90m9
4029a86j05K05n2J8L1J77l27L14l68J22j7m4K12l05P4J62K11j1l96P0J82N5l03
4052b81L71n10J38L54l09L8j00M70j23k68j86K49K88l85O8o4O6K0l4k19N07p5
4074A5K2j94p3P1J47K3l56P9K96k4n1j85M6L98m19J32j85J19M24J69m53J23l59
$$ plain form
3917 -184 -142 -196 -240 -542 -157 -13 26 -193 49 -320 -40 -352 -181 -704 -198 317 -102 -302 -562 -202 -84
3938 -84 -423 -341 -518 -67 119 -26 -333 -333 111 -71 -147 -352 -53 -223 -24 -355 -358 -83 -110 -95 -289 -70 31
3961 31 28 -320 6 -111 244 168 136 -245 -24 487 209 8 -22 267 389 280 -38 -10 107 3 188 299
3983 299 243 248 216 -74 -182 330 309 57 -240 105 326 205 166 -161 224 470 215 -65 -61 181 262 -34 -53
4006 -53 55 238 484 418 -188 115 109 234 -217 -81 364 379 188 -35 -111 298 341 357 -74 -168 253 -137 -186
4029 -186 -291 -86 -138 -120 -89 88 -239 75 -293 -171 -188 -232 -20 -325 -251 -89 122 111 -285 -215 -33 22 -281
4052 -281 90 -420 -282 72 -237 -199 -299 171 48 -220 -406 -157 131 -254 -186 -250 -184 -164 -198 -417 90 15
4074 15 37 -157 -230 -159 -12 11 -345 -266 30 6 -45 -230 -184 214 -205 -73 -258 -139 285 454 1 124 -235
4097b35L46Q8k51k58N63N3P3l94L43J56j09o33l3K06M10J52m98P2K7K92k55m35
4119c20Q4J71J73K51l37OK68p9j33j40K87N6k98j33L56j38m9J96m52L32N70l68
4141C03j27k29M0k5K01j72k4J38J44j13l02O7J78rk4j86Q0N4K77j65q25O63J59
4164A03j18j83K04j37O5QJ9l4j35K26m19R9J4L68j8k52j37L86K5M2n34K56J36
4187a6j09l8j60K24K89l89l7p5J0J73K90n45J98J5K21j92k83L24O5J7k30K5J07
4210a16J47j56J95k79J26j08j5K4j76M70J94m37J1k01J62J11K19m08J78L85k34
4231I2l41K43K09J41k65j38J43J12J75k57n15Q65j62l97K49p7O2K3K34m45L5K58
4253B44J56j89k37J72K35l97N9J64j07J39k5J2j64M5J80l60P1L6J93J04j39k99
$$ plain form
4097 -235 111 199 -52 -310 253 306 379 -15 328 484 375 -258 -291 -85 325 477 -21 51 78 370 115 -320
4119 -320 -236 -65 108 359 22 28 296 217 84 -56 231 287 -11 -144 212 74 25 221 -231 101 671 303
4141 303 176 -53 -13 -38 163 -9 -33 105 249 136 -166 -99 79 70 46 -140 -60 -6 271 106 -719 -56 103
4164 103 -15 -198 6 -131 -66 -58 -39 -73 -208 18 -401 -302 -288 80 62 -190 -327 59 84 126 -408 -152 -16
4187 -16 -125 -163 -323 -99 190 -199 -236 -311 -301 -128 162 -383 -185 -170 51 -141 -424 -100 -35 -18 -248 -223 -116
4210 -116 31 -125 70 -209 -83 -191 -206 -182 -358 112 306 -131 -120 -321 -159 -48 171 -237 -59 326 92
4231 92 -249 -6 203 344 79 -59 84 196 371 114 -401 464 302 -95 154 77 139 162 396 -49 -14 244
4253 244 400 211 -26 146 381 -16 43 207 100 239 214 226 62 107 287 -73 -2 34 227 331 192 -107
4275a07J1L66O0l88q1k33M57J72r3j77J60K00n79k0J51J26J76k42k73j3M22N4
4297A49m77J24K18K08l48J33k74J71J58j9k36l61L92P9j34o8K03p2j34N0j08L8
4319c08O2o2L10k94P1L83j92J27l68J43J72m11R6K16M8L3l01K08O5J29j51o0j47
4342b31l1M84k85m61N59j48J67k84J34P6J61j11l53J30M05j48K58l01j1o4K04
4363A50j59J91j05p6J2Q2QK13j09j46J58k8p8m3N0k21m8N45m9n99K83J99j21o1
4387D8R4j91P1R7Lk58P5K87R8l30m1k14K00M95n49O3L82J1l44l00M35j99O5K52
4411B50l24q3K71l4k05K42j00K93l8j54l46J26K86j43k30j28M88k9m76P2L24j19
4433e7J70m15m9N43l64K9QK9K4J52j39n5m74N07M7j50m6r2K38J93m28M2J15p6
$$ plain form
4275 -107 -96 270 330 -58 -139 -372 85 257 164 -13 147 347 -232 -252 -101 25 201 -41 -314 -327 95 149
4297 149 -328 -204 14 222 -126 7 -267 -96 62 43 -193 -554 -162 -83 -217 -285 -82 -154 -288 -238 -346 -308
4319 -308 -246 -308 2 -292 -221 162 -30 97 -271 -128 44 -367 -271 -55 -7 26 -275 -67 -2 127 -24 -84 -231
4342 -231 -262 222 -63 -524 35 -113 54 -230 -96 -20 141 30 -323 -193 212 64 322 21 10 -54 150
4363 150 -9 182 77 1 13 95 103 316 207 61 219 191 113 70 120 -101 -149 396 347 -252 31 230 109 48
4387 48 142 -49 22 119 122 -136 -61 226 324 -6 -47 -261 -61 434 -115 -52 330 341 -3 -303 132 -67 -2 250
4411 250 -74 -157 114 80 -125 117 17 310 272 118 -228 -102 184 41 -189 -317 171 142 -334 -262 62 -57
4433 -57 113 -302 -351 192 -172 -143 -135 -106 -82 70 -69 -124 -598 -91 -44 -194 -240 -332 -94 99 -329 -287 -172 -248
4457b48J47k07o0K78m3j59M68m29L69j82K7j44R6l6L0l12J95K56lk5l12M73k61
4480h2L08k23k15K38J13J57j42j74L47R2k28l32N1L74P9k77j97J96Ll1Pj47J50
4503F7K40j19k44K10K58k29r1j49L26j12M6k52n0L02K93j94n66K42J85j56J09
4524A16Pl30J60L90j88l1Q3j27K31l36M3L0P9N0m06K14m0L55j1l12J05q0J02r2
4548A2j33OJ48Q4k49K00k7Jj52j52K34k7L03n79J68j02L60j89K2l98K15L27L5
4571A07m93J29P4M0j89L1l71O69J85l21j3p6R6M81o75j04L97N2k21M4o9M8K96
4594A17k11J33k28J58k6k17J3L23j54K24k25P9j00j2O7J07k72M12r1k97n7J03
4616a54k2L30j38n7L06Q4k59j43j29P5J48K26k22k07K01m7K2nK54k42K47k59K37
$$ plain form
4457 -248 -101 -308 -368 -90 -133 -292 176 -253 116 -66 -39 -183 -87 -123 -93 -405 -210 46 43 18 -294 179 -82
4480 -82 226 3 -212 26 139 296 154 -20 327 419 191 -141 -90 284 363 86 -111 85 88 57 64 -83 67
4503 67 307 188 -56 154 412 183 92 -57 269 157 203 -49 -99 203 496 302 -264 -22 163 7 116
4524 116 123 -207 -47 343 155 124 207 80 311 -25 18 48 127 177 -229 -15 -55 300 289 -23 82 2 104 12
4548 12 -121 -115 33 117 -132 68 41 42 -110 -262 -28 -55 248 -331 -163 -265 95 -94 -72 -470 -255 72 107
4571 107 -386 -257 -183 -143 -332 -301 -672 -3 182 -139 -152 -228 -132 349 -326 -430 -33 19 -202 -158 -227 -179 117
4594 117 -94 39 -189 -31 -57 -274 -261 62 -92 132 -93 -14 -114 -126 -59 48 -224 188 97 -200 -257 -154
4616 -154 -176 154 16 -41 265 349 90 -53 -182 -107 41 267 45 -162 39 -8 14 9 263 21 268 9 246
4639B46p9L7N9l75L46K4J87Qm23R4J20P5r5l16L59K5o9j76r1j11L49l7j12Q9L58
4664D92M5l64k93N6J66l09L68o1m96M59k08jL07j46LL9j45n4J78K13k49J1j30
4687a19kM0L5j57K47n1l45P7o8M75l59j22J22R7J48j10j20j15K56Pq8l5l05N61
4711F9k9k14Q0n5K27J28m62J39m68L50K7o0P8K36j95J14p2k03J66J49j2j37j42
4734b86M43R7m46l3J19L68ol00j65M09m1k76J80k20M83k02k33J38L4o6l8K11l11
4757a41L72q8J22k17k7J28J88k8j74k43K64K28m61l33L42L93k32J12j59L09k81
4778G4Pj23J22J37K80m22K34l86K08J28j68K15m43L98j72j62J83n8J60k20j01
4799a09J7K83m8k37j22K56K77n14n7K45q1P5j7q7O4K62k44j51k37O11k34J41k65
$$ plain form
4639 246 167 204 263 -112 234 258 445 453 30 124 244 319 224 -92 267 292 223 47 -44 -155 194 157 45 134 492
4664 492 537 173 -120 -64 102 -207 161 100 -396 63 -145 -146 161 15 18 57 -88 -142 36 249 0 11 -119
4687 -119 -121 -81 -46 -203 44 -7 -352 -275 -343 132 -227 -349 -227 -130 18 -92 -212 -327 -71 -64 -152 -187 -492 69
4711 69 40 -174 -94 -149 78 206 -256 -117 -585 -235 -208 -268 -190 46 -149 -35 -107 -310 -144 5 -7 -144 -286
4734 -286 157 254 -192 -225 -106 262 256 -44 -209 200 159 -117 63 -157 326 124 -109 29 63 -3 -41 170 -141
4757 -141 231 143 265 48 21 149 337 309 135 -108 156 384 -77 -410 -68 325 93 205 46 355 74
4778 74 81 -42 80 217 497 75 309 -77 131 259 91 306 -137 261 89 -73 110 52 212 -8 -109
4799 -109 -92 191 143 -94 -216 40 317 -197 -254 -9 -90 -15 -32 -119 -55 207 -37 -188 -425 186 -48 93 -172
4822a72J2M03l80K58k71k8J81L6j88Ok78O89j75n27J63K01Q0j67r8J48N1J82l9
4845H7m01L0M75l9n19L5J63L68l40k7NK27k26K38l38r6K54J68j28k02K50r5R5
4868a6k30J71j00M82m66L27m22J99K03J4j12Q4l6j71J86l11J61k0K15J45q6J02
4890C19J41l01j7j52m0K74j33j32R9J12%L1k24K0Q7P5J8J1Q2k00j09J91j7J63
4914B98j90j40p1J92R3Oj39n0K2M80l86Ln37L28P3lMM3L23m35l2o2J44J62L5k15
4940e4m4K23k71j5K92Jl56J08O4p1l2J34jK8p1K0l9R6Q9l36R9M1k9k09K20J09
4966dp1k45J24J82j87J01m4q9Q0K59k72rJ9l1k7J35J25p8j6R0q2q0K5J41k75m4
4992b73Q8K3K92k56K4k17M69P8k92K15j72M45l17J53o63L63K55J77m07J10Q7j54
$$ plain form
4822 -172 -160 243 -137 121 -150 -178 3 39 -149 -143 -421 268 93 -434 -271 -70 10 -157 -255 -107 -56 126 87
4845 87 -314 -284 191 152 -367 -332 -169 199 -141 -168 -163 64 -162 76 -262 -358 -104 64 -64 -266 -16 -111 -16
4868 -16 -246 -75 -175 307 -159 168 -254 -55 148 162 50 134 98 -73 113 -198 -37 -57 158 303 217 319
4890 319 460 159 142 -10 -50 224 91 -41 58 170 170 201 -23 -3 84 159 177 188 270 70 -39 152 135 298
4914 298 108 -32 -103 89 182 188 49 -1 21 501 115 118 -419 -91 -18 -21 -17 26 349 -86 -118 -180 -36 126 161 -54
4940 -54 -98 125 -146 -161 131 132 -224 -116 -52 -123 -155 -21 -22 6 -65 -45 -84 12 101 -235 -136 -95 -124 -333 -113 -4
4966 -4 -75 -320 -196 -14 -201 -100 -144 -233 -153 106 -166 -175 -156 -187 -214 -79 46 -32 -48 42 -40 -120 -95 46 -229 -273
4992 -273 -185 -162 130 -126 -102 -319 150 228 -64 151 -21 424 107 260 -403 -40 215 392 -15 95 182 28
5014B8M15m69K12MJ51j82j11L8R7k8k87K12K17k44m3oN0K84j52q3j56p5L40j06
5038A06j57j60L97K04r2k89L0J66M2j18l57M47k62J2K89n57J19J39q8j9M0nQ5
5061b8j25J27L4J11k3l40J44N8J58j62K23k97K9R2L70l16k60J26j19O4J48q4k33
5084c03J81J23l63L87r2J02k38o6J60j45L0j96J1K26M5o3P6J99k54Q1J32l86K76
5107g7K53l67j48pj35N26j65Pj5K70k73k12J39N1J23L40k27n9j38L97l28k37L40
5130E8k41M25o5l29R5K50k5m56K62L07k48NJ07k59J37K32l45N4K35j27K14k7l52
5153i3L7J99J70k87j78K01J62k00K7J45K08l37l8jm5l6L23R6n52K18K44j09l37
5176a83O8J92J60k09J3k14K88J05j99j02L4k41J76O5Q9PJ97j55l3k58M27r3k77
$$ plain form
5014 28 443 -26 186 190 341 159 48 86 183 155 -132 80 297 53 10 4 54 338 186 103 -53 -128 212 106
5038 106 -51 -211 186 390 298 9 39 205 247 129 -228 219 -43 -31 258 -299 -180 -41 -129 -148 -108 -113 -28
5061 -28 -153 -26 8 119 96 -244 -100 -42 116 -46 177 -120 -91 1 371 55 -205 -79 -198 -134 14 -70 -303
5084 -303 -122 1 -362 25 -67 35 -203 -269 -109 -254 -224 -420 -409 -183 -138 -201 -125 74 -180 -99 33 -353 -77
5107 -77 176 -191 -339 -346 -481 45 -120 -113 -128 142 -131 -343 -204 -153 -30 310 83 24 -114 283 -45 -282 58
5130 58 -183 242 177 -152 -57 193 168 -288 -26 281 33 38 145 -114 23 255 -90 -36 199 72 286 259 -93
5153 -93 -56 143 313 26 -152 49 211 11 38 183 391 54 16 15 -30 -66 257 353 -199 19 263 154 -183
5176 -183 -115 77 237 28 41 -173 115 220 21 -81 -47 -288 -112 -47 42 49 246 91 58 -200 227 134 -143
5199a43j5R3M04q9m43l14M54qK13j99j54j94J69R8n3k9K78J51m59qJ64j30O4J4
5223a36J43J02J89j45k0l27Q3p7L13j75l06L89J06j62j49J76j07O7O5j86L61n18
5245c14N94l49J7j17L08j75j22K56m27L83k19Q5K6K2N8k51J16M14k31jJ8l47K15
5268d1N0j44M2Q2n6K63l70L5K02J3PK3j63J92O7l22J8M58j32o8M8j34j72M16k03
5293A11l27O4L54n7k9k90N20j9j42j46j19o7J51K68m25J65K41Pj35j49k36L30
5315G0N5j93J37N8j37J04j35j72L61l69M1K62n0J51l28q4L20j76K27l8o2j61j13
5338b32qM53k88k15K80j07K42m85J50K75J44l32J72q7j60L48l11j28J96L8k35
5359b90P3j0j00L93k67Q9j3L53n64M43m16J69O6J0j22L25j89j17k4J32J76j5k16
$$ plain form
5199 -143 -158 -65 339 250 -193 -507 -53 -61 152 -47 -201 -395 -226 -128 -181 -210 68 219 -240 -248 -84 -214 -150 -136
5223 -136 7 109 298 153 133 -194 -111 -188 125 -50 -356 33 139 -23 -172 4 -103 -36 29 -157 204 -314
5245 -314 280 -69 -52 -169 139 -36 -158 98 -329 54 -165 -80 -54 -32 26 -225 -109 305 74 73 91 -256 -41
5268 -41 9 -135 -93 -11 -67 196 -174 -139 63 76 83 106 -57 135 202 -120 -102 356 224 156 204 70 -102 314 111
5293 111 -216 -152 202 145 116 -174 346 327 185 39 -80 -147 4 272 -153 12 253 260 125 -24 -260 70
5315 70 125 -68 69 127 -10 94 -41 -213 148 -221 -180 82 32 183 -145 -229 91 -85 142 104 42 -119 -232
5338 -232 -240 213 -75 -290 -10 -117 125 -360 -210 65 209 -123 49 -38 -198 150 -161 -289 -93 -55 -290
5359 -290 -217 -227 -327 66 -201 -112 -125 228 -336 107 -309 -140 -74 -64 -186 139 -50 -167 -191 -59 117 102 -114
5382a14j3L3J42n7j59j9Q5K87j73J30n18L29j03J32K42n07K93K79j10L9j44m5
5404B9JJ52j88J17k12K09M2k90K50J03M2n60K41j61J82J43k02J92%K82n00L36
5426B08k76j23M68m22L68m60Q9O08l22k08P5K22O1j2n3j93O6K2No0k27L28j60
5449DR6j18L23k91j61j53K35M00l06l79L59r7kL4P8r0n14N87J67m66J2K98L29
5472C45n21K01J81k20J23n65J62J78K47j89j71J46j34r2K30o4%L88l43j58LL69
5494A16k51p8j4J47j31J31k5M8k8M10m12K4k69J31J74K68l95K94L8K1j85P9l70
5517b77O02l34l3j52L87j46j17K6q8p3M78M3m25j44L62J80k18k48J91N30m28j57
5539d1p7K29o3J56O3k95PM14j94M5j41K60O7j32l05j08M50j04j75k90L61N8q7
$$ plain form
5382 -114 -127 -94 48 -9 -168 -187 -102 185 12 142 -376 -47 -150 -18 224 -283 10 289 179 218 74 29
5404 29 30 182 -6 111 -101 108 150 -140 110 213 255 -305 -64 -225 -43 100 -102 90 90 372 -128 208
5426 208 -68 -191 277 -145 223 -237 -148 460 138 -70 5 227 288 276 223 30 96 118 123 63 -164 164 4
5449 4 100 -18 305 14 -147 -300 -65 335 29 -350 9 -88 -90 -56 22 -68 -582 5 172 -294 -282 16 345
5472 345 -176 25 206 -14 109 -456 -294 -116 131 -58 -229 -83 -217 -309 -79 -143 -143 245 -98 -256 -253 116
5494 116 -135 -213 -227 -80 -211 -80 -105 -57 -85 325 -87 -63 -332 -201 -27 241 -154 140 178 199 14 93 -277
5517 -277 325 -9 -42 -194 193 47 -70 -44 -132 -205 273 316 -109 -253 109 289 71 -177 14 544 116 -41
5539 -41 -118 111 48 204 267 -28 -21 393 199 244 103 363 430 298 -7 -115 335 231 56 -234 127 185 98
5562I8l28L14pO1k05j5J54J2J08j50K03k53M3k10J19l03N84j92j02o6N7o8L69
5585B23k1l03k7L2K68k31J36l15K28L43p70Q8K10K61k76R0M4k14M58l59J60j21
5607i6K25j51n1k20P1K02K44k65j76L82l54K54k17L7j43K81l5k07rK90J36k79
5629h1k41J43L15r0j80K85k23m3Q8k46L9N81m82N5J74j33o3J80L4k86L74k92N7
5652c5J04oL27l65m5j95J52J14L40K13n46j12M08l50L6J6j05K51j28k1K3N26m59
5675A43o3j31J05K03k56K77n15L08j11L00j77j67K96j91k7Q6J30j60j3P3l49M1
5697a98J25J19p1j91J37L89k21l8m05P41p6n29J92J25R8j71kk09J76m0K22m64
5719b91J67J76k20L61k62J22j7O9m89K73J52k47K05m7r2N1K7J72o2k48L62J09
$$ plain form
5562 98 -230 84 77 138 -67 -82 72 84 192 42 245 -8 35 -175 -56 -359 225 33 -69 -135 -78 -146 223
5585 223 202 -101 -128 -96 172 -59 77 -238 -10 333 -437 -349 -139 122 -154 -64 -20 -234 224 -135 25 -96
5607 -96 129 -22 -73 -293 -222 -20 224 -41 -217 165 -189 65 -152 -115 -258 23 -12 -219 -228 62 198 -81
5629 -81 -322 -179 136 46 -134 151 -72 -115 -27 -273 -234 347 -135 -80 94 -39 -102 78 112 -174 200 -92 -35
5652 -35 69 63 390 25 -20 -215 -63 51 391 604 58 -54 354 4 40 56 -49 202 74 53 76 602 143
5675 143 80 -51 54 257 1 278 -237 71 -40 260 83 -84 212 21 -6 80 210 50 37 110 -239 -198
5697 -198 -73 46 -25 -216 -79 310 89 51 -354 387 311 -218 -26 99 197 26 24 -185 -9 -49 173 -291
5719 -291 -124 52 -168 193 -69 53 36 105 -384 -111 41 -206 -1 -48 -140 -89 -62 110 48 -200 162 271
5741B71k05l22J57j01Q9p0k84O00j12j21p4o2J85mR5j28oo2J74J81k44j02Q9K68
5765B12k04l60J59J42k0J49R8l19J70j28n0k3M38l87j85R2K12K35q3l7j04j43
5787a36K44R6J70J5k98rj34l6P9J71r0M6p9ok21L35qR3j12NR8j32j09J32K71q0
5813C05j94j63j2Q5j53J79J10k23M25l64j04K90k4j17p9M77l37mj90K41r7J9j42
5836g2j48J21n8K30q5j12O9K12k42J22l99K84K32k39l03L24N0L2l1P4k8n6J38
5859A15q3Q5l39k7Q9M7L4R5J8k81M34p4n43O02k80k26L76qO6j85j82J54L24j30
5883H1o33M60P7O6j11Q9m18K84k02O0J58Q2n6K92j62k14L69n0Jk83j4J65K50j30
5907A61N7k86Q0k27J67j86L29J61j02k81j18P29l57k28k9L5L35k03K62m60K32
$$ plain form
5741 271 66 -256 -99 -200 -111 -181 -465 135 23 -98 -172 -234 -49 -53 42 -86 -92 -154 20 201 -43 -145 -56 212
5765 212 8 -352 -193 -51 -71 78 176 -143 27 -101 -151 -174 264 -123 -308 -216 -4 231 148 111 7 -136
5787 -136 108 204 374 389 91 82 -52 -88 -9 162 72 118 39 33 -188 147 139 232 120 125 223 91 -18 114 385 305
5813 305 111 -52 -64 21 -132 47 157 -66 359 -5 -109 181 157 40 -39 438 101 97 -93 148 51 70 -72
5836 -72 -220 -99 -157 73 -12 -124 -55 157 -85 37 -362 -78 154 -85 -388 -64 -14 18 -13 61 33 -23 115
5859 115 32 117 -222 -249 -160 -113 -79 16 34 -247 187 113 -430 172 -108 -334 42 34 100 -85 -267 -113 211 81
5883 81 -552 -92 -15 51 -60 29 -389 -105 -307 -247 -89 -7 -63 229 67 -147 222 172 173 -110 -124 41 291 161
5907 161 218 -68 12 -215 -48 -234 95 256 154 -127 -245 484 127 -101 -130 -95 240 37 299 -161 71
5928G1m4J79j33j47j61M26Jk14K69j11Q8k31P6mN3kj66J77O3k07J96j74R2QJ05
5953B10l62Jl7K73r4J24n5J13k%M2o5j29K66j90j12J16k16K18Q3l92R6L34k60
5977c8k05R1k19N05J01l90J69j54K08j31k06K07O9j66K35k95q5K45l1J96k28Q3
5999c9K6J09j57j75L2J38j8j57J31MmJ31k85N4L40p5k25K25k58M87k62m33Q28
6022D17k88l62K9J27N6n7o8J90m4J68p9l5J08j77q1K19p1k44M68J18m09j79J01
6045i3J2N1K84j67k68K71J2m18M44l08K94j13J34k13j97K95L26k64m5L94l19J31
6067B43L8j24mJ74l60P7L69j11M3j24k37n9K89j62l4qJ99q2K26l79j8L62l81J06
6091D3r7k4j04J47P9K6p9J06j77R0j83L5K14j57K5j14K85j38J34r7L1Pl4q8l52
$$ plain form
5928 71 27 206 73 -74 -235 191 192 -22 247 136 224 -7 69 65 118 116 -50 127 190 -17 179 5 97 105 210
5953 210 -152 -151 -188 85 -9 115 60 173 171 171 213 148 19 285 95 -17 99 -117 101 184 -208 -112 222 -38
5977 -38 -243 -152 -371 134 235 -155 14 -140 68 -63 -269 -62 7 -159 76 -219 -304 -59 -90 106 -122 -39
5999 -39 -13 96 -61 -236 -204 -66 -84 -241 -110 -106 -110 21 -264 -210 130 55 -170 55 -203 284 22 -411 417
6022 417 129 -233 -204 -77 -21 -78 -146 44 0 168 89 54 162 -15 -96 123 52 -192 276 394 -15 -194 -93
6045 -93 -81 -30 254 87 -181 90 102 -316 128 -180 114 1 135 -78 -275 20 346 82 37 431 112 243
6067 243 281 157 153 327 -33 44 413 302 345 221 -16 -75 214 52 18 10 209 127 353 -26 -44 318 -63 43
6091 43 -54 -78 -182 -35 44 70 -9 97 -80 10 -173 -138 76 -81 -56 -170 115 -23 111 14 45 52 18 -70 -422
6116d22K62L11j65P9j34J3L3r0J54l38J23M06p9q7k50K43L9l48K59r9L98j47j58
6139Cp3J0J60j14j63k5L58l04j14J53K60j74l5o4J13l5j00K8K02k37j09L85l8
6162H7Q8k33J36L00n05p3M11j53k4Kp4j7l9k44J1J58J68M91n46k31N80j55m03
6185b65M01j05J87n9N0j31k53N28j60k87P5J47k5J54L8k63J7J16R9n7M7m24K9
6208a41l5O5o9N7L12k70m9k0L55j90K7KJ25L2p5qk09N46k96m20K45j41K68J14
6232B25N1l10p7K76j51j28J25k36L37L01n83J82K24j96mp9J20J03l45R1k10J82
6254a02o1J72j49Q9k4j38J41K00j94J56J33j06k07J22N9o4l49J01K91m5p9j71
6276b25L2K43Ok75J27j2K46j86m9M8n6j35N1j89K67K20k45j00J24j74K75J57O5
$$ plain form
6116 -422 -160 151 -14 65 -69 -56 -23 -113 41 -297 -174 232 153 66 -184 59 98 -250 9 -90 308 161 3
6139 3 -70 -60 100 -14 -177 -202 156 -148 -262 -109 151 -23 -58 -122 -9 -44 -144 -116 86 -151 -260 125 87
6162 87 175 -58 78 378 -127 -200 211 58 34 36 -38 -55 -94 -338 -327 -169 -1 490 -56 -287 293 138 -265
6185 -265 136 31 218 159 209 78 -175 353 193 -94 -19 128 103 257 295 32 49 165 264 207 254 -170 -141
6208 -141 -176 -111 -180 -123 189 -81 -130 -150 205 15 42 44 169 201 126 118 -91 455 159 -261 -16 -157 111 225
6232 225 276 -34 -111 165 14 -114 11 -225 112 413 -170 12 236 40 36 -43 77 180 -165 -74 -284 -102
6254 -102 -163 9 -140 -51 -75 -213 -72 128 -66 90 223 117 -90 32 91 27 -322 -221 70 25 -54 -225
6276 -225 -193 50 56 -219 -92 -104 142 -44 -93 -45 -101 -236 -185 -374 -107 113 -132 -232 -108 -282 -7 150 215
6299B15k27j06M09m0Kl39O0Q7q4J45k36J95Q7j43rk1J49j88m2J02R1J85k16N6
6323A32p5L4K38k15j13O6m4K63j80J28l14M05j29l14O2J5M00l94J42L1K31j20
6345B49k47k44K15K49k48PJ61l28L28J5l27J81k20J32j48m8K00N8K08k98k1J14
6367a2n8n4J03o2N7L14m08J58j4k43J87l88M40k25L03J81k32k61J33m0K06j78
6389i3K3r4j85K12M7j33R7J12j76J44j45J15j53KJ10J44ok27J59Q8l02K20Ol83
6413d18M03j99J24p5K0R9o2L1J86j38L3n0K05j93j23J93j12M7l20K63M2L3L8J71
6437A98L9l85J04j9Q2K44j36j44k3K31j78K4ML9k75M38k26m3k8J2J25k6j13R8
6461D2mJ46j28l18L41P3J09l9j74M4l60K30M2J40k10K9KK18k71j24K24O7k03P7
$$ plain form
6299 215 -12 -118 291 251 253 -86 -26 61 -23 122 -114 81 168 25 16 -5 144 -44 -86 16 107 292 76 132
6323 132 57 91 329 114 1 67 23 286 106 234 -80 325 196 -118 -56 -41 359 -35 107 138 369 249
6345 249 2 -242 -27 222 -26 -19 142 -186 142 157 -170 11 -209 -77 -225 -273 -73 -15 193 -105 -126 -12
6367 -12 -70 -124 -21 -83 -26 288 -120 38 24 -219 -32 -420 20 -205 98 279 47 -214 -81 -121 85 -93
6389 -93 -70 -164 -349 -137 -90 -223 -126 -14 -190 -46 -191 -76 -229 -227 -117 27 21 -206 -47 41 -261 -41 -35 -418
6413 -418 -15 -214 -90 -165 -145 -46 -108 -77 109 -29 4 -46 159 -34 -157 36 -76 -29 -349 -86 -44 -11 27 198
6437 198 237 -148 -44 -63 19 263 127 -17 -40 191 13 37 41 80 -195 243 17 -26 -54 -42 83 57 -56 42
6461 42 38 184 56 -262 79 152 261 222 48 92 -268 -38 4 144 -66 -37 -35 183 -88 -212 12 79 -124 -47
6485d7J89Q4k87o4K53J14n53K16M9J35j97J52j30J4J50j45k09L06l05K8L49m79
6507c77M90j33K48l42O6J08J82l94O5k84K06j86M80k52M2l29M69J7j64k43J50
6528a81J20j25n6J5K02K2m15K89L7J96r7k38J56K46P8m19m3L24j24jk36L77j00
6551B7k87K54Nj71M29l07p9J53l01M94o3o9j99k6J03M7j2j63L47k5J26k59l08
6574b84M20J88M4l05k10M25l40J47Q2k89K46M74k62l83j13RL52k34m1J75n6K4
6596F9k04J30r1J40k14J56J21n6j88L65l35J18O1J79m35p0n5L85K09m49J73M6
6618E5m1j83K2j23M01m8j76j66J75J47R8j52j42j32M96l02j22K44q2l11L65j59
6640a36J61K2j66m1P6K07j17N1k63nJ36k6J8J6r3K0M21l26J49o2p2l44N25k11
$$ plain form
6485 -47 142 226 -61 -125 128 242 -311 -95 -46 89 -108 44 -86 -72 78 -67 -276 30 -275 -247 102 -377
6507 -377 113 -20 228 -114 -48 60 242 -152 -87 -371 -165 -351 129 -123 -81 -410 59 76 -88 -331 -181
6528 -181 -61 -186 -242 -227 -25 -3 -418 -129 -92 104 7 -231 -75 171 249 -170 -213 111 -13 -14 -250 127 27
6551 27 -260 -6 -1 -172 257 -50 -129 24 -277 217 154 85 -114 -140 -37 10 -2 -165 182 157 283 24 -284
6574 -284 136 324 368 63 -147 278 -62 85 167 -122 124 598 336 -47 -160 -151 201 -33 -74 101 45 69
6596 69 -135 -5 -96 44 -170 -14 107 51 -137 228 -107 11 72 251 -184 -254 -309 76 285 -164 9 55
6618 55 14 -169 -147 -270 131 83 -93 -259 -84 63 161 9 -133 -265 231 -71 -193 51 -31 -342 23 -136
6640 -136 25 47 -119 -160 -84 123 6 57 -206 -211 -75 -101 -83 -67 -160 -140 281 -45 104 42 -30 -374 151 -60
6664f0J80k63J34K8k77N4P8j63J17Q2R3N9j74j72K70mN1J54j06k20K62j37k12
6687b26K08J80j40q5n2P0P8J03n5k92L20k62L17q7R3j33K72j54J2m31K00K30k43
6710g7J21j71L27j05L08k37r1j50o4L30J13O4m26O0J37j52j3Q5k42R1K47J59k47
6733F7j4j15J38k10K63k98L05J39k37k7j65K66J1o9l34L82l04J26kK42j09J37
6755A92j50J06j61J08r0J05k56oJ01o1J3K02j58o0K44L2n65L36N3l30K94k07J35
6778a23N5l0k97M85k13j92K72N6k03J81n3J43j17k95L32J92m62j29O04r1O1k19
6800d3j34K9j98L23P0PJ39j86k39K50j68J98j05Q8q5J18o7L8m9k16K18P0j81Q
6824a15qK36k02K8j34K75J09l20pK17L02k81j21l9K41j52j51K69L4J95j83P4k76
$$ plain form
6664 -60 120 -143 -9 19 -258 -204 -126 -289 -172 -90 3 62 -112 -284 -14 -18 33 187 81 -139 123 -14 -226
6687 -226 -18 162 22 -63 -115 -45 33 136 81 -211 109 -153 164 77 170 37 309 155 167 -264 -64 166 -77
6710 -77 44 -127 200 95 403 166 75 -75 -139 191 304 368 -58 2 139 -13 -26 59 -183 -92 155 314 67
6733 67 53 -62 76 -134 129 -169 136 275 38 11 -154 112 123 54 -280 102 -202 -76 -78 164 55 192
6755 192 42 148 -13 95 5 110 -146 -152 -51 -112 -99 103 -55 -115 129 161 -404 -68 -15 -345 -51 -258 -123
6778 -123 -68 -98 -395 90 -123 -315 -43 13 -190 -9 -62 81 -36 -331 1 193 -269 -398 206 115 176 -43
6800 -43 -177 -148 -346 -23 47 54 193 7 -232 18 -150 48 -57 31 -54 64 -3 35 -14 -230 -12 58 -123 -115
6824 -115 -123 113 -89 -61 -195 80 189 -131 -138 79 381 100 -21 -60 181 29 -122 147 181 376 193 267 -9
6847iO6k21J50J71j5l49M01k31O0R4k96L50j10L3l21J35JL11Q7j86n6Q1j61j07
6871a22L20o6K2j99mK30J80m26J02l69K79K81j55j77M5K49n07K03j02r8M31l87
6893b70M9J08K35J02l28p5k04M44J51k2n18M57l9J8m2j38p0K26J77o23L46P4q6
6916b8L28m04K52k64J60l09J49nK71j53k18j72R2K64J12M1k21LK84l01j53L2J30
6939a10L59j01k26j8J18k35K41J0j93K21j29L5RP5j70k7J55P8K4N6k92j30K31
6962a9J8j79J10M7j12J67K2MJ04j83J15j35L69l04J98j40l69J67L98L01k71k46
6984F2k69J97jL15l26N7L9K24l87L0K39k78K41k68K28J15J1j26R5m4M3r8j68l05
7008c74O3L33O7J06r0k95K8K88j86O3L04m91J54J96k45Q7j23R7q2%n1M09k60J01
$$ plain form
6847 -9 57 -164 -14 157 142 -207 194 -37 23 117 -179 171 61 94 -227 -92 -91 220 307 121 65 146 -15 -122
6871 -122 198 132 154 -45 -49 181 361 -65 37 -332 -53 228 73 -104 -59 190 -317 -114 -216 -314 117 -270
6893 -270 -221 -113 122 224 -104 -179 -383 61 212 190 -328 129 90 108 66 -72 -142 84 261 -362 -16 58 -28
6916 -28 300 -104 148 -116 44 -265 -116 -121 150 -3 -221 -393 -301 -37 75 116 -105 -102 182 -119 -272 -240 -110
6939 -110 249 148 -78 -96 22 -213 28 38 -155 66 -63 -28 -19 56 -114 -141 14 92 116 172 -120 -250 -19
6962 -19 -1 -180 -70 -23 -135 32 54 58 162 -21 94 -41 328 24 222 82 -287 -120 278 579 308 62
6984 62 -207 -10 -11 304 -22 35 74 298 -89 -59 180 -98 143 -125 103 218 229 103 198 154 197 99 -69 -374
7008 -374 -311 22 89 195 105 -190 -162 126 -60 3 307 -184 -30 166 -79 8 -115 -18 -100 -100 -151 258 -2 99
7032I9k1p3j64J93LJ00k15m2J1Q7J03j52J35k69p3K37n2j81J68L1J61R6o89M20
7056h7J50K19l40R6j98K06r6j08L04j03k66L22n4K27k91K46l32RJ83m8kl9R1k58
7080a69K00K10l27nK56m68J19L94j93M8l80J49%n2K59q3q5J10n5L66k03M0k03
7103g2K88l7k00r0j76L61k9j11L12k25J25j12K9k39N5J07pK19j72P2n7j11m7K84
7127A67l98L28r9j71K05K02J00l79J03j52L87l99p2pK02N5j23j80J85j82K78k3
7149B7l26M47k27K42l63M35l42K39l05K75j48J86o2j76j24L55o9j14k52K6J79
7170i7R2j78o7J50k6J83q6r4n2J15J5K55n98J99M98k16k95p4JM07J4q3k96Q4J37
7195a2Q6L5m00M73K7l77j95L01J79j65qk19K68J23j67J72j62K6J67jl33J2K15
$$ plain form
7032 99 78 5 -159 34 37 137 -78 -120 -109 -22 81 -71 64 -205 -278 -41 -93 -274 -106 -75 86 182 -507 -87
7056 -87 63 282 -58 38 -160 46 -50 -158 146 43 -223 99 45 272 -19 227 -105 -96 87 39 37 -2 89 -169
7080 -169 31 241 -86 -91 165 -303 -184 210 17 65 -315 -166 -166 -218 41 -42 -127 -17 -72 294 91 131 -72
7103 -72 216 179 -21 -111 -287 74 45 -66 246 21 146 34 63 -176 -121 -14 -21 198 26 98 41 -70 -117 167
7127 167 -231 97 -2 -173 32 234 334 -45 58 -94 293 -106 -178 -185 17 72 -51 -231 -46 -228 50 27
7149 27 -299 148 -79 163 -200 235 -107 132 -173 102 -46 140 78 -98 -222 133 64 -50 -302 -276 -97
7170 -97 -5 -183 -250 -100 -126 57 -29 -123 -175 -60 -45 210 -388 -189 309 93 -202 -276 -275 132 146 63 -233 -149 -12
7195 -12 74 109 -291 182 209 -168 -363 -62 117 -48 -56 -275 -7 116 -51 121 -41 -15 152 151 -182 -170 45
7218D5K03l01j43N66n31J68O2j71J53J40K20l95n6J92p2j63M0J56k55N6J98j01
7240A1J62m4j47j92k4N81j64p4j7m7J08J1k58k3J03j17J94Q4k19K91k68j9r0K02
7264D4j85J97k23K92l05M45p9n30M15l1n9J06j97l4J46J11l42K02N7Rj7o8o2J58
7288E0k23M57j26l85K31N6j66K21P9j49j53R6r3j0J21N9m9J58m45K46K13l28J67
7311B7L0K34k84Q7l1Q7N3q0j95J20J44j57j24J6k6J84k17j7K8K12k44L73j31k50
7335a61L48l9j68j14l4N10l81J68j60k87N30k3l50J00J06P7R5k79p0K72j03O1
7357I8j5r9J21l16K67JJ16J54k72J67j32J9m8k10J08K18Q8Rl03J09n6J70j98K01
7381A97P4j56j60O3K17j53k1p4m6J43q0j07J09j65J65R5j99p8L19m1k14K15n9
$$ plain form
7218 45 248 -53 -196 370 -161 7 69 -102 51 191 411 16 -40 152 80 -83 -43 113 -142 -86 112 11
7240 11 173 129 -18 -210 -234 347 183 109 92 45 153 164 -94 -117 -14 -131 63 147 -72 219 -49 -68 -158 44
7264 44 -141 56 -167 125 -180 265 186 -344 71 40 -19 87 -110 -144 2 113 -229 -27 30 39 22 -46 -108 50
7288 50 -173 284 158 -227 4 60 -106 115 194 45 -108 -12 -105 -115 6 65 16 174 -271 -25 188 -140 27
7311 27 57 291 7 94 63 150 203 123 -72 48 192 35 -89 -73 -99 85 -132 -149 -121 91 -153 220 89 -161
7335 -161 187 148 -20 -134 -168 342 -39 129 -31 -318 212 189 -161 -61 45 122 217 -62 -132 140 37 98
7357 98 83 -16 105 -211 56 57 173 327 55 222 90 109 61 -149 -41 177 265 274 -29 80 24 194 -4 197
7381 197 271 115 -45 18 235 82 61 -13 -59 84 4 -103 6 -159 6 101 -98 -176 143 102 -112 103 44
7404D4J9O3k87j51M34p5j09O5k5j72K27J01j55k7k72J43K88k36j65L25l35L73
7426G3q8M1J3k67J41P4j3l20N47k9j53K0O5p8p0j23K37M1k9k48K11J3k29K51j03
7451b3J21j40r5J89p9R3J04J32K9l09R0O0k32N6k02K54k13N1K5j09N6J91n2q3
7475h6l9J94J31r6j46RJ40K4l2m2M2q2M42m07n7J22k85N10k16o2P6o7p3J44K4
7500A68k06R7K09k49J1J79m06J95q9L78l42K11j23j21L26nj96k26K15l8k9j12
7522a53P7j4K19j40j1J35J82m71J12r8L34J6n27L02P6q9p4J46k64j16N32k81K23
7545A16l8j18j56J35P0r3j41o7L03k10J9J65M3R8k83j35J43l0K88O5j54j29NK3
7569h1l01K85Q0n6O1j32J48J11m0j43j10J43R1K6k14M4j63J88q5j53L71K26m34
$$ plain form
7404 44 63 126 -161 -312 122 47 -62 3 -22 -194 33 134 -21 -48 -320 -177 111 -125 -290 35 -300 73
7426 73 -15 26 39 -228 -87 -13 -26 -346 201 172 19 39 104 26 -44 -167 70 111 82 -166 45 58 -171 80 -23
7451 -23 98 -42 -137 52 -27 66 170 302 331 22 112 172 -60 -4 -206 48 -165 -114 -89 -198 -142 49 -3 -86
7475 -86 -125 69 200 104 -42 -33 107 131 99 57 99 17 459 52 -5 117 -168 342 126 64 140 73 0 144 168
7500 168 -38 59 268 19 30 209 -197 -2 -91 287 -55 156 33 -88 238 233 37 -189 26 -12 -41 -153
7522 -153 -76 -90 129 -11 -22 113 295 -176 -64 -162 172 188 -339 -37 39 -50 -124 22 -242 -358 174 -107 116
7545 116 78 -40 -196 -61 9 -84 -225 -292 11 -199 -180 -15 28 126 -157 -292 -149 -179 109 174 20 -109 -104 -81
7569 -81 -382 -97 -17 -73 -12 -144 4 115 75 -68 -178 -35 56 82 -132 -88 -251 -63 -148 -301 70 296 -138
7592a38J27l8Q6J10j88L3K3q7k00K62j19K21n0R2N6j84k0N0j79L8J05J40k4J51
7616B67k30k64L37K68n27J55j00K44j52l8K7j02J58m7p9J35J40l47K06j04O7l1
7638a7J24m06K94oj00K57k87m8K56N4j59q7J8J63J2j68j54M36K42l19j2j58K80
7661B15j09k19J15l04L78L8r7k1K64m70N32m59K87L1j92M5j82M54j75p6r8O2J68
7684A87l49J1J39j77L08Lp5j77M2K57q2l44J48l46K50N9K07k31L88o5r9j89K00
7707F5m7p8m4K62n2l54M31P4P5m54J20m4K98m73M76k48Q5n2J41j52K60m05K19
7730A03o0K8J03k49J16Oj76K07K2m1k8J75j78l5M7Q5J12m44J85J19O7j56K76m22
7754a38K69j35J33l49K68R4n7k45J90K16k07j5n0%nk3J26R8m13K89J14j30l94
$$ plain form
7592 -138 -11 -49 37 147 -41 -8 15 -72 -272 -10 -129 92 42 134 190 6 -14 36 -143 -105 0 140 116 267
7616 267 37 -227 110 378 -149 6 -94 150 -2 -40 -13 -115 43 -4 -83 52 192 -155 51 -53 14 -17
7638 -17 107 -299 -5 -11 -111 146 -141 -189 67 121 -38 -125 -107 56 68 -100 -254 182 424 105 93 -65 215
7661 215 106 -113 2 -302 76 114 17 -4 260 -210 322 -137 150 181 -11 34 -148 306 131 55 -43 19 187
7684 187 -162 -151 -12 -189 119 122 47 -130 -88 169 87 -257 -109 -455 -205 -146 61 -170 218 153 54 -135 65
7707 65 18 -60 -104 158 106 -248 183 257 332 -122 -2 -46 252 -221 255 7 92 40 181 29 289 -116 103
7730 103 43 71 174 -75 41 47 -129 78 100 59 31 206 28 -7 40 125 237 -207 -22 97 164 8 284 -138
7754 -138 131 -4 129 -220 48 142 85 -160 30 246 39 24 -26 -26 -31 -54 72 170 -243 46 160 30 -364
7777c64L48J76j30j19r3Q4L7J25k7Mj73J50J11k78J07J74k24K40n13K19Q1J69
7799A04j06j42OK16k05N9r3R8J54m6j55J08k91M00l83O7p8M07k25q1k01M35J24
7822A72k12J55j84QJ53O6l34N7P2K07R2l19m6M90n68j00K14J0J22k13n5M2J47
7845b4J4J31l51K58O6j9N4l45K4L29o2j80P0K55k54J4j18N2M34k76N2j89o5J72
7869D2o2J35q6q2Q2j3l06L74m5R0j66R2j23K10k3O0j92M00k33j07K35l08J29q1
7893B2J0j82L59p4l27M42m28M17l68R0J03k13J14l12M42n6q0J60l38R4R3J34r6
7916FO8J55j39J12k07P4k87l9K65O6N3k9j12J23k49J04L2j87O4K67m50K70J51
7939A11K4j59O7k69O6P0L9J06k22O3M06k91j63J45J7m2m8k04R4K71p5j38R5J20
$$ plain form
7777 -364 -16 160 30 -89 -182 -98 -61 64 37 41 -132 18 129 -149 -42 132 -92 148 -365 -146 -65 104
7799 104 -2 -144 -138 78 -127 -68 -161 -63 91 45 -110 -2 -293 107 -276 -209 -287 120 -105 -186 -387 48 172
7822 172 -40 115 -69 -61 92 158 -176 -119 -47 160 252 -67 -113 377 -191 -291 -77 -67 55 -158 -213 -171 -24
7845 -24 -10 121 -230 28 94 75 129 -216 -192 137 75 -105 -35 220 -34 -20 -138 -86 348 72 124 -65 -130 42
7869 42 -20 115 29 -53 29 16 -290 84 39 129 -37 55 -68 142 119 179 -13 387 154 47 282 -26 103 22
7893 22 32 -150 209 135 -192 250 -178 239 -129 -39 64 -149 -35 -347 95 39 -41 119 -219 -125 -32 102 6
7916 6 74 229 90 202 -5 69 -218 -257 8 74 127 98 -14 109 -140 -36 -4 -191 -127 140 -310 -40 111
7939 111 135 -24 43 -226 -160 -90 -51 55 -167 -104 302 11 -152 -7 10 -32 -80 -284 -190 81 6 -132 -37 83
7963H3k93M91m05J34J34j77j25L21j19j93Q7N2K17j28r8K5J37j45N6K61k40l88
7985c13J72K4J38L2J28j87R7j63l2p3K09k37K15j90J26L03k06J12j84Q7K81l20
8007A9Q1j0j68L33k98p2j3L34q9o7j73l7L72R7j17j47k17L52j48n5l1J6K28q3
8031A07l80L87R9j25J52l26L31l43N8j2l22J76K82l09mO2M07k99J35j12K5j9K
8054b8k4Qj4n3M17m92K54k18K39k48K31r5p4P5J4j53R0K46m27K87J2k99K03R9
8078E0k35j73L33J01m37N30j19P0q9l19J83J31j3O4k03L82l46J34k93J91M2J14
8100I8j89j24l6L13J25k93J33J26k59J56OK1j39K05k8K03k51j2k7J7J68m25J95
8123a7m4J50J01p1K2J29m43O2p0L88j50j6j17J48O2J32m51K71l85L74K8l69K56
$$ plain form
7963 83 -210 281 -124 10 144 -33 -158 163 44 -149 -62 -10 207 79 -19 6 143 -2 54 315 75 -313
7985 -313 -141 -117 21 53 181 -6 91 -72 -104 -177 32 -205 10 -180 -54 249 43 155 -29 58 339 19
8007 19 100 90 -78 255 -43 -115 -128 206 117 50 -123 -160 212 309 192 45 -172 180 32 -23 -54 -38 190 107
8031 107 -273 114 213 88 240 -86 245 -98 -40 -52 -374 -198 84 -225 -229 -167 240 -59 76 -36 -11 -30 -28
8054 -28 -52 -44 -58 -111 306 -186 68 -150 89 -159 72 -23 -97 -22 -8 -161 -71 175 -252 35 47 -252 -49 50
8078 50 -185 -358 -25 76 -361 169 50 120 31 -288 -105 26 13 77 -126 256 -90 44 -249 -58 -16 98
8100 98 -91 -215 -251 62 187 -106 27 153 -106 50 56 77 -62 143 115 318 67 55 28 45 213 -212 -17
8123 -17 -61 89 190 119 141 270 -173 -111 -181 207 57 41 -76 72 134 266 -185 86 -299 75 103 -266 -10
8146a0n9j0N1j13L03r7jK31k69L7j58J12m06N12q4l21N17k81o8L59j42k43l4k9
8170b03N22m97M46k23N2J48j34j22pj14J88j74jR1J11K7j80K3K09rq3
$$ plain form
8146 -10 -69 -79 -28 -141 162 65 64 295 26 63 -95 17 -389 123 39 -282 235 -46 -114 245 103 -140 -174 -203
8170 -203 319 -178 268 45 97 245 111 -11 -18 -132 56 -118 -119 -28 83 110 -70 -47 162 153 70
8191G0
$$ Imaginary data points
##PAGE= N=2
##DATA TABLE= (X++(I..I)), XYDATA
0@%%%%%%%%%pJ5j6J6j6K4l2L2m0M8n6O8p7Q9j04J21j38J57j79K03k30K60k93L28
33A73l67M09m54N06n63O25o93P68q52R44j044J157j283J423j585J771j984K233
51A184k532K897l352L941m736N875p654J0842j8314O8027L5573j28213O337Q0450
65E0325J124q4285Q437O7759L730n3709N817L5004r479l4514P274J7625o574q490
79D4J6613Q956q094p713m639j1107O236J9565j615j7450R701J9420j4803k4000
93h886J3017J6076j6804j0897K2443R140j9538l149J7483q539k4283O632K2095
106A4790m950j0347J3842M138k3877m943K6177N9l0606M341L5942m549l5952N036
120a0899L3215r667k9676Q609K1285j0132p451J7965j823k8857K837K9699m569
$$ plain form
0 0 0 0 0 0 0 0 0 0 0 -7 8 -8 8 -8 16 -16 16 -24 24 -32 36 -41 48 -56 65 -73 84 -95 108 -122 138 -155 173
33 173 -194 215 -239 267 -296 329 -364 404 -448 496 -548 609 -674 749 -836 935 -1049 1184
51 1184 -1348 1549 -1803 2138 -2598 3277 -4377 6465 -11849 56178 91751 -36462 -30125 50325
65 50325 51449 -32836 -24399 43360 47090 -6619 -802 34202 24723 -9791 -2517 15108 8534 44
79 44 16657 25613 17519 9806 5167 -5940 296 19861 18246 796 10497 29917 15114 -8886
93 -8886 4131 20207 3403 -7494 14949 24089 4551 1402 18885 10346 -13937 -7305 14790
106 14790 9840 -507 13335 17473 -6404 -11347 14830 14889 -15717 -11376 24566 20017 -15935 -10899
120 -10899 22316 12649 -17027 -8418 12867 2735 -4716 13249 11426 -17431 -14594 15105 10536
133A0536k7759R954K8183j2894k7630J1244K2270j1975j7023J4194J2160j4324
145c064m967J5462p63j7809J782J2350n183k356J5841k116k4550L358K6913r467
159E431k9519J6091L4827j7328l5231J8903L1998k2345l1975K3716K9172k3887
171a47k2415K9903K2252l2990k5704K7112K1886k2132j4862K2738J4331j7592
183B380j2394Q481N034m263o40P26M29O334K686p937l237P211m253j3462P738
198e167K2436m654k1551N157K0251j0572k3661J0114K3707p898j8226J1743J4643
211A6322j4606j1315J5575K867k1793K111K7241j97k3910K943J8926j1233j8452
224a5521J3381J5799j3993q727J8591M453k2585k780K3336j487k5730L451K7220
$$ plain form
133 10536 -17223 -7269 20914 8020 -19610 -8366 13904 1929 -15094 -900 11260 -3064
145 -3064 -8031 7431 6668 -11141 -9359 2991 -2192 -4548 11293 9177 -15373 -12015 14898 5431
159 5431 -24088 -7997 26830 9502 -25729 -6826 25172 2827 -29148 -5432 23740 -147
171 -147 -22562 7341 29593 -3397 -29101 -1989 19897 -2235 -17097 5641 19972 2380
183 2380 -10014 -1533 3501 -762 -1402 -676 -247 6087 8773 836 -2401 4810 557 -12905 -5167
198 -5167 17269 12615 -8936 -3779 16472 5900 -17761 -7647 16060 8162 -10064 1679 16322
211 16322 1716 -9599 5976 8843 -12950 -10839 16402 16205 -7705 -4762 14164 2931 -15521
224 -15521 -2140 13659 -334 -9061 9530 13983 -8602 -11382 11954 10467 -15263 -11812 15408
237A5408k345k3116N312J9025j2522j9450J3989J8490j2844j2113J3023P490j3834
250c487n052J0393M46o928M542N327p822k140J1344Q1j4984j962J4106J656r329
265c809K764P098p713o272J0244L984j4390m50K0175K48k4471n72K4736J385k3565
280a0608q12J9740n86j3525N203R142q998q405R675N883p898j861R655L71r565
295b589p85N054p99p29N041j828p840N551J1619q802j4438R251J4008j2099j1442
310a0827J8612J2243k1467j2904K0991R459k2481o373K4810O480k1937n189J7919
323I336J027j5045J184J1482n101o881J1126P483j4753q096J3264M943j4932j571
337f534J6805J871j3909P64R174p197q407J0504P386j2530n273J4900O301j3916
$$ plain form
237 15408 13063 -10053 -4741 14284 1762 -17688 -3699 14791 1947 -10166 2857 10347 -3487
250 -3487 -8539 1854 2300 -4628 -86 5241 -2581 -4721 6623 6704 -8280 -10242 3864 5520 -3809
265 -3809 -1045 6053 -1660 -7932 2312 6296 -8094 -8544 11631 11879 -12592 -13164 11572 12957 -10608
280 -10608 -11420 8320 7734 -5791 -588 8554 -444 -8849 826 6709 -1189 -3050 6605 6976 -2589
295 -2589 -3374 1680 881 152 5193 3365 -4475 1076 12695 3893 -10545 -1294 12714 615 -10827
310 -10827 7785 20028 -1439 -14343 6648 16107 -6374 -12747 12063 18543 -3394 -8583 9336
323 9336 10363 -4682 -3498 7984 2883 -3998 7128 14611 -142 -8238 5026 9969 -4963 -6534
337 -6534 10271 12142 -1767 -1003 8171 974 -7433 3071 10457 -2073 -7346 7554 13855 -61
351f1p107R107L426p482j052P138J202k854K93j719m911J447O704j926n979M053
367B79N829o515l658P478R89j2534N86J4342k70j3312L536J2132p610j3939Q536
382d131J2562r138r235J2271P692j4433p582J4696N776j5155n561J4690M696j0879
396c731j629R172k837q932M444P154n930l907R352K350j0764j369Q845q71o387
411e040M179M396p322k251J1089J200j4204j316J4981J681j4747J12J5386l96
425G748j5011l91J2517j164r022M341Q476o655p024P377N251p876k772O639Q59
440C293m822K510M068m482l462M922J185n732J406Q118k056q283J775P333l396
455B377p069N828P134o187p064P279O248p212n875N246L252l624N84L863l273
$$ plain form
351 -61 -7168 1939 5365 -2117 -3169 3969 5171 2317 2610 891 -4020 -2573 4131 2205 -3774 279
367 279 6108 -407 -4065 3413 4402 -8132 -7546 6796 6526 -6786 -3250 8882 1272 -12667 -4131
382 -4131 8431 -707 -9942 2329 10021 -4412 -11994 2702 8478 -6677 -12238 2452 7148 -3731
396 -3731 -5360 3812 975 -7957 -3513 3641 -2289 -6196 3156 5506 -5258 -6627 2218 1347 -5040
411 -5040 -861 3535 -3787 -6038 5051 6251 -7953 -9269 5712 7393 -7354 -7242 8144 7748
425 7748 -7263 -7654 4863 3699 -5323 -982 7494 839 -6185 1192 6443 -1433 -4205 2434 3293
440 3293 -1529 981 5049 567 -2895 2027 3212 -2520 -1114 7004 4948 -3335 -1560 5773 2377
455 2377 -4692 1136 8270 2083 -4981 2298 8546 1334 -4541 705 3957 333 917 4780 1507
470A507k053M994n99q820J534J0953q19j0747J840R268l366p919L597N870n267
485b7n589R946N117j1557m920J1796L308j3811l162J4224L719j1606k279R580
499D739k165p662L766O037n470m406P088L740p309k232O426n81o829J264O499
514B905j519l990L186K958o067k855O005K923n771j275O126n37n515K759N473
529D806n433o037O922N690n809m857O482K626o055k282L527J073p34K050L04m640
545b367r6N724J36o152k60O098k91m660J687M382l407l910N598K339p386j371
561c936J0253J771j1959k009J1354J191r040Q7P656r41o170K311M261l718k941
576a830M782J992n089m45N959j95o382K06N605k208m469M757M791o334m647P022
$$ plain form
470 1507 -546 4448 3849 -4971 -3437 7516 6697 -4050 -2210 7058 3692 -4227 -630 5240 -27
485 -27 -5616 4330 9447 -2110 -7030 4766 8074 -5737 -8899 5325 9044 -2562 -4841 4739
499 4739 2574 -5088 -1322 4715 -755 -5161 1927 5667 -1642 -3874 2552 1971 -4858 -3594 2905
514 2905 1386 -2604 582 3540 -2527 -5382 623 3546 -2225 -3500 2626 2089 -3426 -667 4806
529 4806 -627 -6664 258 5948 139 -4718 1764 4390 -1665 -3947 -420 653 -81 1969 2273 -2367
545 -2367 -2463 3261 3397 -2755 -3015 3083 2792 -1868 -181 4201 794 -3116 2482 4821 -2565 -3936
561 -3936 6317 8088 -3871 -5880 5474 6665 -2375 -2288 5368 4427 -1743 568 4829 1111 -1830
576 -1830 2952 4944 -145 -590 5369 5174 -1208 -1002 4603 2395 -2074 2683 7474 1140 -3507 3515
592C515L100p017j889P172j54o214J615O227l544n796L622N149m891m117N337
607B115M395m436m145K327J901j959N14J807k037j435L814J605n894k359N687
622A900J546n831m14N433q5l945J655J212m215r94O073N83n951n59O221j28o173
639c672k29M704Q2l893Q99K823j513j749K609j00m309N8N552j20n151K034M929
656B954m268m864M509M290n095k782O014J639n963l89O227j722o078K027N829
671B328k225n168M375M807m808n618M284N988l935m272L800K668l262r25L091
686A128j485k617L156K343l621j686M362J846m834j822L739J191k158R85J415
701A942j940j243K356J443l337j232M503J216m204j117M268M30l604k67K605j146
$$ plain form
592 3515 6615 -402 -2291 4881 4727 -1487 128 6355 2811 -2985 637 5786 895 -3222 2115
607 2115 6510 2074 -2071 256 2157 198 712 2519 482 -953 2861 4466 -1428 -3787 1900
622 1900 3446 -2385 -2799 2634 2549 -1396 259 1471 -2744 -3738 2335 2918 -3033 -3592 2629 2501 -3672
639 -3672 -3901 803 885 -3008 -2109 714 -799 -2548 61 -39 -4348 -4290 1262 1142 -4009 -1975 2954
656 2954 -1314 -6178 -1669 2621 -2474 -5256 758 2397 -3566 -3955 2272 550 -5528 -3501 2328
671 2328 103 -5065 -690 4117 -691 -6309 -2025 3963 28 -4244 -444 2224 -1038 -1963 1128
686 1128 -357 -2974 182 2525 -1096 -2782 1580 3426 -1408 -3230 509 1700 -458 527 1942
701 1942 2 -1241 1115 2558 -779 -2011 2492 3708 -496 -1613 2655 3085 -519 -786 1819 673
717F73j278L010J151l678l72L178r95l387K519L570k967l256L390K560m080j893
733a855L915J320l853n46L969L77m150L03L191j946l260L709M436m730m472M422
749H30L332m054l352M172J648l013K15K013j264j810K428J006m137j356N070J835
765C563m066k128L360J112l161o7K568q53k130K181J928l518k183M567J321m754
781b260j612N125J308l785p10L035j083k381J407K071j387p64J517j02j675L99
797h97J712p28j666J483J431j773j155K326J634l263j077K741N46k275J273K463
813B775k725l000L814K665l992k206M740K083m332j942L591J225k963N2J279o45
829D19n08K428O97l580j636M088K556m368k293M822J202m168j008L499j92k343
$$ plain form
717 673 -605 2405 3556 -122 -494 2684 1689 -1698 821 4391 1424 -1832 1558 4118 38 -1855
733 -1855 2060 3380 -473 -1019 2950 3327 -823 -520 2671 725 -2535 1174 5610 880 -3592 830
749 830 4162 108 -3244 928 2576 -437 -222 1791 527 -1283 1145 2151 -1986 -3342 1728 3563
765 3563 -503 -2631 729 1841 -1320 -1387 1181 328 -1802 379 2307 -1211 -3394 1173 2494 -2260
781 -2260 -3872 1253 2561 -1224 -1934 1101 18 -2363 -956 1115 -272 -1036 481 379 -1296 -897
797 -897 815 87 -1579 -96 1335 -438 -1593 733 2367 -896 -1973 768 1314 -961 312 2775
813 2775 50 -2950 864 3529 -463 -2669 2071 4154 -178 -2120 1471 2696 -267 -215 1064 419
829 419 -89 2339 3036 -544 -2180 1908 4464 96 -2197 2625 3827 -341 -1349 2150 1958 -385
845c85J655J941k972j794M393J350m724j643M694J077l628o47L076K76k677m68
861d76J965k87p74Q87Q16j782o93K172j46k402O96K324j673k000K250J896k634
878A39j472J923L09k080N97K588j534k094J840J504k650j789K848K156k852j865
894b432K151J657j358j672Q29J26p98R75J620k286r20K770L40l544p83M068R21
911A664l710l0K888q27j948J150J479k082j461L375Q36k953o73K873O88l516o13
928b860L840O90k904k75K131n41k066J440J274j343o42K023M39k377O63K168j705
945d5k525K008K494j389j389J603N97j649l20J174L90j241R02J514j359j622J547
962F90K185j848k979K653K161j497j742J142P54k034J154P54j591k8J979J053
$$ plain form
845 -385 1270 3211 239 -1555 2838 4188 -536 -2179 2515 3592 -36 -683 2393 2669 -8 -476
861 -476 1489 1202 428 1315 2131 349 -344 1828 1682 -720 -24 2300 627 -1373 877 2773 139
878 139 -1333 590 899 -1181 -584 2004 470 -1624 216 1720 -930 -2719 129 2285 -567 -2432
894 -2432 -281 1376 18 -1654 -825 -699 -1497 -522 1098 -1188 -2108 662 1002 -2542 -3325 743 1664
911 1664 -2046 -2076 812 -15 -1963 -813 666 -1416 -2877 498 1334 -1619 -2292 581 1269 -2247 -2860
928 -2860 980 1670 -1234 -1509 622 81 -1985 -545 729 -614 -1256 767 1206 -1171 -508 1660 -45
945 -45 -2570 -562 1932 543 -846 757 1354 -295 -615 559 949 -292 610 2124 765 -857 690
962 690 2875 1027 -1952 701 2862 1365 -377 765 1519 -515 639 1393 -198 -226 1753 2806
978B806l600k70L037M41k589j44J750O0q76L08J128j309j161J665O63k063q88
995a042L248R20l248r08K877L92l407P67K927j119k196Q95J315j612n33J660o84
1012B52j457J133K103j451k354J152K113j400k168J324K252j186j637Q94O41j241
1028a030L46J675j482j933K141K457k420k457J637K059j737q20P36J111n06km70
1045f95j152M66J585L90k183p15K377J128j979j374J602R55j415k75J149p2n74
1062g82J027O31k456o3K426M52k325k84K322R7k220M45J542p62p70Q92N73o01
1080A44n09J222k46j109LJ925l48j985J160J937j275k091J209K164j182j722J342
1097F39Q13j158R5J407p18j664J376J729j786j267J702J350j414j667P11J528
$$ plain form
978 2806 -794 -1064 1973 2414 -175 -319 1431 1491 615 923 2051 742 -419 1246 1909 -154 -1042
995 -1042 2206 3126 -122 -1030 1847 2239 -1168 -401 2526 1407 -789 106 1421 -191 -724 936 252
1012 252 -1205 -72 2031 580 -1774 -622 1491 91 -2077 -753 1499 313 -1324 -430 211 -1030
1028 -1030 -684 991 -491 -2424 -283 2174 -246 -2703 -1066 993 -744 -1564 -828 283 -223 -225 -695
1045 -695 -1847 -1381 204 594 -1589 -2304 73 1201 -778 -2152 -550 405 -1010 -1285 -136 -208 -782
1062 -782 245 876 -1580 -1643 783 1235 -1090 -1374 948 1045 -1175 -730 812 50 -720 172 745 144
1080 144 -365 857 611 -498 -495 1430 1082 -903 257 2194 919 -1172 37 2201 1019 -703 639
1097 639 1452 294 389 1796 1078 -586 790 2519 733 -534 1168 2518 1104 -563 148 1676
1113A676n93o69K49J30n91N88R93j765r24J526J547k134j144K088J218k064p25
1130e94J291K7o94O61L4j114j83J414J57j323m20J539k1j267m86J267L07j325
1148g30k16R38j42p20P08N83j101l91J136k97j558J080J712j168j729R40J657
1165G02r95j391Q94N50j037N76N54o46o70R25Q13j439j366J949J754j235j996
1182b058J386J292j289j135J051P99p23Q8J196j446q52J662J052j938n91J456
1198e0J134j223p39P44L77q31J06M75J86l08R17j50r23j68J333K37j433p25J955
1217I14O50j497n84J658k95r48P67P34j181N64J645k034o28J383O63q24j149J001
1235H39J381q70o45p78J239L94q62q8K05l76O93Q45r03j588R79J420j018j454
$$ plain form
1113 1676 1083 414 663 793 202 790 1783 18 -906 620 2167 33 -1111 977 2195 131 -594
1130 -594 697 724 30 691 725 -389 -572 842 999 -324 -744 795 774 -493 -979 288 595 -730
1148 -730 -946 -8 -150 -870 -162 421 -680 -1071 65 -232 -1790 -710 1002 -166 -1895 -955 702
1165 702 -293 -1684 -790 -240 -1277 -701 -147 -793 -1463 -538 275 -1164 -2530 -581 1173 -62 -2058
1182 -2058 -672 620 -669 -1804 -753 46 -677 -589 607 -839 -1691 -29 1023 -915 -1506 -50
1198 -50 1084 -139 -878 -134 243 -588 -482 -7 179 -129 788 638 -285 -453 880 1117 -316 -1041 914
1217 914 1564 67 -517 1141 846 -102 665 1399 218 782 2427 393 -235 1148 1811 987 -162 839
1235 839 2220 1350 705 -73 1166 1560 698 610 815 439 1132 1977 1074 -514 465 1885 867 -587
1253e87P03J881p05j338M80O4k46N02n6q19K23Q25O34j371r09J268P06j308k89
1272c42N07R99m43n97K92l7q71L60P46j115n84J301O57j608l87J129R47k525N67
1291a004J856r51j49j58K30o06M51l90O0N96o18J077m3j568J36J010m2j521J69
1310a465J726J58j254j26N69j90R5N33o57j09N13J145j480j081J262R14r33j76
1328e56j51J299J85r64p10N36o17R93N61j095l0J204Q63j837m72L70J475j305
1346b51l42Q54L54j82J96l3n9k09L73O41j434Q31L01K79j155p46J149J053r66
1365F54m16L11M06n84K18P3n42J24O10j01r69O19J271p29j221L60J283l88p90
1384A89J83K79Jl84L32q49J04P59J36m53p51J98J016l34j061j79J346J27j070
$$ plain form
1253 -587 116 1997 1292 -46 434 498 252 754 698 -121 102 927 1561 190 -719 549 1255 -53 -342
1272 -342 165 1164 721 124 416 379 -492 -132 614 -501 -1085 216 873 -735 -1122 7 954 -1571 -1004
1291 -1004 852 -99 -248 -406 -176 -782 -331 -721 -661 -65 -683 394 351 -1217 -1081 -71 -113 -1634 -1465
1310 -1465 261 419 -835 -961 -392 -582 -487 46 -611 -720 -207 938 -542 -1623 -361 553 -380 -556
1328 -556 -707 592 777 -187 -897 -361 -978 15 576 -519 -549 655 1518 -319 -791 -421 1054 -251
1346 -251 -593 261 615 433 629 596 537 328 701 1342 -92 739 1040 1319 164 -582 567 1620 654
1365 654 238 549 955 371 589 662 120 244 854 753 -216 403 1674 945 -276 84 1367 979 189
1384 189 372 651 652 268 600 -249 -145 614 750 297 -454 -256 760 426 -635 -814 532 659 -411
1403d11k52Q00n23J90J38n95m02J042M23j331l34J013N86j004k66O5N91J98l98
1422d70k10P6J62J74n36n29N57N82k8o46p36J207L33o24n95O60L95n10R0q0j5
1443g43J75P47p08n73J84J260k62j135K14Q93Rn52o11M94N21M15p00J01k08M70
1463iM80o12q22N18J203L8j478j41J571k97o27j04M34J90O1q9k69j70R56n7p77
1484aJ34M30L10k92l56L05J2J71m87j92J102l32k00k54j35j23M23J81q41K44J038
1505A137r1r50k01R96K38p25l01K21R9J83R7q19m9M31O47m72p88N7O57M37o49
1526A55o59L71N21k22p97M11L87j79M20p31l31M00N99p53n85P15M32M9o20m26
1546h43K60K73J26o42k6O81M82o03k73l71J61M90J00r13J75Q44k69p74L21O91
$$ plain form
1403 -411 -663 137 -386 -196 -58 -653 -1055 -13 410 -921 -1255 -242 344 -660 -926 -861 -270 -72 -470
1422 -470 -680 -604 -442 -268 -804 -1333 -776 -194 -222 -868 -1604 -397 -64 -688 -1283 -623 -228 -738 -648 -728 -743
1443 -743 -568 179 -529 -1102 -918 342 80 -1055 -841 52 61 -491 -1102 -608 -87 328 -372 -271 -479 -9
1463 -9 471 -141 -963 -445 758 796 -682 -823 748 451 -176 -280 154 344 405 316 47 -123 833 776 -1
1484 -1 133 563 873 581 225 530 542 713 226 34 1136 804 604 350 215 92 515 696 -145 99 1137
1505 1137 1046 96 -105 891 1129 404 103 324 423 606 703 -116 -165 266 913 441 -347 -290 367 804 155
1526 155 -504 -133 388 166 -631 -220 167 -12 408 -323 -654 -254 345 -408 -993 -278 154 203 -417 -843
1546 -843 -583 -310 -184 -826 -852 -171 311 -292 -565 -936 -775 -285 -185 -1098 -923 -79 -348 -1122 -801 -110
1566a10k75k22k15N2j89N06r5k55J5K53L33l46m92M90Q01m9q77M2O42j1j85m57
1588f44M79J49O6q0p32L27P97P4o72m1O04M05k69l83l40M60M51m27n48L2J086
1609G94R7r71m44Q18M48m07l81m30R85P23o62p97M14J64K55k60J13k21L90M17
1629A045l87p27K16O99k14p63M09M08K82n01j45n24J083j52q34J61J51K73J08
1648E88o72Mj2N20J13q51J41Q14k91k56j89L5N1L57l50p78L94P40n61k83j09K41
1670c54J031j297K00j48L27L68p19n15P87J36R0l23l30N2N61K51q63j09N66K13
1690g6r09Q6K32K89R9m00n32P82O2J90o04J50K5L44j79j7j40K71L58k73q47O05
1712d84N07j32p15L03L16J94J49o32J7O57K54n02m67L38M65j05k44l24J03Q85
$$ plain form
1566 -110 -385 -607 -822 -770 -959 -453 -548 -803 -788 -535 -202 -548 -1040 -550 251 202 -675 -633 9 -2 -187 -644
1588 -644 -165 -16 50 -30 -762 -435 362 436 -236 -277 327 732 463 80 -260 200 651 224 -324 -292 794
1609 794 891 -80 -524 294 742 335 -46 -476 509 1232 570 -227 187 351 606 346 459 238 628 1045
1629 1045 658 -69 147 846 632 -131 278 686 968 467 322 -202 881 729 -105 56 207 480 588
1648 588 -84 -80 -92 428 541 -310 -169 645 354 98 -91 -56 -5 352 2 -776 -382 358 -203 -486 -595 -354
1670 -354 677 -620 -420 -568 -241 127 -592 -1107 -320 -184 -94 -417 -747 -695 -134 117 -746 -855 -289 -76
1690 -76 -985 -899 -667 -378 -279 -679 -1211 -429 -367 -177 -781 -631 -606 -262 -441 -458 -598 -327 31 -242 -1089 -484
1712 -484 23 -109 -824 -521 -205 -11 138 -494 -477 180 434 -68 -535 -197 268 163 -81 -405 -302 583
1732E83j04p87L6N59M46n70O9k30L51R9k40n47M32Q06j44o17k3K26K72J59l13
1753D63n06L98L29k67oj38K31O51n64m70J07L00M34n83n34O73J21m01M4J10J23
1774E15k10K92n47J05j4N36n84j61L03J56k3l97J4J66M11m88m24L15P01o46k29
1795b09k10J63J18K32n79o54P58P80n06o92J33P91r4l95k02m1M82L67l07r15J57
1816h23O26J77q71K29n3P20kq23j10P84j30j97k62K82r4M70p3n05j7P07n7o36
1838f58m51R48J89n10l31L12K89k25r0j51L96J31J9j37k03L74L12K35q61K76O16
1859D80k57k27l22O38L88l35j40j62j75M58M78p60l64P45M18m59n29m6P29K46
1879H04n65k26M98K88n17L0J64j14J28K51o00k49O15M90l36q15J85Q55l42n53
$$ plain form
1732 583 479 -308 -272 287 733 163 232 2 353 452 212 -335 97 903 759 142 119 345 617 776 463
1753 463 -43 355 684 417 411 273 504 1155 591 121 228 528 962 379 -155 518 639 238 282 392 515
1774 515 305 597 50 155 141 677 93 -68 235 391 368 -29 -15 151 562 74 -350 -35 666 20 -209
1795 -209 -419 -256 -138 94 -485 -1139 -381 399 -107 -799 -666 125 31 -364 -566 -607 -125 242 -65 -980 -823
1816 -823 -197 -20 -891 -662 -715 5 3 -820 -930 -146 -276 -473 -735 -453 -547 -77 -150 -655 -672 35 -22 -658
1838 -658 -1109 -161 28 -482 -813 -501 -212 -437 -527 -678 -282 -151 -132 -269 -472 -98 214 449 -412 -136 480
1859 480 223 -4 -326 312 700 365 225 63 -112 346 824 64 -300 445 863 404 -125 -171 558 804
1879 804 239 13 511 799 282 312 476 362 490 741 141 -108 507 997 661 -154 31 886 544 -9
1899iK24J93j25J95j47m36N43J82j96o65N4N61R7n62l67N33M63m44n46L44J93
1920H5j40J9P0k98L7O42n9j056J28J048n16l98p8M11r6L4k08k61K65N7L18o98
1942f94J38K07L34k86m79J13P83l07q04J93Q20k56l82J86L3K3J03J61l82m23P41
1963a78J33n40n36P38J47K16p78M8N11l9J33l32k13O28K57M28q42l49Q86N8m55
1984g9n09P44K76m52l94M21L55k41L05k96m21N73M81m09o79K25O14j81k23J6J77
2005C03N00j11n34LM62K9k74k98J78J5Q45o34n39L57N52k06o83J07R45p06QP4
2027C93k33K21L08j33n63o3O80O8m70n27O36M37k21q05J35P56j67o01m9K94j21
2048b5J12j43k70K3N73m3m73j67L4N01l77l29M61P5Nj10k38N6J6N1l8k33n0N36
$$ plain form
1899 -9 215 408 283 478 331 -105 438 620 424 -241 -187 374 471 -91 -458 75 538 94 -452 -108 85
1920 85 -55 -36 34 -264 -227 415 356 -700 -572 476 -40 -438 -516 -105 -201 -167 -375 -636 -371 -314 4 -694
1942 -694 -556 -349 -15 -301 -780 -667 116 -191 -995 -802 18 -238 -620 -434 -401 -378 -275 -114 -496 -919 -178
1963 -178 -45 -585 -1121 -383 -236 -20 -798 -750 -239 -278 -145 -477 -690 -62 195 623 -219 -568 318 376 -79
1984 -79 -588 156 432 -20 -414 7 362 121 426 130 -291 282 763 354 -325 -100 514 333 110 126 303
2005 303 803 692 158 161 623 652 378 80 258 273 1118 484 -55 302 854 648 -35 72 1017 311 319 393
2027 393 160 381 689 556 -7 -70 610 678 208 -319 317 754 533 -272 -137 619 452 -149 -198 96 -25
2048 -25 87 -56 -326 -303 270 227 -246 -413 -379 122 -255 -584 -123 -48 -43 -153 -391 -335 -319 -268 -306 -539 -589 -53
2072e3k9n15m0O56k04l47j09N34N8j43n5l40M5J5M76m15m70N43P34o73n68M49
2094d51N30m3j95l86R4J10K96l90k02K23L98k5j2n92N04O61n46n85L60N49Q2o50
2116b70r3N98J37N7j09n21M00j0K72n90K7N92k3l2o57O54M51m16l86Q9K90J6l68
2139A08M09k50N6N97Q4j108K75O83j40o20j60N20K52o47L53J71k14J60o5mk80
2160A80m4L27L14p01J41K61K43p78k3K93L63n13kK25m49K74M83o46m26N37N32
2181E91p32l09K56L28j79n02N59M1j02r7k42r8L50N3j42m1q7J56M93o37o91N93
2203d39P44n91m59K70L02j96K10j06l14N3P51l6o68j48L65J23m33r7j32R69j80
2224a2p19j29Q19j65q5j21k0nO57k05o43J52N86L4o56K52K70K95l95q6m8N1K93
$$ plain form
2072 -53 -82 -597 -637 19 -185 -532 -641 -107 -49 -192 -247 -587 -542 -527 -51 -466 -936 -393 341 -332 -900 -451
2094 -451 79 36 -159 -545 -451 -341 -45 -435 -637 -414 -16 -41 -53 -645 -141 520 -26 -611 -251 298 380 -270
2116 -270 -363 235 372 429 320 -201 199 189 461 -129 -102 490 467 435 -222 432 883 467 81 170 460 476 108
2139 108 517 267 323 920 1004 -104 171 854 714 94 -66 454 706 59 412 583 369 529 464 460 180
2160 180 136 463 777 76 217 478 721 -57 -80 213 576 63 61 286 -163 111 594 -52 -478 59 591
2181 591 -141 -450 -194 134 -45 -547 12 53 -49 -146 -388 -486 -136 -83 -225 -266 -353 -197 296 -341 -1032 -439
2203 -439 305 -286 -745 -475 -173 -369 -159 -265 -579 -526 225 189 -479 -627 -262 -139 -572 -669 -801 168 -12
2224 -12 -731 -860 -41 -206 -291 -412 -432 -437 220 15 -628 -476 110 144 -512 -260 10 305 -90 -176 -224 -173 120
2247A20M75o93K0J47L22l48k98M18J14K74o50J43L28Jk38r2M36k84R2K17j49m69
2269a14Q56J10k17n19J51N42n27k04M14j51K86j51k27k78M70L3l50j40K92K30
2289E06K07o36j02M03L47n50l00L52L97l67j14k07j9J46L97l72p52M10O48n37
2309a43k00J42M57j41m30LL43J44l1k49j70J5K2N29m59m47K01N05k09o00J32O65
2331G9k01n0k38m5J29L01k25m77J95M20j46m14K1M09K21k72j58Q1J23K2m21J71
2353d75K90J80r3l03k48L97O1K34o08RQ59j87l65k80N27P5m20K71l39L20M63K17
2375E85p61k74O54m9J78p46K06J31O46n60k47L71M39l04p4k34O1M12M18p78k99
2396b25N76L63k80m59M44R4o8k1m35K50K93K2m37q4L98J01p6l74J5M89n2k90k64
$$ plain form
2247 120 595 -98 -78 69 391 43 -255 163 277 551 -99 44 372 373 135 43 479 195 287 504 355 -114
2269 -114 742 852 635 116 267 809 282 78 492 341 627 476 249 -29 441 474 124 -16 276 506
2289 506 713 77 -25 378 725 175 -125 227 624 257 143 -64 -83 63 460 88 -664 -254 394 -143
2309 -143 -343 -201 256 115 -315 -312 31 175 144 -105 -275 -260 -238 291 -168 -615 -414 91 -118 -718 -586 79
2331 79 -122 -172 -410 -455 -326 -25 -250 -727 -532 -112 -258 -672 -651 -242 -21 -293 -451 -370 -247 -225 -646 -475
2353 -475 -185 -5 -98 -401 -649 -252 -191 43 -565 -556 303 116 -249 -529 -2 73 -347 -76 -415 -95 368 585
2375 585 -176 -450 204 155 333 -413 -207 -76 570 10 -237 134 573 269 195 -39 22 434 852 74 -225
2396 -225 351 714 434 -25 419 513 445 424 -11 239 532 554 117 33 431 532 456 82 97 586 534 244 -20
2419b0K47M55k33k30k80N62n8l36J15k79K88M21k56o24M5N01mo87K58J54K88N4
2441C81l08j63J96m7M97q33K47j65J16l0m05j62O79J22m24m28N23K95k29l9k81
2462d58N3M38j25j76l44N68m0l77K07q2O03o03n37L24N49N2m45k06M46j80J17
2483b16K61m57j63M87L49p17j05O27R2k23l02K72r8K09N8k89J30L86j89k59J83
2504C6j96j6N10l66k64K64M56k84k1k98N35k22Q5j21p0M3O54j60o85M22N00j83
2526F19q57K99M02J15j63k97j6J34K70n9l27m6M21k2l06k37K41N19j68m36j42
2547e6N27K19l13j91K3j76P22k00q07K14L75M23q78j70O00O2l08k31J81OJ86j29
2569G9l67K47L89j00l50l55R6N75o5m36j48J74L23k57j66j94L23K0l6m19n8N75
$$ plain form
2419 -20 227 682 449 219 -61 501 443 107 222 -57 231 652 396 -228 -183 318 314 -373 -115 39 327 381
2441 381 73 -90 106 59 556 -277 -30 -195 -79 -109 -514 -676 3 125 -299 -727 -204 91 -138 -177 -458
2462 -458 -405 33 -92 -268 -612 -44 -84 -461 -254 -336 267 -336 -873 -549 0 52 -393 -599 -153 -333 -216
2483 -216 45 -412 -575 -88 261 -456 -561 66 158 -65 -367 -95 -193 16 74 -215 -85 301 112 -147 36
2504 36 -160 -176 334 -32 -296 -32 424 140 119 -179 356 134 219 98 28 71 725 565 -120 302 802 619
2526 619 -238 61 463 578 415 118 102 236 506 447 120 74 495 473 167 -70 171 690 522 86 -56
2547 -56 471 690 377 186 209 33 755 555 -252 -38 337 760 -118 -288 312 374 66 -165 16 22 208 79
2569 79 -288 -41 348 248 -102 -457 -361 214 149 -287 -435 -261 62 -195 -361 -555 -232 -212 -248 -667 -725 -150
2591a50N58q70K51k10L86J2n27J3M00Q8l05j32J16p3M20k93q1K6J85K08n08o4
2613e50M14L27m59k10L6N50k95j48o3j5J80J83o7n51N41K19J49l12J17N52q63
2634b65K75m0J76O10j340L03R83p53K68K75j66l69j15P02j64m40n8R00n50o8j50
2655A4L17J65j08n9j99J08L38R5l68k07L04J10j04m10j70P22l27k2j86K64J91
2676D68n3j43L0j85L79j57m56j31O13K60o77J62K19K55m76nj03J26J73l79R8r9
2698h1j08M52q0l89k6L37O9m75k69M68L71m66k5l58M09K23k27k04j09M63J03m00
2720c22j27j03M28R6m56J04K17J00k48j6L17k57K36m02PJ28l29J30L88m51J70
2741c90M93m30m32L89K99J13l26J68l70J20L78p0n34M63K88J04k20m85M35J28
$$ plain form
2591 -150 408 -462 -211 -421 -35 -23 -550 -537 -137 -49 -354 -486 -370 -443 -23 -316 -397 -371 -186 22 -486 -550
2613 -550 -136 191 -268 -478 -442 108 -187 -335 -398 -413 -233 -50 -117 -668 -127 92 241 -71 46 598 -265
2634 -265 10 -30 146 756 -584 -281 702 -51 217 492 326 -43 -158 544 380 -60 -118 782 232 164 14
2655 14 331 496 388 329 130 238 576 671 303 96 400 510 406 -4 -174 548 221 199 13 277 468
2676 468 415 272 302 117 496 339 -117 -248 365 625 -52 110 329 584 108 103 0 126 299 -80 18 -81
2698 -81 -189 263 183 -206 -232 105 174 -301 -570 -102 269 -197 -222 -580 -171 52 -175 -379 -488 -25 78 -322
2720 -322 -449 -552 -124 -28 -484 -380 -163 -63 -311 -327 -10 -267 -31 -433 -426 -298 -627 -497 -109 -560 -390
2741 -390 103 -327 -759 -370 -71 42 -284 -116 -486 -366 12 -58 -592 -129 159 263 43 -442 -7 121
2761A21K26n27j46N64K11l82j30J55kO0N6o37K32O01M9l43n83J329k47n26J5J93
2783B89K87k18m5j30j32K14K93j40l95K45K73k38m83P3O52J35r61M19j50M67j4
2804D41k61K37n02mO40l32l20L10N52m27l08j09M53j91l18M30l00J81J75j95j46
2825Fj21L86l0j92l37K52O42o92l70J26N60j07l82J50k69K85Nj26m50O5Q45l36
2847i0j08j61L8L54k58k17K84K19j07j69o4n1R4J51J0n41R7K39K41m97r3L83L48
2870A02m88k65O05Lk00M8l4p4L59M0o22n6M80K42k1m66K69K50j98j97p8K36O8
2893CL9o9j28k53M48N34o36j00O31q8j00o14N76K54j85j99L8Q8K05J51m61j26
2915HL31K80k45m21L55J5J46l43r9J56L45k31q4j23K68n4K72k66l68K48N45k64
$$ plain form
2761 121 347 -180 -326 238 449 67 -63 92 90 150 206 -431 -199 402 451 108 -475 854 607 81 96 289
2783 289 576 358 313 183 51 265 558 418 23 268 541 303 -180 -107 545 680 -281 138 -12 455 441
2804 441 180 417 -85 -89 551 219 -101 209 761 334 26 -83 370 179 -139 291 -9 172 347 152 6
2825 6 -115 271 241 49 -288 -36 606 -86 -456 -330 230 123 -259 -109 -378 -93 -88 -214 -664 -599 246 -90
2847 -90 -198 -359 -321 33 -225 -442 -158 61 -46 -215 -279 -330 -236 -85 -75 -616 -519 -280 -39 -536 -629 -246 102
2870 102 -386 -651 -46 -43 -243 -195 -229 -303 56 96 -526 -582 -102 140 119 -347 -78 172 -26 -223 -301 -65 3
2893 3 42 -27 -155 -408 40 574 -62 -162 469 381 281 -333 243 497 312 113 151 239 444 595 134 8
2915 8 339 619 374 -47 308 323 469 126 27 183 528 297 213 90 358 304 576 310 -58 190 735 471
2937D71m90K23J78K23o98L11n7M59k84l49J34K4K7O9K1k93L9J98M8m49J25O06
2959E36k84o24K45K13j13%R5l19Q3L71j14k14l17N99J47m54l01O4M00kl61l9N0
2982c39L68j15m39K52J00R4Q6k73m54M53L76o09k48N45J58j38j5J34m11J79L66
3003G0m37J64J45m4J68m41O5M48j84r8j82O18l85M4k73K88J14Q8Q6l56j00L10
3025A08L50j41o40K84N48l60n48K29M21Q5o5j57n7m2K58Mk61j21M35j82J17l21
3047e6O4N20j05n23N60M13n53L6k84J10RK95k26k90K55M40k41l96Q2K03K03l99
3069A17q6K13k06M21q9k38o9l9J24O2j86l01O24Q5m76j66K69M45p11OP8O7P5n8
3093c9Q6l37N01n4n81L78K39j64j04m98K58M90J60o48P6%L58j97n4k79L61q7K48
$$ plain form
2937 471 -19 204 382 605 -93 218 161 620 336 -13 121 145 172 241 262 -31 8 206 254 -195 -70 536
2959 536 252 -372 -127 86 -27 -27 68 -251 -168 203 89 -125 -442 157 304 -150 -451 -387 13 11 -350 -389 -339
2982 -339 29 -86 -525 -273 -173 -79 7 -266 -720 -267 109 -500 -748 -203 -45 -183 -198 -64 -475 -296 70
3003 70 -367 -203 -58 -102 66 -375 -310 138 -46 -144 -326 292 -93 -49 -322 -34 80 168 254 -102 -202 108
3025 108 458 317 -323 -39 509 149 -399 -170 251 336 271 114 57 15 273 277 16 -105 330 148 265 -56
3047 -56 8 528 423 -100 460 873 320 356 72 182 191 486 260 -30 225 665 424 28 110 313 516 117
3069 117 31 244 38 459 370 132 63 24 148 210 24 -277 347 432 -44 -210 59 504 -207 -201 -123 -56 19 -39
3093 -39 47 -290 211 157 -424 -46 193 29 -75 -573 -315 175 335 -313 -237 -237 121 -76 -130 -409 -48 -135 113
3116A13l16l03O9O18k33o06K35M16l14J65J80m72M05j19K7o6j32J42J12l70L33
3137a16L7K24j66j52k39M31N8k52J38J92j46K74k01l77J75M70l3o46K70L80k50
3158G1o3q9K44r6M17j72l44K52o0J43j76k42M02N31o91j5l0M73k0o56J83K0M93
3181E75j37j38j81j28M40J2k16o00Q02J46m10j16j07M79r8l6n9L59m2l97j69J72
3203A51Q4j1j31j65j28L03K86l29k98L27K70m08r8L33j32j67J61k44Q6J44p0j11
3225a47k89R2N16j28k51q6J37J60j94l8j90l2N07j90j50n5L44K40k58m52l1M28
3247f7J39l43p4R1k07L22l03J86O1Q0L2r3p2L59q5l80L0J10N03k23m63Q4L05O0
3271E2r1P7k27m2J60M13n33J43L04J1j41o21P30M1j37N2l84K23L36k19j70lJ5
$$ plain form
3116 113 -203 -506 -437 181 -52 -658 -423 -7 -321 -156 24 -448 -43 -162 -135 -201 -333 -191 -79 -449 -116
3137 -116 -79 145 -21 -173 -412 19 77 -175 -37 155 9 283 82 -295 -120 350 317 -329 -59 321 71
3158 71 8 -81 163 67 484 312 -32 220 160 303 127 -115 287 818 127 112 82 555 535 -121 62 82 575
3181 575 438 300 119 -9 431 443 227 -373 429 575 165 49 -58 421 323 287 228 587 545 148 -21 151
3203 151 235 224 93 -72 -200 103 389 60 -238 89 359 -49 -147 186 54 -113 48 -196 -110 34 -36 -147
3225 -147 -436 -344 172 44 -207 -293 -156 4 -190 -228 -418 -450 57 -133 -283 -338 6 246 -12 -464 -495 -67
3247 -67 72 -271 -345 -254 -461 -139 -442 -256 -195 -115 -83 -176 -248 111 26 -354 -324 -214 289 66 -397 -313 -8 52
3271 52 -39 38 -189 -231 -71 342 -191 -48 256 267 126 -495 235 276 139 191 -193 30 366 147 -23 -26 -11
3294a1kJ85k65K24J7K15k55m9R7J71o8m51L50J02J57j46k41J6L38R2K6p61M63
3317B04K86Q5m53l16M76q6j21k38NN35Ll47J62L9J08p9j34k81K22L27l42k08P7
3340g6L34k11n7q4K10J4J14J00p46J79L04q6ol31L36k02L94m65m0M02k5j77j43
3363b62M6K03J2j42j65j15O54k88l23J21J69K14o52j02K82lQ9K6J65l35N11j41
3385c6j37k32O4M77l08k42J98K11K25k67l42J03N16j61r2o5j48J82K51n25o9N65
3407A68q3j09m0pK41J57j58m76J6O63q3k43j05J75M0p4k9m0J22L6Rj59M3J47k13
3432bl1K28k07L33j29J96l30J20K81r7m19L19M16l44p3k80J84J9K42l17j20J17
3454A06J68K09n2m31J89K50L5n62J21L61j67l44N2M23l8r0l15M7N8R8J37o29J96
$$ plain form
3294 -11 -13 172 -93 131 148 363 108 59 156 327 259 -192 158 260 417 271 30 46 384 476 502 -259 204
3317 204 490 575 122 -194 282 196 75 -163 -158 377 380 33 195 234 342 263 129 -152 70 397 55 -153 -76
3340 -76 258 47 -10 -94 116 130 244 344 -402 -223 81 -5 -11 -342 -6 -208 186 -279 -319 83 58 -119 -262
3363 -262 -216 -13 -1 -143 -308 -423 231 -57 -380 -259 -90 124 -528 -630 -348 -351 -262 -236 -71 -406 105 -36
3385 -36 -173 -405 -341 136 -172 -414 -216 -5 220 -47 -389 -286 230 69 -23 -88 -236 -54 197 -328 -397 168
3407 168 85 -24 -64 -71 170 327 169 -307 -291 372 289 46 -59 116 156 82 53 13 135 171 180 21 64 211 -2
3432 -2 -33 195 -12 321 192 388 58 178 459 362 -57 262 678 334 261 -19 165 184 426 109 -11 106
3454 106 274 483 431 0 189 439 474 -88 33 394 227 -117 -65 358 320 230 -85 -38 20 118 255 -374 -178
3477a78N26l50l5l09L24mK82m20j81L65J36l50j89J57Q6%J33k29n6M40j41k71
3499b64k39K91J92k27k5O2j1L04m23j81k0L15M1J04k91K15J8k48Q5k5M00K7m01
3522c01k39J98L29j48m7L7j43J77M93m22r1J8L29k03n8j17J08L72k44k33J49L91
3544C55j61j92j36L08M6k5n3j27p5M23j45l04J2L09J93k63P1r8J3Q7N0j56r9N63
3568E96k74l30P0L57j19n1j87q3M80j16k53R3J53o3L75n47R6l71N02j4l91Q9L37
3591C49j07j23j09j24K62J31M2l91j00M79n9m01m1J07J65L6k46M8OK56k71k8K9
3614i0K57j30N7j14p8j46K13j2j81J79L94n84j74K40M0j09L28j72l06J84J23j3
3636i4k12R2N7j62m66M01J37M26m56j13j93L83J89j7j42q9j28J83j63q3O0O54
$$ plain form
3477 -178 348 -2 -37 -346 -22 -26 256 -164 -345 20 156 -194 -383 -226 -140 -140 -7 -236 -292 148 7 -264
3499 -264 -503 -212 -20 -247 -272 -210 -221 83 -340 -521 -541 -226 -185 -81 -372 -157 -139 -387 -302 -327 73 100 -301
3522 -301 -540 -342 -13 -161 -208 -171 -314 -137 356 -66 -157 -139 190 -13 -71 -188 -80 292 48 -185 -36 355
3544 355 194 2 -134 174 220 195 142 15 -60 363 218 -86 -74 235 428 165 236 138 151 238 288 132 33 596
3568 596 322 -8 62 419 300 249 62 -21 459 343 90 183 336 273 648 101 197 -174 328 314 -77 12 349
3591 349 242 119 10 -114 148 279 321 -70 -170 309 250 -151 -192 -85 80 116 -130 -82 -76 180 -91 -119 -90
3614 -90 167 37 94 -20 -98 -244 -31 -43 -224 -45 349 -235 -409 -169 -129 -238 90 -82 -388 -204 -81 -94
3636 -94 -306 -214 -157 -319 -785 -384 -247 179 -277 -390 -583 -200 -11 -28 -170 -259 -387 -204 -367 -450 -390 264
3658B64m13O8K4Q2M16k28o93J49M06K42m58K22o3j57J35j69l4K95O6j24J10p8
3680F2m3N07p24J89l26L81L25m81Q3r7K69O5k64O3L10j40j20j36L36L3L0r3j12
3703A17N5K53o8l16J73j07K9K9m00J96M31p2k29J70R4k76pN0L4j12L09j76O2k57
3727a8R7J29K4j20j05R2J33k31l00K01L70l63J1j7J49J84k06n0j39n9K42k11K19
3750C2k93K06K75p03K50j5K45jm18j19M04J66j02k50j25L27R1l8j72L8J90l8r8
3773a48m38N85J45l49%p8q5L99j53M4P6k30K14j08Jm0K78L7J9m23J33K96k64j23
3797b12J19k8J96m6R0l23L38Q1m61o2K50M68m04J30K5k56L82J86n51R6M95p2l87
3820E4J48j11L91j61R9l91NM16j22p2j99K07j06J80j60j72L86P9k45n08J96K50
$$ plain form
3658 264 -149 -81 -57 25 441 213 -480 -331 75 317 -141 81 18 -139 -4 -173 -207 88 154 30 140 62
3680 62 19 526 -198 -9 -335 46 371 -110 -27 -124 145 210 -54 9 319 179 59 -77 259 292 322 229 117
3703 117 172 425 357 41 214 107 136 165 -235 -39 392 320 91 261 355 79 72 122 156 44 353 177 239 -18
3727 -18 79 208 232 112 7 99 232 1 -299 -98 272 -91 -80 -97 52 236 30 -20 -159 -218 24 -187 32
3750 32 -261 -55 220 -483 -233 -248 -3 -4 -422 -541 -137 29 -73 -323 -448 -121 -30 -68 -240 -202 -12 -50 -148
3773 -148 -586 -1 144 -205 -205 -283 -368 31 -122 -78 -2 -232 -18 -126 -125 -165 113 150 169 -254 -121 175 -89 -212
3797 -212 -93 -121 75 29 119 -204 134 215 -246 -308 -58 410 6 136 161 -95 287 473 -78 18 513 441 54
3820 54 202 91 482 321 420 29 34 450 328 256 57 264 158 338 178 6 392 471 226 -282 -86 164
3842A64n8k95L31L4J39k98k31K60l9J53O3j39J35j55L59m17L3J10J68j87k82j11
3864b63L67q0r8k14K37J93Lm55J14R5J94R7k22n6J43o1j03k27J0N14k65o6k70
3887d13K85J15Om88K47j77L13r7j98P0L13J14n3m66L42j18K68l21Rj5K70Q0j92
3910a06k62L02K16k36o26L82K12J7j03j2J55K32J8m38M5J09L79k6l56o4M27j84
3932H1J70n61J52N21J48p86L12k0L11j85l79K51L26j9j58l22L02K09Q0K4m24Q5
3954A18n4K34k09J46J15k78L26m92M46j89r1L43n71K7M78K0l07kM7K58k48j3o
3977I8J7L48M7n37Q8N2L03m23M6k29M82n2n78K47R8J85r0k38k94M08K70j30m88
4000c70O9K56L32m32p3J59m6l1j73j19M47mkm26k64N05L28n74K68k0J19P9m73
$$ plain form
3842 164 106 -189 142 176 315 17 -214 46 7 160 223 84 219 64 423 6 39 149 317 130 -152 -263
3864 -263 104 24 -74 -288 -51 142 145 -310 -196 -101 93 190 -32 -88 55 -6 -109 -336 -326 188 -77 -143 -413
3887 -413 -128 -13 -7 -495 -248 -425 -112 -209 -407 -337 -24 90 37 -429 -87 -205 63 -258 -249 -264 6 86 -106
3910 -106 -368 -66 150 -86 -712 -330 -118 -101 -204 -216 -61 171 189 -249 -204 -95 284 258 -98 -162 265 81
3932 81 251 -310 -158 363 511 -275 37 17 328 143 -236 15 341 322 164 -158 144 353 433 457 33 118
3954 118 64 298 89 235 350 72 398 -94 352 163 72 415 -156 -129 349 369 62 60 107 365 117 104 98
3977 98 115 463 510 -27 61 113 416 -7 39 -190 292 240 -338 -91 7 192 102 -136 -430 -22 248 118 -370
4000 -370 -301 -45 287 -145 -218 -59 -105 -136 -309 -428 19 15 13 -413 -677 -172 156 -418 -150 -170 -51 28 -445
4023d45nJ36J68J17j17N7l05J13K84l09R6J61J6Pm14J4L52j18J37K7j49K88j66
4046e5k26J16K38K35k73l91L8L89O7P3p30L90M15p3l34L81j09l26J32K36j54K49
4068B88J45l45l27L16L94k05j56j97q1O10k03k83j45L43N0q1k00k5N48j75k14
4089E7K0j21N41l28l72M11k7K2l02M64k39j16P4L21n52L47O6n9k46K01J37L9j47
4112A91j79j91J43L78k88m06M19K1k7j06k32pM03J75l80q1J7M38m55L7p7L4J50
4135b3o3q0J03K14j30k60l60N63Q3N8l99k0L42j72R2k87J80K92m13K2k1k6Q7R6
4159a22j50Q7P5r2L29k44n5l7O2J14m14K6K63J77k46j75K19L26r5j27r5J16K03
4182A45p6n5%M2K24n40O2K76p9p3j7N6K18K85l82m27J20J32L10r0J98J7l46K69
$$ plain form
4023 -445 -450 -314 -146 -29 -146 -89 -394 -281 3 -306 -210 -49 -33 -26 -440 -426 -74 -192 -55 -28 -177 111 -55
4046 -55 -281 -165 73 308 35 -356 -318 71 138 211 -519 -129 286 213 -121 260 151 -175 -43 193 39 288
4068 288 433 88 -239 77 471 266 110 -87 -168 442 239 -44 -189 154 204 123 -77 -102 446 271 57
4089 57 77 -44 497 169 -203 208 181 203 -99 365 126 10 84 405 -147 200 266 207 -39 162 299 338 191
4112 191 12 -179 -36 342 54 -352 67 88 61 -45 -277 -284 119 294 -86 -167 -150 288 -167 -130 -207 -173 -23
4135 -23 -86 -166 -63 151 21 -239 -599 -36 47 105 -294 -314 28 -144 -52 -339 -159 133 -280 -258 -279 -305 -218 -122
4159 -122 -272 -185 -110 -202 127 -117 -172 -209 -147 -33 -447 -421 -158 19 -227 -402 -183 143 48 -79 -174 -58 145
4182 145 69 14 14 56 280 -260 -198 78 -1 -74 -91 -35 183 468 86 -341 -221 -89 221 131 329 346 0 269
4206B69m47J84j1L47j97j58J45M3J5K05m07QJ94J11l6l53J47L33p6j74q8n5K77
4229B76m51M53m02L85q2j56j46J45K25R7m69Q1NJ70j95K69l19M59j52j27k11J10
4251c5j23L50n9l27J68N1j11r6K6L21j33K4n86M25r3K54l2l50N96j6o08L12k13
4274b55K7L28k59j7j2K96k6j36k05j04K98J20k93R5j77L5K73j29R0k50J52L2j4
4297a31j47K47jj02j65P6j00K69j22k69K19M26K9l70j09J49J78l17j56L98O6R5
4319A63l77K49k42L33M0j20k70N63k79K21k44K1q9L76k68q1lJ88p3k7P0j50M39
4342D40j08r8l64L56J08k48j01K50j35K11j35o5j36J77J84m04P5L08k79J76K5
4363B37k17J04N2J08k95rK06q6L3l18L35o9K13j98k08J90K07l27l04J98K91Q3
$$ plain form
4206 269 -178 6 -5 342 145 -13 132 175 190 395 -12 -4 190 301 265 -88 59 392 316 142 54 -1 276
4229 276 -175 278 -124 261 179 23 -123 22 247 344 -125 -44 -39 131 -64 205 -114 345 193 66 -145 -35
4251 -35 -158 192 133 -194 -26 25 -86 -182 -156 165 32 56 -530 -105 -198 56 24 -326 270 254 -354 -42 -255
4274 -255 -228 100 -159 -176 -188 108 82 -54 -259 -363 -65 55 -238 -143 -320 -285 -12 -141 -51 -301 -149 -117 -131
4297 -131 -278 -31 -32 -134 -299 -223 -323 -54 -176 -445 -226 200 229 -141 -250 -101 77 -240 -396 2 68 163
4319 163 -214 35 -207 126 166 46 -224 339 60 281 37 58 -31 345 77 -4 -7 181 108 81 151 1 440
4342 440 332 234 -130 226 334 86 -15 235 100 311 176 111 -25 152 336 -68 7 315 36 212 237
4363 237 20 124 176 284 -11 -20 186 100 133 -185 150 81 294 96 -112 78 285 -42 -346 -148 143 226
4385B26l0k56r7M66n7n21M2J29J41j07jj79k6J26K03j66l47M62k6j40r9Q5K07
4408C5j13R3j81Q0Q0p2%j48L04l00Q4j69J77J00r5L41k42j70J89k91K73j17n9
4431b01N43l44k41j28L19J75k45l62L18L49k62K1j60J20L25j3k42k36K88L70k92
4452A02k28j6K29k8J71n66J16K32q0J68l99M52J32k74K87m31J58K93k83l30M57
4473A62J15n8k97K52J13j44r6J01R8l09K93k62j50K86J14J48m84o4K47L61J06
4494E32l50j47q4L82j11l7j91K68m6M7l07P5L74k22k29k44L19J51r7m4k50q7N49
4517B51l50J27k79K08o9J86n20L01pJ86q4r1Q2K84k72n6o1K20k4j77l02M94J66
4540B13k31k85K03M5j47M05k91k25L21K13l2p25L60M6K57k51j27M5R5K41m19N7
$$ plain form
4385 226 196 -60 -157 309 252 -269 -227 -98 43 -64 -65 -244 -270 -144 59 -107 -454 8 -18 -158 -257 -172 35
4408 35 -78 15 -166 -86 -6 -78 -78 -226 78 -222 -138 -307 -130 -30 -125 216 -26 -196 -7 -298 -25 -142 -201
4431 -201 342 -2 -243 -371 -52 123 -122 -484 -166 183 -79 -58 -218 -98 227 214 -28 -264 24 394 102
4452 102 -126 -142 87 59 230 -336 -220 12 -68 100 -299 153 285 11 298 -133 25 318 35 -295 162
4473 162 277 219 -78 174 287 143 47 148 246 -63 230 -32 -182 104 218 366 -118 -182 65 426 532
4494 532 182 35 -49 333 222 185 -6 262 216 263 -44 31 405 183 -46 -290 29 180 83 39 -211 -298 251
4517 251 -99 28 -251 -43 -112 74 -446 -145 -152 34 -50 -141 -59 225 -47 -103 -164 56 32 -145 -447 47 213
4540 213 -18 -303 -100 -55 -202 203 -88 -313 8 221 189 -536 -176 -130 127 -124 -251 -206 -111 130 -289 -232
4562b32j04M50j51n00L97J08L29m31m8n3K56K54l54o2J37N29p00P7q5R3K75J37
4584C22m75l5L40m0L0k73J97J96l7j15k11M19n5k53J40k15L49j24J4q2j10J16
4606I8M0l7j53j14N23l79J94l78L91K77k61k49Q7j71N45K85p25j3K21m2j33k66
4628b60R5M81p9J80l86K02j09j62L06k56n4j3p9Ol4L87J68n97K05J73k91j98M67
4651A52k29K61k85K51m68N29k33J59L3l86j6q1K88j69M2K02n7r2j21K67j94q4
4673b31k0k7J30M36k08l95L77k42K70k07J4k90k2N1M01l29KL20m1j92l47K24M33
4696A07l1k66k3L90k84K96n42K40K48p5k65p1L49k15J78j08jJ50j13j97L81o5
4718H3j36J9r6J04l71M40j04R0o0J09J35k5j62M3k13O12k29j81j9J05mQ0j96K8
$$ plain form
4562 -232 -336 114 -37 -537 -140 -32 297 -134 -182 -235 21 275 -79 -141 -4 525 -175 -98 -183 -90 185 322
4584 322 -153 -188 152 112 142 -131 66 262 225 110 -101 318 263 10 150 -65 284 160 174 92 -18 98
4606 98 138 101 -52 -166 357 -22 172 -206 185 462 201 -48 39 -132 413 698 -27 -40 181 139 6 -260
4628 -260 -165 316 237 417 31 233 124 -38 268 12 -42 -55 -134 -128 -162 225 393 -204 1 174 -117 -315 152
4651 152 -77 184 -101 150 -318 211 -22 137 170 -216 -232 -313 -25 -194 -152 50 -7 -99 -220 47 -147 -231
4673 -231 -251 -278 -148 288 80 -315 62 -180 90 -117 -103 -393 -415 -364 37 -292 -290 30 -11 -203 -550 -326 107
4696 107 76 -190 -213 177 -107 189 -353 -113 135 60 -205 -276 73 -142 36 -72 -73 77 -36 -233 148 83
4718 83 -53 -34 -130 -26 -397 43 -61 29 -31 78 213 188 26 69 -144 468 239 58 39 144 140 220 24 52
4742E2J39L7j66k3L61j08J8k13j60N09L2j44r4k45K71j20Q5m11K20J57P2n06j69
4765d06J49L00J49j68r4K20K4m0k59J6J00j35j79J51J18K00k82L25j93k91N02
4786B07k79j83k4L14J2j42K2o7J35l7j39k0K35k51L25j82k48K93l84J98j00K86
4808b9k3M8j76K68m02N59n7k23j51O3J76l34K8K29J56k34N9j94Q8J83j11J97l84
4831b64J44J38p7Lj01K9L78k55k91M59m5J89k36k0n1J05J00mk46K26N56n07k52
4854b2J79j4p7j23k17K84q3K91k93J98K28n72K33Kq1J42K36L0l58m5K23k2Q9k6
4878B02j22j7J12j31Q6K01q7l41K49k02L37m6k47J87l10K26J72j06j37K66j48
4899A44r6k20oL77j51J80l36N2P3J21k68o1J84p1K38j69m38M40J25j73L9j08J
$$ plain form
4742 52 191 228 62 39 400 292 310 97 -63 446 478 334 240 -5 266 146 231 -180 40 197 269 -237 -406
4765 -406 -257 43 192 24 -70 150 174 134 -125 -109 -9 -144 -323 -172 -54 146 -136 189 -4 -295 207
4786 207 -72 -255 -279 35 47 -95 -73 -140 -5 -42 -181 -201 34 -217 108 -74 -322 -29 -413 -215 -315 -29
4808 -29 -52 -4 -180 88 -314 245 188 -35 -186 -123 53 -281 -253 -24 132 -102 -43 -237 -149 34 -77 120 -264
4831 -264 -120 18 -59 -56 -157 -128 250 -5 -296 163 118 307 71 51 0 105 205 201 -45 181 737 230 -22
4854 -22 157 143 66 -57 -274 10 -73 218 -75 123 351 -221 12 14 -67 75 311 341 -17 -62 161 139 228 202
4878 202 80 63 175 44 130 331 244 -97 152 -50 287 241 -6 181 -129 97 269 163 26 292 144
4899 144 48 -172 -178 199 48 228 -108 -56 17 138 -130 -191 -7 -78 160 -9 -447 -7 118 -55 -16 -124 -123
4922a23R0k42P9j60K03L36k95k49L30l9l55J61J30L5k02J11m7j86M08j86J32j42
4944b11J54J5j27j01p8J48L87l97L10l2J9m9k08j43Q5J32N48m47n01M09K59Q2
4966B54l13J1q5L87J51n92lK10j49O6k17O48R2j98l26K93j6j90K46k30j26k4L44
4989B33j35K15m2n5j74K18l63L24K44l09rk80K35K65j08q9j54J67P2m4r2k1N38
5012F36o04m5j05K32R9p8m2k78K72K89l39j69j15M7J79M6%j50K66q4J94n31j0
5035b90j45L21K12k01L96l69L13k09l27J97P8lp9j04J99R7l1l89J71K2j36K40
5057c7j44Q2J43l2j10k73L40pM5k90K32Mj16L73l44o3P2j22QK00j30J12p6j82
5081c15K10K20l26J25k09J14K52o0p6k82K86j28r5n7L61J91Jk59j43L08j73Q2
$$ plain form
4922 -123 -33 -275 -196 -356 -153 183 -112 -361 -31 -70 -425 -264 -134 -99 -301 -190 -237 -423 -15 -201 -69 -211
4944 -211 -57 -42 -169 -270 -348 -200 187 -210 100 68 87 38 -170 -313 -228 -96 452 5 -496 -87 172 254
4966 254 -59 -48 -133 254 405 -187 -190 20 -129 -63 -280 368 460 262 -64 229 213 23 269 39 -87 -111 233
4989 233 98 313 271 216 42 260 -103 221 465 156 147 -133 102 367 259 170 16 183 255 211 119 98 636
5012 636 32 -13 -118 114 213 135 93 -185 87 376 37 -132 -247 -200 -21 25 25 -125 141 57 251 -280 -290
5035 -290 -435 -114 98 -103 293 -76 237 28 -299 -102 -24 -27 -106 -210 -11 86 55 -334 -163 -141 -277 -37
5057 -37 -181 -99 44 12 -98 -371 -31 -38 7 -283 -51 -47 -163 210 -134 -197 -125 -247 -239 -39 -169 -57 -133 -315
5081 -315 -105 115 -211 -86 -295 -181 71 11 -65 -347 -61 -189 -284 -341 20 211 212 -47 -190 118 -55 27
5103B7K59o43K26M23j01l76k4M85j23k08j76N6N74j23k83j64J90K72j78r3N7k67
5125a90L17J65j31j90p7K89k9k78j28N10q8j0jK1Q0j22k20l8R0L22j04k46J44
5148H6J83j28k68K56J45m82K21J81k68j06M09l25K34p9K0o4J85P6m69J84l6k41
5170b86M4j2L05n3m1m96P34L5k70J35m73K82L8k16J42K02j16j7k2j87o1N91m43
5193a85n8P6K84j57k87K26l62K68L8J14k41J29L88j39j87k30J65J58k63P8K37
5214E2j98K93k40J95k60j46L62J1j17k25J97M5m07L50J1J00J96o26N01L2j11L3
5236D8p2P7J09J08l2l87L41o8l32L91j01n9J11k53k47K36L40J80l30R8J98l1j60
5259A65q0j42K29j91R5j99M24j00j07p9M3J40l7K32o46J18L91J4m08J70K5L5k0
$$ plain form
5103 27 286 -357 -131 292 191 -185 -209 276 153 -55 -231 -175 399 276 -7 -171 19 291 113 20 77 -190
5125 -190 127 292 161 -29 -106 183 154 -124 -252 258 170 160 159 180 260 138 -82 -120 -30 292 188 -58 86
5148 86 269 141 -127 129 274 -208 13 194 -74 -180 229 -96 138 59 79 15 200 276 -193 -9 -45 -286
5170 -286 -242 -254 51 -2 -43 -539 195 230 -40 95 -378 -96 -58 -274 -132 70 -46 -63 -85 -272 -333 258 -185
5193 -185 -243 -167 117 -40 -327 -101 -463 -195 -157 -43 -284 -155 233 94 -93 -323 -158 0 -263 -185 52
5214 52 -146 147 -93 102 -158 -304 58 69 -48 -273 -76 -31 -438 -88 -77 23 219 -407 94 126 15 48
5236 48 -24 53 162 270 238 -149 192 124 -208 183 82 23 134 -119 -366 -130 210 390 60 158 356 325 165
5259 165 85 -57 172 -19 76 -123 301 201 94 15 58 198 161 393 -253 -135 256 270 -138 32 57 92 72
5282G2k70J52j50J30L14j19j66M6J9K83m66j07N30k19j86J18p3j76M52j78kj00
5304i6M47k05k88j64L90k78l1m9J9J18P4p2L8j55L31j37L7o01M72K40j39p9j61
5327b89J82J5l2j97r0M88l12R1Q3K5k3k13K65n02M69on3J7j8k14M64n15J81J91
5351GK45n10J59j44K69L0l5j41J77j01M9J55j71k86M94Kj78J24k5L05k73j27j36
5374a11R2M69j25j28k62j17K53J18K86m60M4k16L18k38L12k2k74J90j0k90N53
5395C82J9l52k30M63J53k79k44L4J42j49J68Ok07L54l02j04K08l0P2k34j50M05
5417A25QP9j63L2l9j7P3l58J24J28J0j23JJ7j44N01m63K71j08j53L91p66K04M2
5441c28K77j26K68m54K36J35p4l55L86J64r3Mj97o9L36k75k35K42M8p1j7J70j68
$$ plain form
5282 72 -198 -46 -196 -66 248 129 -37 9 28 311 -155 -262 268 49 -137 -19 -92 -268 184 6 4 -96
5304 -96 351 146 -142 -306 84 -194 -225 -274 -255 -137 -63 -135 -97 -252 79 -58 -21 -622 -150 90 -49 -128 -289
5327 -289 -107 -92 -124 -321 -411 77 -235 -144 -61 -36 -59 -272 -7 -509 -40 -46 -99 -82 -100 -314 150 -365 -184 7
5351 7 252 -258 -99 -243 26 56 21 -120 57 -44 5 160 -11 -297 197 199 21 145 120 425 152 25 -111
5374 -111 -19 450 325 197 -65 -182 71 189 475 15 59 -157 161 -77 235 213 -61 129 119 -171 382
5395 382 401 49 -181 282 435 156 -88 -54 88 -61 107 113 -94 260 -42 -146 62 32 104 -130 -280 125
5417 125 133 212 49 81 42 25 98 -260 -136 -8 2 -121 -120 -103 -247 254 -209 62 -46 -199 192 -574 -370 -328
5441 -328 -51 -177 91 -363 -127 8 -66 -421 -35 129 36 40 -157 -226 110 -165 -400 -158 -110 -181 -198 -28 -196
5464a96K18j93j34K31J21o8K07l39kL63J1j71j17K3J40j75j19O1J2K6R5oj94J38
5488f8O8L50m82R7j48J15M29j59m59L19M5J9k74j06K77M3M3K02m10K78m5j26J70
5511A78n1o3rJ03j51n8M12l83k63O03RJj99j31J64K09m17k3J78K0K9M5q3n9%L43
5537D04k72m01K96J64m8K04k48j68K74k98J09k40L10j14j8j58k4L87k37J02j24
5558a00q5J46J33j63l04L85K60m32P2L1J68j22j36k4j68N64m40J77R4k5O4l00
5580b05j24j43L14M37m73K50k48J01R1K0m8J6k05L46k10m4K04Pk57l1K61k69K21
5603A1N3k38K54J99l54k2J17k36L02M5p2k67K97o8j46q2K21K09j59l52j8K48L60
5626C02q4j37R1m1l07L31n9om8J88j45R2j33PJ16n04K69L10N2j92J25j51M4K8
$$ plain form
5464 -196 22 -171 -305 -74 47 -21 186 -153 -155 208 219 48 -69 -46 94 -81 -200 -139 -127 -101 -6 -12 -206 -68
5488 -68 0 350 -132 -35 -183 -68 361 202 -257 62 107 126 -148 -254 23 66 109 311 -99 179 134 8 178
5511 178 127 64 55 158 7 -51 361 -22 -285 318 327 328 129 -2 162 371 -46 -69 109 129 158 203 120 61 61 404
5537 404 132 -269 27 191 143 347 99 -69 205 -93 16 -224 86 -28 -46 -204 -228 159 -78 24 -100
5558 -100 -185 -39 94 -69 -373 12 272 -160 -88 -57 111 -11 -147 -171 -339 225 -215 -38 56 31 95 -205
5580 -205 -329 -472 -158 279 -194 56 -192 -91 0 20 -28 -12 -217 129 -81 -125 79 86 -171 -202 59 -210 11
5603 11 64 -174 80 279 -75 -97 20 -216 86 131 59 -208 89 21 -125 -207 14 223 64 -288 -306 -58 302
5626 302 218 81 172 131 -176 155 96 90 42 230 85 177 44 51 167 -337 -68 242 294 102 227 76 120 148
5650A48Q3p2j05o5J00J4k73N3p4L63O8k69J04l2K94p0l53K42j27K13k69j81L46
5673A38K12n66j7L65L4l04Q9J72k48L06m49K3j23L68J28k22l24K98J34m11J82
5694b15K26j62LL25n50L90K0l06J92J50j17O7j39K1J02L6J49l47k6J78k05M0J75
5717Gl39J93q6K33k02k0K32m11J61J15k26M85j20k0L56n48K41k7j97M9J25O2j38
5740g5l43J42R4M65o9l32P7j81M37k3j85j60K07J00k41p3N50n01k3K48k66M24
$$ plain form
5650 148 231 159 54 -11 89 103 -170 -117 -191 172 240 -29 75 43 337 267 -86 156 29 242 -27 -208 138
5673 138 350 -216 -233 132 166 -138 -49 123 -125 181 -268 -245 -368 0 128 -94 -418 -120 14 -397 -215
5694 -215 11 -151 -148 177 -373 17 37 -269 -77 73 -44 23 -116 -95 7 43 192 -155 -181 -3 -208 -168 7
5717 7 -332 -139 -225 8 -194 -214 18 -393 -232 -117 -343 142 22 2 358 -190 51 24 -173 -124 1 63 -75
5740 -75 -418 -276 -182 283 214 -118 -41 -222 215 192 7 -153 54 154 -87 -160 390 -111 -134 114 -152 272
$$ [...]
8191d2
##END NTUPLES=NMR FID
##END=
