##TITLE=1H_TG-2281-1
 CDCl3, 8 sc, 
 29.1.2020
##JCAMPDX= 6.0         $$ Bruker NMR JCAMP-DX V2.0
##DATA TYPE= NMR FID
##DATA CLASS= NTUPLES
##ORIGIN= UXNMR, Bruker Analytische Messtechnik GmbH
##OWNER= root
$$ XWIN-NMR		Version 3.5
$$ Wed Jan 29 14:06:22 2020 Russian Standard Time (UT+4h)  she@DPX200
##.OBSERVE FREQUENCY= 200.1315
##.OBSERVE NUCLEUS= ^1H
##.DELAY= (6, 6)
##.ACQUISITION MODE= SIMULTANEOUS
##.ACQUISITION SCHEME= undefined
##.AVERAGES= 8
##.DIGITISER RES= 18
##SPECTROMETER/DATA SYSTEM= spect
##.PULSE SEQUENCE= zg30
##.SOLVENT NAME= DMSO
##.SHIFT REFERENCE= (INTERNAL, DMSO, 0, 15.7039)
##AUDIT TRAIL= $$ (NUMBER, WHEN, WHO, WHERE, WHAT)
$$ ##TITLE= Audit trail, XWIN-NMR		Version 3.5
$$ ##JCAMPDX= 5.01
$$ ##ORIGIN= Bruker BioSpin GmbH
$$ ##OWNER= she
$$ F:/spectra/data/she/nmr/H-F/1/audita.txt
$$ ##AUDIT TRAIL=  $$ (NUMBER, WHEN, WHO, WHERE, WHAT)
(   1,<2020-01-29 14:05:29.39 +0400>,<she>,<DPX200>,
      <created by zg, POWCHK disabled, PULCHK disabled
       configuration hash MD5:
       00 E9 B6 7A A2 85 ED C7 34 08 36 98 17 FE 4E 26
       data hash MD5: 16K
       9A EB 5F CD A6 AC 98 8B 9E 58 63 3C 66 68 46 66>)
$$ ##END=
$$ 
$$ hash MD5
$$ 9A F5 47 EB 8A 47 26 01 F6 43 A5 CA 6C 67 8B 68
##$RELAX= 
##$RELAX= 
##$RELAX= 
##$RELAX= 
##$RELAX= 
##$RELAX= 
$$ Bruker specific parameters
$$ --------------------------
##$DU= <F:/spectra>
##$EXPNO= 1
##$NAME= <H-F>
##$PROCNO= 1
##$TYPE= <nmr>
##$USER= <she>
##$AMP= (0..31)
100 100 100 100 100 100 100 100 100 100 100 100 100 100 100 100 100 100 
100 100 100 100 100 100 100 100 100 100 100 100 100 100 
##$AQSEQ= 0
##$AQ_mod= 1
##$AUNM= <au_zg>
##$AUTOPOS= <>
##$BF1= 200.13
##$BF2= 200.13
##$BF3= 200.13
##$BF4= 200.13
##$BF5= 200.13
##$BF6= 200.13
##$BF7= 200.13
##$BF8= 200.13
##$BYTORDA= 1
##$CFDGTYP= 0
##$CFRGTYP= 5
##$CHEMSTR= <none>
##$CNST= (0..31)
1 1 145 1 1 1 1 1 1 1 1 1 1 1 1 1 1 1 1 1 1 1 1 1 1 1 1 1 1 1 1 1 
##$CPDPRG= <>
##$CPDPRG1= <>
##$CPDPRG2= <>
##$CPDPRG3= <>
##$CPDPRG4= <mlev>
##$CPDPRG5= <mlev>
##$CPDPRG6= <mlev>
##$CPDPRG7= <mlev>
##$CPDPRG8= <mlev>
##$CPDPRGB= <>
##$CPDPRGT= <>
##$D= (0..31)
0 1.2 0 0 0 0 0 0 0 0.06 0 0.03 0 0 0 0 0.0002 0 0 0 0 0 0 0 0 0 0 0 0 
0 0 0 
##$DATE= 1580292328
##$DBL= (0..7)
120 120 120 120 120 120 120 120 
##$DBP= (0..7)
150 150 150 150 150 150 150 150 
##$DBP07= 0
##$DBPNAM0= <>
##$DBPNAM1= <>
##$DBPNAM2= <>
##$DBPNAM3= <>
##$DBPNAM4= <>
##$DBPNAM5= <>
##$DBPNAM6= <>
##$DBPNAM7= <>
##$DBPOAL= (0..7)
0.5 0.5 0.5 0.5 0.5 0.5 0.5 0.5 
##$DBPOFFS= (0..7)
0 0 0 0 0 0 0 0 
##$DE= 6
##$DECBNUC= <off>
##$DECIM= 24
##$DECNUC= <off>
##$DECSTAT= 4
##$DIGMOD= 1
##$DIGTYP= 9
##$DL= (0..7)
0 120 120 120 120 120 120 120 
##$DP= (0..7)
150 150 150 150 150 150 150 150 
##$DP07= 0
##$DPNAME0= <>
##$DPNAME1= <>
##$DPNAME2= <>
##$DPNAME3= <>
##$DPNAME4= <>
##$DPNAME5= <>
##$DPNAME6= <>
##$DPNAME7= <>
##$DPOAL= (0..7)
0.5 0.5 0.5 0.5 0.5 0.5 0.5 0.5 
##$DPOFFS= (0..7)
0 0 0 0 0 0 0 0 
##$DQDMODE= 0
##$DR= 18
##$DS= 0
##$DSLIST= <SSSSSSSSSSSSSSS>
$$ [...]
##$SUBNAM2= <"">
##$SUBNAM3= <"">
##$SUBNAM4= <"">
##$SUBNAM5= <"">
##$SUBNAM6= <"">
##$SUBNAM7= <"">
##$SUBNAM8= <"">
##$SUBNAM9= <"">
##$SW= 24.9337058887773
##$SWIBOX= (0..15)
0 0 2 0 0 0 0 0 0 0 0 0 0 0 0 0 
##$SW_h= 4990.01996007984
##$TD= 16384
##$TD0= 1
##$TE= 0
##$TE2= 300
##$TE3= 300
##$TEG= 300
##$TL= (0..7)
0 120 120 120 120 120 120 120 
##$TP= (0..7)
150 150 150 150 150 150 150 150 
##$TP07= 0
##$TPNAME0= <>
##$TPNAME1= <>
##$TPNAME2= <>
##$TPNAME3= <>
##$TPNAME4= <>
##$TPNAME5= <>
##$TPNAME6= <>
##$TPNAME7= <>
##$TPOAL= (0..7)
0.5 0.5 0.5 0.5 0.5 0.5 0.5 0.5 
##$TPOFFS= (0..7)
0 0 0 0 0 0 0 0 
##$TUNHIN= 0
##$TUNHOUT= 0
##$TUNXOUT= 0
##$USERA1= <user>
##$USERA2= <user>
##$USERA3= <user>
##$USERA4= <user>
##$USERA5= <user>
##$V9= 5
##$VALIST= <valist>
##$VCLIST= <CCCCCCCCCCCCCCC>
##$VD= 0
##$VDLIST= <DDDDDDDDDDDDDDD>
##$VPLIST= <PPPPPPPPPPPPPPP>
##$VTLIST= <TTTTTTTTTTTTTTT>
##$WBST= 1024
##$WBSW= 4
##$XGAIN= (0..3)
0 0 0 0 
##$XL= 0
##$YL= 0
##$YMAX_a= 217666
##$YMIN_a= -138214
##$ZGOPTNS= <>
##$ZL1= 120
##$ZL2= 120
##$ZL3= 120
##$ZL4= 120
##$ABSF1= 10
##$ABSF2= 0
##$ABSG= 5
##$ABSL= 3
##$ALPHA= 0
##$AQORDER= 0
##$ASSFAC= 0
##$ASSFACI= 0
##$ASSFACX= 0
##$ASSWID= 0
##$AUNMP= <proc_1d>
##$AZFE= 0.1
##$AZFW= 0.1
##$BCFW= 1
##$BC_mod= 2
##$BYTORDP= 1
##$COROFFS= 0
##$CY= 11.3945322036743
##$DATMOD= 1
##$DC= 2
##$DFILT= <>
##$DTYPP= 0
##$F1P= 16.9975609425685
##$F2P= -3.02152046262296
##$FCOR= 0.5
##$FTSIZE= 0
##$FT_mod= 4
##$GAMMA= 1
##$GB= 0.15
##$INTBC= 1
##$INTSCL= 1
##$ISEN= 128
##$LB= 0.24
##$LEV0= 0
##$LPBIN= 0
##$MAXI= 10000
##$MC2= 0
##$MEAN= 0
##$ME_mod= 0
##$MI= 1.114404
##$NCOEF= 0
##$NC_proc= 0
##$NLEV= 6
##$NOISF1= 3.799351
##$NOISF2= 2.8
##$NSP= 1
##$NTH_PI= 0
##$NZP= 0
##$OFFSET= 15.70392
##$PC= 1
##$PHC0= -9794.135
##$PHC1= 22.60081
##$PH_mod= 1
##$PKNL= yes
##$PPARMOD= 0
##$PSCAL= 0
##$PSIGN= 0
##$REVERSE= no
##$SF= 200.130013532006
##$SI= 16384
##$SIGF1= 3
##$SIGF2= 2
##$SINO= 400
##$SIOLD= 16384
##$SREGLST= <1H.CDCl3>
##$SSB= 0
##$STSI= 0
##$STSR= 0
##$SW_p= 3612.71676300578
##$SYMM= 0
##$S_DEV= 0
##$TDeff= 0
##$TDoff= 0
##$TI= <>
##$TILT= no
##$TM1= 0
##$TM2= 0
##$TOPLEV= 0
##$USERP1= <user>
##$USERP2= <user>
##$USERP3= <user>
##$USERP4= <user>
##$USERP5= <user>
##$WDW= 1
##$XDIM= 8192
##$YMAX_p= 0
##$YMIN_p= 0
$$ End of Bruker specific parameters
$$ ---------------------------------
##NTUPLES= NMR FID
##VAR_NAME=  TIME,          FID/REAL,        FID/IMAG
##SYMBOL=    X,             R,               I
##VAR_TYPE=  INDEPENDENT,   DEPENDENT,       DEPENDENT
##VAR_FORM=  AFFN,          ASDF,            ASDF
##VAR_DIM=   8192,          8192,            8192
##UNITS=     SECONDS,       ARBITRARY UNITS, ARBITRARY UNITS
##FACTOR=    0.0002004,     1,               1
##FIRST=     0,             0,               0
##LAST=      1.6414764,     0,               0
##MIN=       0,             -138214,         0
##MAX=       1.6414764,     217666,          0
$$ Real data points
##PAGE= N=1
##DATA TABLE= (X++(R..R)), XYDATA
0@%%%%%%%%qJ6j6J6k4L2l2M0m8N6p2Q6j00J17j35J54j78K06k35K68l05L46l92
31b08M40m92N51o15O87p67Q53r48J054j167J291j431J583j751J941k154K393k667
49a407K981l347L779m296M935n744O801q259J0417j3966K1145o2814J58456K9579
63A38260k68532K6140K05116k8186k11012L4844J64765k4706j27041N8026J09410
74G7084m8646r4196L9448M9914m6987m1935M9036M3512o309j3050j4630k8722
86c5481P745L0935j4966k9912L7247L9463l9970l2187M7449J2319o8418r495P6998
99B1727N824o8428J6184Q0031k3193q5464J1556O2561j5863l3585L9666K2154
111C3170n3788j0010O3500o076p5654J4442Q2732j9262p7892K9082P2140l6173
$$ plain form
0 0 0 0 0 0 0 0 0 0 -8 8 -8 8 -16 16 -16 24 -24 32 -40 46 -54 63 -72 82 -96 110 -125 143 -162 184 -208
31 -208 232 -260 291 -324 363 -404 449 -499 555 -612 679 -752 831 -920 1021 -1133 1260 -1407
49 -1407 1574 -1773 2006 -2290 2645 -3099 3702 -4557 5860 -8106 13039 -49775 108681 138260
63 138260 -130272 -104132 100984 72798 -138214 -103370 61395 36689 -90352 -32326 77084
74 77084 28438 -65758 -26310 23604 -23383 -65318 -16282 27230 20921 7871 -6759 -35481
86 -35481 -27736 3199 -11767 -41679 -4432 35031 -4939 -37126 10323 22642 -45776 -55271 21727
99 21727 27551 -40877 -24693 55338 32145 -53319 -41763 20798 4935 -28650 11016 33170
111 33170 -20618 -30628 32872 26796 -48858 -34416 48316 29054 -48838 -19756 52384 16211
123A6211o4793L5016M1781l9882j5100N8337M747o7955m914N6808p439m3975K5605
136e553M0929l4045l2860M1884K0362n1862j7184N2237R596m7142O121M8589j0270
149B0802m3239Q989J6848k5638N012N1102p961o0072J4388N7437k8351o1437L4478
162a7642N5199m0883l9612N7721L3579o8174k9148O9889J0908q3337k447J00713
174D6766J2463r5958j3545Q2905J305q1177K413P5364j313o1392Q471N4804p164
187B3942m8403l965L1366P019j8028r659J6218K6727l807m2718j6400M0720K4084
200B7096l8011j9856M3934J8167m7033j2838N0690L071o0603J241O7659l887o5918
213c6288J3337O9851k0843p4452J7971O6389j6618m7463K6293L3012l7177k2390
$$ plain form
123 16211 -48582 -13566 28215 -11667 -26767 31570 36317 -31638 -36552 20256 12817 -31158 -5553
136 -5553 35376 1331 -31529 10355 30717 -21145 -38329 13908 23504 -23638 -17517 31072 20802
149 20802 -22437 -13448 3400 -22238 -17226 33876 25915 -34157 -19769 37668 9317 -52120 -17642
162 -17642 37557 -3326 -42938 14783 48362 -19812 -48960 20929 31837 -51500 -53947 46766
174 46766 59229 -36729 -50274 32631 33936 -47241 -44828 30536 29223 -32169 -23698 31106 23942
187 23942 -24461 -28426 2940 9959 -8069 -17728 -1510 25217 21410 -21308 -37708 3012 27096
200 27096 -10915 -30771 13163 31330 -15703 -28541 22149 25220 -35383 -34142 33517 29630 -36288
213 -36288 -22951 46900 26057 -48395 -30424 35965 19347 -28116 -1823 31189 -5988 -28378
225b8378M3201J3353m5927n634M4318j395l8225J1855L2795k2330k8663K8222
237C192K1561l2910j1056M2237O131n0673o369M8133M724l7738L671K8762j5798
250C867k0833K4866J3486l4631p572M0887M564m0076l5L8146n113l4993L730K3701
264I994p296q315K0002J454k9619j079L0290n071k9963J1141K9349j4886k3464
277a7463K2365J7408l2074j4274L5863N862l9725K323M7656k167m8234n55L6703
290A3688n248k7555J4170K4098j6952j9274J8758J3893k0471j2671J4836P833
302E105p785R78M412m441M093P852j8445k0420K7061L2575k8298l4715L1821L3108
316C2901l7472l0694M1523K4997m7318j9801N3968J7245n4870j2693N3067O613
$$ plain form
225 -28378 14823 28176 -17751 -23385 20933 19538 -18687 -6832 25963 3633 -25030 3192
237 3192 24753 -8157 -19213 23024 29155 -21518 -27887 20246 24970 -12768 -9097 19665 3867
250 3867 -16966 7900 21386 -13245 -20817 20070 24634 -15442 -15477 22669 17556 -17437 -13707 9994
264 9994 2698 -5617 14385 15839 -13780 -14859 15431 10360 -19603 -8462 20887 6001 -17463
277 -17463 4902 22310 -9764 -24038 11825 17687 -22038 -19715 27941 25774 -22460 -23015 13688
290 13688 8440 -19115 -4945 19153 2201 -17073 1685 15578 -4893 -17564 -2728 5105
302 5105 -2680 -1702 2710 -1731 2362 10214 -8231 -28651 -1590 30985 2687 -32028 -207 32901
316 32901 -4571 -35265 6258 31255 -16063 -35864 18104 35349 -19521 -32214 20853 27466
328B7466n3221k833N1731L271m4133J196L3298r749k7928J7089K4649k0286j8921
341a8371K2507J3861k1490q438J7627k76j3801P976J0887j2700m456J8311p74
354A0863k5274M94K7216J074k1869J340J6118o860j2650J0576R424j4283n377
367i208J7275L290j7784J72J5750n782j5867P968J2670q740l176J5228l194k3771
381a5169M093K3222n367k0990J0181J7570j3626j2847J8445P716k5547o414K7449
394H716N148k7734K15K9532k143l1420J72K5549k387j8036R219J4073j4625j1162
408a4883J7470O347j9582m211J7494J220j1509N702Q068j1027n568J2607j772
421C56j7406O896K4392o690k5350O386K2693r772k0594J3962J7123j7860j3667
$$ plain form
328 27466 -25755 -28588 23143 26414 -17719 -16523 16775 7026 -20902 -3813 20836 550 -18371
341 -18371 4136 17997 -3493 -11931 5696 5420 -8381 -405 10482 -2218 -6674 11637 10863
354 10863 -14411 -13917 13299 14373 -7496 -6156 9962 3102 -9548 1028 10452 -3831 -9208
367 -9208 8067 11357 -6427 -6255 9495 3713 -12154 -4186 8484 -256 -3432 11796 8602 -15169
381 -15169 -11076 12146 6779 -14211 -4030 13540 -86 -12933 5512 13228 -12319 -18733 8716
394 8716 13864 -13870 -13655 15877 13734 -17686 -17514 8035 5648 -12388 -3169 10904 -3721 -14883
408 -14883 2587 8934 -10648 -14859 2635 3855 -7654 -1952 6116 -4911 -10479 2128 356
421 356 -17050 -10154 14238 7548 -17802 -11416 11277 1505 -19089 -5127 11996 -5864 -19531
434a9531K3638J2838k7158j2491K7489R515k7616o111K6795O086k1539m280J3215
447H50j155q012P546O375j0054m489J0149M356r017k869M656n11r13M979o05o689
463e403L806R204q377j3020R365J6369q239j4084R297R372j2723m593J6485J126
477H585j9458J495K1442k154k0701L765J7229o004j4632Q536J1144q413n882J0715
491E667K57j5112J866J7174k163j6447M643J4590p383j1779J0571P589j5387m763
505a0677J9373K962k0510L61K1323l742k2876L642K0368l830j5103O772J1515
518I578j0882r053J2253P036j3037o314J2727M961j0314j759P669k225o901M584
532a677L740o498K43J0724k541j3806J726J2778k929r507N455O980q479l479J0483
$$ plain form
434 -19531 4107 16945 -10213 -22704 4785 14300 -13316 -19427 7368 13454 -8085 -12365 850
447 850 -305 -8317 -771 5604 -4450 -8939 1210 5566 -3451 -6320 -1664 -2175 -3088 1891 1286 -5403
463 -5403 -1597 7607 -770 -13790 -4425 11944 3705 -10379 -1082 8290 -4433 -9026 7459 8585
477 8585 -10873 -9378 12064 9910 -10791 -7026 10203 4199 -10433 -1897 9247 834 -5048 5667
491 5667 5924 -9188 -7322 9852 7689 -8758 -4115 10475 3092 -8687 1884 9473 -5914 -10677
505 -10677 8696 11658 -8852 -8491 12832 9090 -13786 -10144 10224 6394 -8709 -1937 9578
518 9578 -1304 -10357 1896 8932 -4105 -10419 2308 7269 -3045 -4804 2865 640 -6261 -1677
532 -1677 2063 -4435 -4192 6532 3991 -9815 -8089 4689 1760 -7747 -2292 4688 -3791 -7270 3213
547C213J733j3180j300J2120J032j0827J539R934k315q138J758N014m409m30P371
562C115j169j0259K974R938l842r152O200O931q765l137J2234O98j4706P22J5341
577G123k957j5662O054J6396n688j5252N813J1726q098q675J1422O996j2501n744
591i047J3892N352j4257m726J3320K121j0844J309R679l543p105N530L095q491
605c715m50J0990J112j0329k03P573j984n099M321K910p128j486J0604K222j1145
620a807k426J0456L0j0233P8J0560J65p217K011M036n970k817P678K201q581j448
636c284P965J911o134k91J585k346K56M718j628n449L665O519n138q994M166Q034
652E555l279n460M456L400o306j944Q002m94j0840P74J2063o85j0818K222Q923
$$ plain form
547 3213 4946 -8234 -9534 2586 3618 -7209 -5670 4264 1949 -6189 -4431 583 -3826 -4256 3115
562 3115 1946 -8313 -5339 4599 757 -8395 -2195 4736 -4029 -7166 5068 5766 -8940 -8218 7123
577 7123 4166 -11496 -5442 10954 5266 -9986 -4173 7553 -545 -9220 2202 9198 -3303 -9047
591 -9047 4845 10197 -4060 -8786 4534 6655 -4189 -2880 6799 3256 -3849 1681 4776 -3715
605 -3715 -4165 6825 7937 -2392 -2595 4978 2994 -2105 2216 5126 -2002 -3488 7116 9338 -1807
620 -1807 -4233 6223 6253 -3980 -3902 6658 6823 -394 1617 5653 -317 -3134 4544 6745 -1836 -3284
636 -3284 4681 6592 458 167 1752 -594 -338 4380 2752 -2697 968 7487 2349 -6645 -2479 5555
652 5555 2276 -3184 1272 4672 -1634 -3578 4424 3930 -6910 -6136 5927 5242 -5576 -3354 5569
667E569m037p836L753M844n348p18Q127j565r647J293R770k263q699K127P698
682C068k933n565M910L729p455l454Q464K286q928j27R752K10j0161m84P682q39
698A55n107L424K985m855p70O045k38o663m23N409j79l084K173K347l188p74K570
715a73o02m078J866N986j641n944J324N287k566l786L866K004n589Q46P691j985
731B506q189J622P514k619o968M291O138l993l682M071J334o233L62O909n44o724
747d205J117O854j272n958J795L649l496k381N434J676o440J37O944k190q187
762f523L356Q045l876o127M966M090o764k461P653J021q804l0Q816J87p997K42
778d206O527k145n734K799N381l491l671M796K130o543j826O782J322o619K0N258
$$ plain form
667 5569 1532 -6304 -2551 2293 -3055 -3773 4354 2789 -6858 -5565 4205 1942 -6757 -4630 3068
682 3068 135 -5430 -520 3209 -4246 -7700 764 3050 -5878 -6005 3747 3957 -6204 -6688 994 155
698 155 -4952 -1528 1457 -3398 -4168 1877 1639 -5024 -5447 -38 -217 -3301 -1128 1219 -1969 -2743 -173
715 -173 -775 -4853 -2987 2999 1358 -4586 -3262 2025 -541 -4327 -461 1543 -4046 -3200 4491 2506
731 2506 -5683 -4061 3453 834 -6134 -1843 4295 302 -3380 691 2025 -4208 -3846 3063 2519 -4205
747 -4205 -3088 3766 2494 -3464 -1669 1980 -1516 -3897 1537 3213 -3227 -3090 3854 1664 -6523
762 -6523 -3167 4878 1002 -5125 -159 3931 -2833 -5294 2359 3380 -5424 -5454 3362 3549 -4448 -4206
778 -4206 2321 176 -5558 -2759 2622 -869 -4540 256 2386 -4157 -5983 799 2121 -4498 -4478 780
794G80j315l342L614J021n426o71O565O40o695J64N736q96n055P68L598j177k257
811c948L248J299m854j187O201R00o442j137O060P00m573J376K565k812k067M950
827B79L90n662Q61O980j085p075R25O017j596l272K155K476m039q02N393Q34o898
844d119r12P213J459o611o20O141k9n318N02M076k508j585M372J773n646j125
860b937N417O78m735k21L406n41j369K163R30l194q53L264M82m088L25M993N87
877D307n326n14M076r08k994K248K813l551k282M386K343n147k243M377R89k911
893c37l1L014j040j647R74m1k043J13K529Q09k272r60J583N05j772O72L66j269
911h47o65K666J025l753n02K981Q0l293L55L244r83j585J644k95k596j48L513
$$ plain form
794 780 -535 -3877 -263 758 -4668 -5339 1226 1866 -4829 -4665 1071 175 -4880 -4112 -514 -1691 -3948
811 -3948 -700 599 -4255 -5442 759 1659 -4783 -5920 140 840 -3733 -2357 208 -2604 -4671 279
827 279 669 -4993 -4132 2848 1763 -5312 -4387 1630 34 -3238 -1083 1393 -2646 -3448 1945 2779 -4119
844 -4119 -5031 2182 3641 -2970 -3590 2551 2522 -2796 -2294 1782 -726 -2311 2061 3834 -1812 -2937
860 -2937 2480 3158 -1577 -1798 1608 1067 -302 1861 2791 -403 -1256 2008 2490 -1598 -1273 3720 4307
877 4307 -1019 -1533 2543 1635 -1359 889 3702 151 -2131 2255 4598 -549 -2792 1585 2574 -337
893 -337 -368 2646 1606 -41 933 892 -1151 -1038 1491 2300 28 -932 651 1156 -616 56 422 -847
911 -847 -1512 1154 2179 -1574 -2076 905 985 -2308 -1953 1291 308 -1277 367 72 -2524 -2672 841
928H41l66l043J99L040J58k695Q8R59q05p69J613J299k244l32K654j09l472r17
946c901L935Q75l099J31K137r29j675K204P75l085m94L469R65k585l03J815q49
963f14j507J082P73l69j47J634K49k227p07J587J192k099j03J616L58j296J526
980I48P89k542j061K697J318k542n34K737M27k359NJ155n78n76J965K5j463m59
998d8J707J103k114j198J023J493l49j45K02o09p15J396J65j981o3K831J86k138
1016G46l21J606o97p86Q52j37j557Q50K689m13l595J95K016N28k049j74J822K2
1034A597j207Q1P40j767o25K602R88l066j575L507J560l388j497K053M87j153
1050f63O47Q87j032j506J474R12j886j206J994J275j153j228K66O94k26l51M76
$$ plain form
928 841 475 -2568 -2369 671 829 -1866 -1778 -819 -1624 -2393 -780 519 -1725 -2057 597 488 -2984 -3901
946 -3901 34 909 -2190 -2059 78 -851 -2526 -322 453 -2632 -3126 343 1308 -1277 -1580 235 -614
963 -614 -2121 -1039 -266 -635 -782 852 1101 -1126 -1833 -246 946 -1153 -1256 360 718 -578 948
980 948 1737 -805 -1866 831 2149 -393 -927 1810 2237 -122 -117 1038 460 -116 1849 1874 411 -48
998 -48 1659 2762 648 -550 473 1966 1617 1472 1674 1065 350 1746 1911 -70 -133 2698 2884 746
1016 746 425 2031 1334 548 1400 1263 -294 556 3245 2832 -763 -568 1448 1976 -73 -247 1575 1597
1034 1597 390 471 1211 -556 -1181 1421 2409 -657 -2232 1275 2835 -553 -2050 3 490 -663
1050 -663 -16 871 -161 -1667 -193 719 -1167 -2373 -379 896 -257 -1485 -1219 -525 -751 -1102 -626
1067f26o71m97J244J359j703j288J241J027j766k69J564j04o08K74R91j669n72
1084b073J369J245j332j162P46J330m90p48J12n3kM42R86m82j041N96J132p71
1102a96j475Q67J725p51n97Q81l31p50R38R05j502j033J401J471n90j094O7N46
1120D82j21L8j02M79j02J80N91l80j328K41J553m09j016J80J365n13k17N70n21
1139I70j616J060J597q55j383Q51J310j007r18P32Q13j153mO55L99j357n56J743
1157A281M58k249m29K115N92j659l70J416o48j484R72J259j151q37J293N36j548
1174d53n26Q57J30j64N8m2l77J51O43l67p45q81J142Q54r66m85Q02L80q91j84
1194a064N62j171N0J693N59k398m92J838K88j207m44P98M4k75R62K18j430p33
$$ plain form
1067 -626 -1297 -1794 -550 809 -894 -2182 -941 86 -1680 -1949 -385 -489 -1097 -823 168 -1501 -2073
1084 -2073 -704 541 -791 -1953 -1207 123 -367 -1115 -1003 -1056 -1058 -616 370 -112 -1153 -557 575 -196
1102 -196 -1671 -804 921 170 -427 454 123 -627 311 1216 -286 -1319 82 1553 963 -131 -64 482
1120 482 361 399 297 776 674 854 1445 1065 -263 -22 1531 1122 106 286 1651 1138 921 1491 970
1139 970 -646 414 2011 1156 -227 624 1934 927 9 741 1554 401 397 1052 1451 94 -462 1281
1157 1281 1739 -510 -939 1176 1768 109 -261 1155 507 -977 -5 1254 103 -734 559 1095 -453
1174 -453 -979 -122 8 -156 -98 -140 -517 -366 277 -90 -835 -1716 -574 280 -686 -1171 -369 11 -880 -1064
1194 -1064 -502 -1673 -1623 70 629 -1769 -2261 -423 -135 -1342 -1786 -988 -944 -1219 -257 -39 -1469 -2202
1212b202J172R20j028j389J945J297r88j581O95R75q99K08O93j114k51J649O81
1229G83j675p12J064O15o49J13N99m67J44Q53k67j730J89J560P78j548m15J134
1247C69O95r05n40O76m0p70J016J483j486j427J563J374j941r74J822N05j107
1264C13K93O42o91n13R06L03j189n69J175Q52p91q26J009m0q20r3R92k51q30N75
1284D47J367j872j423J805J238j830q20J666L8r10N84M68j665m87J519K62r81
1301e94j36Q98J01j213K47O42r61j65Q47O88j311o49J464P75k117j043K059J089
1319F21j981J29J453o61j752J241J066j315j038J688P64j518o34J314O5j134K12
1336a480J043o98p07J155O45r90j197J254J004j461k36J780k66j529N42J673j257
$$ plain form
1212 -2202 -1030 -110 -1138 -2527 -582 715 -273 -1854 -1159 -184 -1083 -875 -182 -1296 -1547 102 783
1229 783 -892 -1604 -540 75 -574 -461 138 -329 -185 668 401 -1329 -1140 420 1198 -350 -765 369
1247 369 1064 159 -381 295 255 -515 501 1984 498 -929 634 2008 67 -907 915 1420 313
1264 313 606 1248 557 44 950 1253 64 -505 670 1522 731 -95 914 874 54 -39 953 702 -128 447
1284 447 1814 -58 -1481 324 1562 -268 -1088 578 616 -294 290 758 -907 -1394 125 387 -594
1301 -594 -730 168 269 -944 -697 -55 -1016 -1181 -334 354 -957 -1606 -142 633 -1484 -2527 -468 621
1319 621 -1360 -1231 222 -439 -2191 -950 116 -1199 -2237 -549 215 -1303 -1937 -623 -558 -1692 -1480
1336 -1480 -437 -1135 -1842 -687 -42 -1032 -2229 -975 29 -1432 -1668 112 -154 -1683 -1141 532 -725
1353g25j633J843J387j705j294K419L96k040m0J576j94j544J322J578j148j676
1369a478J330J397j290j136R69J415j650j40J743m52j842R37J899j178j884J888
1385E28J366j235j314J700J0j577O40J967j217j761J748J444j307j719J217J588
1401B078j496r48J300P71j561j97J533o26j968J262K519j841j906J514J692k289
1417a63o97K089r3j989P45K256j904j758J548K017k094j552J546J148j145o79
1433g25J394k66j453Q6K107j285j854J554K157k048j883J632J623j993p96J978
1449B28j06k146J074J769j473k306K237J723j755j440K042M05j554l26J867k74
1465c5j948Q11J745r39j869J203K123j663j753J969Q93j779P2K183p45k250P06
$$ plain form
1353 -725 -2358 -515 872 -833 -2127 292 688 -1352 -1392 184 -10 -1554 -232 1346 198 -1478
1369 -1478 -148 1249 -41 -1177 -208 1207 -443 -583 1160 708 -1134 -197 1702 524 -1360 528
1385 528 1894 659 -655 1045 1055 -522 118 2085 868 -893 855 2299 992 -727 490 2078
1401 2078 582 -366 934 1705 144 -53 1480 854 -1114 148 2667 826 -1080 434 2126 -163
1417 -163 -860 1229 1136 -853 -108 2148 244 -1514 34 2051 -43 -1595 -49 1099 -46 -725
1433 -725 669 403 -1050 -964 1143 -142 -1996 -442 1715 -333 -2216 -584 1039 -954 -1750 228
1449 228 122 -2024 -950 819 -654 -2960 -723 1000 -755 -2195 -153 252 -1302 -1628 239 -35
1465 -35 -1983 -1172 573 -366 -2235 -1032 1091 -572 -2325 -356 537 -1242 -1170 1013 268 -1982 -1276
1482a276K388j180j950J667J173j165q11J356J6r32k3J284j59j303R73R84p36
1499C06j430P51J500j333n12J911J65j960L98K015j119j835J407K007j692j465
1515h86J964O05j343p94J720k18j384M13J605m25j553N32J547j097q43P10R59
1532A512q68n38J014K60j514K91J442q45j330J289J162j615o94J886l73j627M30
1549a18J551n63j834J153J545j396j079J108K69j102o1J258Jj150m8J431q09j367
1567a211N59J521o39j199J143M64j767m3J328m66j470R93K024j703j194J155P13
1584B08j057o87J292j68j146O25J299j046r31L77J472n02j415O84J191q93r26
1601a623J291Jj319M14J737n66j957J488J394j642j175J640N34j416M72J067l71
$$ plain form
1482 -1276 1112 -68 -2018 -351 822 -343 -1154 202 218 -714 -737 547 388 -915 58 1042 306
1499 306 -1124 -373 1127 -206 -718 1193 1358 -602 -204 1811 692 -1143 264 2271 579 -886
1515 -886 1078 1683 340 -454 1266 1048 -336 77 1682 1257 -296 236 1783 686 -157 553 1512
1532 1512 644 106 1120 1380 -134 157 1599 754 -576 713 1875 260 -434 1452 1079 -548 -118
1549 -118 1433 870 -964 189 1734 338 -741 367 636 -466 -527 731 732 -418 -466 965 156 -1211
1567 -1211 -652 869 230 -969 174 638 -1129 -1172 156 -310 -1780 -787 1237 -466 -1660 -505 208
1584 208 -849 -1536 -244 -412 -1558 -933 366 -680 -1611 -1234 238 -264 -1679 -995 196 -697 -1623
1601 -1623 -332 -331 -1650 -1236 501 -65 -2022 -534 860 -782 -1957 -317 217 -1199 -727 340 -31
1618c1j366R95J413j542j001J445J015j103r80J128J332j690m66K064k55k023
1634a065P15K333j328j956J155J884j413j291J360P32r85k32J584p83j441J259
1650E28Q21o10j278J401N55r31o63R61K88j468L78J698m44j781Q70J445j282j641
1668a153J659J274j852o68K006J3j966N25J796j183j612J141J893j514r94Q59
1684B24P63j180j34P33J23j419J85J511k22k173Q58K089j537j299J415Q89j855
1701a029r0J722n66j659R04J670j157j394J373Q96j569p28J538K46j214n4J359
1718B48m60j099K98J341m23j719Q91J226p55j019J089N81j596M03J241m73j255
1735a481O77J413r56j112J252Q03j363n13J636p7j145K59J102n0j642N51J241
$$ plain form
1618 -31 -1397 -402 1011 -531 -1532 -87 928 -175 -1155 -27 1305 -385 -851 1213 958 -1065
1634 -1065 -350 1983 655 -1301 -146 1738 325 -966 394 1126 141 -91 1493 710 -731 528
1650 528 1349 739 -539 862 1417 486 -177 784 1072 -396 -18 1680 1236 -545 325 1770 488 -1153
1668 -1153 506 1780 -72 -740 1266 1279 -687 -162 1634 451 -1161 -20 1873 359 -635 224
1684 224 987 -193 -327 406 529 -890 -705 806 584 -1589 -731 1358 -179 -1478 -63 826 -1029
1701 -1029 -1119 603 37 -1622 -718 952 -205 -1599 -226 670 -899 -1627 -89 157 -1057 -1111 248
1718 248 -212 -1311 -1013 328 -95 -1814 -923 303 -452 -1471 -382 199 -1397 -994 247 -226 -1481
1735 -1481 -804 609 -347 -1459 -207 596 -767 -1280 356 279 -866 -607 495 445 -1197 -646 595
1752E95m00j151R13P24q84m46J217L49j222P9J073k49j240R23Q05j135k26J003
1770G28k23j105O81J447o84j384R34Q58n11q24O57N52p88k92Q66mj008K3J501
1789A424j55j662N16J514n32j439J116M11q79k72J064m55j011Q43Q22j277n67
1806e39J060N56q22o11Q57m5p56N53N76o06j032P80J173p21j454J016Q00j006
1824b21n99J065L6j187L03J129r20r29Q56J272j455p44J423J22q27j04J056m19
1842a43j045N00R01o64o53P95M24p77n96P99O53j364M45Q52K1j369QJ491n90j444
1862a756J526J079j356l46J132k09j383N64J480j084r27P84J382j054p69P87N27
1879C77q19k09Q45M54j095M3J406p25j130J064R32r84j183J687M49j244m58J575
$$ plain form
1752 595 195 -956 -43 681 -203 -649 568 917 -305 -226 847 598 -642 281 1086 -49 -275 728
1770 728 505 -600 81 1528 844 -540 394 1252 741 -83 574 1126 338 46 912 908 -100 -77 1424
1789 1424 1269 -393 123 1637 1105 -334 782 1193 314 42 1106 651 -360 483 1305 28 -539
1806 -539 521 1077 255 -356 501 456 -300 253 829 223 -809 -29 1144 423 -1031 -15 785 -221
1824 -221 -820 245 281 -906 -603 526 -394 -1323 -467 805 -650 -1394 29 151 -676 -780 276 -143
1842 -143 -1188 -688 213 -451 -1104 -309 115 -662 -1258 -459 194 -1170 -725 127 148 -1221 -1213 278 -312 -1756
1862 -1756 -230 849 -507 -853 279 70 -1313 -749 731 -353 -1280 -496 886 -168 -937 -150 377
1879 377 -442 -651 194 648 -447 -404 1002 277 -853 211 1143 159 -1024 663 1112 -132 -590 985
1897I85o4j423P57J134j065r19J393L42p55q01J264L11r45j84R07n8p71K26Q18
1916A152n27q88P19R37r88q26J542M04j858L10J437p15j163R79J006j124r84J614
1934A027K02j377n3J105O2j380L13J009k86j170O28O49l15j025O22P81j146j43
1952d97J191j06j498J50J469n31j497R50J086j194o52J394j38j182K09J358p54
1969b42j030N55J132o62q95O35Q54r43p31J007K14q80jR94j46j423O12J320p18
1988c48j210R47J031j059m07R53L8r97O10O42m91j081J262N22r51o49J050O15
2006D77q23O2L66J08q99J93J160l70j130M99J442j091n56J023L57j050m4R08j33
2025D99q71N28P09o27m93Q32L04n92l62O56J24r43L37R25k71r21K82J117m24q25
$$ plain form
1897 985 921 -502 255 1389 324 -595 798 1140 385 -416 848 1159 214 30 937 879 108 334 1152
1916 1152 625 -263 456 1393 405 -421 1121 1525 -333 -23 1414 699 -464 515 1521 397 -587 1027
1934 1027 1229 -148 -201 904 966 -414 -101 908 622 -548 80 729 414 -611 11 792 -354 -497
1952 -497 694 588 -910 -760 709 178 -1319 -369 717 -477 -1129 265 127 -1055 -846 512 -242
1969 -242 -1272 -717 415 -247 -1142 -507 347 -596 -1327 -320 -106 -986 -987 7 -139 -1562 -950 370 -348
1988 -348 -1558 -611 420 -639 -1046 -93 -55 -1052 -442 200 -291 -1372 -110 412 -539 -1188 -138 477
2006 477 -346 -284 82 190 -709 -516 644 274 -856 -357 1085 -6 -562 461 818 -232 -276 632 499
2025 499 -372 156 865 238 -255 577 881 289 -73 583 707 -236 101 1026 755 -166 116 1233 809 -16
2045a6P09M98j232j53R25m9j037N01J314p14j270Q19J101j331m74J138J61j049
2063a59K0J303p54j042O17J051r72m35L87O36n85o80J164K23q11m97J172l38j281
2082i81Q03Q78p58j320J497N96j438j41Q63N5j118L75J067p54q04O30P88r53n17
2101a232J027K30o45m92J185k1j034k0J001l69r78Q59Q26j121o41J516J6j038
2119i31j46J154l17j151P27R01p39o47P05P01p30m80O83P22j169n0J110qj519
2138a184M98J113l16j181J015P73o41p92J350j55j154K79J258m68j040O18J011
2155I84m52j059Q81P94r35k96J048k57j111L61J117l22j042N49O94j98j035O99
2173D20J078j335n69J246O6j315M59J258o85j289J568K75p82o08O60L80r12J8
$$ plain form
2045 -16 693 1191 -41 -194 731 682 -355 146 1460 746 -524 295 1396 65 -409 729 890 -159
2063 -159 -139 1164 410 -632 -15 1036 64 -371 16 652 67 -613 551 774 -37 -534 638 300 -981
2082 -981 -178 700 -58 -1378 119 715 -723 -864 -1 54 -1064 -689 378 -376 -1180 -550 238 -715 -1232
2101 -1232 -205 25 -620 -1112 73 52 -982 -1002 -1 -370 -1348 -489 337 -784 -1425 91 107 -931
2119 -931 -1077 77 -240 -1391 -664 237 -502 -1149 -444 257 -473 -953 -270 452 -717 -767 343 335 -1184
2138 -1184 -686 427 111 -1070 -55 718 77 -715 635 480 -674 -395 863 395 -645 -27 984
2155 984 532 -527 354 1148 213 -83 965 708 -403 -42 1075 753 -289 260 954 756 -279 420
2173 420 1498 163 -406 840 906 -409 50 1308 623 -666 902 1177 395 -213 447 827 -85 -67
2191f7Q67l25r44M43J095n97r44L61J186p69n18M55M70r29n05J167L25j295J18
2210d06J382r94j246J152Q10n91j021P57M10p56j08J015m0j076R7J096p45o34
2228h98O90N88m97r81J131K92j024m7P66r4j056M43J152q69p81Q46P82j177k57
2247i91R46p6q35Q8J039j60r48O04Q45n89n81M74M61o27n72Q91n1l67j7Q14pj177
2269h36N47R71l71r52Q41M58o46l83J223o43o79M26P78n84l53M66P54r64l7O23
2289F39q4o06J85P04l07p46N33O05m96m62M45O34p44m40O60K74m97r1Q40n00o29
2310h3O91L50m70m14L79J95k74l1K91p3o40K58P16n69n04J58Q24r00j05O54L80
2331H33j232K08Q81l66q57J92R02k61n97M70K72m88l78P11l79l39L7Q18n13l56
$$ plain form
2191 -67 800 475 -469 -26 1069 472 -472 -111 1075 306 -212 243 713 -216 -721 446 771 -524 -406
2210 -406 976 -18 -1264 -112 698 107 -914 -157 253 -503 -611 404 364 -712 -615 481 -264 -898
2228 -898 -208 380 -117 -1098 33 325 -699 -746 20 -74 -1130 -687 465 -404 -1185 -339 443 -734 -991
2247 -991 -45 -121 -956 -868 171 11 -937 -333 512 -77 -658 -184 277 -350 -922 -31 -82 -449 -466 348 341 -836
2269 -836 -289 682 311 -641 200 658 12 -371 852 209 -470 -44 734 150 -203 263 1017 53 16 639
2289 639 555 -51 134 838 531 -215 318 923 427 -35 410 1044 300 -140 520 794 297 206 1046 546 -83
2310 -83 608 958 488 74 453 648 374 343 634 561 -79 179 895 326 -178 -20 804 -96 -201 453 833
2331 833 -399 -191 690 324 -533 -341 561 300 -297 173 445 -43 -421 290 -89 -428 -391 427 -86 -442
2351d42L03N68n40m98M40K83p95j38J023j44r59J74J258p89q34O51R70r98n87
2370a054Q16J40n66M8N45j76o67P64K5j50n29M51N32n68k34M82K44o06j7N07K8
2391A5n09L03M37j71o74L32N22n64k90R12L15j109N8J323m41j113M83J101p34
2410A96m75O99J67m40k62M86n5j53j50P17j11n90K13O79m49k61J09M02l39l15
2430F8Q99n0j198N11J018p49m53L22O13r39j86R23J75j018K44N55n7r01M56Q01
2450A034n18l40JL65j76j85j41N41p24k28O01L71j211M60O93k81n73N06J52n89
2470b42o3L21K10n22K51L44m44o29M67K82j32m27K03J81L4n30M95K28o17J10L51
2491a29j95p7k16N35k94n18L63L26n5n75L85M8q5J33K72l27o2N4L01j35j99Q7
$$ plain form
2351 -442 -139 429 -111 -609 -169 114 -681 -819 204 60 -899 -725 533 -256 -1090 -439 531 -467 -1054
2370 -1054 -238 -98 -664 -616 -71 -247 -914 -150 -125 -275 -804 -353 179 -389 -623 -141 103 -503 -520 -13 15
2391 15 -494 -191 246 75 -599 -267 255 -309 -599 313 628 -481 -423 900 459 -654 -171 930 196
2410 196 -279 420 587 147 -115 371 316 163 13 730 619 29 242 921 472 211 320 722 383 68
2430 68 967 917 -281 230 1248 499 46 368 981 42 -144 779 954 -64 180 735 678 -223 233 1034
2450 1034 516 176 177 542 366 181 40 581 -143 -371 230 601 -610 -150 543 262 -311 195 347 -242
2470 -242 -305 16 226 -296 -45 299 -145 -774 -307 -25 -157 -584 -381 -200 -166 -696 -201 27 -590 -480 -129
2491 -129 -324 -401 -617 -82 -376 -894 -531 -205 -260 -835 -450 -402 -487 -354 -82 -409 -471 -417 -116 -251 -450 -363
2513c63K52k90k45O79l07k31j36P27l17n15L99K30L1l09O00L20o89J79J10N0n98
2534d23J99N83l19k81O16l28O4M77j57j31k88L23j4q7jk08M89j26k27O8L77n11
2556I5J19N63j32r81O12L33k06l33N00K54m42n4j72L81n66M27K21n47L90k71L91
2577E82k30K38l71j31J05J93j25p1j04r1K96j16m26K93L94k68m09O26j20k45j19
2598i9J54j77m91O19K42k94k82J57P0r3K09j65j18O2j29N3k9j18k09N90J14q09
2620g43M23L28l6p14O88n3n97jO13j03l47J48L56n16j01M58j81k18J60K77J54
2641em40J77N4k5m03N0N74J68m06K1K16o7k81L28K41o53M05O72o60m77P40R1k04
2664A16l83O29l31k12k0N59j92l07K10L15m3n8j31K91J81p19L23L35j79m04M67
$$ plain form
2513 -363 -111 -401 -646 33 -274 -505 -641 86 -231 -746 -347 -117 -86 -395 205 525 -164 15 125 175 -423
2534 -423 -224 359 40 -241 375 47 111 588 431 300 12 335 321 234 233 25 514 388 161 229 606 95
2556 95 214 777 645 -336 276 609 403 70 570 824 382 328 156 537 -29 398 619 72 462 191 582
2577 582 352 590 219 88 193 386 261 190 86 -5 291 175 -251 42 436 168 -241 385 265 20 -99
2598 -99 55 -122 -613 6 248 -46 -328 -171 -101 -194 15 -150 -268 -206 -335 -282 -311 -429 -638 -48 66 -743
2620 -743 -320 8 -28 -742 -54 -107 -704 -705 -92 -195 -542 -394 -38 -554 -655 -197 -378 -596 -436 -159 -5
2641 -5 -445 -268 -214 -239 -642 -592 -18 150 -256 -235 -19 -86 -367 -39 202 -451 -46 626 -34 -511 229 320 116
2664 116 -267 362 31 -181 -201 358 166 -141 69 384 341 283 152 443 624 -95 228 563 384 -20 447
2685D47N3n76L36M85j90n52J07N04l28j96O30k81r5P1j5n3m1m5Q2J70j12k5K6
2708D02k07k8l53O40k09j79M06Om08p6M71k12q2m7l5m42m5N88j92n3j61L64k33
2731h5J55M5j23l55K01L52m95J20J15mk03j5M1l9J67k42J64L3j69o2J60k5j11
2754c75r1M00j53l69K90J27k15k27L21k7l38N59m30j99M21J4n1J95k56J01j81
2775d84N48k00K7l7k32LL96m13K36j46O67m15n23N34K74L3k06K75m68R3L92k45
2797A09J89k61J55J01o6O6O5N2j39J95n71K62J40k24L83j03l39O16j39l85L15
2818D21L30m52n92O26J48l52K97Lj34j87R2K26n9m4m3Kj02L41j86p6K57l92P7
2841B01K53k56l7L8P9l25k3O9J06O6r1K43m67qN18R3o04R8J41l12J1K46l0r8k45
$$ plain form
2685 447 500 -76 260 745 555 3 110 614 286 90 720 439 344 415 400 347 306 261 343 513 401 376 402
2708 402 195 167 -186 454 245 66 472 478 70 -6 465 253 171 124 89 -353 -398 190 -2 -55 -216 148 -85
2731 -85 70 115 -8 -363 -162 190 -305 -185 -70 -74 -277 -292 -251 -290 -123 -365 -201 -168 -337 -399 -239 -264 -375
2754 -375 -466 -66 -219 -588 -298 -171 -386 -613 -292 -319 -657 -98 -528 -727 -306 -292 -343 -148 -404 -303 -484
2775 -484 64 -136 -109 -146 -378 -375 21 -392 -156 -302 365 -50 -573 -39 235 268 62 337 -131 -38 354 109
2797 109 298 37 192 293 227 293 358 410 271 466 -105 157 297 73 456 353 14 630 491 106 421
2818 421 751 299 -293 333 481 129 426 429 295 108 200 426 367 323 280 282 180 521 335 259 516 124 201
2841 201 454 198 161 199 278 -47 -70 -1 105 171 80 323 -144 -152 366 459 -145 -47 94 -218 -207 39 9 -89 -334
2866c34M6L03k38r6J74L54n82J33m7K83l60L13n4J69o56K69L08k15j56N7J36q1
2888b74m0n7j10K7J91Q9j79O6K08J00m82J7J7K73K0k62M92k07j08q0M09o8l89
2911c47O7N08k72m60O06p6j67J69r6n8J42O1M6rr6n7Q7j55J58J59m2K5J19k8j61
2936A23K9l2L20J76p42J38L92j01k93K46j95L6K28o0p9k93M41M1J1J26l34K75
2958D53k03J32j43j02J20k0J00j73J40j13M14l89k46L03J45k53k0n8K82m12P8
2979C5L64l67j24M5J84m42L21K5J71m88N19m10K70k36M7P3j86L7l9K25j92j45
3001c13J70J99k78J32k35R7j67K21O7k86j44M09j64j8m8J42R7rj21m3k60L17k39
3024d74L27j09N8o0P1o2j55K26R8k2m17N43k6j2l53L45q6m9K50k54k4N50k60k4
$$ plain form
2866 -334 -288 15 -223 -319 -145 209 -373 -240 -287 -4 -364 -51 -105 64 -592 -323 -15 -230 -386 -329 -193 -274
2888 -274 -314 -371 -481 -454 -263 -174 -353 -287 -79 21 -461 -444 -427 -154 -134 -396 96 -111 -219 -299 110 42 -347
2911 -347 -280 228 -44 -504 102 26 -141 28 -68 -126 16 77 123 114 18 -39 48 -107 51 210 168 193 312 284 123
2936 123 152 120 440 616 -126 12 404 303 10 256 61 97 325 265 186 -107 334 375 386 512 178 453
2958 453 250 382 239 137 257 237 337 164 304 191 605 216 -30 273 418 165 145 87 369 -43 35
2979 35 399 32 -92 -47 137 -305 16 41 212 -276 243 -167 103 -133 -86 -13 -199 -162 -201 24 -168 -313
3001 -313 -143 56 -222 -90 -325 -228 -395 -174 -107 -393 -537 -128 -292 -310 -358 -216 -119 -128 -249 -292 -552 -235 -474
3024 -474 -147 -256 -198 -258 -187 -249 -404 -178 -80 -102 -519 24 -2 -14 -367 -22 -108 -157 93 -161 -185 365 105 81
3048H1m36P46m18Qk05M19J29l20j0R8j7J10J36l42p0K46M3Q5J0l76L03L15j7n21
3072cJ17K20j16K35J74l65p2L70j23J44j52M5l14qJ78O2j96J9k6Q0l67K65j07
3095F0J86R0p7J15l42l18M02Q4R7k79K09J85l31k98M8K24j22j30M08j59N3l53
3117b48K85j05nL10n14L18K4P4k43J59k74M8J72j16r7L07r5m82K89l1L00n29K08
3140b45j8k57Q7M25j52j51l5J34j48m8J42J19L1j01l22L54p9k19J62r2J58j82
3162d37L27j09l0L09J4j79k13J72J07k46K22J63k72j42K85l4M6k59L89R2l4j41
3184C0j27P2N6j3K30p7L68m07J07K6P6k72L96j75l09J29K7J74j93J75L0Q7j85
3207B25j35P3J90n28L82m5Mj44K05j18o9L83j98J25n01L30M08m62K2J23k0l07
$$ plain form
3048 81 -355 391 -27 -19 -224 195 324 4 -6 92 75 185 321 -21 -91 155 198 283 293 -83 220 535 518 -3
3072 -3 114 334 218 453 627 262 190 560 437 581 429 474 160 152 330 392 196 215 189 269 -98 167 60
3095 60 246 336 259 374 32 -286 116 200 297 18 227 412 81 -217 -169 55 -67 -197 211 52 105 -248
3117 -248 37 -68 -73 237 -277 41 65 139 -104 55 -219 -171 1 -115 -212 95 0 -482 -193 -224 76 -453 -245
3140 -245 -263 -520 -433 -8 -160 -311 -346 -212 -360 -408 -266 -147 -116 -217 -539 -185 -264 -483 -321 -413 -255 -437
3162 -437 -110 -219 -249 60 74 -105 -318 -146 -39 -285 -63 100 -172 -314 -29 -63 -17 -276 113 205 171 30
3184 30 -97 -25 31 18 248 171 539 132 239 265 341 69 465 290 -19 110 137 311 118 293 323 410 225
3207 225 90 163 353 -175 207 162 166 22 227 109 40 423 225 350 -151 179 587 125 147 270 250 -57
3229e7L39j04k84p0Q2R6Q9m13M85k10J05j1l30K55K1k6R9k3q5N0j70L38m76J56
3253a44j56L02q7M4o0j84j30J79j04M21q1j66l11K65p0K6P9m8j49PJ44k10R3M07
3277F7k94j67jK04k37L2J92q9o8j96L40m31N34Rj70p6K89J00l95K96k3j2j8J0
3301a04j47Q8N5O5J22L29m07l41M18p6J20m14L84J46j21j89M26m60J73Q8k5p0
3323F0j47K74j27N2J23l76O05n8l72J68Q6J51l60K14k17j77J30LK38n1k2J78q
3346C67j18L71l33J8j88M43k97J47l36QM7O2o9J1L52n57J61M5P3j2k75K63k35
3369e2oJ54K46j41j96J44L2l41M20n9l03J49j66N8k9P0k33L34m14K90k55L78l44
3392b64N6J13j47r8O0K64k67j76J82K90j76k16J29n9K3o3O2r3K86Pk56J32J25
$$ plain form
3229 -57 282 178 -106 -176 -94 2 91 -322 163 -47 58 47 -283 -28 -7 -33 66 43 -42 8 -162 176 -300 -144
3253 -144 -300 2 -85 -41 -101 -285 -415 -236 -340 81 0 -166 -477 -212 -282 -256 -177 -225 -374 -367 -223 -433 -340 67
3277 67 -227 -394 -395 -191 -428 -396 -204 -293 -361 -557 -217 -648 -114 -105 -275 -351 -62 38 -357 -61 -84 -96 -114 -104
3301 -104 -251 -163 -108 -43 79 408 1 -340 78 2 122 -292 92 238 117 -72 354 -106 67 155 130 60
3323 60 -87 187 60 112 235 -141 464 406 34 202 288 439 79 293 76 -101 29 32 270 219 197 375 367
3346 367 249 620 287 305 117 560 263 410 74 82 129 191 122 133 485 -72 89 134 207 195 -80 183 -52
3369 -52 -58 96 342 201 5 149 181 -160 260 201 -102 47 -119 -61 -90 -20 -253 81 -333 -43 -298 80 -264
3392 -264 -208 -95 -242 -340 -280 -16 -283 -459 -277 13 -163 -379 -250 -309 -286 -349 -287 -380 -94 -87 -343 -211 -86
3415h6k04Q4J98l65K94J72k94j05M5J40R9k1j75J97j35L07j55j20M26k17n7r1
3437f3K17j9K9k61K77j88o4o3r3K45J85j47L44N8n6m23J62M21k75k50J51k26J33
3460I4j14J39p5J67k50J47J72O9j20k58K6J22P4L16k57Q9n3J38p7j06R3j02j21
3483A13P7P4l1j77K11O6j99j82M15l33j11K90k26O2K16k28ON6k32j32K60K31k26
3506@q5j43J56k71j22N35j77J01K69n03R9j92j54K46L70j80k75K60l05M45n83
3527e09M01j09J77k4K1k94L48m0j60P4k55O55q29N14l73L02m6j53kJ53j27J59
3549a17Q5L7j56r9L91o4k19pJ93j61j46J27J74m63M42K18k71O6j51J50p4K65q9
3572A31n31N96j30r2K17J05m3k02j5L16p7M6r2q7k3L3p4j85N90k46m8j26K46j8
$$ plain form
3415 -86 -290 -206 -8 -373 -79 93 -201 -306 -261 -121 -22 -43 -218 -21 -156 151 -4 -124 302 85 28 -63
3437 -63 154 135 164 -97 180 -8 -72 -135 -228 17 202 55 399 457 401 -22 140 561 286 36 187 -39 94
3460 94 -20 119 44 211 -39 108 280 349 229 -29 -3 119 193 509 252 341 288 426 349 243 336 234 113
3483 113 190 264 233 56 267 333 134 -48 367 34 -77 213 -13 49 265 37 43 99 -133 -265 -5 226 0
3506 0 -85 -228 -72 -343 -465 70 -107 -6 263 -240 -141 -333 -487 -241 129 -51 -326 -66 -371 74 -509
3527 -509 -108 -217 -40 -64 -43 -337 11 -29 -189 -115 -370 285 -544 -30 -403 -101 -147 -300 -302 -149 -276 -117
3549 -117 -32 5 -151 -250 141 77 -142 -149 44 -117 -263 -136 38 -425 17 235 -36 30 -121 29 -45 220 131
3572 131 -400 196 66 -26 191 296 253 51 36 352 275 321 229 142 119 152 78 -107 483 237 189 63 309 291
3596B91p5J32k53k8R8J17J38m49P6M8m7j68M39O0j85k62M8K49K3j82n5K65O9m23
3620g4M3J44k40M25ll58J64j85m3K19k31L24j42N4j1j9k06J44m7o5N1j19O0p2
3644a87R0n9LL08j18l39M9M6q1L9L2Rl52L22J20m20K71J95n4O0n8Q0j95K8K38
3669B7m25N3K52R1k20L2k3j23J79p1o9K76k35L20j14J56k26k8L8j61M1R0j06J
3693b45J52N16l09k18J66J93k97j12R4j68K10j%J93k9r1J45P2j29O9j83K65k85
3716HJ78j2j3Pj86Q6J99l70K52L10l09K45k5m21K35P7j40j05J38J71k59K85j84
3739A67K0k6l2J01J3Jj89k5K52l15L8k9K10k67L7L70k38j6K4J75k77j1r1R3J33
3764A18k15j53k11K22L86k20Oj58j16K69L4m10K90M35l10k73J68K10l92J57K23
$$ plain form
3596 291 216 348 95 67 165 282 420 -29 47 95 48 -120 319 379 194 -68 -20 229 252 70 15 280 349 -74
3620 -74 -31 113 -127 298 295 -63 101 -84 -127 92 -139 185 43 97 86 67 -139 5 -42 -107 -56 -175 -115 -187
3644 -187 -97 -156 -153 155 37 -302 -253 -207 -288 -249 -217 -208 -560 -238 -118 -538 -267 -72 -126 -66 -124 -44 -239 -211 27
3669 27 -398 -345 -93 -2 -222 -190 -213 -336 -157 -228 -297 -21 -256 64 -50 106 -120 -148 -110 -271 -230 -140 -246 -245
3693 -245 -93 423 114 -104 62 255 -42 -154 -60 -228 -18 -19 -19 174 145 54 199 271 142 211 28 293 8
3716 8 186 174 161 168 -18 68 267 -103 149 459 150 395 370 -51 184 261 121 16 154 325 66 351 167
3739 167 187 161 129 230 243 244 55 30 282 -33 5 -24 186 -81 -44 326 88 72 96 271 -6 -17 -108 -15 118
3764 118 -97 -250 -461 -239 147 -73 -67 -225 -341 -72 -38 -448 -158 277 -33 -306 -138 72 -320 -163 60
3785F0j69k80P0K54j4l29M2L0K76kj87J90m16L72J56k07J02m6l50J73Q9J59j89
3808b16M0l28K91J01J61R9N1r4l47R0N8k58J59L68j71k07K50q4J91m5k98L26k09
3831g2J43l22L32J54k28k4J31nl8N8L72j60l1j76K27j41J77l7P1k29q5J97j20
3854A94j95K84j98l0K5l5J07L16m05J39J45l44L39k31J02j82L49j04J46m02J86
3875B06k6m69N27j5k19J7N1j56J62j57J77q1oK4Lj65L04k82L4J77m44K91k48J59
3899a36l3J97P4k91k8L29K08n05J45j35Q3j00k40N73j59l59M03m66K48K27k46
3920b11j52J30K13l28L28Lm00K73j19N9j17j61K72j5m6J30j62j09kR6J33J48n9
3943i6nj8J45j20k90K21K72l39J03j85L39J39k60J26j50L03k1L0k2k00n6Q1J25
$$ plain form
3785 60 -109 -389 -319 -65 -79 -408 -366 -336 -60 -62 -249 -59 -475 -103 53 -154 -52 -98 -448 -275 -186 -27 -216
3808 -216 -176 -504 -213 -112 49 148 199 105 -242 -152 -94 -352 -193 175 4 -203 47 -37 154 109 -189 137 -72
3831 -72 71 -251 81 235 7 -17 114 109 71 129 501 341 310 134 361 220 397 360 431 202 117 314 194
3854 194 -1 283 85 55 80 45 152 468 63 202 347 3 342 111 213 31 380 276 422 20 206
3875 206 180 -289 238 223 4 21 72 -84 78 -79 98 17 11 35 38 -127 177 -105 -71 106 -338 -47 -295 -136
3899 -136 -169 28 102 -189 -217 112 320 -185 -40 -175 -92 -192 -432 141 -18 -377 26 -440 -192 35 -211
3920 -211 -363 -233 -20 -348 -20 -17 -417 -144 -263 -204 -321 -482 -210 -225 -271 -141 -303 -412 -414 -318 -185 -37 -96
3943 -96 -101 -119 26 -94 -384 -163 109 -230 -127 -312 27 166 -94 32 -118 185 164 194 172 -28 -84 -3 122
3966A22o1K68J8j91o5L9q4j77K48r6K9k7N26l00k55M14K4k15p3M5kn9L28l43j39
3991b6K43Q8n7r7j0Q0j8k61J09k4q6K26m19Q24n66q6M07m01L8K46o5j57%k06M01
4016A83m0o7N1l54J36j42J79K15j36L11m75J9n4J49j69K74k7K7j69p2r3L0N3j53
4040c24j5P4L59l19K13M7l30M3J70J17j77p7r6L02l0n2J44j28k15P7M40m77K72
4063A8J90m76J91L7k08J41k4M3l53K84J9j58K84j81L19l28K45J79k84N6k11K67
4085E0J86j08q3qj1k91J21K4J25J82l26J55l1l8K74k70o6M36N3k13k0%M9q4O2
4110A68p1K57K2k49m64P75k47j32L32k77m4nL69k78J64l62J80m64P03j69J22k89
4132D1J08j85J64k91L13k42L28k55k79J36J00O9j71M21o9p0k12L80k91K57n07
$$ plain form
3966 122 61 329 347 156 91 130 46 -131 117 21 50 23 549 249 -6 408 432 217 144 189 187 128 456 113 -26
3991 -26 217 305 248 151 141 221 203 -58 51 27 -59 167 -252 572 6 -80 327 -74 -36 210 145 -12 -12 -218 183
4016 183 143 76 127 -227 -91 -233 -54 161 25 336 -139 -120 -174 -25 -194 80 53 80 -89 -161 -254 -224 -171 -324
4040 -324 -339 -265 94 -225 -12 35 -295 -252 -82 35 -142 -219 -315 -13 -43 -95 49 -79 -294 -217 223 -254 18
4063 18 208 -268 -77 -40 -248 -107 -131 -88 -441 -157 -138 -296 -12 -193 126 -202 43 222 -62 -6 -217 50
4085 50 236 128 45 37 26 -265 -144 -120 5 187 -139 16 -15 -53 221 -49 -115 321 374 161 141 141 190 106 168
4110 168 97 354 376 127 -337 438 191 59 391 114 70 65 434 156 320 -42 138 -326 377 208 330 41
4132 41 149 -36 128 -163 150 -92 236 -19 -298 -162 -62 7 -164 257 188 118 -94 286 -5 252 -255
4153b55K79J05j08m2k61J23P3N1k32K81J51m52J82rq6l1J90k28L9M38m35J29J85
4176H7l08n7L89j79k50k0M79l12m4K95k12J42l14N9L97k27k09J65J59l98J81J52
4198b5j20p1J35P0n3k58K66j84N84m54l9J50k78J12M39k2k48j80L13J37l11J98
4220A61k46J59J20j95k34K73j59J93J71k11q2M6J32k13L36l06M43l01K95r3k51
4241C8m1L89N9n15k24M51P2L0k24K33p9k66L58j58o4J39N5K06m61Q5J15k14O1
4264D5J46j27K35j52m0R7j61j12K34j01%N6j49L6K42j25k24J68j96L03m72K25
4286g2J69o1N7k40P3k8K61rk26k50L39j56k79M37l69J95J66k10J22O6r6j88K18
4309h1L1J5k73K89q3J80j87k27K67j79R3p3j38J46k01L08m0k6J65J48j14R9m99
$$ plain form
4153 -255 24 129 21 -21 -282 -159 -86 -35 -267 14 165 -287 -105 -114 -200 -231 -41 -269 -230 208 -227 -98 87
4176 87 -221 -278 111 -68 -318 -338 141 -171 -215 80 -132 10 -304 -245 152 -75 -284 -119 40 -358 -177 -25
4198 -25 -145 -216 -81 -11 -64 -322 -56 -240 344 -110 -149 1 -277 -165 274 252 4 -176 137 274 -37 161
4220 161 -85 74 194 -1 -235 38 -121 72 243 32 -50 -4 128 -85 251 -55 388 87 382 289 38
4241 38 -3 386 445 -70 -294 157 229 259 35 268 189 -77 281 123 59 198 253 459 -2 83 198 -16 45
4264 45 191 64 299 147 107 204 43 -69 165 64 64 120 -29 7 249 124 -100 68 -128 175 -297 -72
4286 -72 97 36 93 -147 -74 -102 159 150 -76 -326 13 -143 -422 15 -354 -159 7 -203 -81 -15 -111 -299 -81
4309 -81 -50 -35 -308 -19 -102 78 -109 -336 -69 -248 -155 -228 -366 -220 -421 -113 -153 -179 -14 134 20 119 -380
4332c80M22j17m5J28J75n64J04K51j15J46J38m52j6L61K1k40L98l68K78l79L40
4353H6R1j01R2j72J7j91M93l27k90L53j7lL0K6j88N5n0P9K28k77p7J73K99p6k60
4378gK45q5k18J33kl0J33J92j46k71Q7K79j03l06M82k41l2L0Q4q9J35M7n13K66
4402G0J59O3l35m4K11P0k04J84j67J04k14O1Kj4n4R5j18J01J44N2l18l39K88M1
4426a62J46j31J26J71K8l39l22oK15K71m18K33q6R2K8k28L14k51J50J38J27r5
4448Aj19m9J10j40J14K0k47K98j37k1J85Pk79j15M22l9k64L30j18J81j32k44N44
4471C08k74rk40J60j7O1k84L74R3j94L04k06k09J10J37q1N6mJ02j16j02j9K73
4494B23k44M0K64l06l22L28L96j34j5J48k61j36M23j50Rk28J07j56J32O7j06L81
$$ plain form
4332 -380 42 -75 -120 8 183 -381 -277 -26 -141 5 143 -309 -325 36 57 -183 215 -153 125 -254 86
4353 86 177 76 168 -4 13 -178 315 -12 -302 51 34 31 61 87 -101 -46 -96 -17 211 -66 -143 30 329 253 -7
4378 -7 238 153 -65 68 66 36 169 361 215 -56 31 310 207 -99 383 142 110 140 224 135 270 317 -196 70
4402 70 229 292 -43 -87 124 194 -10 174 7 111 -103 -42 -40 -54 -108 -13 -131 -30 114 166 -152 -491 -203 -162
4426 -162 -16 -147 -21 150 178 -161 -483 -489 -274 -3 -421 -188 -274 -182 -154 -382 -68 -319 -169 -31 96 1
4448 1 -118 -167 -57 -197 -83 -63 -310 -12 -149 -170 15 22 -257 -372 50 11 -253 77 -41 140 8 -236 308
4471 308 34 25 -215 -55 -72 -11 -295 79 172 -22 282 76 -133 -23 114 33 89 85 187 71 -31 -50 223
4494 223 -21 19 283 -23 -345 -17 379 245 230 378 117 -19 404 254 263 35 142 -14 118 185 79 460
4516D60l02j94QK10K5k41K53J54k76p5P7J27k42K34k87p9pK6l9M37j83k22J50
4539A4K68k50j50J84j9m00N40j28K0k53j44L81l19LK34N6k15j63K15l9j1O3J2
4562a01L3j15K84m32K66N0Q3j61j47o4K04q8l1K75R4r8k06m2J80Q9j26j38O8n2
4586a75j55M05l10k7K76m7K5K0K5k29m2%K47r0q9J33J48k62MK28j00J79l32L03
4610A35k07j27K15lJ01p4L6K30j98j05J09j38K50k04Q6j03l47M51p7K81k56l1
4632B4J55k99K20j22J87Pj69p4L34j45nJ96l44J90j35J25L9J33k8o2n7j10j08
4655d8L43k39o5j96K17K38l29J27k7J29k14M3J87k21M9k2m5j92J17K3L61k33j06
4678a03K39j46J37j25j69K38j47K5j6o1j00K44J96l27l44K24pJ23J35j41LJ56
$$ plain form
4516 460 158 -36 -28 182 207 -34 219 373 97 22 99 226 -16 218 -69 -148 -155 -129 -168 269 86 -136 14
4539 14 282 32 -118 66 47 -353 187 59 79 -174 -318 63 -256 -253 -19 37 -178 -341 -126 -165 -176 -113 -101
4562 -101 -68 -183 101 -331 -65 -15 68 -93 -240 -304 -100 -188 -219 56 150 52 -154 -196 -16 73 -53 -191 -123 -175
4586 -175 -330 75 -235 -262 14 -33 -8 12 37 -192 -234 -234 13 -77 -166 -33 115 -147 -143 85 -15 164 -168 135
4610 135 -72 -199 16 13 114 40 76 306 108 3 112 -26 224 20 106 3 -344 107 30 311 55 24
4632 24 179 -120 100 -22 165 172 3 -71 263 118 113 309 -35 155 20 145 184 317 289 227 170 60 -48
4655 -48 295 56 -9 -205 12 250 -79 48 21 150 -64 -21 166 -55 -6 -28 -73 -265 -148 -125 236 3 -103
4678 -103 136 -10 127 2 -167 71 -76 -51 -67 -128 -228 16 212 -115 -459 -235 -242 -119 16 -125 -122 34
4700C4j46q2J92r9j35K82l64M75o8j54p1M0j79K07K2l32L62l2j20j46O5K18j94
4723b25K9J14j64J41o6R0n7K92n76M00J81j96J01J96k90J83k24L41r8k46j08L10
4745A28j18N1j24L3l3L7J49k96J71K53l19K70q1J22k40M0K26j98q3J68q4k86L33
4768A19lj81K7P0Q0r6N7K54l51J40k47J46J46p9k76K13k3l3L30j31k5J52m45L78
4792B22k27J8n6k41J49J75J07k30J65j25m03K00N02m21R6J91l27J08j41L39p1
4813C0J79l01J12j62K12K07o67M05n0r6L5l24J02J36R7j71J8L60k67j38j22K09
4835a96j80N0J00L43o7j24R1o7n3K07j6j24j44L22j19q9J25j9k25J18k47J36L0
4858a48K42J21k93J29pL69K6l98r8K71j20k58M0K64l09j28J46J57m1L82o3k36
$$ plain form
4700 34 -112 -194 -2 -101 -236 46 -318 157 89 -65 -136 -96 -275 -68 -46 -378 -16 -48 -168 -314 -249 -31 -225
4723 -225 -196 -82 -246 -105 -171 -81 -138 154 -422 -22 159 -37 64 260 -30 153 -71 270 172 -74 -182 128
4745 128 10 61 -63 -30 -63 -26 123 -173 -2 251 -68 202 121 243 3 43 269 71 -12 156 72 -214 119
4768 119 116 -65 -38 32 112 16 73 327 -24 116 -131 15 161 82 -194 19 -4 -37 293 162 137 289 -156 222
4792 222 -5 13 -43 -284 -135 40 147 -83 82 -43 -446 -246 256 -165 -69 122 -205 -97 -238 101 30
4813 30 209 -92 20 -142 70 277 -390 15 -35 -131 -96 -420 -318 -182 -85 -256 -238 122 -145 -283 -405 -196
4835 -196 -376 -326 -226 117 50 -74 17 -50 -103 104 88 -36 -180 142 23 -66 59 40 -185 -67 -314 -178 -148
4858 -148 94 215 -78 51 44 413 439 41 -57 214 94 -164 -124 140 -169 -297 -151 6 -35 347 284 48
4880D8M8j14J01k4J72k19J20K5j48Q6j13P5K4j58j4J27K21j74j3J40l29O9J20
4903G0j71J20j39M52o7k50P8Q2k03L1j13j22K20M97m51k42M35j47K4k20j32J40
4925a08lJ18K31m50L5K44k47J12k57L43j42J90k09P6j03J47j80P7R9n8J19j18
4947h4l83L72J10O5k06j51J57J43k00J93k8Mk15L94j50k69R0n6L2l59M26j2k90
4970d17L46pj04L01k29Q1Q6m2K3p2k36m3K47P1j30L06l32J14K16k06L2o1R5M7
4994H6l9l9N8q3J82k43J06L3l58L13K0k26K52j76K44N5k11kPj32L87J89l10j2
5018A01k08O75m64j14J87k67N68k34l48J4M00k32k47K49p3j3J86L9j11N5P8k09
5040C2j06K73l27J30R0O6n0j73K19k07K08j66K01l69L98j90j53k8J14l70N78n8
$$ plain form
4880 48 96 -18 83 59 231 12 132 157 9 95 -18 57 81 -77 -91 36 257 83 70 210 -119 -50 70
4903 70 -101 19 -120 332 265 15 93 175 -28 3 -110 -232 -12 485 34 -208 227 80 104 -116 -248 -108
4925 -108 -111 7 238 -212 -177 67 -180 -68 -325 18 -124 66 -143 -67 -170 -23 -203 -126 -27 -85 34 -84
4947 -84 -467 -95 15 80 -126 -277 -120 23 -177 16 -12 -8 -223 171 21 -248 -158 -214 -182 -541 -115 -127 -417
4970 -417 -71 -78 -182 119 -110 -29 57 15 38 -34 -270 -313 -66 5 -125 181 -151 -37 179 -27 5 -56 39 86
4994 86 47 8 66 -17 165 -78 28 61 -297 16 36 -190 62 -114 130 185 -26 -28 -21 -153 234 423 113 101
5018 101 -107 568 104 -10 177 -90 478 244 -104 -90 310 78 -169 80 7 -6 180 219 108 163 241 32
5040 32 -74 199 -128 2 92 158 108 -65 154 -53 155 -11 190 -179 219 29 -124 -152 -38 -408 170 112
5062A12n9p9PnJ52Qm22L89k06j7J89o1J0Jj65j52O6o5L89n1J5j86J33k31K39k55
5088b44M41m39J15J75j60J94j47K76k35j03K17j42j81J16K2K9J7r7M0k24L52q7
5110f5l2j62M15j0j99K45k68R6J99k18L1k92K93P8l62K80L5J67k20P6k8j25Q6
5133B0j72L26J50j21J4J11m93K49K0k3M5k32l4J71k33L92j91J6j10q3K39k5O8
5156A04M6J6J51m23J71P3j84P7J84J68l30P9k2J5jk44J10NJ5P2Q9M7k10J20J15
5181B43k03J28l78L24j13L27l53k3M1J31k69l8K14j09O4j9j65K41l4j6k86N4r9
5204c38k1K41j8J30J34k65p8j5J78PQ2P3j53j35K08J38M9m4p9l96P5K27k6qk47
5229b81K58j51K07J45m2J83n06L9n3o6L33j37L18k93O6Nj26J65n19J77N6k19M31
$$ plain form
5062 112 53 -26 -19 -24 128 136 -286 103 -103 -120 69 8 18 19 -146 -298 -232 -297 92 41 56 -130 3 -228 11 -244
5088 -244 197 -242 -127 48 -112 82 -65 211 -24 -127 90 -52 -233 -117 -95 -66 -49 -146 -106 -330 22 -65
5110 -65 -97 -259 156 146 -53 192 -76 20 219 1 32 -260 33 111 -251 29 64 231 11 87 59 -66 20
5133 20 -152 174 324 203 217 328 -165 84 104 81 126 -106 -140 31 -202 190 -1 15 -95 -178 61 36 104
5156 104 150 166 317 -106 65 138 -46 31 215 383 53 132 110 125 124 -120 -10 -5 10 82 171 218 8 128 243
5181 243 40 168 -210 114 1 328 -25 -48 -7 124 -145 -183 31 -78 -14 -33 -198 43 9 -7 -293 -239 -338
5204 -338 -359 -118 -136 -6 128 -137 -215 -230 -52 -45 37 110 -43 -178 30 168 217 173 94 -302 -227 0 -26 -34 -281
5229 -281 -23 -174 33 178 136 319 -187 -148 -201 -267 66 -71 247 -46 20 25 -101 64 -455 -278 -222 -441 -10
5252a0J49j94j32M20k19M4K90r2j11lJ21k60K41k59q8P0J65k82K99j88R7K28l28
5275d2J76j47J06J91j32p5R9j19j18K11j8j48k42M50k05j07R8j65J95M5j28L25
5297B50K24k60j09j47J72k42L03k17K19k32K2L6J84r8j59J77K10o07Q2K03k35
5318b24M1J99j25k34O8J93j55J22q1K90l67J66N9k87L15j96K15L7k02j51K85K91
5340B59k62j12j61J63j09J79k69k9J62J27k98M35l48K34M6N1j44L5K42l87m5P6
5362a55K59m04K89r8QJ84j05l4r1M56l45k8L17k71J06k05j14J02M5J64K0Q4o1
5385A23r0k34K03p7j69J31N5K56k4k04P8k96K21J27J75j58j70K84j1j01JL1l3
5408A18O0N7j95k15K04J31J52j84k76K68k21K36j02j31J99o6J84l68N1R7O4J02
$$ plain form
5252 -10 139 -55 -187 233 14 58 348 256 145 142 263 3 244 -15 -103 -33 132 -150 149 -39 58 286 -42
5275 -42 134 -13 93 284 152 77 176 57 -61 150 132 -16 -258 192 -13 -120 -22 -187 8 53 -75 250
5297 250 474 214 105 -42 130 -112 191 -26 193 -39 -17 19 203 105 -54 123 333 -274 -192 11 -224
5318 -224 -183 16 -109 -343 -275 -82 -237 -115 -196 94 -273 -107 -48 -335 -20 -216 -1 36 -166 -317 -32 259
5340 259 -3 -115 -276 -113 -222 -43 -312 -341 -179 -52 -350 85 -263 -29 17 68 -76 -41 201 -186 -231 -155
5362 -155 104 -300 -11 -109 -101 83 -22 -56 -147 309 -36 -64 253 -18 88 -117 -231 -129 -84 80 100 184 123
5385 123 33 -201 2 -75 -244 -113 -58 198 174 -30 48 -248 -27 100 275 117 -53 231 220 119 120 151 118
5408 118 178 235 40 -175 29 160 312 128 -148 120 -101 135 33 -98 101 35 219 -149 -98 -1 63 165
5430A65l45K28J63k00j66j15J91L61l20L07l4j57J80J57k64L18m87J8J49k57n8
5451a66j8p0M59l29J89l14K3J66k18J25J23J98j77J49j98M0j97M48m97J55J7Q9
5473cj3k24M4J03K42j06K1k20r1L9K86n46M55n4k32P4J88l38O35k93r2m5J52l6
5497e4j38M34l84J06J16M0o4j44K33j67K36j6r2J01l00K61j60J57Kk01l38N46
5519A74p2k79K78O1l22J94j05q9K60mj13J56k0j35Q9k46K45J48k86Q3q2J32n5
5542A2J2J61j10J21l16L19L0j09j86J10J81k09J91n1J9N2k66M6L35j97Q0k26j52
5565a53L31l07R8K0j71K96l8N6J8j02j72m1NJ89j10K66j78J04k29R7j98J65J52
5588I8r2Lp9oj41L82l27Q2J18Nk76J37nP0N3J70m57M25k92k5L39l23K24n8k6J73
$$ plain form
5430 165 -180 48 211 11 -155 -270 -79 282 -38 269 235 78 258 415 151 469 -18 0 149 -108 -166
5451 -166 -184 -254 205 -124 65 -249 -226 -60 -278 -153 -30 168 -9 140 -58 -18 -215 233 -264 -109 -92 -3
5473 -3 -16 -240 -196 -93 149 43 64 -156 -247 -208 78 -468 -13 -67 -299 -225 -37 -375 260 -33 -125 -170 -18 -54
5497 -54 -192 242 -142 -36 80 120 56 -88 145 -22 214 198 106 207 -93 168 8 165 167 -34 -372 174
5519 174 102 -177 101 162 -160 34 -71 -160 100 96 -17 139 119 -16 73 -173 72 220 -66 17 -65 67 12
5542 12 24 185 75 196 -120 199 229 120 -66 44 225 16 207 156 175 227 -39 7 342 145 225 -1 -153
5565 -153 178 -129 -31 -11 -182 114 76 132 150 48 -124 -165 -160 29 -81 185 7 111 -118 -21 -219 -54 98
5588 98 6 9 -70 -76 -217 165 -162 -80 38 43 -233 -96 -101 -31 22 192 -265 160 -132 -157 182 -141 83 25 -1 172
5614A72m51M15o9j97K48Ol39K29j08J76l06J92L4r3N8Q2J78l44L31j49j88j67
5636b90N01r4k85K19k7j97O0L54j27k4m1M6n3K95l65P6L00l01J38j60J56j32o5
5659a6J24j82K17R6k35J13N0p9k08L82k84j7J7J02o5k09J83p6L59k23L35l27K9
5682H6k6qk75L44RO4o7j53Q6k60J74K5j16P3K69n0j45p4P6r7q5K29k85L29p1o4
5708a2o5L5n9J16R2m6j89k24J66L64K0j57j69j7K20O1L7m87N52j67p0m10K90N6
5732f3o1N64o45L5K39k72k5J96po5k1J16k14K38M8q2k99J25K87k57K07ll9pr1
5757i6J75m21L60k8n6J03n1k46L65Q5K23l41k62L14L5m26J06J8M2L44m85J63J86
5780A07r4M6K5P9k72J15j54J10L3K80j80J19j35o7K22n6j05J44k63M4j40K01K30
$$ plain form
5614 172 -279 136 67 -130 118 124 -215 14 -94 82 -224 -32 2 -91 -33 49 227 -117 214 65 -123 -290
5636 -290 211 117 -168 51 24 -173 -113 241 114 90 49 95 42 337 -28 48 348 47 185 25 181 49 -16
5659 -16 108 -74 143 239 4 117 167 88 -120 262 -22 -39 -22 80 15 -194 -11 -87 272 49 384 57 86
5682 86 60 52 -223 121 130 194 127 -26 60 -200 -26 -1 -117 -44 225 175 30 -44 32 -65 -150 79 -206 123 52 -12
5708 -12 -77 -42 -101 15 107 61 -128 -352 -186 178 198 41 -128 -145 75 136 173 -314 238 71 1 -409 -119 -63
5732 -63 -124 440 -205 -170 69 -203 -228 -32 -39 -104 -125 -9 -223 15 63 -19 -318 -193 94 -163 44 41 2 -5 -96
5757 -96 79 -342 18 -10 -66 37 -14 -260 105 190 413 72 -190 124 159 -267 -161 -143 -101 243 -242 -79 107
5780 107 13 59 84 163 -109 6 -148 -38 -5 275 95 214 79 12 234 178 73 217 -46 -2 -142 59 289
5803B89n3k65p8L50j24j89K32l5j92R9J23M1l06J56j92J19N6J86j09Qj51o4J04
5826EL0Q5m7O8oj37L8M7J8L23m66r3L74l57L4O2J48l8k13K51l09l1K70J71k62
5851c5k39K79k91J39J93k05L43k50L5Q8o0k79J71%P1J73j88N7k39M81j31j37L19
5874B95m09J69j65R6j4m8J23L7j70j0J04k91J42R2Q1j41J22j86K07p8r0J41pk65
5898b65L71k48q0K80l02K21J0K16l48L21k76j58N29k01PO5q7j61M06j79j63O8
5920B6m8J73l42P7J65o5J8N0j96J2J39k0O9l73L08n6J24P2l38P2K68m26L50J79
5944B38m86O8K70P0l34J0R1k8J60k69M31j80Q7J13l84R6K98n3l52M5m3j01K03
5967e0j42J76j34J89L0j0l36J42m4J53R6l9J0j73J1r4L37k74J22m9K78l82L7J79
$$ plain form
5803 289 236 -29 -107 243 119 -70 162 127 -65 34 157 198 -108 48 -144 -25 31 217 108 116 -35 -99 5
5826 5 35 120 73 141 135 -2 36 83 101 424 -42 -135 239 -118 -84 -22 126 88 -125 126 -183 -214 56 227 -35
5851 -35 -274 5 -286 -147 46 -159 184 -66 -31 57 -3 -282 -111 -111 -40 133 -55 2 -237 244 113 -24 295
5874 295 -114 55 -110 -14 -28 -76 47 84 -86 -96 8 -283 -141 -49 32 -109 13 -173 34 -44 -134 7 0 -265
5898 -265 106 -142 -222 58 -244 -23 -13 203 -145 176 -100 -258 271 70 77 142 55 -106 300 121 -42 26
5920 26 -22 151 -191 -114 51 -14 4 54 -142 -130 9 -11 58 -315 -7 -63 61 133 -205 -133 135 -291 59 238
5944 238 -248 -180 90 160 -174 -164 -73 -101 59 -210 221 41 128 241 -143 -47 251 198 -154 -109 -152 -253 -50
5967 -50 -192 -16 -150 39 69 59 -277 -135 -179 -26 70 31 41 -132 -121 -215 122 -152 -30 -79 199 -183 -146 33
5991C3k42K21n2J0q8J52J34l30K32J2l38O2J93K26l57K12j63j65K15j2J69k31
6013a07L07l06J34k8j47J6O5J83l99J75P3l01M31k67J84R4k11L11k32j86J11J83
6035H3r5n6j10M15j65K3L2j44K22k4j03R3j84K13J89n29L46j08J02j75j06M8L26
6058B93L5k95n7N0K4J05j57rk84L83j24J77j90L29j49j15rj79K64p7J40m4r9k34
6082b22J82K91k34K11k74l0J17l01M00k84K93l49q8M08j4j39k99M69l2m30M93
6103A68k79J21l34L13p5jk20K74o3p8K12K90m13J85j6k14l31J28M39q9J5l81K62
6126h7K46k37J3m8l2L92p9n13K26p0l02L91q8j39N65l91L08j10o2K0lj97j07K69
6150c5r5K34l51J47J26mj52j95M78j9l98n7K36K83N7r0rm6j89K92k33k26L55m48
$$ plain form
5991 33 -209 12 -40 -30 -118 34 168 -162 70 82 -256 -194 -1 225 -132 80 -83 -248 -33 -45 124 -107
6013 -107 200 -106 28 0 -147 -131 -66 117 -282 -107 -34 -335 96 -171 13 107 -104 207 -25 -211 -100 83
6035 83 -12 -68 -178 237 72 95 127 -17 205 181 78 171 -13 200 389 -140 206 98 200 25 -81 -33 293
6058 293 328 33 -24 26 50 155 -2 -11 -295 88 -36 141 -49 280 131 16 7 -172 92 15 155 111 12 -222
6082 -222 -40 251 17 228 -46 -76 41 -260 140 -144 149 -200 -288 120 106 -33 -332 137 105 -325 168
6103 168 -111 10 -324 -11 -86 -87 -307 -33 -96 -174 38 328 -85 100 84 -130 -461 -333 106 17 32 -349 -87
6126 -87 159 -78 -65 -113 -145 247 168 -345 -119 -189 -491 -100 -188 -327 238 -153 155 45 -17 3 0 -197 -304 -35
6150 -35 -130 104 -247 -100 26 22 -130 -325 153 134 -264 -321 -85 198 255 165 156 110 -79 213 -20 -246 109 -339
6174c39M35q1k09L3J43j17K78M1k33P1j86m7OL57J50l92K76o4j57J52p5J68m59
6197b49K45j49L50J0n34P6M3N11r6j05Rl15j0J09j07O6o3O8rJ93j45N3J17Q8k10
6222e4l8j04k1L55j77p8p6j23L70j82PO7J93j60J4J75k91r9J42J8k89L56J8K43
6246B66k87q0L51j53k18R8R4j68j12K73j79p5K93k60K19j07J17j85p1j20K39J51
6268H6l07K17J05l96M1K45j20J99r1J15l47K61N9j4k30M60n17K39J46l30J89k28
6290b18L05Q4q0J8l14L92n59L33k8K96l38K5J05J25K1j79M6R7K70n26M78k05m9
6313I9l5L31k90q5J83J50m19j04J00j7J42K26k55j85R3J47l53L03L65m06K7j27
6335a10pP9J7L81m30J91O8p6Lp6R0q4Knj53J29K0n7m9N6m4P6l2J35j09j91K12
$$ plain form
6174 -339 96 15 -194 -161 -18 -135 143 184 -49 22 -164 -211 -205 152 302 -90 186 122 -35 117 42 210 -249
6197 -249 -4 -153 197 207 -327 -251 -208 303 207 102 111 -204 -214 -105 -212 -146 -209 -141 -150 43 -102 -49 68 156 -54
6222 -54 -92 -196 -217 138 -39 -117 -193 -316 54 -128 -121 -54 139 -21 -7 168 -123 -222 -80 -62 -351 5 23 266
6246 266 -21 -101 250 97 -121 -23 71 -97 -209 64 -115 -190 103 -157 62 -45 72 -113 -184 -304 -65 86
6268 86 -221 -4 101 -295 -254 -9 -129 70 -21 94 -253 8 67 53 -177 283 -234 5 151 -179 10 -218
6290 -218 87 171 91 109 -205 187 -372 -39 -67 229 -109 -84 21 146 167 -12 34 131 401 -125 353 148 99
6313 99 64 395 105 20 203 353 -66 -170 -70 -87 55 281 26 -159 -66 81 -272 31 396 -10 17 -110
6335 -110 -117 -38 -21 360 -70 121 189 113 116 40 130 46 48 43 -110 19 39 -18 -67 -11 -55 21 -11 124 15 -176 36
6362C6oJ04r5Rp4o4J55j48M8L4l78L75J7k66K58o9j15Mr3L07l9q6k40L42r3L3
6388d4J65l88K13J2o7k32J78J19k51L69l02K86K20m92L31l13J14j7O1r2Q2J26
6410G8MJ11k17R8pO2j43L37l04k71K14k3J06L9k64L8J66P0j4J16q1k25J68O8j43
6435a7J87rj63j26N5L2N4p9O3k0L1j33N5K77j60O4l52M67j27j43J57k26jL15J3
6460B14n60J77J97L62l46M0j05j51J99p4N7m5J12j04k60L27p3k64J46M76j46k75
6482i6k5l31N70j88K18q3k14K36j29j60K27J8j23k4J26j62o3N6J53J20l73J21
6504a26j53J45K06k34J20O5j3qj56N9q6n4J11K25k37P1q4K81j51j21j26J09L47
6527A90l47J23k7O3m2J47j35R6k09J76K2m2J30k03J0Q3k41M58l58J60on0J6M5
$$ plain form
6362 36 30 134 39 48 -26 -90 65 -83 -35 -1 -379 -4 13 -253 5 -64 -179 -175 -268 39 0 -86 -326 16 -77 -44
6388 -44 121 -267 -54 -42 -109 -341 -163 -44 -295 74 -228 58 278 -214 117 -196 -82 -99 -38 -130 -48 78
6410 78 82 193 -24 74 67 129 -14 323 19 -252 -38 -61 45 84 -180 -142 24 94 80 196 115 -110 58 126 -17
6435 -17 170 161 -2 -128 -73 -41 13 -66 -3 -23 8 -125 -70 207 47 111 -241 226 99 -44 113 -113 -114 201 214
6460 214 -346 -169 28 390 44 84 -21 -172 27 -47 10 -35 77 -27 -287 40 -33 -297 -151 325 179 -96
6482 -96 -121 -452 118 -70 148 65 -149 87 -42 -202 25 43 -80 -104 22 -140 -203 -147 6 126 -247 -126
6504 -126 -279 -134 72 -162 -42 23 10 2 -154 -95 -181 -235 -124 101 -136 -65 -149 132 -19 -140 -266 -157 190
6527 190 -157 -34 -61 2 -40 107 -28 68 -141 35 57 15 145 -58 -48 35 -206 252 -106 54 48 -2 14 59
6551E9q8J41k17L95Ol07j11J62j37k75L45R5r6J9Nn4R9p0N1m4k3J61j49K38j85
6576B0k7k00K11P0j96J54Q9l9k93K35k63M2L17J7k1J66l88r5j05M34k22L30k24
6599A2K51m37K53j83J81J58n2o2j93O0J03k63L1Q7J12J3Lk29p8J71O0R3k2l53
6623b84J87k7L30j81J08k16Mm5K45j24k03O1J76j62L04j35p0q4N3J49j04m2J24
6646F4k73L08J42l37J66J21J23l79M9o7K73l92L18j01Q0o7j70J64k45J16J00K05
6668A98j02m8l08L16O6k18j11J98j78L39q6j49PL52k59j56K34M4po5l45K40k12
6691b50J04J0k9j18j56K96L01j70J60r4J07j34J11j13K98k59q8M13j98l44K42
6712H9J76p0j9Km2r8j43N5o3J14J00q4K58l52P1j15J95K77k80k00k6J76O5p3P
$$ plain form
6551 59 -29 112 -105 290 296 -11 -122 40 -97 -372 -27 68 -28 -9 -4 -58 41 -29 22 -22 -45 116 -33 205 20
6576 20 -7 -207 4 74 -122 32 121 82 -211 24 -239 -197 120 137 116 282 -106 -201 -306 128 -94 236 12
6599 12 263 -174 79 -104 77 235 183 121 -72 -12 91 -172 -141 -54 58 71 74 -155 -233 -62 -2 91 69 -284
6623 -284 -97 -124 206 25 133 -83 -79 -124 121 -3 -206 -145 31 -131 173 38 -32 -116 -63 86 -18 -60 64
6646 64 -209 99 241 -96 70 191 314 -65 -16 -83 190 -202 116 15 95 28 -142 22 -223 -107 -7 198
6668 198 96 48 -260 56 122 -96 -207 -9 -187 152 66 -83 -76 276 17 -139 95 139 132 67 -278 -38 -250
6691 -250 -146 -136 -165 -283 -439 -143 158 -12 148 54 161 27 138 25 323 64 -24 389 191 -153 89
6712 89 265 195 176 178 136 38 -105 -50 -113 1 101 17 275 -77 -6 -121 74 351 71 -129 -155 21 86 13 20
6737B0j66M43R8n36K42k59L44L1l72Q4jj11M02l38Q6r4J77r9j20R3Q0q9l6J01
6761b0j13J72j65J49J23p2j5j29oQ2Q1l26OL8L86rQ3m94L06q8l4j33M24l26J11
6786C1Rj36J97q3Oj18O0K09j75j65N87o97K40J27k06j18J47j54K80J59m0k51J72
6809H1o6j50J42L1j01Q6j48K77p2j65M34k86O4j96p4m5J44K51m11J99J25j09K86
6832B97n15L1L6J70J31J9J05l69J17R5j72k77K93R4jN2M2l2j61n5J55l22K33K3
6856a1J32k58K11j20j87J18J6n5J59O3J81l17J62r2K82l28M8p0Q0j12K85P7l74
6879a10J66n12L90N8m6L7j10p7K65k93M02k38J9o8L9K3J11l7j26J74j11J79k07
6902g2k08K74J74k89J25k37J84j83M60l82m5L09k12J29k35K1K7N8K16n14N45n7
$$ plain form
6737 20 -146 297 395 -141 101 -158 186 217 -155 -71 -72 -183 219 -119 -33 -127 50 -49 -169 -76 4 -85 -121 -20
6761 -20 -133 39 -126 23 146 74 59 -70 -76 6 87 -239 -233 -195 191 182 265 -229 77 -11 -45 -178 246 -80 31
6786 31 40 -96 101 18 24 -94 -34 175 0 -165 422 -275 -35 92 -114 -232 -85 -239 41 200 160 -91 81
6809 81 15 -135 7 38 -63 23 -125 152 80 -85 349 63 127 -69 -143 -188 -44 207 -204 -5 120 11 297
6832 297 -218 -187 -151 19 150 169 274 -95 22 117 -55 -332 -39 55 54 106 148 116 -45 -100 55 -267 -34 -11
6856 -11 121 -137 74 -46 -233 -115 -99 -154 5 68 249 -68 94 2 284 -44 4 -66 14 -98 187 264 -110
6879 -110 56 -456 -66 -8 -54 -17 -127 -204 61 -232 170 -68 -49 -117 -78 -55 56 19 -107 67 -44 135 -72
6902 -72 -280 -6 168 -121 4 -233 -49 -232 228 -154 -199 110 -102 27 -208 -187 -160 -102 114 -400 145 88
6924H8k76OR4K22j1J1j15j91o0L06J3k93L62p6O2j42Rj03k1K43o0LL73n90J25
6949b1r0m5L63k03j33K30k35J02j82K17j00J56J45m2p7q1O8J31l41K41o4L30m54
6972h5J84J42m31j94L67P1j48K68j06q3j60K99o2j76L84m75K15r2J22J24j7M2
6994A89l68J36O2j36L02p4j5n9j16J20j34L19q7K7K3j52m5l9K84j99j6j8L70n2
7018C22m40L0o0Q7M3r2L51j68k5k55J34K48R6k87j01P4L0j38J38J4k76L71K1Q9
7042B06l13q3L8R4K9k15J70Q3k1j03Q1J04J74m46M90j44P6q5K14l32j02K5n8j22
7066b40K52m0K00N3m62L06p9mL00l26J61r0r3o5J89N7k44K50k21L40k83n5K5K06
7090A37j31j56n1L02K05j54m9j27J49m98L24M4J73p4l35R1L33k00J15l14K18M5
$$ plain form
6924 88 -188 -182 -88 134 123 134 19 -172 -232 74 87 -206 156 80 142 0 9 -94 -115 128 68 71 444 -146 -21
6949 -21 -111 -156 207 4 -129 101 -134 -32 -214 3 -97 59 204 162 85 4 72 203 -138 103 39 369 -85
6972 -85 99 241 -190 -384 -17 54 -94 174 68 -15 -175 124 62 -114 270 -205 10 -82 40 164 147 189
6994 189 -179 -43 19 -117 185 111 96 37 -79 41 -93 226 139 166 189 37 -8 -47 237 38 22 4 374 322
7018 322 -118 -88 -148 -61 -18 -110 241 73 48 -207 -73 175 271 -16 -117 -43 -13 -151 -13 1 -275 96 117 206
7042 206 -107 -190 -152 -58 -29 -244 -74 9 -12 -115 -34 70 244 -202 288 144 220 135 349 17 -85 -60 -118 -240
7066 -240 12 -28 172 225 -237 69 -10 -14 286 -40 121 31 -62 -127 62 119 -125 125 -96 244 -39 -94 -69 137
7090 137 6 -150 -201 101 306 152 103 -24 125 -373 -49 -5 168 94 -241 -150 183 -17 98 -216 2 47
7112D7J14o5M5n6r0P6l62K41N4J7N6r3J76j14J02l1o2mJ4l0k22K60j05J93j01
7137F0%q4j86N93j04l76M08j90j52m0N6O3j88L26mj13q3L00l44Oj90J56K00Lj51
7162c4J26m20K44k7K99r1k54q2J33j58K71J01n9m5j31J57Q5n53M97J12l32K78
7184A17j6k78L19r6j13J24R2n0l8k55L84p7O2j80q5J62n2n9K79o1l63J93K4j09
7208g6J94j38m8J06l52K94p1J66j6k25K32J53l10J97Lj97J60KRj32J28r9k4J50
7232A06J8k08P5l6k0j83K04j02oJ10k58R7K46j31K03j72J23r4K23j28l18L12j14
7255e3j72K92j75J22L7l9J1J05j43J18j17J32p1l6M64n23Q6k26L3J23K20k3p8
7278H7K7J59o10P8O2K32J63j92L0K01k10J5l0j23O4L00j87L1O9j85K30k37J81
$$ plain form
7112 47 161 96 141 85 -5 71 -291 -50 4 21 77 -16 160 46 148 117 55 51 65 35 -187 73 -32 161 60
7137 60 60 -24 -210 383 279 -97 311 121 -31 -71 -15 48 -140 186 182 69 -14 286 -58 -52 -242 -86 114 117 -34
7162 -34 92 -328 -84 -111 188 97 -157 -239 -106 -264 7 108 49 4 -127 30 115 -438 59 171 -161 117
7184 117 101 -177 142 46 -67 57 149 99 61 -194 190 113 175 -5 -90 72 20 -39 240 179 -184 9 33 -76
7208 -76 118 -20 -68 38 -314 -20 -91 75 59 -166 66 219 -91 106 109 -88 72 74 83 -49 79 -20 -44 106
7232 106 124 -84 -9 -45 -65 -248 -44 -146 -152 -42 -300 -203 43 -88 115 -57 66 -28 195 67 -251 61 -53
7255 -53 -225 67 -108 14 51 12 23 128 -15 103 -14 118 47 11 475 -48 38 -188 -155 -32 188 165 87
7278 87 114 273 -337 -259 -197 35 198 6 36 237 27 42 12 -111 -47 253 66 97 166 -19 211 -26 155
7301A55j71Nj58J61J71k79K61k04K51l04P2j2K8J89k05j67L5J52r6R6j81j85N42
7324A56l3k44K31q6P9k17K57K32n35K78j21QJ3kj27M0P6L2j07l9L01j01K2k18
7348a05K13M8j73m7K81k62K93k98M4R4Pj22P6K74n37o6J66RJ61q6Rk26P6L32r8
7373F3j75j44L52J3K03l69J23Ko4RK3j56K77k97j79J50J87n8j75o3M58m93M44
7396A31J5j52j16J09N5k54J95l23L39o5k03J09lJ30K17l27q8J13M47m18O9j78
7418a98M19j98L5K3l9j8Q9k47R8MK27j70P1m5k92M9L20K2k7l01L22q8J19J22m71
7443a74L76r9k12K01l36J46j1N1o6J48j75Q5J25k69K22K52k38K9j44k66K91j3
7465g7K64o3q3j09K51J3k34R4j9k6Qk48J14r8O4J86P3j2q2j01K50L4j37J7k22
$$ plain form
7301 155 -16 -11 -169 -8 163 -116 145 -59 192 -112 -40 -52 -24 165 -40 -207 -172 -20 -116 -20 -201 -386 156
7324 156 123 -121 110 24 103 -114 143 375 -160 118 -3 5 18 16 -111 -71 5 37 -70 -109 192 91 113 -105
7348 -105 108 156 -17 -64 217 -45 248 -50 -6 88 95 -27 49 323 -214 -280 -114 -105 56 -30 -21 -247 -171 161 63
7373 63 -112 -256 96 109 312 -57 66 68 4 13 36 -120 157 -140 -319 -169 18 -40 -215 -278 180 -313 131
7396 131 146 -6 -122 -13 42 -212 -17 -340 -1 -66 -269 -160 -163 -33 184 -143 -231 -118 329 -89 -20 -198
7418 -198 221 23 58 81 42 24 113 -134 -36 -32 195 25 96 51 -241 -192 128 150 123 -178 144 56 175 297 -174
7443 -174 202 103 -109 92 -244 -98 -109 -58 -124 24 -151 -66 59 -210 12 264 26 55 -89 -355 -64 -77
7465 -77 187 124 41 -68 183 196 -38 56 37 11 19 -229 -115 -213 -149 37 110 98 16 -85 165 199 62 79 -143
7490a43L4K72l7j63J51j98oK91p6N5l10J15J08j1q0k4J51J3k37P6m4J10l62J80
7514a35J89LK32m92M00l91L74j97j99N3P6J12lk1k7J31m6K19j15k40M27k29l90
7537b69M04j49k18J36J28j05K06P0k16R5r8J61j72j04J83k20Q1K21q4n14L93R
7559f2M6k36K99j26mO5J23N3j51j6J10n7l0n2Q5j67O8L03j17m43J67M42l94L71
7583B77j22k25J39j47K23l9k49K54m15L78N3p2m3j55N39l09rk95P2O1J02Q2J38
7606B38k77J23l66M31r6n8o2N8L9K42j47m48L27K8j66L57k37n6Q2L17k50k29N24
7629C74j73m14J02J32N2l00L02J33J3l15Q0j2m8J6L6q0J41k16N9K57o7mL0j98
7653a00j62L40j60R0q9K36l47J28K3R7k48J74L8J19q3Jk35L2N7q6j15J85K59l44
$$ plain form
7490 -143 -109 163 126 -37 114 -84 -90 201 125 180 -130 -15 93 82 2 -22 129 142 -95 -19 -63 47 -315 -135
7514 -135 54 57 289 -203 197 -194 180 -17 -216 -163 -87 25 22 1 -26 105 59 278 163 -77 350 121 -269
7537 -269 135 -14 -232 -96 32 -73 133 203 -13 82 -16 145 -27 -131 52 -168 -87 134 50 -464 -71 -62
7559 -62 -16 -252 47 -79 -83 -18 105 158 7 -9 101 44 14 -38 47 -120 -52 251 134 -309 -142 300 -94 277
7583 277 155 -70 69 -78 145 106 -143 111 -304 74 127 55 12 -143 396 87 78 -217 -145 -84 18 100 238
7606 238 -39 84 -282 149 53 -5 -67 -9 30 272 125 -323 4 32 -134 223 -14 -70 12 329 79 -150 374
7629 374 201 -213 -111 21 73 -227 75 208 221 -94 -14 -26 -74 -58 -22 -102 39 -177 -118 139 72 68 98 -100
7653 -100 -262 78 -82 8 -81 155 -192 -64 -41 56 -192 -18 20 139 56 57 -178 -146 -89 -175 -290 -105 154 -190
7677a90K70k28J98k9NoM9l3l88R2L92r2r0k19M90m24K16j3l6J36K9j81PJ28P1
7702A54j78J22k80k0M15m96N9K72L98m49K78k92M2m95K16K90l7Nk2m06O97l53
7724h0P3K62l61j07R7Q7N2oJ23j36k46M40k08m2K94k4k69K4j13J71J43k11K41
7747B04jj1K8k16o2L33j86o5K7O0k87P7K38k26J53p8k9Q8J83l69K99Q5l3k00n2
7772d0J00J1j46J82k24J25R9j08L19l85J18M4O6j39j65M44m80L33q2j44J87q0
7794C5k3K08k75P9l08M47m25M15J47k61k31N1M07l64J81J06k33N4k65K36L6k99
7816b82J21J0K19J51j44o9J37k56J68j88N73j40m44L73p1j55N3k5p8J89m2j8k09
7839a27J97N5j33j9R4J86p8k68J39N5l46K6rJ42m7j45J60J70j68O4j03L03L5m
$$ plain form
7677 -190 80 -148 50 21 26 20 69 36 -352 -260 132 40 -50 -269 221 -203 13 0 -36 100 129 -52 -45 83 154
7702 154 -24 98 -182 -202 213 -283 -224 48 446 -3 275 -17 25 -470 -254 36 -1 4 -18 -424 273 -80
7724 -80 -7 255 -106 -213 -116 -29 23 17 140 4 -242 198 -10 -52 242 218 -51 -27 -140 31 174 -37 204
7747 204 203 192 220 4 -58 275 89 24 51 111 -176 -99 139 -87 66 -12 -41 47 230 -139 160 245 212 12 -40
7772 -40 60 71 -75 107 -117 8 107 -1 318 -67 51 95 161 22 -143 301 -179 154 72 -72 115 35
7794 35 12 220 -55 24 -284 163 -262 153 300 39 -192 -141 266 -98 83 189 -44 10 -255 -19 17 -282
7816 -282 -161 -151 68 219 75 6 143 -113 55 -133 440 300 -144 229 158 3 56 31 -47 142 100 82 -127
7839 -127 70 125 -8 -27 67 253 175 -93 46 101 -245 -219 -228 -86 -133 -278 -118 52 -116 -52 -155 148 183 179
7863A79j68J10M9r2k3k04j90K44q3o1M8R8r0K72k75J7M86k90J27k78J83j77M10
7886B92j16j7j24M5j39J09P4l65M55m72N38k11k5k03Q1Q8j00j63M93k24j44K5
7908a03K29k32R8l1k42lK80K47m88M47l19L32k97K64j66j92K9k9L61m09J77n2
7930i9r1L23k19l29J83K27j06O2l4J03j12J13P5r5j58J67k12K13o2M1k78K24J32
7953F8J32j1m20R1K3J56m4J00J3j98j13K48K31m09J42o4L37l11R6m5j18o9J36
7976b9k71K67J77K77k57j41J95l51n6L32k70J72j82J16p3MJ26k83L74N9J19l96
7998i1J85j23K55k47l1K66k38m3J15K45k40r4l9nK45j31q8n2R0J01J4p0p0R3j06
8023e9R9J30Q6j33k47K64J49j25K6J15m64N29l22O2l65n1K94j4Q5k5r8k1L04q8
$$ plain form
7863 179 11 121 170 78 55 -149 -339 -95 -178 -239 -191 -93 -183 89 -186 -169 317 27 154 -124 59 -118 292
7886 292 176 159 35 80 -59 50 124 -241 214 -258 280 69 44 -159 -78 10 -90 -253 240 16 -128 -103
7908 -103 126 -106 -8 -39 -281 -284 -4 243 -245 202 -117 215 -82 182 16 -176 -147 -176 185 -224 -47 -99
7930 -99 -190 133 -86 -415 -232 -5 -111 -49 -83 20 -92 21 96 1 -157 10 -202 11 -51 -10 -288 -64 68
7953 68 200 189 -231 -140 -117 39 -5 95 108 -90 -203 45 276 -133 9 -55 282 -29 67 22 -96 -165 -29
7976 -29 -300 -33 144 421 164 23 218 -133 -189 143 -127 45 -137 -21 -94 -90 36 -247 127 186 305 -91
7998 -91 94 -29 226 -21 -52 214 -24 -67 48 293 53 -41 -80 -85 160 29 -59 -111 -21 80 94 24 -46 47 -59
8023 -59 40 170 256 123 -124 140 289 164 190 305 -159 370 48 110 -255 -306 -12 -26 59 34 -64 -85 219 131
8047A31j44k0m9K41j61K23l30k4M5%J3Q0J30l4J32k49j83J82j31K29j39m01N85
8070A26k23K09o1k01j7k5K81l10L72k38K27K01l89J50j15P2l8L2K33j97k20J26
8092eo7J76j49Q4K13k39k40J67j29J95J71m5l10J02j3K09j99O4m8J86j75k6L3
8115d5J32n33P03L1k55k19J91P5J93j92k58Q3K51j11r3J00j20n1K71l78j42N19
8137A52j32RJ6k46L47l26J66p5J75Q0j28l11N56K52n32R4j95L3j3Q7k42K32j54
8160a55K46j46j75K73J27k10j21J85j73M03l92LJ6K75j78j78K86kj42J75M1j56
8182BM9j12j35P7r5L98j84J14j44
$$ plain form
8047 131 -13 -33 -82 159 -2 221 -109 -133 -88 -88 -75 5 135 101 233 -16 -199 -17 -148 81 -58 -459 126
8070 126 -97 112 51 -150 -167 -192 89 -221 151 -87 140 341 -48 102 -13 59 21 53 286 89 -131 -5
8092 -5 -72 104 -45 39 252 13 -227 -60 -189 6 177 132 -178 -76 -89 120 -79 -15 -63 123 -52 -78 -45
8115 -45 87 -446 257 288 33 -186 5 80 273 81 -177 -94 157 46 -47 53 -67 -118 153 -225 -367 152
8137 152 20 29 45 -201 146 -180 -14 -89 86 166 38 -273 283 535 3 97 -98 -65 -78 9 -233 -1 -155
8160 -155 91 -55 -230 43 170 -40 -161 24 -149 254 -138 -135 -119 156 -22 -200 86 84 -58 117 158 2
8182 2 51 -61 -196 -119 -214 184 0 114 -30
8191c0
$$ Imaginary data points
##PAGE= N=2
##DATA TABLE= (X++(I..I)), XYDATA
0@%%%%%%%qJ6j6J6k4L2m0M9n7P2q8J04j20J44j71J95k24K62l02L42l88M41m98
30b63N62o33P09p95Q88r91J103j225J360j507J669j850K049k266K510k785L092
47A627l442L843m307M853n505O303p300Q589j0334J2841j6766K3824m0398J46293
61A20121R7545l11727K0518K11219j6803k19751M3173J84205j9663j49086M5879
72E630J10065n5368j10232M3973O8378l9362m3997N5036M2444k8897l5826q668
84C176j2756J2287L2391p063l0126K7933L4350m0802l9772M1460K0630n7590r118
97b5000P5999J0041p2434L847P1946k4471q6119J6781P7289j0640m7044K7066
109A7261K5589m9104j7018N7496J149o9532J0962Q0064j7127q1576K3166P4104
$$ plain form
0 0 0 0 0 0 0 0 0 -8 8 -8 8 -16 16 -24 25 -32 40 -48 56 -64 80 -91 104 -120 142 -160 182 -206 235 -263
30 -263 299 -334 375 -420 468 -523 580 -645 715 -792 877 -973 1076 -1190 1320 -1465 1627
47 1627 -1815 2028 -2279 2574 -2931 3372 -3928 4661 -5673 7168 -9598 14226 -26172 120121
61 120121 217666 -94061 -73543 137676 120873 -98878 -55705 128500 108837 -40249 5630
72 5630 115695 60327 -49905 -5932 62446 23084 -20913 34123 76567 47670 11844 3176
84 3176 -9580 2707 35098 28035 -2091 25842 60192 19390 -20382 21078 41708 -15882 -25000
97 -25000 50999 61040 -11394 -7547 64399 39928 -46191 -29410 47879 37239 -9805 17261
109 17261 42850 -6254 -23272 34224 35373 -34159 -23197 56867 39740 -41836 -18670 55434
121E5434l4134p0326L6172N4726l5756k7430M8423O691o5882n261O3962N43m8969
134b1807J6880M2092l1379l7959L7047K5693m7477j8074N3957J4956m9346j989
146a7406M7502j0409m8976R104L1623j4702l444L9308p882n8354R445N8739k1557
159A2991n9380L3122O0560l6042m7230M8633L5018o4569l2841O8480K1602p4523
171c4179l754R4073O500j01245j5358Q8218P754q0806K644P9788r22o8066M585
184b0768N6866j0158n2845K022M0629P101k2594p061J6486J6834j2323l6557o624
197b8992M3402K2482l8163k2314M0986J8733m6684j6243M7993Q005n5226k41O5417
210C9155j501o7327P472O7245j8409p2945K0167P1946j6065n7208K0025L9360
$$ plain form
121 55434 21300 -49026 -12854 41872 6116 -21314 27109 33800 -32082 -37343 26619 27162 -21807
134 -21807 -4927 37165 5786 -32173 4874 30567 -16910 -34984 18973 33929 -15417 -17406
146 -17406 30096 19687 -29289 -20185 11438 -3264 -6708 32600 24718 -33636 -24191 34548 12991
159 12991 -46389 -13267 47293 11251 -35979 12654 47672 -16897 -49738 18742 40344 -34179
171 -34179 -37933 56140 62640 -38605 -53963 34255 42009 -38797 -36153 43635 42713 -25353 -20768
184 -20768 36098 25940 -26905 -24883 15746 22847 253 -6808 9678 26512 14189 -22368 -28992
197 -28992 14410 36892 -1271 -23585 17401 36134 -10550 -26793 21200 29205 -26021 -26262 39155
210 39155 37654 -29673 -22201 45044 26635 -46310 -26143 45803 29738 -27470 -7445 31915
222C1915l2253k7373M0255J7661m4707r484M5488K318m1526O062L4584j7850l0387
235b5297K5207K5900l0107j6470L6906P305m7615n947N0602O759m3783j312L2552
248A4700r731k4564K0156J6828k9700r821L7893O586m1330k996L8685k836l7155
261b3285M758L0359m239j5507J2901L262k5989j221L0290j196k9468Q534L0225
274A9424j3046k6963J8043K0345k7731j6159L4696J0850l6768j223M3907l402
286B1973m9688L62M3253p23l1111R750K5849j5864k2358J8142J5786j9758j3118
299a7505J8921J0817j0794k733O135l199j786N600j1116j3375K4385K7817k7897
312E270l4618K9304L4144l4469l2807L9935K8683m4217k2078N1222J8021n4541
$$ plain form
222 31915 -338 -27711 12544 30205 -14502 -23986 21502 23820 -17706 -11644 22940 5090 -25297
235 -25297 -90 25810 -4297 -20767 16139 23444 -24171 -30118 20484 27243 -16540 -17852 14700
248 14700 4969 -19595 561 17389 -12311 -22132 15761 22347 -18983 -21979 16706 13870 -23285
261 -23285 -18527 11832 7593 -7914 4987 8249 -17740 -18961 11329 10133 -19335 -10801 19424
274 19424 6378 -20585 -2542 17803 -9928 -26087 8609 19459 -17309 -18532 25375 21973
286 21973 -27715 -27353 15900 15177 -15934 -6184 19665 3801 -18557 -415 15371 -4387 -17505
299 -17505 1416 12233 1439 -1294 4841 1642 -144 5456 -5660 -19035 5350 33167 5270
312 5270 -29348 -44 34100 -369 -33176 6759 35442 -8775 -30853 20369 38390 -16151
324a6151j6023N4231J0032n3092m010N3372K624m8629k091L8540n135l0397J4079
337b650K6407j8938k1786K1557J6111k2586j1428J9355M494j5393M307J2259j0115
350A594q400J5304R82k2443J449K7339K74k5221m15J8487m117j4566R169J1105
364A0541j2378p366J5660L688j7538k302J6546k966j5825P310J5292q039q172
377e549J0655q48j9712L410K4334m204k2280Q158J8967j2259j5291J5343R786
390A0510k2238o288K7285N824k7114k329K7787j796l1371J617K9155m49k1447
403a0854N444J5867j2303j2757J5998Q541j8435m472J9418L676j5149J675R674
416F323q952p107J2041K266j4168N109K1458p420k5499O615K4003q284k1292J2028
$$ plain form
324 -16151 -32174 22057 32089 -21003 -25013 28359 30983 -17646 -19737 18803 13668 -16729 -2650
337 -2650 23757 4819 -16967 4590 20701 -1885 -13313 6042 10536 -4857 -550 11709 1594
350 1594 -6806 8498 9480 -12963 -11514 15825 16099 -9122 -9537 8950 4833 -9733 -564 10541
364 10541 -1837 -9203 6457 10145 -7393 -9695 6851 3885 -11940 -4630 10662 2623 -5549
377 -5549 5106 4258 -15454 -12044 12290 8086 -14194 -6036 12931 672 -14619 724 10510
390 10510 -11728 -18016 9269 15093 -12021 -14350 13437 11641 -19730 -18113 11042 10593 -10854
403 -10854 -5410 10457 -1846 -14603 1395 9936 -8499 -12971 6447 10123 -5026 -3351 6323
416 6323 -2629 -9736 2305 4571 -9597 -4488 16970 9550 -15949 -9334 14669 6385 -14907 -2879
430b879J9101j4883j5016J9994J3463k6044j2937K7547J1540k6693p778K7455
442A2870O022k4539n924J7497K177j0118M833O819r125n563J0646M202r941l556
456c700O807J680k420K675J04n869J929P467n862j1504R649J5675r571j5772Q320
471c92J1882j0895o954J4609K723j8046M19K0500k080k1508K902J8736m933j5698
485h735P247J3365q619q940Q832K463j2555J054J6945k348j7181L377J5279o441
499C743j3395Q882R671j2857o141J7959L737k0296j793K0866k431k2424M142K2149
513A1812l491j7701N014J2577r345r693J1306Q336j2485o714J3140N744j1552
526c052l791Q774k22p414L441O054n195j986Q524j503j2662K260J3535k417j0794
$$ plain form
430 -2879 16222 1339 -13677 6317 19780 -6264 -19201 8346 19886 -6807 -14585 12870
442 12870 18892 -5647 -11571 5926 8103 -2015 2818 9637 512 -5051 5595 9797 -144 -3700
456 -3700 3107 4787 2367 5042 5146 -723 1206 8673 2811 -8693 956 16631 7060 -8712 -392
471 -392 11490 595 -6359 8250 10973 -7073 -6654 13846 11766 -9742 -6840 11896 6963 -8735
485 -8735 -1488 11877 3258 -5682 3150 5613 -6942 -5888 11057 8709 -8472 -5095 10184 3743
499 3743 -9652 -770 8901 -3956 -10097 7862 11599 -8697 -10490 10376 7945 -14479 -10337 11812
513 11812 8321 -9380 -4366 8211 -1134 -10827 479 8815 -3670 -10384 2756 8500 -3052
526 -3052 -6843 1931 1709 -5705 -2264 3790 -1405 -3391 5133 3630 -9032 -6772 6763 4346 -6448
541f448M330Q392o808n055R274K463j1866j685J3349J647j1514K52J0178j821
555D688r335K337O673k719k302N768m44q953J940J0468k840r706N264P781o628
570A992n441J0620J694j3715K54J5263j279j5674M859J6232o061j6186N601J3422
584A1581o591r840R880P640j1792o807J3978N446j4808n068J4172L154j1512n3
598f20R901l044q352M358N039o870j492J0156Q01j1137r69Q685j193o213L014
613B064M306n595k016R266Q09j1271k403J0785J206j0635L52J1201q2r455L22
628a146N115l457l927P025K756q129k417Q992J195p396j205L543q13r33M060r28
644B335n417K318O420n025p987M781Q923l491p042L615M484n535k707O936O79
$$ plain form
541 -6448 -2118 6274 -534 -5589 3685 6148 -5718 -7403 5946 7593 -3921 -3669 6509 4688
555 4688 -4647 -2310 4363 1644 -658 5110 4666 -4287 -2347 8121 5281 -4425 839 8620 1992
570 1992 -3449 7171 8865 -4850 -4596 10667 9388 -6286 -1427 14805 8744 -7442 -1841 11581
584 11581 4990 -4850 5030 12670 878 -5929 8049 13495 -1313 -6381 7791 10945 -567 -620
598 -620 9281 6237 -2115 2243 7282 412 -1080 9076 9877 -1260 -2229 6456 5263 -950 2064
613 2064 6370 775 -1241 8025 8834 -2437 -4840 5945 7151 -3484 -3132 8069 7987 -1468 -1146
628 -1146 3969 512 -3415 3610 6366 -1763 -4180 4812 6007 -1389 -2594 949 136 -797 3263 2335
644 2335 -3082 -764 5656 631 -7356 -2575 6348 2857 -4185 -570 3914 -1621 -4328 2608 3287
659C287r401R77J1622n60j1376J194R440l089q994M829O366m668k346O602o29
674C254r124J658J0311k369r115K231Q368k708o215L980M181o343l284Q130L049
689F004q023j274Q960j33j0111n85R338K79o446K323M115m544j840N619K68o535
705b585Q6O274K68l978R81K494k755k210L345M56l579J483N550k239o280J639
721a050N489k051m111K821L006m333o56O294j296q231J676Q293k428p298L924
736D9O624m482n415M324J888n333L63O595m95p207P95P267j728o468J141M708
752B626k535k770M500J960n941r47O572j738p400L136Q062l400p384M119N269
767D129o030l064O885J600q313l63R062J96q844j44P037r09o292K628N813l174
$$ plain form
659 3287 -6114 -5137 6485 5925 -5451 -4257 5183 2094 -6900 -2071 4295 -373 -2719 3883 3254
674 3254 -5870 -4212 6099 3730 -5385 -3154 5214 2506 -3709 271 4452 -1891 -5175 2955 6004
689 6004 -2019 -3293 5667 5534 -4577 -5162 4176 4455 -1991 332 4447 -97 -1937 3682 3950 -2585
705 -2585 -2499 3775 4043 65 1046 3540 785 -1425 1920 2376 -1203 280 5830 3591 -2689 -1050
721 -1050 4439 2388 -1723 1098 4104 -229 -885 5409 4113 -4118 -2442 5851 3423 -3875 49
736 49 6673 2191 -3224 1100 2988 -2345 -1982 4613 4118 -3089 -2294 4973 3245 -3223 -2082 2626
752 2626 91 -2679 1821 3781 -2160 -3107 3465 1727 -5673 -2537 5525 2125 -5259 -1140 4129
767 4129 -1901 -4965 1920 3520 -4793 -5156 3906 4102 -4742 -4886 2151 1242 -5050 -2422 3391 217
783B17m506M163K934o250j660P020J417p114l81N811n67m313K280K158m196j313
799d300O644N66o118l81N831o73n215J169M241q80k871K286J866m416j199N900
815B450Q55o120q03O346Q27n034K00L425k485j746L997J256m789K41N871q61p165
832c535J155O445j089m133J241L110l026j291M411N12n718j181P381J375p323
847a666r21O588K78o265N21M958j298l150L464J736n211j521N584P21n103l58
863a643L873J34k443J294J144l354m55L336N42l891k28M749j73n046l20M239j87
880A571l533J613K945l066k696M137K035m931k227M755J740l262q25K847r12j792
896a601L69R43j509j59K928k4k416o10J891K63j342m51J087l49n73J798Q03k889
$$ plain form
783 217 -4289 -126 2808 -3442 -5102 1918 3335 -3779 -4160 1651 1084 -3229 -949 1209 -2987 -4300
799 -4300 2344 2910 -3208 -3589 2242 1569 -3646 -2477 1764 884 -1987 299 2165 -2251 -3450 2450
815 2450 3305 -2815 -3618 2728 3555 -1479 -1279 2146 -339 -2085 1912 3168 -1621 -1380 4491 3630 -3535
832 -3535 -2380 4065 2976 -1157 84 3194 168 -1123 3288 3800 -1918 -3099 4282 5657 -1666
847 -1666 -2587 4001 4279 -1986 -1465 3493 2195 -955 2509 4245 -966 -2487 3097 3818 -1285 -1643
863 -1643 2230 2364 -79 1215 2359 -995 -1450 1886 2428 -1463 -1691 3058 2885 -2161 -2481 1758 1571
880 1571 -1962 -349 2596 -470 -3166 971 3006 -1925 -4152 603 2343 -919 -1744 1103 191 -1601
896 -1601 -1232 -289 -1798 -1957 971 947 -1469 -2079 -188 75 -1267 -1718 -631 -980 -1553 245 1048 -1841
914a841j354L435Q02l292L4L564m99k668J023Q94k089J10K988M8l254J69L510
931A580l38l087L5J704J19q65J078J509k090p79K204N37l327k72L832J123l344
948c81o3K238o73j855J298J419k370l23L020Q72k778o13K029o68j256Q50J325
965B071n86k26Q19K03k039n28J949J163k143m09J816K90j759R62O27k241q18K957
983B108J389k686p78K503L9k606L3J440j96o68J279J29j689p94K136nj504j346
1001a216J660J796r63j228M62k79l93M98O34j445m51K556L87k953q28K032J05
1018C74j689R41L40j301N59K001o62l136R6K881L68k142k35J749J07j607j51J096
1036d11r95n12J955J038k750k035L613J383l368j644K726J513k076M13J225j148
$$ plain form
914 -1841 -3195 240 1042 -2250 -2216 1348 849 -1819 -796 98 -1991 -1881 1107 1155 -2099 -1930 1580
931 1580 1242 -1845 -1810 -106 13 -852 226 1735 -355 -1134 1070 1607 -1720 -1992 1840 2963 -381
948 -381 -444 1794 1121 -734 564 1983 -387 -710 2310 3182 404 -209 1820 1152 -104 746 2071
965 2071 1485 1259 2078 2281 242 -286 1663 2826 683 274 2090 2380 621 1583 2210 -31 -849 2108
983 2108 3497 811 33 2536 2575 -31 2 1442 1246 578 1857 1986 297 -497 1639 1634 130 -1216
1001 -1216 444 2240 1277 49 511 232 -161 337 971 -474 -925 1631 2018 -935 -1763 269 374
1018 374 -1315 -374 -34 -1335 -776 1225 563 -2573 -2477 404 772 -1370 -1605 144 251 -1356 -1507 -411
1036 -411 -1406 -1918 37 1075 -1675 -3710 -97 1286 -2082 -3726 -1000 513 -1563 -1150 75 -1073
1052a073q43Q83R50j770l79J966R56r63j431L99J164k8p03Q8J6k10J394R34j911
1071e61j643J852J445j646p71K001K76j472K46J256j353o34J712J131j523j234
1087i18J355R00l82j208P0P78o4L85N62l02j333N75J323r78j567J389J754r59
1105A380j376Q57M17j185N05J248r19j727J600J571q75j478O5Q05p3j24l2M27
1123A086m31NK46m98o91K74J519q04j135K91J494j156m67Q63o29j138M69K130
1141A428j204j227P41J253j343j094R95Q59q40n45P23K92j475k27J559N28j914
1158a491p67K264O29j935q31J759l22j652J236J552j411j051J645M05j823l63
1174b156P23N13J15m03J79J83k22L61l6p52o75J184J287r12o17N72L35o27j98
$$ plain form
1052 -1073 -1916 -1033 -83 -1853 -2232 -266 690 -273 -1704 -1305 -141 -169 -872 -784 -768 -978 416 1350 -561
1071 -561 -2204 -352 1093 -553 -1324 677 953 -519 -273 983 -370 -1004 708 1839 316 -918
1087 -918 437 1337 955 -253 -183 595 531 916 1478 1176 -157 418 1741 763 -804 585 2339 1380
1105 1380 4 861 1278 93 598 1846 927 -800 800 2371 1496 18 83 888 815 691 659 1086
1123 1086 655 660 906 408 -283 -9 1510 706 -429 -138 1356 200 -267 596 -33 -1171 -702 1428
1141 1428 224 -1003 -262 991 -352 -1446 -451 408 -432 -977 -254 38 -1437 -1664 -105 423 -1491
1158 -1491 -2258 6 635 -1300 -2131 -372 -694 -2346 -1110 442 -969 -2020 -375 30 -1793 -2156
1174 -2156 -1433 -920 -805 -1208 -1029 -846 -1068 -707 -743 -1495 -2170 -986 301 -611 -1228 -656 -321 -948 -1146
1193a146Q91q74k27J596P40k233o12K215M15j708k53J326N78o30J06L49j458j13
1211a038J347O39j103m80J154J510j274j547R36P12l21j34N92m72n50J274N71
1228A816j853j054J690J041p54m36O33Nn07O67n80q16J12J378N97j567n16J004
1246H60J194j298j018J034K77q35P97R27j423j479J390J530k129j033J999J293
1262B086k128k1R44m58q04O38N22j109m59J283Q57j437r95Q64P67j052j05J017
1280D10l11j310P45J006j109j648J800J302j440p21J181L00j020O9P31r16p57
1297a688J538M93j138m08J033r5n60j07L91Pj74K51R73j575p03J460J033j650
1315i19j442K607Q87j835n54J930n05j552J030J441j350r07J471J271j952n77
$$ plain form
1193 -1146 -255 -1129 -1356 240 980 -1253 -1865 350 765 -943 -1196 130 708 78 184 533 -925 -1038
1211 -1038 309 948 -155 -635 519 2029 755 -792 144 856 535 401 993 521 -29 1245 1816
1228 1816 -37 -1091 599 1640 886 450 1083 1088 581 1248 668 -148 -36 1342 1939 372 -144 860
1246 860 2054 756 -262 772 1049 214 1011 1938 515 -964 426 1956 -173 -1206 793 2086
1262 2086 -42 -63 881 423 -381 257 779 -330 -789 494 1351 -86 -1081 -217 550 -502 -607 410
1280 410 99 -1211 -466 540 -569 -2217 -417 885 -555 -1276 -95 205 -815 -746 -15 -931 -1688
1297 -1688 -150 343 -795 -1203 -170 -265 -825 -932 -541 -534 -708 -457 516 -1059 -1762 -302 731 -919
1315 -919 -2361 246 1133 -702 -1256 674 169 -1383 -353 1088 -262 -1169 302 1573 -379 -956
1331i56J308K78j095M13R73o50m48J051N57j086r64J043J210j045o48J346J95
1348A482j857N73J748r44j760J534J609j662j441K213N93j965k51J844m19j217
1364H0Q88J427j217j712J160J700j258j290J376J095j206j439J595L43j734M26
1380B34J828j243j948J700J978j790j517J359O71j460L2J790j157j759J460J890
1396B068j835j766J489J843j493j280J442L61j485j59J373m64j664R36K613j966
1412A3k178J445K170j871j493J849L07j511K68J795j269j622J406J763j887j671
1428b486J777J515j353j102R02P09j722M23J889o76j657Q54J959j405k151J596
1444i28J857j368j072J572M02k136O71K202j436k085K174J594j800j201J706R24
$$ plain form
1331 -956 352 630 -465 -52 921 271 -177 874 1431 345 -619 424 1634 589 -59 1287 1482
1348 1482 -375 198 1946 1002 -758 776 2385 723 -718 1495 2088 123 -128 1716 1297 80
1364 80 968 2395 1178 -534 626 2326 1068 -222 1154 2249 1043 -396 1199 1542 -192 234
1380 234 2062 819 -1129 571 2549 759 -758 601 1272 -188 -156 1634 477 -1282 178 2068
1396 2068 233 -1533 -44 1799 306 -974 468 829 -656 -815 558 94 -1570 -634 1979 13
1412 13 -2165 -720 1450 -421 -1914 -65 242 -1269 -1001 794 -475 -2097 -691 1072 -815 -2486
1428 -2486 -709 806 -547 -1649 -747 -38 -1760 -1337 552 -124 -1781 -927 1032 -373 -2524 -928
1444 -928 929 -439 -1511 61 463 -1673 -1002 1200 -236 -2321 -147 1447 -353 -1554 152 1076
1460A076j479p07J532K3j032K51J627n57k093J262J732j427j617K177J087j686
1476A69q16K040j43k332Q72K129q81j930J467J495j263j397J155N64j086L10R89
1493A342k59j232M51J438m94j815J005J172m30j260J161N05j668J10J417m49j900
1510i06J221J790j787j629J726J391j697r98J790K80j742M38J258n18j711N39
1526e55J423o57j381J027Q85j195n43J100P0j420L11J433n05j307J159J201j616
1543e70j155J563L17j760L58J805r52j444J235J008j254r79J062R50j211r1P56
1560c62M69j635R7J535l87j360M35J708n32j528J100M21j260k13J761k25j999
1577a975J050J947j325j931J435J350j368k67R74K52r59L76J257r86j413J055
$$ plain form
1460 1076 -403 -1110 422 445 -587 -336 1291 734 -1359 -97 1635 208 -1409 768 1855 169
1476 169 -647 1393 1250 -1082 -210 1919 1038 -892 575 2070 807 -590 565 1129 43 353 1342
1493 1342 1083 -149 302 1740 1246 -569 436 1608 1178 -82 1079 1584 -84 26 1443 994 -906
1510 -906 315 2105 318 -1311 415 1806 109 -889 901 1181 -561 -123 1135 617 -1094 -555
1526 -555 868 211 -1170 -143 742 -453 -996 104 174 -1246 -935 498 -7 -1314 -155 1046 -570
1543 -570 -1725 -162 155 -1605 -1247 558 -394 -1838 -603 405 -849 -1828 -766 184 -1027 -1118 -362
1560 -362 107 -1528 -1431 104 -283 -1643 -1208 500 -32 -1560 -460 -39 -1299 -1512 249 24 -1975
1577 -1975 -925 1022 -303 -2234 -799 551 -817 -1084 -110 142 -817 -441 816 -170 -1583 -528
1593e28J486m52j240L65J361j048p17P69J076j630K74J600o61j769J438J518j783
1610E9j634K092J008j539Q2J265j49j591R94J149j036j343J437R85j088j404J409
1627F96J020j112r89J325L58j656O55J491o11j923R34J942j027j643J224Q60j562
1644a8O6J051o85j162Q48J209j169l99P11P48j059r48J336L19j622J57J633m13
1662F03j680J83K214j528j470J401J560j883p73J905L13k441N21J839p28j762
1678a726J063J612j034j678J189P82r41n91J041M54j276M7J280l61j531Q09J613
1695G52q88j811J489J421j555r36J627l28j300P38J856j179j299J319R72j156
1711b78j074J502M63j452j52J502r9j395J69J461R5j562M00J661j085r19J240
$$ plain form
1593 -528 958 506 -734 -369 992 -56 -773 -4 1072 -558 -284 1316 655 -1114 324 1842 59
1610 59 -1575 517 1525 -14 68 1333 1184 -407 587 1736 700 -643 794 1779 691 -713 696
1627 696 1716 604 -385 940 1298 -358 297 1788 1177 -746 188 2130 1103 -540 684 1544 -18
1644 -18 48 1099 414 -748 100 1309 140 -259 452 1200 141 -807 529 848 -774 -617 1016 603
1662 603 -1077 -894 1320 -208 -1678 -277 1283 -600 -1373 532 845 -1596 -1075 764 36 -1726
1678 -1726 -663 949 -85 -1763 -574 208 -733 -1324 -283 171 -1105 -1058 222 -139 -1670 -861 752
1695 752 -136 -1947 -458 963 -592 -1528 99 -229 -1529 -791 1065 -114 -1413 -94 878 -278
1711 -278 -1352 150 613 -839 -991 511 412 -983 -814 647 742 -820 -420 1241 156 -763 477
1728D77L66r67l87J664m71j265O67J572j366j070J401R36j262n49J401L76j798
1745b75N36R35k06j040M85P08l58p79K96J049q89m31R33M46j507L28J031q0j172
1764A0N91J130j623k12R72K88j378M7J291n65j098Q55J034q88r50M97P81n02o86
1783d06Q88K56j127j57J255l45j178J75J485m03j536Q19P26p17l90R00J24j321
1801i52O00P56p46j020R09Q07j129O6L29L58r22N51M40n03o63K61J378j064o84
1820a228P59R93q98j247J451L91j335L92J354p32j487J271Q94j067p07J388M29
1837F21j386n16J526j69o60K29J024r78n47J136K79n37o91R00L06m66o73J263
1855F61R6j354L44J355p16j310J319J013j233o98J202M99j268oJ391n28j092P24
$$ plain form
1728 477 843 -124 -511 1153 682 -583 84 1656 290 -780 621 1557 295 -254 1147 1523 -275
1745 -275 261 1196 990 -50 435 1143 785 6 302 1351 462 31 964 1410 -97 231 1262 1182 10
1764 10 601 1731 108 -104 868 1156 -222 -175 1116 551 -547 308 1342 454 -496 1 782 280 -406
1783 -406 482 738 -389 -546 709 364 -814 -639 846 443 -1093 -274 452 -265 -655 245 369 -952
1801 -952 -352 404 -342 -1362 -453 354 -775 -709 -380 -22 -944 -393 47 -456 -1119 -858 520 -544 -1228
1820 -1228 -469 524 -374 -1621 -170 221 -1114 -722 632 -100 -1587 -316 578 -489 -1196 192 621
1837 621 -765 -1281 245 76 -584 -355 669 -309 -856 280 559 22 -669 231 537 71 -602 661
1855 661 757 -597 -253 1102 386 -924 395 1408 175 -523 679 1178 -90 -96 1295 767 -325 399
1873C99J069p22j042R24P38j058m30J026K70p11k39J111n83j125P24J274r31j370
1891f76J427J069j924m05J582m6j238M54J258r78j133J077J072j142j202J332
1907E27N87j283l67J249Q0j176K89P83n30r32P84Q60p80q81J008N66j451J01J170
1926F04m53j413R73J157j337q96J190Q98j576m14J598k6j260j34J340j52j486
1943a387N86Q63k48j175N40J524j040r96J039M40j087j45J389r5j788O98J421
1960E39j068p31J098N88j279K41Q13o6j048Q28N21k81j359P19J021n19j019J047
1978D5O06r54k80J057K8j412L52J787q26j397Q27J543j412n87J065m0n08K17R22
1997A033o91o14O48J081j136o00Q19M27o37m63R72L79j358O47R45n86o81J21J148
$$ plain form
1873 399 1468 746 -296 628 1366 308 -122 904 1174 463 224 1335 752 -373 351 1625 694 -676
1891 -676 751 1820 -104 -509 1073 1027 -211 243 1501 523 -610 467 1539 397 -805 527
1907 527 1114 -169 -536 713 793 -383 -94 689 159 -773 11 871 91 -790 218 784 -667 -566 604
1926 604 151 -1262 -289 868 -469 -1365 -175 723 -853 -1267 331 305 -955 -1089 251 99 -1387
1943 -1387 -801 62 -186 -1361 -821 703 -337 -1333 -294 146 -941 -1086 303 208 -1580 -882 539
1960 539 -529 -1260 -162 426 -853 -612 201 135 -913 -85 436 155 -1204 -485 536 17 -1002 45
1978 45 651 -303 -583 474 502 -910 -558 1229 403 -994 -167 1376 -36 -623 442 402 -106 111 1033
1997 1033 342 -272 376 1457 321 -279 540 967 330 -133 839 1218 -140 507 1452 866 185 306 1454
2016A454q27j234J029R11j070p6P29k22p04M28R48q71j045J264P27j157o96Q98
2034D86N03r05K5O11k36o75J03Q45n93q21Q06M88p68q97J432L52j475J1J596q30
2054E8j282Q51J299j398o50J025L49j111O0J069m42r31N44P53l77p98M91N37p03
2073f56p41Q82N05o75k28J001k23j187O78Q87n49j078J070R67j568k37J251j15
2091a6q72o1J190l96q48O94Q68r26r57J162P61r24m55Q73L80r05k66J110o0j281
2111i29J011P69o82p30R43O68j257m79J293r3r74O24J185r95r04Q42Q24j192k90
2130c66Q79L07q62l65J452j35j189L18J288l24j189L84J238j120m83Q15N32j429
2148b49j26J870m56j499M74J344p40j084J000Q50j393M5P83Mj032K76P66R9j366
$$ plain form
2016 1454 627 -607 422 1333 263 187 916 694 -10 418 1366 495 -550 714 1441 284 -412 486
2034 486 989 84 109 720 484 -191 -88 757 164 -657 149 637 -131 -1028 404 756 -719 -708 888 58
2054 58 -1224 -373 926 -472 -1122 -97 252 -859 -799 270 -172 -1103 -559 194 -183 -981 -490 47 -656
2073 -656 -1397 -515 -10 -685 -913 88 -135 -1322 -644 243 -306 -1384 -314 653 -915 -1152 99 -16
2091 -16 -888 -949 241 -155 -1003 -309 559 -367 -1324 -162 599 -325 -780 93 473 -432 -698 412 352 -929
2111 -929 82 851 169 -561 382 1050 -207 -686 607 514 -460 164 1349 354 -550 292 1116 -76 -366
2130 -366 513 820 -42 -407 1045 910 -279 39 1327 1003 -186 198 1436 316 -167 648 1180 -249
2148 -249 -375 1495 1039 -460 14 1358 618 -466 534 1384 -9 36 819 823 -209 67 833 932 -434
2167d34OJ821p98j536J009O69q24l72Q83L29j217k53J707q42r65L89J334r45j117
2186a156J396L67j240m70J511k45j080K31J350r40q45Q04R64r53r87R43N99p54
2204e05n35R74J65j344K73J278l95j318Q49J137o24j424J414L16q99k40J164l77
2222i1q28L32J065l84j271J007L01m55n45O66L92n01n46J006K25j217O15J010
2240G81r07l96Q14L06p36k29R56K44j107M79M71J8j092L15O96j97n36O45J95m98
2260B22k25Q70j95m08J38K38J70o63K61L64j02p54M84O67r08j67Q09j55o22M97
2280E21N50r39j15M44O53p04m63O70K4n58J71J32L7l63j53Q18m09l46j75Q95k57
2301D33q58P36K69o71J48L92j28r69N11P36j024k22M48O92j048R5M26l25j44o5
$$ plain form
2167 -434 -428 1393 595 -941 68 737 -87 -459 424 753 -464 -717 990 148 -817 -428 906 -39 -1156
2186 -1156 240 607 -633 -1103 408 163 -917 -686 664 -276 -1121 -317 647 -306 -1293 -350 249 -505
2204 -505 -1040 -66 99 -1245 -972 306 -89 -1407 -558 579 -45 -1469 -55 261 -638 -878 286 -91
2222 -91 -919 -587 478 94 -1177 -170 131 -324 -869 -203 189 -312 -858 148 373 -844 -229 781
2240 781 -126 -522 292 598 -138 -367 589 833 -274 205 676 694 -398 -83 613 416 -120 525 720 222
2260 222 -3 867 672 264 402 640 810 147 408 772 670 -84 400 1067 159 -8 801 646 24 521
2280 521 1071 132 17 461 1114 410 -53 617 641 83 254 386 423 60 -93 725 316 -30 -205 690 433
2301 433 -425 311 580 -91 57 449 321 -648 -137 599 -425 -647 -199 493 -555 -460 -34 -359 -503 -568
2321e68N95o72k32N79M00m77l63N42L79p02k13O43K51j264L80R09l05p53N01O49
2341B79p18o92J150Jr42M30P06m36m06J75P39r42P9L00L93o27k0O75r4o32L3Q98
2363C49m63r63P84P90m93m57M89L75r02rJ039k63o48J90Q48m21p53J022O0l45
2383B29l94N65o4l50J98O58m46p31O08P26m86r68P85Q48n07p28N80N47j091j51
2403a72J211k36j055O37P09n72n62N57M12n36l06L61Mk20j85M20Q3n03k1N76M4
2424F46r83M85P63q13l04M91M42r53k47J011l50q35N37M54k73o93N45K95j000
2443g82M48N26mo80J37N12N2p93K96J38Q0o61K90M59l76l28N90O1o45q6N43j63
2465c86l93L10O22q16K8K93L43p48K01M43m9n71M1P95l43o35M06O11k69n49N15
$$ plain form
2321 -568 27 -645 -877 -298 102 -375 -738 -196 183 -519 -732 -89 162 -1102 -722 187 -118 -871 -370 279
2341 279 -439 -1131 19 20 -922 -492 214 -222 -628 -453 286 -656 -577 -277 116 -511 -531 144 50 -582 -549 349
2363 349 -114 -1077 -293 497 4 -453 36 411 -491 -500 539 276 -372 -182 666 245 -508 514 574 229
2383 229 -165 400 336 -14 184 842 396 -335 273 999 513 -455 330 1178 671 -57 523 1070 -21 -172
2403 -172 1039 803 -252 385 1094 522 -40 517 929 393 87 448 452 232 47 467 550 47 26 602 646
2424 646 -337 148 911 98 -206 285 727 -226 -473 538 188 -647 -110 344 71 -622 -77 218 -782
2443 -782 -334 192 188 -492 -355 157 209 -584 -288 -150 -70 -731 -441 18 -358 -686 -96 -35 -680 -766 -223 -386
2465 -386 -779 -469 153 -663 -635 -342 1 -747 -546 -103 -152 -723 -682 113 -230 -865 -459 152 -117 -666 -151
2486a51J3k00j32O03J02o65qP60j00r67N23M03j36k87N33K5l68K43K96o05j37
2507b55M49J35j13k05J80q4J75j32J43J4m9l3M71l84j74M0M16l96m57P95J13l47
2529C02k70O99k23k86l24M06L05l53L49J30m15J54j19k7k49J80J00K56m03M7K78
2550E37k41l55M92M7m61k4N30l35l4k34O18n30q9R6K99k23l17K83K27n87J80K08
2572H7k48j44K50N31q85L53n8j19j04L83m66p8R4j22N72j95m14L02L71m61n24
2593h75O22J99n62K41K00j66k74L99J78m19j95L99K11j96j66K65J8m15J44K06
2613a86R6m35J15N03m25j34J81N56n51j47O97j15m74K00L02R5n41M80K5l77LL35
2635B03J23m64J99L08m0l35R1K85J76n32J48M93j73m90L34M88m44l88L40K62n14
$$ plain form
2486 -151 -138 -338 -470 133 235 -430 -438 322 222 -745 -222 181 45 -242 291 316 -52 191 487 -118 -255
2507 -255 194 329 216 11 191 107 282 150 293 307 258 225 696 312 138 178 594 198 -259 536 649 302
2529 302 32 731 508 222 -102 304 609 256 605 735 320 474 355 328 79 259 359 615 212 259 537
2550 537 296 -59 433 480 19 -5 525 190 156 -78 540 10 -79 17 316 93 -224 59 286 -301 -121 87
2572 87 -161 -305 -55 476 -409 -56 -114 -233 -337 46 -420 -498 -404 -526 46 -149 -563 -261 110 -351 -875
2593 -875 -253 -54 -616 -375 -175 -341 -615 -216 -38 -457 -652 -253 -42 -238 -404 -139 -121 -536 -392 -186
2613 -186 -90 -525 -410 93 -332 -466 -285 271 -280 -427 270 155 -319 -119 183 278 -263 217 242 -135 -132 203
2635 203 326 -138 61 369 329 -6 85 370 546 14 162 655 482 -8 326 814 370 -18 322 584 70
2656G0m2O65m89k58L03K33k80k0K41L62p11K60J29J27m83O01j62m40J13p8L50
2677D91O9l49m28N39M0m44L61K35n67J04K43J8n53J27O27o56j29O41p1o11M23
2698A10Rk05k92M61j21l36K46M3K09k16l78k8L96r6kj50P54o61k23P66l77k95
2720c86K72R3k57l19M67j0k06j16J17J56l30N07j47j52p0L14k66p9l5K14R2l02
2742d43K37J64j09M7K3P8l49J09K30j0k76P9L3K56n15N02J33m19L89k9m9mN8n6
2766G9R0MJ01j47j42K11j17K6NJ54j66K00j33M5J87j04j65L6L86m05J80j21J4
2789B18R5o8L05J23m77lP5o6K07j61K44l68K27J62K01m60Lm1Nj14R8L00m09o5
2813C1nN6j94m4L10j42lj91M37p6k18J90L1pn11O35n91j53L00J13j84q4K33p9
$$ plain form
2656 70 28 693 204 -54 249 482 202 182 423 785 74 334 463 590 107 708 546 106 219 141 491
2677 491 560 211 -217 322 362 -82 279 514 -53 51 294 312 -241 -114 513 -143 -272 369 298 -313 110
2698 110 119 -86 -378 83 -38 -374 -128 -85 124 -92 -470 -498 -102 -198 -200 -350 404 -257 -480 286 -91 -386
2720 -386 -114 -21 -278 -597 -130 -140 -346 -462 -345 -189 -519 -12 -159 -311 -381 -67 -333 -412 -447 -233 -141 -443
2742 -443 -206 -42 -151 -104 -81 -3 -352 -243 -13 -23 -299 -220 -187 69 -446 56 189 -230 159 130 81 77 135 79
2766 79 169 173 274 127 -15 196 79 105 110 264 98 298 165 210 397 293 128 164 550 145 325 204 218
2789 218 313 245 550 673 196 193 268 202 409 248 492 124 351 513 714 254 257 216 221 107 205 505 96 31
2813 31 26 82 -112 -156 154 12 9 -182 255 179 -39 151 182 175 -336 299 -292 -445 -145 -32 -216 -300 -67 -146
2837a46l05n8N5J70m3m1J86l2k30J89j81J59j95J95M33p07j23M98J06n18j49N37
2859b00r0j10M31k07l89K74P1o2l5k52j39O88m0l73K80P2j44k40M40n4r7o1M41
2882B04j62m24M08M6l76J04M33j48m37N70j29j86m7K23l5L5L4j04J32J86j58p1
$$ plain form
2837 -146 -451 -509 -454 -284 -327 -368 -182 -214 -444 -255 -436 -277 -472 -277 156 -551 -674 -176 -70 -588 -737 -200
2859 -200 -290 -400 31 -176 -565 -291 -220 -282 -317 -569 -708 -20 -60 -433 -153 -81 -225 -465 -25 -79 -176 -237 204
2882 204 42 -382 26 72 -304 -200 233 85 -352 218 89 -97 -144 79 44 79 113 9 141 327 169 98
$$ [...]
8191a20
##END NTUPLES=NMR FID
##END=
