##TITLE=1H_TG-2280-1
 DMSO, 8 sc, 
 27.1.2020
##JCAMPDX= 6.0         $$ Bruker NMR JCAMP-DX V2.0
##DATA TYPE= NMR FID
##DATA CLASS= NTUPLES
##ORIGIN= UXNMR, Bruker Analytische Messtechnik GmbH
##OWNER= root
$$ XWIN-NMR		Version 3.5
$$ Mon Jan 27 13:56:16 2020 Russian Standard Time (UT+4h)  she@DPX200
##.OBSERVE FREQUENCY= 200.1315
##.OBSERVE NUCLEUS= ^1H
##.DELAY= (6, 6)
##.ACQUISITION MODE= SIMULTANEOUS
##.ACQUISITION SCHEME= undefined
##.AVERAGES= 8
##.DIGITISER RES= 18
##SPECTROMETER/DATA SYSTEM= spect
##.PULSE SEQUENCE= zg30
##.SOLVENT NAME= DMSO
##.SHIFT REFERENCE= (INTERNAL, DMSO, 0, 15.7039)
##AUDIT TRAIL= $$ (NUMBER, WHEN, WHO, WHERE, WHAT)
$$ ##TITLE= Audit trail, XWIN-NMR		Version 3.5
$$ ##JCAMPDX= 5.01
$$ ##ORIGIN= Bruker BioSpin GmbH
$$ ##OWNER= she
$$ F:/spectra/data/she/nmr/H-F/1/audita.txt
$$ ##AUDIT TRAIL=  $$ (NUMBER, WHEN, WHO, WHERE, WHAT)
(   1,<2020-01-27 13:55:14.65 +0400>,<she>,<DPX200>,
      <created by zg, POWCHK disabled, PULCHK disabled
       configuration hash MD5:
       00 E9 B6 7A A2 85 ED C7 34 08 36 98 17 FE 4E 26
       data hash MD5: 16K
       09 87 D3 AA 6A AE A0 9A 30 A3 67 2C D9 D7 44 0E>)
$$ ##END=
$$ 
$$ hash MD5
$$ 08 ED F0 1B 4F F1 7D 7A 85 04 A2 32 F7 A7 07 EC
##$RELAX= 
##$RELAX= 
##$RELAX= 
##$RELAX= 
##$RELAX= 
##$RELAX= 
$$ Bruker specific parameters
$$ --------------------------
##$DU= <F:/spectra>
##$EXPNO= 1
##$NAME= <H-F>
##$PROCNO= 1
##$TYPE= <nmr>
##$USER= <she>
##$AMP= (0..31)
100 100 100 100 100 100 100 100 100 100 100 100 100 100 100 100 100 100 
100 100 100 100 100 100 100 100 100 100 100 100 100 100 
##$AQSEQ= 0
##$AQ_mod= 1
##$AUNM= <au_zg>
##$AUTOPOS= <>
##$BF1= 200.13
##$BF2= 200.13
##$BF3= 200.13
##$BF4= 200.13
##$BF5= 200.13
##$BF6= 200.13
##$BF7= 200.13
##$BF8= 200.13
##$BYTORDA= 1
##$CFDGTYP= 0
##$CFRGTYP= 5
##$CHEMSTR= <none>
##$CNST= (0..31)
1 1 145 1 1 1 1 1 1 1 1 1 1 1 1 1 1 1 1 1 1 1 1 1 1 1 1 1 1 1 1 1 
##$CPDPRG= <>
##$CPDPRG1= <>
##$CPDPRG2= <>
##$CPDPRG3= <>
##$CPDPRG4= <mlev>
##$CPDPRG5= <mlev>
##$CPDPRG6= <mlev>
##$CPDPRG7= <mlev>
##$CPDPRG8= <mlev>
##$CPDPRGB= <>
##$CPDPRGT= <>
##$D= (0..31)
0 1.2 0 0 0 0 0 0 0 0.06 0 0.03 0 0 0 0 0.0002 0 0 0 0 0 0 0 0 0 0 0 0 
0 0 0 
##$DATE= 1580118914
##$DBL= (0..7)
120 120 120 120 120 120 120 120 
##$DBP= (0..7)
150 150 150 150 150 150 150 150 
##$DBP07= 0
##$DBPNAM0= <>
##$DBPNAM1= <>
##$DBPNAM2= <>
##$DBPNAM3= <>
##$DBPNAM4= <>
##$DBPNAM5= <>
##$DBPNAM6= <>
##$DBPNAM7= <>
##$DBPOAL= (0..7)
0.5 0.5 0.5 0.5 0.5 0.5 0.5 0.5 
##$DBPOFFS= (0..7)
0 0 0 0 0 0 0 0 
##$DE= 6
##$DECBNUC= <off>
##$DECIM= 24
##$DECNUC= <off>
##$DECSTAT= 4
##$DIGMOD= 1
##$DIGTYP= 9
##$DL= (0..7)
0 120 120 120 120 120 120 120 
##$DP= (0..7)
150 150 150 150 150 150 150 150 
##$DP07= 0
##$DPNAME0= <>
##$DPNAME1= <>
##$DPNAME2= <>
##$DPNAME3= <>
##$DPNAME4= <>
##$DPNAME5= <>
##$DPNAME6= <>
##$DPNAME7= <>
##$DPOAL= (0..7)
0.5 0.5 0.5 0.5 0.5 0.5 0.5 0.5 
##$DPOFFS= (0..7)
0 0 0 0 0 0 0 0 
##$DQDMODE= 0
##$DR= 18
##$DS= 0
##$DSLIST= <SSSSSSSSSSSSSSS>
$$ [...]
##$SUBNAM2= <"">
##$SUBNAM3= <"">
##$SUBNAM4= <"">
##$SUBNAM5= <"">
##$SUBNAM6= <"">
##$SUBNAM7= <"">
##$SUBNAM8= <"">
##$SUBNAM9= <"">
##$SW= 24.9337058887773
##$SWIBOX= (0..15)
0 0 2 0 0 0 0 0 0 0 0 0 0 0 0 0 
##$SW_h= 4990.01996007984
##$TD= 16384
##$TD0= 1
##$TE= 0
##$TE2= 300
##$TE3= 300
##$TEG= 300
##$TL= (0..7)
0 120 120 120 120 120 120 120 
##$TP= (0..7)
150 150 150 150 150 150 150 150 
##$TP07= 0
##$TPNAME0= <>
##$TPNAME1= <>
##$TPNAME2= <>
##$TPNAME3= <>
##$TPNAME4= <>
##$TPNAME5= <>
##$TPNAME6= <>
##$TPNAME7= <>
##$TPOAL= (0..7)
0.5 0.5 0.5 0.5 0.5 0.5 0.5 0.5 
##$TPOFFS= (0..7)
0 0 0 0 0 0 0 0 
##$TUNHIN= 0
##$TUNHOUT= 0
##$TUNXOUT= 0
##$USERA1= <user>
##$USERA2= <user>
##$USERA3= <user>
##$USERA4= <user>
##$USERA5= <user>
##$V9= 5
##$VALIST= <valist>
##$VCLIST= <CCCCCCCCCCCCCCC>
##$VD= 0
##$VDLIST= <DDDDDDDDDDDDDDD>
##$VPLIST= <PPPPPPPPPPPPPPP>
##$VTLIST= <TTTTTTTTTTTTTTT>
##$WBST= 1024
##$WBSW= 4
##$XGAIN= (0..3)
0 0 0 0 
##$XL= 0
##$YL= 0
##$YMAX_a= 941840
##$YMIN_a= -502377
##$ZGOPTNS= <>
##$ZL1= 120
##$ZL2= 120
##$ZL3= 120
##$ZL4= 120
##$ABSF1= 10
##$ABSF2= 0
##$ABSG= 5
##$ABSL= 3
##$ALPHA= 0
##$AQORDER= 0
##$ASSFAC= 0
##$ASSFACI= 0
##$ASSFACX= 0
##$ASSWID= 0
##$AUNMP= <proc_1d>
##$AZFE= 0.1
##$AZFW= 0.1
##$BCFW= 1
##$BC_mod= 2
##$BYTORDP= 1
##$COROFFS= 0
##$CY= 11.3945322036743
##$DATMOD= 1
##$DC= 2
##$DFILT= <>
##$DTYPP= 0
##$F1P= 16.9975609425685
##$F2P= -3.02152046262296
##$FCOR= 0.5
##$FTSIZE= 0
##$FT_mod= 4
##$GAMMA= 1
##$GB= 0.15
##$INTBC= 1
##$INTSCL= 1
##$ISEN= 128
##$LB= 0.24
##$LEV0= 0
##$LPBIN= 0
##$MAXI= 10000
##$MC2= 0
##$MEAN= 0
##$ME_mod= 0
##$MI= 1.114404
##$NCOEF= 0
##$NC_proc= 0
##$NLEV= 6
##$NOISF1= 3.799351
##$NOISF2= 2.8
##$NSP= 1
##$NTH_PI= 0
##$NZP= 0
##$OFFSET= 15.70392
##$PC= 1
##$PHC0= -9790.671
##$PHC1= 18.8008
##$PH_mod= 1
##$PKNL= yes
##$PPARMOD= 0
##$PSCAL= 0
##$PSIGN= 0
##$REVERSE= no
##$SF= 200.130013532006
##$SI= 16384
##$SIGF1= 3
##$SIGF2= 2
##$SINO= 400
##$SIOLD= 16384
##$SREGLST= <1H.CDCl3>
##$SSB= 0
##$STSI= 0
##$STSR= 0
##$SW_p= 3612.71676300578
##$SYMM= 0
##$S_DEV= 0
##$TDeff= 0
##$TDoff= 0
##$TI= <>
##$TILT= no
##$TM1= 0
##$TM2= 0
##$TOPLEV= 0
##$USERP1= <user>
##$USERP2= <user>
##$USERP3= <user>
##$USERP4= <user>
##$USERP5= <user>
##$WDW= 1
##$XDIM= 8192
##$YMAX_p= 0
##$YMIN_p= 0
$$ End of Bruker specific parameters
$$ ---------------------------------
##NTUPLES= NMR FID
##VAR_NAME=  TIME,          FID/REAL,        FID/IMAG
##SYMBOL=    X,             R,               I
##VAR_TYPE=  INDEPENDENT,   DEPENDENT,       DEPENDENT
##VAR_FORM=  AFFN,          ASDF,            ASDF
##VAR_DIM=   8192,          8192,            8192
##UNITS=     SECONDS,       ARBITRARY UNITS, ARBITRARY UNITS
##FACTOR=    0.0002004,     1,               1
##FIRST=     0,             0,               0
##LAST=      1.6414764,     0,               0
##MIN=       0,             -502377,         0
##MAX=       1.6414764,     941840,          0
$$ Real data points
##PAGE= N=1
##DATA TABLE= (X++(R..R)), XYDATA
$$ [...]
$$ plain form
1833 34 144 307 90 60 120 284 -47 -137 -51 -256 -8 -5 -197 10 242 247 38 -181 -194 129 -332 -200 -356
1856 -356 75 -18 -7 -204 196 120 2 8 -13 528 -43 -244 -200 -465 -5 -145 84 -159 165 -237 197 -110
1878 -110 -353 95 130 -292 -170 58 171 -49 118 -165 60 266 -34 -13 -346 122 49 -112 -101 159 59
1899 59 131 -272 6 333 154 -219 -106 139 59 183 -114 -68 -285 43 64 -241 63 104 341 -139 -167 -1
1921 -1 356 44 265 207 188 -97 -85 110 -152 137 -1 -38 -146 213 96 -18 -324 -184 124 225 54 -248
1943 -248 -91 -9 -103 -51 29 245 100 -18 198 -42 248 113 -9 -192 151 126 -72 -139 -31 117 201 -175
1965 -175 -20 -87 412 252 -397 -12 -58 -9 125 10 -35 158 -208 -44 -232 -80 315 219 -98 -340 -101 -230
1987 -230 9 -159 -190 26 14 -350 10 46 437 123 -169 -25 156 79 -210 -121 353 -92 174 -32 -120 91
$$ packed form
1833C4J10J63k17l0O0J64l31r0Q6k05K48Lj92K07K32Nk09k19j3L23m61J32j56
1856c56M31r3J1j97M00p6j18Ok1N41n71k01M4k65M60j40K29k43L24m02M34l07
1878a10k43M48L5m22J22K28J13k20J67k83K25K06l00K1l33M68p3j61J1K60j00
1899E9P2m03K78L27j79l73J13K45q0J24k97M6k17L28K1l05L04M1K37m80k8J66
1921aL57l12K21n8j9k85J2J95k62K89j38l7j08L59j17j14l06J40L08J01j71l02
1943b48J57Q2r4N2Q0K16j45j18K16k40K90j35j22j83L43k5j98o7J08J48Q4l76
1965a75J55o7M99j60o49L85m6M9J34j15m5J93l66J64j88J52L95r6l17k42K39j29
1987b30K39j68l1K16j2l64L60L6L91l14k92J44J81p7k89Q9M74m45K66k06q8K11
$$ plain form
2009 91 -91 -44 -123 -90 244 121 -256 -132 32 115 274 8 -252 241 83 -128 -89 42 161 74 -101 -139 -171
2032 -171 -11 -1 -82 274 89 88 -349 -320 -94 44 -76 -140 -350 6 83 -74 -337 -128 330 -12 -177 -270 -3
2055 -3 210 -170 -8 -145 81 -16 -63 -42 40 37 -28 -188 -38 181 243 -42 -107 -3 208 222 -31 -28 -9 -214 419
2080 419 -298 -157 -39 -32 -33 192 -296 272 -184 -219 -233 239 178 120 21 -216 79 -99 -45 -101 -283 100 92 -368
2104 -368 -17 188 418 -130 3 -41 67 70 -149 -274 2 149 -74 -269 114 -123 31 -321 -433 -322 206
2125 206 322 -258 -104 -143 50 25 -124 -146 -130 74 -51 -336 39 61 -93 -188 91 333 124 83 115 -3 176
2148 176 -107 -18 279 328 139 -71 -137 12 383 -6 -125 -229 -223 92 43 -156 -142 -174 81 119 -19 60 -58
2171 -58 182 -46 -98 42 -151 158 -424 -26 256 310 -65 -64 59 178 115 118 -269 132 260 29 -234 -327 -34
$$ packed form
2009I1j82M7p9L3L34j23l77J24J64Q3J59k66k60M93j58k11L9J31J19q7j75l8l2
2032a71J60J0q1L56j85jm37K9K26J38j20o4k10L56P7j57k63K09M58l42j65r3K67
2055cK13l80J62j37K26r7m7K1Q2lo5j60J50K19O2k85o5J04K11J4k53LJ9k05O33
2080D19p17J41J18PjK25m88N68m56l5j4M72o1n8r9k37K95j78N4n6j82L83qm60
2104c68L51K05K30n48J33m4J08Lk19j25K76J47k23j95L83k37J54l52j12J11N28
2125B06J16n80J54l9J93k5j49k2J6K04j25k85L75K2j54r5K79K42k09m1L2j18J79
2148A76k83Q9K97M9j89k10o6J49L71l89j19j04OL15m9j99J4l2K55L8j38P9j18
2171e8K40k28n2J40j93L09n82L98K82N4l75JJ23J19o3Ll87M01J28k31k63r3K93
$$ plain form
2194 -34 133 36 27 -107 -104 19 -342 -283 -159 194 -59 0 -362 -102 69 97 51 15 243 18 77 -176 54 87
2218 87 -214 -152 -94 65 241 -35 25 -111 202 41 -73 205 11 -150 -64 46 -179 138 157 -224 -42 161
2240 161 350 -77 -132 70 81 391 -117 -36 -186 8 -15 -341 -31 15 -204 103 -244 -79 173 106 101 152 2
2263 2 238 -64 -148 27 41 61 128 -353 -80 36 224 -309 -209 -62 282 93 38 10 110 63 -188 50 20
2286 20 151 -246 -223 4 -35 -124 -49 -131 -179 373 235 -299 -29 85 255 17 -159 -148 45 174 6 -47 98
2309 98 -17 -222 -404 -355 222 276 -186 30 -1 107 46 -122 154 -78 -90 437 -101 -62 170 243 4 39 159
2332 159 170 -77 108 69 76 100 50 -161 163 4 -107 -202 -339 67 437 25 -138 10 -57 221 -13 44 -41
2355 -41 -23 -208 -287 191 141 -28 -25 -44 95 329 43 109 -172 -83 258 100 39 -29 145 17 264 -24 -157 236
$$ packed form
2194c4J67r7rj34LJ23l61N9J24L53k53N9l62K60J71K8m6l6K28k25N9k53K30L3
2218H7l01O2N8J59J76k76O0j36L13j61j14K78j94j61Q6J10k25L17J9l81J82K03
2240A61J89m27n5K02J1L10n08Q1j50J94k3l26L10M6k19L07l47J65K52o7nN1j50
2263BK36l02q4J75J4K0O7m81K73J16J88n33J00J47L44j89n5k8J00m7k51K38l0
2286B0J31l97K3K27l9q9P5q2m8N52j38n34K70J14J70k38j76J1J93J29j68n3J45
2309I8j15k05j82M9N77N4m62K16l1J08o1j68K76k32j2N27n38L9K32P3k39L5J20
2332A59J1k47J85l9PK4n0k11L24j59j11r5j37M06L70m12j63J48o7K78k34N7q5
2355d1J8j85p9M78n0j69Lj9J39K34k86O6k81Q9L41j58o1o8J74j28K47k88j33L93
$$ plain form
2379 236 43 30 -197 -140 149 135 -218 -148 306 202 -252 -74 178 198 -47 -2 -14 -68 -44 329 -105 -269 187
2402 187 165 -46 -92 260 -27 37 -123 30 169 -1 -203 -249 170 -241 17 -295 112 14 -171 86 80 -117
2424 -117 -47 192 -430 -184 -212 309 129 117 -134 50 -20 -21 63 -191 -103 -12 -325 65 85 44 -24 -163 -134 -20
2448 -20 87 56 -58 -29 360 207 -152 140 120 129 66 -142 -208 24 84 -54 -10 -5 137 -43 236 138 -135 74
2472 74 118 -174 -125 224 -122 -84 228 -29 111 15 -339 -12 -5 -43 -74 -5 13 122 88 -217 -338 -31 46 -106
2496 -106 -120 -166 146 90 -122 18 38 265 -2 -223 -128 61 9 -315 -66 -9 200 190 -145 38 142 -178 -245
2519 -245 127 -212 188 105 -10 -323 43 275 -66 269 191 121 -112 154 -386 135 195 99 -186 -138 -20 108
2541 108 -11 -76 -32 170 190 18 -383 -63 102 153 -217 246 -22 49 134 62 230 -57 -65 -43 242 156 56 231
$$ packed form
2379B36j93j3k27N7K89j4l53P0M54j04m54J78K52K0k45M5j2n4K4L73m34j64M56
2402A87k2k11m6L52k87O4j60J53J39j70k02m6M19m11K58l12M07r8j85K57oj97
2424a17P0K39o22K46k8N21j80j2k51J84p0jQ4k54Q8R1l13L90K0m1o8j39K9J14
2448b0J07l1j14K9L89j53l59K92k0Ro3k08o6K32O0j38M4NJ42j80K79r8k73K09
2472G4M4k92M9L49l46L8L12k57J40r6l54L27Pl8l1O9J8J09l4l05j21L07P7j52
2496a06j4m6L12n6k12J40K0K27k67k21R5J89n2l24K49N7K09j0l35J83J04l20o7
2519b45L72l39M00q3j15l13L66K32l41L35p8p0k33K66n40N21O0r6k85M8J18J28
2541A08j19o5M4K02K0j72m01L20J65N1l70M63k68P1Q5p2J68k87qK2K85q6j00J75
$$ plain form
2565 231 206 60 51 85 -27 67 133 203 -145 -68 -349 40 -25 -229 -85 -23 35 -96 104 -51 -285 253 32 -11
2589 -11 -174 45 93 -229 -321 -157 -37 -57 58 -59 -21 -125 -93 20 -103 144 -119 -341 -72 -98 -94 109 -285
2612 -285 14 90 -20 43 -172 -85 229 245 -99 38 -41 46 227 -120 197 220 221 -111 -237 -3 103 93 -13
2635 -13 -178 258 -41 26 -33 64 206 -92 167 -416 48 -51 -79 54 173 171 30 332 -221 148 193 51 73
2658 73 126 91 36 -249 -134 -1 -143 -20 90 -119 42 74 195 -60 -219 265 35 -260 159 -149 130 4
2680 4 -196 33 -17 186 3 -25 -78 56 50 161 87 -154 190 51 -178 -113 78 114 138 22 301 -45 -187 118
2704 118 -198 -212 45 76 -466 -86 -308 -75 51 -67 75 25 99 -161 -44 80 452 24 -329 162 -111
2725 -111 -144 -82 -196 -23 68 -84 -127 -41 108 121 -33 -370 78 9 -54 -355 -83 134 101 327 -277 -120 13
$$ packed form
2565B31k5j46rL4j12R4O6P0l48P7k81L89o5k04J44O2N8j31K00j55k34N38k21m3
2589a1j63K19M8l22r2J64J20k0J15j17L8j04L2J13j23K47k63k22K69k6MK03l94
2612b85K99P6j10O3k15Q7L14J6l44J37p9Q7J81l47L17K3Jl32j26K34J06j0j06
2635a3j65M36k99O7n9R7J42k98K59n83M64r9k8J33J19kj41L02n53L69M5j42K2
2658G3N3l5n5k85J15J33j42J23J10k09J61L2J21k55j59M84k30k95M19l08K79j26
2680Dk00K29n0K03j83k8n3J34oJ11p4k41L44j39k29O5J91L6K4j16K79l46j42L05
2704A18l16j4K57L1n42L80k22K33J26j18J42n0P4k60J17J24L72m28l53M91k73
2725a11l3O2j14J73R1j52m3Q6J49J3j54l37M48o9o3l01K72K17l3K26o04J57J33
$$ plain form
2748 13 -56 -54 -254 -257 11 137 -11 -71 276 -35 -99 131 -314 -58 -25 19 -59 204 61 -27 -52 35 -155 106 154
2773 154 -280 -110 -103 144 -101 -184 -69 27 237 -15 32 -91 -61 -179 36 98 222 43 -294 187 -89 31
2795 31 -51 1 221 -148 53 -78 -169 -89 -170 -248 124 -36 23 140 81 -169 -94 163 24 -102 -24 -83 -122 123
2819 123 -329 48 -186 207 143 -172 -160 47 -38 -130 -240 56 305 151 52 -135 100 -56 -127 -417 -67 34
2841 34 168 93 -101 -24 88 101 0 88 -65 69 34 -38 -33 -1 212 -176 76 -142 -281 -186 -57 -208 255 -109
2865 -109 130 83 111 -82 150 170 23 68 154 -71 -311 67 21 -134 -69 111 -155 144 -320 119 45 -16 0
2888 0 -228 -43 -76 21 -229 -446 -60 192 43 -108 2 90 -169 18 -44 -207 -29 -40 52 59 68 85 76 134 -83
2913 -83 16 -123 45 27 72 -31 -168 282 -141 -140 -118 68 -98 -226 -269 11 136 -4 61 -55 133 -176 -146
$$ packed form
2748A3o9Kk00lK68J26j48o0L47l11o4K30m45K56L3M4p8K63j43q8k5Q7j90K61M8
2773A54m34J70PK47k45q3J15R6K10k52M7j23L0j18K15O2J24j79l37M81k76J20
2795C1q2N2K20l69K01j31r1Q0q1p8L72j60N9J17n9k50P5K57j39j26P8n9l9K45
2819A23m52L77k34L93o4l15J2K07q5r2j10K96K49j54r9j87K35j56p1k90L50J01
2841C4J34p5j94P7J12J3j01Q8j53J34l5p2NL2K13l88K52k18j39R5J29j51M63l64
2865a09K39m7K8j93K32K0j47M5Q6k25k40L78m6j55O5J80k66K99m64M39p4o1J6
2888@k28J85l3R7k50k17L86K52j49j51J10Q8k59J87o2j63J78j1R2PRJ7rN8k17
2913h3R9j39J68j8M5j03j37M50m23JK2J86j66j28m3K80J25j40O5j16J88l09L0
$$ plain form
2936 -146 -177 168 390 -208 15 320 29 48 -5 -80 342 125 93 -364 179 -76 -55 90 -208 -94 97 -196
2958 -196 -201 -18 424 -307 -87 126 -213 243 -198 -176 136 -178 -117 -168 194 -93 102 231 -300 117 18 -130
2980 -130 176 -142 -61 136 70 219 -5 11 181 -317 33 34 -110 152 36 -62 14 -163 17 -171 37 -68
3002 -68 43 -224 -219 -249 -16 320 230 135 -146 401 -217 -5 19 -118 87 -156 231 67 311 306 -403 37 -2
3025 -2 -51 -138 -265 -2 173 -47 91 100 29 12 -260 194 -128 241 27 28 -87 53 -85 231 -12 -8 130 -142
3049 -142 185 -51 89 137 -194 217 -79 112 -79 266 -79 -77 -10 83 142 -254 15 -190 333 -31 -415 172
3071 172 -21 -31 177 84 -140 -29 -300 -210 66 176 46 119 -9 -84 117 -23 -79 -63 131 115 220 233 -143
3094 -143 50 -101 -169 -267 44 -179 -178 -314 -53 95 174 -60 -48 -126 -77 -43 -36 77 109 -93 187 -191 -54 294
$$ packed form
2936a46l1L45K22n98K23L05k91J9n3p5M22k17l2m57N43k55K1J45k98J14J91k93
2958a96nJ83M42p31K20K13l39M56m41K2L12l14O1n1L62k87J95J29n31M17r9j48
2980a30L06l18Q1J97o6J49k24J6J70m98L50Jj44K62j16r8P6j77J80j88K08j05
3002f8J11k67Nl0K33L36r0r5k81N47o18K12K4j37K05k43L87j64K44np09M40l9
3025bm9q7j27K63J75k20J38Rp1j7k72M54l22L69k14Jj15J40j38L16k43MJ38k72
3049a42L27k36J40M8l31M11k96J91j91L45l45KO7R3N9l96K69k05N23l64l84N87
3071A72j93j0K08r3k24J11k71R0K76J10j30P3j28p5K01j40n6J6J94j6J05J3l76
3094a43J93j51o8r8L11k23Jj36K61J48P9k34J2p8M9L4PJ13L2k02K80l78J37L48
$$ plain form
3118 294 103 82 -394 -278 -117 -21 90 56 -123 -115 -14 -20 -287 -125 -173 -139 -176 33 116 -61 70 -114 369 -55
3142 -55 -111 -212 -93 160 -97 -100 33 205 254 40 -158 442 -7 -15 101 -21 -165 213 272 -21 -97 72 14
3165 14 56 324 -27 89 88 151 -170 209 119 -108 79 8 47 138 13 163 34 -153 -204 -107 -146 -50 87 -67
3189 -67 30 -101 215 239 435 -95 -48 163 269 21 -147 -50 -57 -41 8 145 160 -9 99 -21 16 -128 -104 14
3213 14 28 359 -81 -215 -172 -219 102 142 61 160 -201 174 281 183 209 39 54 278 38 -68 -128 241 99 10
3237 10 -164 251 44 -210 -53 155 48 32 101 11 -16 11 315 3 -163 -55 -62 -32 103 218 -35 26 -50 -117
3261 -117 32 159 -27 209 46 182 109 119 163 39 -126 44 82 184 114 30 81 -173 60 36 62 131 244
3284 244 126 -252 23 -238 132 -60 -40 -265 -317 -24 -91 -106 139 83 -199 59 91 -48 83 -110 228 11
$$ packed form
3118B94j91k1m76J16J61R6J11l4j79QJ01ok67J62m8L4l7K09Q3j77J31j84M83m24
3142e5n6j01J19K53k57lJ33J72M9k14j98O00m49qJ16j22j44L78N9k93p6J69n8
3165A4M2K68l51J16jO3l21L79r0k27J87p1L9R1j25J50j29j87n1R7l9R6J37j54
3189f7R7j31L16K4J96n30M7K11J06k48j68R7pJ6M9J37J5j69J08j20L7j44K4J18
3213A4J4L31m40j34M3m7L21M0q1R9l61L75J07r8K6j70J5K24k40j06o0L69j42q9
3237A0j74M15k07k54J57K08j07j6O9r0k7K7L04l12j66J08pL0J35J15k53O1p6o7
3261a17J49J27j86K36j63J36p3J0M4j24j65J70L8J02p0q4N1k54K33k4K6O9J13
3284B44j18l78K75k61L70j92K0k25n2K93o7j5K45n6k82K58L2j39J31j93L38k17
$$ plain form
3306 11 155 16 47 -495 -7 -149 84 35 -23 234 147 61 -264 -134 155 51 -122 77 119 344 97 96 62
3329 62 -77 285 1 193 615 -28 -44 -154 -257 -63 -17 -97 -101 216 188 146 248 -102 198 -68 70 -88 -95
3352 -95 122 18 -137 -284 -248 -164 -33 -98 115 58 -91 -44 -49 25 116 -386 202 -72 48 190 56 -84 -259
3375 -259 -174 -40 -80 113 197 -88 -114 5 -36 249 43 133 32 267 200 70 6 0 -62 -131 122 65 -181 147
3399 147 250 -404 83 -27 130 107 -59 -150 126 68 17 -364 -4 -27 144 -167 15 61 1 261 -160 -101 179
3422 179 -318 -135 -48 -12 -243 99 295 -101 -86 108 -31 -70 210 -316 -48 -277 279 58 59 198 -119 104
3444 104 233 -26 -211 103 141 -26 74 -251 -146 -20 102 -73 -176 -139 -79 152 -243 67 70 -107 -203 -54
3466 -54 -174 -107 -82 148 -15 -59 -256 3 117 -280 -94 -97 -244 -187 -125 -152 -98 251 -23 75 225 -78 18 -72
$$ packed form
3306A1J44j39L1n42M88j42K33m9n8K57q7q6l25J30K89j04j73J99M2K25k47jl4
3329F2j39L62k84J92M22o43j6j10j03J94M6q0mL17k8m2J02l50L00k66J38j58p
3352i5K17j04j55j47L6Q4J31o5K13n7j49M7nP4R1n02N88k74J20J42j34j40j75
3375b59Q5J34m0J93Q4k85k6J19m1K85k06R0j01K35o7j30o4oo2o9K53n7k46L28
3399A47J03o54M87j10J57k3j66r1K76n8n1l81L60k3J71l11J82M6o0K60m21N9K80
3422A79m97J83Q7L6k31L42J96l96J5J94j39l9K80n26K68k29N56k21JJ39l17K23
3444A04J29k59j85L14L8j67J00l25J05J26J22j75j03L7O0K31l95L10Lj77r6J49
3466e4j20O7K5K30j63m4j97K59J14l97J86lj47N7O2k7N4L49k74R8J50l03R6r0
$$ plain form
3490 -72 -137 -106 -209 -110 -22 39 -156 9 208 60 192 141 -134 -117 190 -46 99 59 -40 99 -159 90 14 -31
3514 -31 -12 139 37 -224 233 484 -18 -139 -135 -96 -361 106 109 -180 -113 107 -119 -90 -77 75 -99 166 62
3537 62 121 -85 148 105 72 44 103 192 173 -148 246 -33 45 92 -57 97 -13 30 -117 51 -209 294 72 -1
3561 -1 68 135 -86 -33 367 -320 -29 127 133 -133 19 -81 -31 -18 -2 -150 -137 138 77 -107 111 100 -69 -101 -5
3586 -5 -243 -168 -190 -91 -7 64 -123 -331 -247 -154 -38 -225 27 157 55 -28 -123 -133 -279 7 62 67 270 -168 151
3611 151 151 123 33 -96 135 131 188 93 170 176 -57 -283 63 174 -41 -107 192 -181 25 95 91 -390 -81 -233 -99
3636 -99 -194 34 155 276 -28 -104 -147 -107 32 -13 -186 83 -116 16 -146 159 -26 37 187 42 37 -63 10
3659 10 -132 -27 52 -133 30 33 -240 119 92 17 -94 54 107 -40 -73 270 -335 -52 185 -249 113 82 -164
$$ packed form
3490g2o5L1j03R9Q8O1j95J65J99j48J32n1k75J7L07k36J45m0r9J39k58K49p6m5
3514c1J9J51j02k61M57K51n02j21ML9k65M67Lk89O7K20k26K9J3J52j74K65j04
3537F2N9k06K33m3l3k8N9Q9j9l21L94k79P8M7j49J54j10M3j47J68k60N03k22p3
3561aO9O7k21N3M00o87K91J56Ok66J52j00N0J3J6j48J3K75o1j84K18j1j69l2R6
3586ek38P5k2R9Q4P1j87k08Q4R3J16j87K52J30j02q3r5j0j46K86N5NK03m38L19
3611A51%k8r0j29K31mN7r5P7Ok33k26L46J11k15o6K99l73K06P0mm81L09j52J34
3636i9r5K28J21J21l04p6m3M0J39m5j73K69j99J32j62L05j85O3J50j45nj00P3
3659A0j42J05P9j85J63Lk73L59k7p5j11J48N3j47l3L43o05K83K37m34L62l1k46
$$ plain form
3682 -164 -313 50 156 334 134 -260 -39 61 -115 36 129 25 198 276 73 -248 -244 -95 127 163 400 25
3704 25 66 243 -138 -282 77 -174 75 -63 -416 -14 197 -59 -172 -102 -464 -52 -166 122 150 -31 -165
3725 -165 125 -31 -98 -195 -251 -290 -30 -60 123 127 20 -28 -5 125 99 -219 -73 78 -100 -37 -65 17 67 -162 -116
3750 -116 -15 -409 -219 14 25 -187 -88 110 48 91 -187 52 63 -146 96 -112 348 -187 -101 221 0 -177
3772 -177 111 -2 -72 262 127 -194 41 -10 -94 -20 -110 -7 -19 11 112 -122 -5 -124 142 72 11 -96 -2
3795 -2 -217 -406 -383 -1 142 12 51 98 96 -229 -346 62 -23 -62 -39 -185 -211 -149 174 -50 -80 -61 -76 168 160 186
3821 186 -216 -35 152 149 9 -325 57 26 -249 -41 7 -25 113 -80 -108 243 0 -183 8 -339 -88 25
3843 25 -287 -404 100 163 -6 -76 247 -17 -22 129 121 48 199 136 228 188 -4 -294 -26 -143 -14 -103 104 52
$$ packed form
3682a64j49L63J06J78k00l94K21J00j76J51R3j04J73P8k03l21MJ49K22L6K37l75
3704B5M1J77l81j44L59k51K49j38l53M02K11k56j13P0l62M12j14K88K8j81j34
3725a65K90j56o7r7n6l9K60l0J83Mj07m8K3J30k6l18J46J51j78O3k8Q2N0k29M6
3750a16J01l94J90K33J1k12R9J98o2M3k78K39J1k09K42k08M60n35Q6L22k21j77
3772a77K88j13p0L34j35l21K35n1q4P4r0J03j2L0J01k34J17j19K66p0o1j07R4
3795bk15j89K3L82J43j30L9M7kl25j17M08q5l9K3j46k6O2L23k24l0J9j5K44qK6
3821A86m02J81J87lj40l34L82l1k75K08M8l2J38j93k8L51k43j83J91l47K51J13
3843B5l12j17N04O3j69p0L23k64nJ51qp3J51o3R2m0j92k90K68j17J29q9K07n2
$$ plain form
3867 52 -15 -116 71 -177 91 73 -50 -26 -308 179 -72 -8 -7 -153 -160 -352 -3 214 -136 61 115 -56 -12 263
3891 263 8 1 140 155 -101 -163 51 -230 -290 110 4 -40 -189 16 -12 -13 -224 -203 53 -216 -123 116 -188 62
3915 62 -83 218 -418 11 -107 -58 -58 84 218 -117 -123 18 191 -205 180 -69 161 150 70 99 -41 -315 61
3938 61 394 51 58 265 -101 293 -237 141 104 -180 -166 -139 -108 -54 -153 -315 247 94 -356 156 -260 -93 192
3961 192 -21 -152 -75 -44 199 168 -118 -168 -67 183 15 -18 -200 53 -30 112 -35 -13 -43 85 26 4 -258
3984 -258 -20 4 -45 -264 -180 171 -316 19 278 39 104 170 -211 212 184 108 70 -88 -58 -237 -72 149 -13
4007 -13 -126 132 73 -126 144 -30 -18 -7 -115 -80 -222 131 -12 144 -213 162 7 19 10 167 -207 -140 86
4030 86 55 -86 -37 6 -251 -123 -378 -17 -81 233 12 -155 28 -255 -52 -249 -53 -351 40 -491 197 13
$$ packed form
3867E2o7j01J87k48K68j8j23K4k82M87k51O4Jj46pj92L49K17l50J97N4j71M4K75
3891B63k55pJ39J5k56o2K14k81o0M00j06m4j49K05k8jk11K1K56k69R3K39l04K50
3915F2j45L01o36M29j18M9%J42J34l35oJ41J73l96L85k49K30j1q0K9j40k74L76
3938F1L33l43PK07l66L94n30L78l7k84J4K7L1N4r9j62N62j53m50N12m16J67K85
3961A92k13j31P7L1K43l1k86n0J01K50j68l3j82K53q3J42j47K2l0J28n9k2k62
3984b58K38K4m9k19Q4L51m87L35K59k39O5O6l81M23k8p6l8j58L0j79J65K21j62
4007a3j13K58n9j99K70j74J2J1j08L5j42L53j43J56l57L75j55J2rJ57l74O7K26
4030H6l1j41M9M3k57J28k55L61o4L14k21j67J83k83K03j97J96k98L91n31O88j84
$$ plain form
4052 13 346 -17 -228 62 143 203 3 -246 255 -326 184 550 182 -435 226 25 91 146 -70 148 -21 69
4074 69 -31 -1 -285 295 -134 -90 183 -160 26 -42 -260 -29 13 148 9 -108 -165 63 30 75 41 -46 -85 -57
4098 -57 17 81 -72 51 -26 -46 105 -168 -130 16 -136 233 -87 -328 176 311 -143 -8 249 -216 122 -90
4120 -90 -69 -4 98 -5 2 -191 43 286 185 6 -75 -165 -77 318 148 -44 -213 -138 162 199 99 48 161 -83
4144 -83 77 237 41 72 121 -8 77 85 -320 -55 106 -30 127 120 20 333 55 1 127 14 -137 137 167
4167 167 53 -23 34 -120 -24 3 -240 301 -250 -74 -98 236 -7 -56 55 108 -45 -264 103 2 -54 35 187
4190 187 -155 -111 -50 -29 1 -21 -5 -217 103 -202 -20 -133 3 -33 64 178 156 -334 73 35 28 168 -308 -129
4214 -129 140 -212 115 -220 -247 -182 -236 74 168 126 107 -292 -162 -228 141 -18 136 108 164 184 -108 132 -135
$$ packed form
4052A3L33l63k11K90Q1O0k00k49N01n81N10L66l68o17O61k01O6N5k16K18j69R0
4074F9j00L0k84N80m29M4K73l43J86o8k18K31M2J35j39j17n7K28l3M5l4q7l9K8
4098e7P4O4j53J23p7k0J51k73L8J46j52L69l20k41N04J35m54J35K57m65L38k12
4120i0K1O5J02j03Pj93K34K43j01j79q1r0Q8L95j70j92j69P5L00L7j00n1J13k44
4144h3J60J60j96L1M9j29Q5Qm05K65J61j36J57pj00L13k78n4J26j13j51K74L0
4167A67j14p6N7j54R6K7k43N41n51J76k4L34k43m9J11N3j53k19L67j01n6Q9J52
4190A87l42M4O1K1L0k2J6k12L20l05J82j13J36l6R7J14k2m90M07l8pJ40m76J79
4214a29K69l52L27l35k7O5n4L10R4m2j9l99J30o6L69j59J54k8N6K0k92K40k67
$$ plain form
4237 -135 -52 -280 195 39 -49 113 127 -98 -39 80 -245 51 -26 92 -95 95 28 113 144 62 153 -189 473
4260 473 -24 167 115 -136 -46 74 65 -97 110 -94 1 160 15 10 81 -165 -66 101 355 129 177 157 80 -1
4284 -1 15 -66 181 297 -131 161 -279 -166 -48 53 34 247 148 -226 70 412 -277 -74 -45 -98 -25 115 140
4307 140 -21 137 142 -288 1 -134 147 -38 -27 -84 6 -35 -79 -331 -86 25 -84 115 132 20 -199 -251 -72
4330 -72 -27 64 39 -287 106 53 71 35 -322 -75 -421 190 -325 9 -60 13 -1 -168 -151 127 111 438 253 -99
4354 -99 373 229 157 185 28 69 64 84 107 -390 -134 25 -158 127 110 -109 17 183 66 116 33 260 -39 178
4378 178 117 -62 -77 133 -280 71 12 247 25 -91 229 35 -27 450 64 -170 -171 -85 44 -143 32 51 100
4401 100 40 216 71 -112 11 53 -20 63 136 -167 139 -18 -12 277 -468 -95 1 -3 204 299 24 -303 51 -174
$$ packed form
4237a35Q3k28M75j56q8J62J4k25N9J19l25K96p7J18j87J90o7Q5L1q2R1l42O62
4260D73m97J91n2k51R0J20rj62K07k04R5J59j45nP1k46R9J67K54k26M8k0p7q1
4284aJ6q1K47J16m28K92m40J13J18J01j9K13r9l74K96L42o89K03K9n3P3J40K5
4307A40j61J58Nm30K89j35K81j85J1n7R0m1m4k52K45J11j09J99J7j12k19n2J79
4330g2M5R1k5l26L93n3J8l6l57K47l46O11n15L34o9P3j4j67J7K78j6L27j85l52
4354i9M72j44p2K8j57M1nK0K3m97K56J59j83K85j7k19J26J66j17N0q3K27k99K17
4378A78o1j79j5K10m13L51n9K35k22j16L20j94o2M77l86k34jQ6J29j87J75J9M9
4401A00o0J76j45j83J23M2p3Q3P3l03L06j57OK89p45L73R6mK07R5k75l27L54k25
$$ plain form
4425 -174 -391 -6 -103 15 57 -60 12 86 -70 -25 37 -48 -143 304 83 21 89 -49 -202 -153 -27 34 253 155
4449 155 46 132 144 -372 59 -114 221 230 -103 139 -95 40 94 -200 -157 184 86 -133 -131 171 211 57 2 287
4473 287 208 205 156 -222 -41 -90 139 -10 11 -131 -94 -142 384 55 -97 280 -429 -80 37 234 -138 -245 182
4496 182 -266 229 -77 -64 -50 -95 -155 -90 -75 -247 -175 -159 -314 -258 -462 -209 -18 13 -194 187 22 -215 105
4519 105 -183 -24 -151 -52 270 -6 -118 -8 -152 -199 49 -4 -80 -253 123 -171 31 83 -210 -304 19 -185
4541 -185 -80 -119 -49 352 -74 237 -58 -48 -78 -135 185 4 81 -107 -246 151 -45 -24 -142 -97 -76 250 -24
4564 -24 179 -21 226 222 76 97 79 -238 57 -15 -233 55 -30 -13 62 234 37 267 119 44 -44 -35 -269 -330 88
4589 88 186 89 368 16 -96 -13 -143 -126 -330 110 71 -58 -218 15 -130 -100 -184 -65 -96 -37 310 -300 -21
$$ packed form
4425a74k17L85r7J18M2j17P2P4j56M5O2q5r5M47k21o2O8j38j53M9J26O1K19r8
4449A55j09Q6J2n16M31j73L35Rl33K42k34J35N4k94M3L41r8k19KL02M0j54n5K85
4473B87p9lm9l78J81m9K29j49K1j42L7m8N26l29j52L77p09L49J17J97l72j07M27
4496A82m48M95l06J3J4m5o0O5J5j72P2J6j55N6k04K53J91L1k07L81j65k37L20
4519A05k88J59j27R9L22k76j12J10j44m7K48n3p6j73L76k94K02N2k93r4L23k04
4541a85J05l9P0M01m26L11k95J0l0n7L20j81P7j88j39L97j96K1j18M5K1L26k74
4564b4K03k00K47mj46K1j8l17K95p2k18K88q5J7P5J72j97K30j48p5q8Rk34o1M18
4589H8R8r7K79l52j12Q3j30J7k04M40l9j29j60K33j45L0q4J19l1N9L47o10K79
$$ plain form
4612 -21 -64 -125 -7 54 -64 -466 68 8 -37 -105 90 -36 54 -99 -50 85 -211 12 -229 319 123 -18 11
4635 11 28 -33 -334 -46 217 97 -59 -140 169 -33 -33 104 -8 -233 129 -140 29 -44 -8 148 -135 -128 -120 -10
4659 -10 -104 -121 -326 172 -246 -257 257 79 7 120 -30 -100 130 86 -132 1 -365 7 -370 -162 -4 -92 -226
4682 -226 248 -223 -38 -183 215 170 -81 -19 -187 -3 106 341 344 82 -68 111 9 125 -50 179 1
4703 1 151 21 -24 121 65 -7 -31 84 -157 72 -240 -26 -194 -79 5 11 58 132 278 -202 -173 132 -14 -319
4727 -319 -2 45 12 86 -88 113 32 -65 -47 -8 38 -173 -75 -220 7 169 -54 -75 235 35 -51 -252 61 179
4751 179 176 -72 89 -66 36 292 -46 376 174 236 159 -127 195 135 220 -121 195 -30 -213 -27 54 -304
4773 -304 -274 -110 46 -254 -210 97 -172 -219 77 48 -197 -113 90 -120 -106 82 -181 101 -20 150 162 -6
$$ packed form
4612b1m3o1J18O1j18m02N34o0m5o8J95j26R0j53M9J35k96K23k41N48j96j41K9
4635A1J7o1l01K88K63j20j56q1L09k02%J37j12k25L62k69J69p3L6J56k83PQJ10
4659a0r4j7k05M98m18j1N14j78p2J13j50p0K30m4k18J33l66L72l77K08J58q8j34
4682b26M74m71J85j45L98m5k51O2j68J84J09K35Lk62j50J79j02J16j75K29j78
4703AJ50j30m5J45n6p2k4J15k41K29l12K14j68J15Q4OM7P4J46m80K9L05j46l05
4727c19L17M7l3P4j74K01q1r7J8L9M6k11R8j45K27J62k23k1L10k00q6k01L13J18
4751A79lk48J61j55J02K56l38M22k02O2p7k86L22o0Q5l41L16k25j83J86Q1l58
4773c04L0J64J56l00M4L07k69m7K96k9k45Q4K03k10J4J88k63K82j21J70J2j68
$$ plain form
4795 -6 3 106 -199 4 18 -287 135 -32 27 -46 140 129 -92 -91 -17 104 404 -167 -344 269 -314 -171 70 134
4819 134 63 37 179 -94 -62 67 -193 20 70 -96 69 17 -267 14 -179 -40 20 132 72 51 134 35 -2 151
4843 151 142 263 -103 230 -46 -144 284 73 134 9 110 -138 -188 -93 -44 38 -207 11 306 0 313 -117 96
4866 96 -60 113 8 144 231 52 112 -117 54 161 -93 -86 95 -52 12 -113 58 317 43 -119 -11 217
4888 217 0 -83 -356 -187 274 -13 108 -86 -128 -25 180 -23 -36 -55 -120 -210 -40 93 -67 260 -15 190
4910 190 -90 -139 -9 6 59 105 -67 -220 224 201 -26 -71 71 -76 217 -69 28 156 -231 178 1 -149
4932 -149 -117 -167 193 223 337 228 -148 169 -62 -163 -203 80 42 -102 -226 207 14 -80 3 -108 4 78 340
4955 340 109 69 -166 53 -67 -322 -41 56 -15 -74 -103 37 -86 181 17 -13 212 -212 183 -9 -40 -36 112
$$ packed form
4795fRJ03l05K03J4l05M22j67N9p3J86j1k21JP4J21L00n71j77O13n83J43K41O4
4819A34p1k6J42k73L2J29k60K13N0j66J65n2k84K81j93J39O0J12o0k1Q3r9l7J53
4843A51rJ21l66L33k76r8M28k11O1j25J01k48n0R5M9Q2k45K18K95l06L13m30K13
4866I6j56J73j05J36Q7j79O0k29J71J07k54PJ81j47O4j25J71K59k74j62J08K28
4888B17k17q3k73J69M61k87J21j94m2J03K05k03j3j9o5r0J70J33j60L27k75K05
4910A90k80m9J30J5N3M6j72j53M44k3k27m5J42j47K93k86R7J28l87M09j77j50
4932a49L2n0L60L0J14j09l76L17k31j01m0K83l8j44j24M33j93r4Q3j11J12P4K62
4955C40k31m0k35K19j20k55K81R7p1n9k9J40j23K67j64l0K25m24L95j92l1MJ48
$$ plain form
4978 112 -141 52 22 88 -17 174 -332 -180 -142 -164 -124 -65 23 -290 73 -99 -91 -167 1 -139 197 157 398 -366
5002 -366 -77 91 13 -146 302 48 -176 122 -126 -411 19 -73 -84 207 -84 -13 75 70 94 -132 156 10 56
5025 56 127 150 28 99 -90 47 116 -167 63 81 191 229 -24 -44 113 -87 105 -72 -20 67 -272 353 -18
5048 -18 -77 93 -34 100 -263 8 79 -5 57 163 -32 88 150 -198 226 68 -75 45 138 205 123 24 -5 192
5072 192 -94 -73 12 5 -376 -159 84 148 107 -99 30 132 -123 -9 27 19 -147 -178 246 0 -142 183 -121
5095 -121 -91 46 -32 158 17 -24 -10 118 110 -105 22 94 -156 -60 224 43 97 -183 186 -39 -177 65 -286
5118 -286 247 325 -36 -83 -93 -100 -203 -265 -281 -47 -275 108 -222 -166 198 -112 -27 -143 27 -168 -3 22 75 -245
5142 -245 -19 -85 30 197 -206 -13 -88 -153 -403 -32 -130 -167 -72 -43 84 -259 167 -412 197 -87 -143 382 -147
$$ packed form
4978A12k53J93l0O6j05J91n06J52L8k2M0N9Q8l13L63j72Qp6J68j40L36m0K41p64
5002c66K89J68p8j59M48k54k24K98k48k85M30r2j1K91k91P1Q8nK4k26K88j46M6
5025E6P1K3j22P1j89J37O9k83K30J8J10L8k53k0J57k00J92j77N2Q7l39O25l71
5048a8n9J70j27J34l63K71P1q4O2J06j95J20O2l48M24j58j43J20R3O7q2r9k9J97
5072A92k86K1Q5pl81K17K43O4m1k06J29J02k55J14L6qj66l1M24k46j42L25l04
5095a21L0J37p8J90j41m1J4J28qk15J27P2k50R6K84j81N4k80L69k25j38K42l51
5118b86N33P8l61m7j0pj03o2j6K34k28L83l30N6L64l10Q5j16J70j95J65K5N3l20
5142b45K26o6J15J67m03J93p5o5k50L71r8l7R5K9J27l43M26n79O09k84n6N25n29
$$ plain form
5165 -147 37 -65 54 391 171 48 37 -22 29 -32 40 1 -287 -318 -269 90 19 -34 185 116 -203 119 -44 168
5189 168 127 -210 -230 41 -97 6 -198 33 -152 -40 -169 -149 46 179 -207 -89 -92 131 -38 -218 182 -430
5211 -430 12 397 72 120 103 68 82 229 -35 -242 32 213 -180 34 112 -204 307 58 -160 -63 -258 76
5233 76 42 -148 216 -129 -244 -119 41 -133 74 152 114 -29 -265 62 -419 301 -67 33 169 -28 -295
5254 -295 122 -39 79 -243 -99 -200 -13 178 -108 81 -77 -23 -141 57 -68 76 70 30 -25 117 -59 -3
5276 -3 -292 138 -2 104 -44 -94 25 -432 -62 133 189 125 -2 -55 -19 290 -1 30 177 25 -57 17 45 265
5300 265 229 31 143 -148 199 137 -142 -196 56 -497 -133 -252 -98 -27 -115 -162 -112 -24 -281 24 -57 60 8
5323 8 158 124 188 184 59 -465 -57 -53 -92 202 222 103 -28 31 121 -22 155 -214 43 113 -210 -31 63 -70 -254
$$ packed form
5165a47J84j02J19L37k20j23j1n9N1o1P2l9k88l1M9L59p1n3K19o9l19L22j63K12
5189A68m1l37k0K71j38J03k04K31j85J12j29K0J95J33l86J18lK23j69j80M00o12
5211d30M42L85l25M8j7l5J4J47k64k07K74J81l93K14P8l16N11k49k18R7j95L34
5233G6l4j90L64l45j15J25J60j74K07P8l8j43k36L27m81P20l68J00J36j97k67
5254b95M17j61J18l22J44j01J87J91k86J89j58N4j18J98j25J44om0n5J42j76N6
5276ck89M30j40J06j48n0J19m57L70J95N6o4j27n3L6L09k91L1J47j52q2P4K8K20
5300B65l6j98J12k91L47o2k79n4K52n53L64j19J54P1q8m7N0Q8k57L05q1J17n2
5323HJ50l4O4mj25n24M08Ml9K94K0j19j31N9R0j43J77l69K57P0l23J79R4j33j84
$$ plain form
5348 -254 47 -232 29 350 133 107 -10 -84 6 34 -36 -67 67 396 -24 -138 138 -105 -79 178 95 -46 48
5371 48 166 164 -528 -28 -47 -181 -270 -295 198 -231 149 129 -186 52 -43 -48 25 -176 -171 175 -80 40 175 133 157
5396 157 66 -104 46 -227 80 8 -258 87 141 128 226 78 -59 -92 285 44 -184 218 54 -121 -182 87
5418 87 -59 -63 68 64 37 286 -92 -52 -77 -167 61 40 -177 -191 -11 88 -62 -13 -44 -40 197 -124 67 -26 -130 -18
5444 -18 -164 305 17 38 -184 -205 -124 163 173 -105 118 -118 -31 -74 -112 48 272 304 -37 -43 -149 125 -162 -8
5468 -8 -167 -21 90 174 -87 80 215 122 -90 80 82 84 179 -198 59 -162 -29 194 -223 190 67 -52 255
5491 255 -155 145 66 146 -127 -4 0 58 65 -103 61 84 -173 79 -11 199 -177 -139 191 -116 0 32 117 7
5515 7 -30 -54 210 58 90 -15 245 109 229 -32 -129 -155 -161 -221 147 -185 -516 173 103 -25 169 148 -2 -220
$$ packed form
5348b54L01k79K61L21k17k6j17p4R0K8p0l1J34L29m20j14K76k43K6K57q3j41R4
5371D8J18ko92N00j9j34q9k5M93m29L80k0l15K38r5nP3k01NL46k55J20J35m2K4
5396A57r1j70J50k73L07p2k66L45N4j3R8j48j37l3L77k41k28M02j64j75o1K69
5418H7j46mJ31mk7K49l78M0k5r0K28k1k17j4J80R9j50M9l1MK37l21J91r3j04J12
5444a8j46M69k88K1k22k1Q1K87J0k78K23k36Q7m3l8J60K24L2l41oj06K74k87J54
5468hj59J46J11Q4k61J67J35r3k12J70KKR5l77K57k21J33K23m17M13j23j19L07
5491B55m10L00p9Q0k73J23MN8Pj68J64K3k57K52r0K10l76L8L30l07J16L2Q5j10
5515Gl7k4K64j52L2j05K60j36J20k61r7k6oo0L68l32l31O89p0j28J94k1j50k18
$$ plain form
5539 -220 -318 -86 -38 -75 41 -377 -259 -156 -285 -36 -2 -151 76 -44 38 48 -157 -7 -64 -398 -131 -35 120
5562 120 73 30 14 -80 319 -27 59 121 -50 -191 -47 74 97 29 24 146 179 -16 -182 -317 59 128 118 10
5586 10 -119 -26 -112 -23 61 -146 -1 238 36 46 135 -135 -221 19 -38 64 -77 -93 -108 11 -54 1 345 10
5610 10 -145 -72 -15 -57 11 111 307 1 69 -6 -121 29 -50 -31 311 163 75 29 -85 -136 -26 -272 33 -78
5634 -78 -349 -36 13 -84 80 9 -50 249 -502 -101 -159 113 34 73 240 154 317 201 206 -267 -202 -86 242 236 333
5659 333 146 -31 71 -185 158 39 202 -119 -33 -309 139 34 175 -79 150 -141 -37 -128 -60 67 -106
5680 -106 -13 -84 235 -31 429 164 -42 44 117 -31 -204 -78 -58 -154 106 227 -18 288 101 -109 107 79
5702 79 -54 -21 112 136 -189 88 -105 -132 96 288 -76 -27 177 46 128 -184 -112 -152 -311 -331 42 209 205 124
$$ packed form
5539b20r8K32M8l7J16m18J18J03j29K49L4j49K27j20Q2J0k05J50n7l34K67R6J55
5562A20m7m3j6r4L99l46Q6O2j71j41J44J21K3o8nJ22L3j95j66j35L76O9j0j08
5586A0j29R3q6Q9Q4k07J45K39k02J0Q9k70q6K40n7J02j41j6j5J19o5N5L44l35
5610A0j55P3N7m2O8J00J96l06O8p5j15J50p9J9L42j48q8m6j14n1J10k46L05j11
5634g8k71L13M9r7J64p1n9K99p51M01n8K72p9L9J67q6J63j16Nm73O5J16L28oR7
5659C33j87j77J02k56L43j19J63l21Q6k76M48j05J41k54K29k91J04r1O8J27j73
5680a06R3p1L19k66M60k65k06Q6P3j48j73J26K0r6K60J21k45L06j87k10K16k8
5702G9j33L3J33K4l25K77j93k7K28J92l64M9K04j31Q2l12P2m0j59k0L73J67mq1
$$ plain form
5726 124 -49 -18 -94 -28 210 -159 102 -58 -103 -168 -126 7 -95 -3 44 260 -283 -148 -175 -53 -3 40 -151 202
5750 202 275 -139 125 -97 -27 -106 174 -56 -69 -285 6 80 263 -110 -55 -185 255 -86 155 -112 177 -101
5772 -101 -76 70 163 140 -287 -87 -193 -137 -143 60 5 0 -15 212 100 -17 135 -1 -165 73 -22 80 -220 -87
5796 -87 -269 -44 315 -123 -196 48 230 20 -83 53 -67 -73 -5 82 60 120 -61 -20 20 123 49 -90 233 225
5820 225 -61 111 -323 37 -131 186 69 95 164 -99 38 -49 -11 6 156 -270 -39 -216 -148 105 -39 103
5842 103 157 -43 99 -62 56 207 252 342 -53 -10 94 76 139 119 -105 -144 -80 176 -104 -37 11 70 -195 5
5866 5 -59 -81 -20 136 319 161 -82 423 -32 -445 198 91 161 -213 275 156 64 67 -139 50 202 224 -40
5889 -40 -45 -171 -218 35 -87 -28 23 -139 -155 -8 14 61 3 -82 -175 -131 -157 -59 -4 163 56 -149 -148 -245 -25 33 -56
$$ packed form
5726A24j73L1p6O6K38l69K61j60m5o5M2J33j02R2M7K16n43J35k7J22N0M3j91L53
5750B02P3m14K64k22P0p9K80k30j3k16K91P4J83l73N5j30M40l41K41k67K89k78
5772a01K5J46R3k3m27K00j06N6oK03n5nj5K27j12j17J52j36j64K38r5J02l00J33
5796h7j82K25L59m38p3K44J82k10j03J36j20oO8Q7k2O0j81M1M0J03p4j39L23q
5820B25k86J72m34L60j68L17j17K6O9k63J37q7L8J7J50m26K31j77O8K53j44J42
5842A03N4k00J42j61J18J51M5R0l95M3J04j8O3k0k24l9O4K56k80O7M8N9k65K00
5866Eo4k2O1J56J83j58k43N05m55m13O43j07P0l74M88j19r2Lk06J89J52K2k64
5889d0nj26m7K53j22N9N1j62j6J47K2M7n8q5r3M4k6R8N5J67j07k05Jr7K20N8q9
$$ plain form
5916 -56 -23 -87 53 -157 30 42 -57 -139 -149 -189 -113 -62 72 56 -278 79 343 98 80 67 -89 -378 67 -59
5940 -59 83 -157 217 -20 -59 -46 -248 -37 -306 -301 -85 141 152 124 108 272 125 -78 -86 -88 80 -127 -45 13 -155
5965 -155 -180 118 -180 -310 -17 -110 185 -244 168 98 85 -29 130 -101 -64 -43 -88 -219 -262 236 74 109 94
5988 94 221 -118 81 87 -412 -99 143 -182 -73 -215 -44 78 -114 103 -45 -170 231 47 -198 -16 -57
6009 -57 -90 134 -197 -62 11 24 -35 97 -158 4 -109 74 164 -75 -133 -80 -196 -227 50 211 -112 -13 -41 -69
6033 -69 70 29 -198 168 -67 -38 -109 122 135 -192 158 -206 351 46 -200 121 53 168 -22 91 7 4 57
6056 57 -70 -11 89 193 -122 -97 -142 169 -173 -63 123 107 147 -142 -130 299 102 99 -60 -81 -84 -36 -137 380
6080 380 303 -54 -27 -93 -21 -226 -222 94 -71 -43 104 114 150 -175 139 149 36 98 84 120 -171 46 1 -72 12
$$ packed form
5916e6L3o4J40k10J87J2r9q2j0m0P6N1J34j6l34L57K64k45j8j3j56k89M45j26
5940e9J42k40L74k37l9J3k02K11k69NK16K26J1k8j6J64j47k03qkJ68k07Q2N8j68
5965a55k5K98k98j30K93r3K95m29M12p0j3j14J59k31L7K1m5j31m3M98j62L5j5
5988I4J27l39J99Om99L13K42l25J09j42J71J22j92K17j48j25M01j84k45J82m1
6009e7l3K24l31J35P3J3n9J32k55J62j13J83R0k39n8N3j16l1K77J61l23R9k8k8
6033f9J39m1k27L66k35K9p1K31J3l27L50l64N57l05k46L21o8J15j90J13q4lN3
6056E7j27N9J00J04l15K5m5L11l42J10J86j6M0k89J2M29j97lj59k1lM8j01N17
6080C80p7l57K7o6P2k05ML16j65K8J47J0L6l25L14J0j13O2j4L6k91K17m5p3Q4
$$ plain form
6105 12 -306 181 100 184 23 270 -248 -32 91 -205 -33 52 -73 65 36 -142 153 -49 -195 12 -62 139
6127 139 122 160 -218 122 -208 -5 -41 -128 110 46 125 -65 222 12 -37 12 -173 -217 230 147 -258 -304 92 163
6151 163 -191 162 -254 -38 111 -237 -6 -12 83 -190 -186 -236 40 -31 -257 -81 -100 17 -116 246 -26 -17 25 156
6175 156 81 -229 26 -84 -239 67 -178 119 107 -74 -52 22 35 255 196 48 4 -28 -165 166 -58 27 95
6198 95 -10 -202 -115 195 -299 -58 -34 -57 97 130 6 -147 -23 28 -47 77 -68 -23 -35 -200 -70 418 -210
6221 -210 -27 -92 -138 33 213 193 158 31 -46 -147 -120 -98 198 71 30 -158 -142 -85 22 209 -215 146 134 -250
6245 -250 -290 -190 138 447 -185 -109 72 -61 -377 91 119 -270 -55 -319 -342 162 -2 130 -168 24 -267
6266 -267 -207 -79 297 184 -162 -23 127 -264 -151 74 -34 106 13 104 -90 -330 59 -40 199 -323 113
$$ packed form
6105A2l18M87q1Q4j61K47n18K16J23k96J72Q5j25J38k9j78K95k02j46K07p4K01
6127A39j7L8l78L40l30K03l6q7K38o4P9j90K87k10m9M9j85m4M47q3m05m6L96P1
6151A63l54L53m16K16J49l48K31oR5k73Mn0K76p1k26J76j9J17j33L62k72RM2J31
6175A56p5l10K55j10j55L06k45K97j2j81K2P4J3K20n9j48m4l2j37L31k24Q5O8
6198I5j05j92Q7L10m94K41K4k3J54L3j24j53J24N1p5J24j45M5j2j65J30M88o28
6221b10J83o5m6J71J80k0l5j27p7j01K7K2K96j27m1j88J6N7J07J87m24L61j2l84
6245b50m0J00L28L09o32P6J81j33l16M68K8l89K15k64k3N04j64J32k98J92k91
6266b67O0J28L76j13l46J39J50l91J13K25j08J40r3R1j94k40L89r9K39n22M36
$$ plain form
6287 113 148 294 -16 17 -266 -179 220 -155 -101 -78 -81 -40 6 100 69 -120 164 75 -5 187 -131 -134 -304 -3 -223
6312 -223 40 -87 56 -25 -195 249 134 -9 -88 204 165 -289 76 4 -154 -215 -104 -39 -24 -252 250 49
6334 49 57 -111 -31 -96 66 -15 -148 30 83 74 180 -20 -51 27 220 61 -56 5 130 212 96 81 235 -141 -356
6359 -356 -222 158 195 -47 14 14 12 144 -61 -15 46 33 8 84 -21 -117 -83 154 -197 -167 -72 16 41 27 461 -119
6385 -119 112 77 88 60 -210 -11 59 -270 -57 -80 132 -1 92 38 77 -8 -187 -61 -65 -28 2 -121 67 127 33
6410 33 92 -20 -127 -215 -118 -252 194 -297 37 -77 123 2 -166 -58 205 84 -117 -130 107 87 -23 167
6432 167 -89 185 -8 -255 55 66 -197 47 103 -137 17 -242 -65 -152 -94 142 -19 19 -19 46 9 65 -4
6455 -4 -469 24 -262 27 23 177 -8 -31 240 40 -162 155 -103 9 20 -96 -46 126 -64 -71 -85 -171 -125 81
$$ packed form
6287A13L5J46l10L3k83Q7L99l75N4K3lM1M6R4l1j89K84q9q0J92l18lj70L01k20
6312b23K63j27J43q1j70M44j15j43p9K92l9m54L65p2j58o1J11O5J5k28N02k01
6334D9Qj68Q0o5J62q1j33J78N3rJ06k00l1P8J93j59j17O1J25Q2j16j5J54l76k15
6359c56J34L80L7k42O1%kJ32k05M6O1j3k5P6j05r6L4K37l51L0R5Q8K5j4M34n80
6385a19K31l5J1k8k70J99P0l29K13k3K12j33R3n4L9q5j79J26mL7L0j23J88O0r4
6410C3N9j12j07q8R7j34M46m91L34j14K00j21j68J08K63j21k01j3K37k0j10J90
6432A67k56K74j93k47L10J1k63K44N6k40J54k59J77q7N8K36j61L8l8O5l7N6o9
6455dm65M93k86K89mJ54j85k3K71k00k02L17k58J12J1j16N0J72j90pj4q6M6K06
$$ plain form
6479 81 -6 -202 97 -94 17 -78 -130 -6 57 -119 -60 43 247 241 -8 -219 -111 -115 96 -30 -92 -99 -59 59 -62
6504 -62 -111 60 19 -409 -89 -8 -67 175 -39 -191 -46 136 -51 100 -105 67 -198 124 -57 134 -110 252
6526 252 77 -128 -74 -84 -126 -95 51 -508 -186 -101 124 -347 -247 242 2 182 361 65 -240 -86 -233 -114
6548 -114 -21 -66 272 -113 210 -3 266 91 -28 104 -134 -13 57 -333 -141 141 17 130 -295 44 153
6569 153 -97 -84 17 134 -9 -48 -182 -187 -130 6 -104 12 216 -39 18 -189 37 291 58 -37 69 2 207
6592 207 166 -47 -57 20 238 86 -348 -10 151 20 -348 -278 -165 96 -25 -70 58 88 262 43 83 -171
6614 -171 244 74 121 114 104 -20 108 -326 168 4 -21 -70 20 -196 92 126 -131 -65 -101 2 -14 184 -26 -36
6638 -36 222 -276 -65 135 -141 49 92 18 96 218 -150 -320 -152 365 -20 -69 -107 -84 -78 -77 119 -49 -75 100
$$ packed form
6479H1q7j96K99j91J11r5n2J24O3j76N9J03K04ok49k11J08mK11j26o2pM0J18j21
6504f2m9J71m1m28L20Q1n9K42k14j52J45J82j87J51k05J72k65L22j81J91k44L62
6526B52j75k05N4j0m2L1J46n59L22Q5K25m71J00M89k40J80J79k96l05J54j47J19
6548a14R3m5L38l85L23k13K69j75j19J32k38J21P0l90J92K82j24J13m25L39J09
6569A53k50J3J01J17j43l9j34nN7J36j10J16K04k55N7k07K26K54k33r5J06o7K05
6592B07m1k13j0P7K18j52m34L38J61j31l68P0J13K61j21m5J28L0J74k19M0k54
6614a71M15j70M7pj0j24J28m34M94j64k5m9R0k16K88L4k57O6l6J03j6J98k10j0
6638c6K58m98K11K00k76J90M3p4P8J22l68j70J68N17l85m9l8K3OJJ96j68k6J75
$$ plain form
6662 100 37 145 -49 -70 245 26 -7 -301 -136 173 213 102 62 -123 203 151 -61 -157 -215 -178 109 201 167 -37
6686 -37 190 202 -131 -18 -234 7 -182 238 140 157 419 -147 -22 -77 94 61 0 77 42 -118 102 172 -134
6709 -134 -16 157 322 72 -123 -55 174 241 284 11 -169 -39 -254 -89 -121 -293 -70 80 25 -18 131 -39
6731 -39 -61 19 94 -71 -115 -91 -127 -139 6 -113 63 -223 -270 78 -97 -6 364 139 -23 207 61 58 120 373
6755 373 344 42 -282 -63 58 141 46 50 -49 149 259 237 157 -43 -49 -30 -100 -87 -67 0 40 -170 96 59 156 115
6781 115 67 123 219 -71 42 -128 34 321 -60 -89 -9 -176 -109 -16 188 21 -103 59 -152 -34 25 -32 13
6804 13 101 43 -20 -13 64 33 -139 -19 1 -33 -196 277 22 138 -99 119 95 -26 184 -136 -66 59 -7 202
6828 202 -135 -46 209 -35 -73 67 -132 -91 6 -163 152 10 -57 53 43 -97 -199 303 54 -32 65 152 137
$$ packed form
6662A00o3J08j94k1L15k19l3k94J65L09M0j11m0j85L26n2k12r6n8L7K87R2l4k04
6686c7K27J2l33J13k16K41j89M20r8J7K62n66J25n5J71l3o1P7l5j60K20P0l06
6709a34J18J73J65k50j95O8K29O7M3k73j80J30k15J65l2j72K23J50n5m3J49j70
6731c9k2Q0P5j65m4K4l6j2J45j19J76k86m7L48j75R1L70k25j62K30j46lO2K53
6755C73k9l02l24K19J21Q3r5Mr9J98J10k2q0k00oJ9p0J3K0O7M0k10K66l7R7m1
6781A15m8N6R6k90J13j70J62K87l81k9Q0j67O7R3K04j67j24J62k11J18N9n7M5
6804A3Q8n8o3PP7l1j72J20K0l4j63M73k55J16k37K18k4j21K10l20P0J25o6K09
6828B02l37Q9K55k44l8J40j99M1R7j69L15j42o7J10j0j40j02N02k49q6R7Q7j5
$$ plain form
6851 137 -40 258 22 -88 -368 46 -189 116 111 54 -177 288 173 8 -121 55 -25 -155 -141 -57 -2 -247
6873 -247 -51 25 -21 28 116 3 -19 -239 -253 -120 -5 -125 124 2 21 176 468 233 -233 214 -108 -223
6895 -223 46 -87 -77 24 52 -272 135 89 -237 342 335 -136 -53 268 160 137 -128 146 -148 -35 142 108 -117
6918 -117 -16 -73 -117 148 108 -138 242 -197 -186 126 1 109 3 -58 104 127 100 -318 -71 112 -150 -162 -160
6941 -160 46 43 386 13 -45 149 -126 -45 65 -99 -214 -194 200 16 5 -54 -217 206 -112 206 -135 -26
6963 -26 66 -82 -38 -3 130 245 162 57 227 82 67 -301 -178 14 211 -61 41 96 -170 -183 166 113 61
6986 61 122 340 -2 324 5 -115 248 165 50 16 72 103 28 -16 38 136 87 67 -84 394 -152 -30 45 16 167
7011 167 -130 117 -240 233 1 24 -22 -100 -158 -24 -182 189 37 -208 6 -227 97 168 95 29 -37 51 -141
$$ packed form
6851A37j77K98k36j10k80M14k35L05nn7k31M65j15j65j29J76q0j30J4Q4N5k45
6873b47J96P6m6M9Q8j13k2k20j4J33J15j20K49j22J9J55K92k35m66M47l22j15
6895b23K69j33J0J01K8l24M07m6l26N79pm71Q3L21j08k3k65K74k94J13J77l4k25
6918a17J01n7m4K65m0k46L80m39J1L12j25J08j06o1J62K3k7m18K47J83k62j2K
6941a60K06lL43l73n8J94k75Q1J10j64j15K0L94j84j1n9j63M23l18L18l41J09
6963b6R2j48M4L5J33J15q3j05J70j45j5l68J23J92J97k72J02N5k66j3L49n3n2
6986F1O1K18l42L26l19j20L63q3j15l4N6L1p5m4N4R8m9k0j51M78n46J22P5k9J51
7011A67k97K47l57M73k32K3m6p8n8J34j58L71j52k45K14k33L24P1p3o6o6Q8j92
$$ plain form
7034 -141 -13 -107 -101 -63 -173 -93 120 187 -58 259 65 -108 -226 -74 292 349 -151 -115 -122 -322 -282 -137 53 22
7058 22 99 402 -1 -46 -46 54 139 77 28 -29 -246 -363 291 36 112 52 -83 380 4 1 39 -10 -57 -180 40
7083 40 -57 -131 -55 -24 -74 -69 68 96 -307 17 -40 -168 -83 -143 196 -146 186 32 -152 -309 -172 -8 -219 -151
7107 -151 -118 66 64 4 -179 21 29 75 -19 151 -333 62 20 98 -1 -33 222 95 -242 87 -11 -1 43 -88 -232
7132 -232 -153 104 -159 55 -38 -168 -131 124 -127 203 -11 -6 177 2 357 304 -123 -47 -223 -147 158 84 326
7155 326 17 -211 169 109 296 -77 -160 113 76 54 -174 40 63 60 78 -133 -244 145 56 99 30 -240 -257 -145
7179 -145 -407 -79 47 147 28 255 259 288 -56 -77 166 -117 -183 -41 96 -125 -169 -149 -142 110 -172 156 -145
7202 -145 -42 -193 -41 -139 74 265 -276 89 -125 110 2 -54 123 173 324 57 94 263 -73 -64 134 83
$$ packed form
7034a41J28r4OL8j10Q0K13O7k45L17j94j73j18J52L66N7n00L6pk00M0J45J90l1
7058B2P7L03m03m5%J00Q5o2m9n7k17j17O54k55P6o0j35M63l76lL8m9m7j23K20
7083D0r7p4P6L1n0NJ37K8m03L24n7j28Q5o0L39l42L32j54j84j57J37J64k11O8
7107a51L3J84ko0j83K00QM6r4J70m84L95m2P8r9l2K55j27l37L29r8J0M4j31j44
7132b32P9K57k63K14r3j30L7K55k51L30k14NJ83j75L55n3m27P6j76P6L05p4K42
7155C26l09k28L80o0J87l73q3K73l7k2k28K14K3lJ8k11j11L89q9M3o9k70j7J12
7179a45k62L28J26J00j19K27MK9l44k1K43k83o6J42J37k21m4K0PK52k82L28l01
7202a45J03j51J52r8K13J91n41L65k14K35j08n6J77N0J51k67L7J69l36RJ98n1
$$ plain form
7224 83 98 455 71 -305 200 -139 -31 111 16 -238 163 144 64 107 -76 14 -184 5 29 -131 8 172 51
7247 51 -38 47 122 59 -69 -152 53 -14 198 138 92 -26 -16 353 37 34 85 -197 13 176 21 -23 -114 -193 -213 187
7273 187 -28 248 149 -277 -112 332 35 -16 182 42 1 114 67 352 -84 -62 184 98 -26 -44 239 -86
7295 -86 -128 -10 44 128 152 371 254 -137 -7 106 234 148 -43 109 -65 -239 -11 3 81 -52 159 -115 -71
7318 -71 -332 96 -165 69 -118 140 72 26 -254 150 129 -52 -143 -94 -53 109 21 -355 123 11 -133 94 -176
7341 -176 -68 -41 -90 197 11 1 -62 -93 138 207 -90 46 178 23 170 -101 -70 194 -45 98 65 -117 24
7364 24 -215 -197 -88 79 25 210 -63 -94 -14 8 60 -104 -224 -119 -82 -29 -48 45 -273 -102 -203 10 -127 90
7388 90 -62 -15 125 -52 60 120 -41 -179 44 174 -123 -67 -198 -141 51 -121 -9 111 150 -112 -10 -41
$$ packed form
7224H3J5L57l84l76N05l39J08J42r5k54M01j9q0M3j83R0j98J89K4j60J39J64j21
7247E1q9Q5P5o3j28q3K05o7K12o0m6j18J0L69l16lN1k82K10J63j55m4r1p9k0M00
7273A87k15K76r9m26J65M44k97n1J98j40m1J13m7K85m36K2K46q6j24j8K83l25
7295h6m2J18N4Q4K4K19j17l91J30J13J28q6j91J52j74j74K28J4P8j33K11k74M4
7318g1k61M28k61K34j87K58o8m6k80M04k1j81r1M9M1J62q8l76M78j12j44K27k70
7341a76J08K7m9K87j86j0o3l1K31O9k97J36J32j55J47k71L1K64k39J43l3j82J41
7364B4k39J8J09J67n4J85k73l1Q0K2N2j64j20J05L7N3j9R3l18J71j01K13j37K17
7388I0j52M7J40j77J12O0j61j38K23J30k97N6j31N7J92j72J12J20L9k62J02l1
$$ plain form
7410 -41 298 -8 134 -34 -36 -118 84 91 -33 424 -369 136 272 -137 46 72 -273 88 96 -22 -126 298 221
7433 221 229 118 -46 -205 1 120 -67 44 5 -15 140 286 132 102 -92 -5 -36 -258 85 -54 20 142 0
7456 0 115 117 67 -36 -397 70 41 -76 -17 36 206 118 177 249 -188 72 49 -56 -60 -124 13 38 253 -111 -39 155
7482 155 77 -25 -348 -266 44 176 -207 28 -8 100 36 -124 260 5 -113 -206 -79 9 49 -67 -115 -122 -249
7505 -249 324 25 36 61 -196 12 28 156 133 251 -303 -8 18 181 -51 -353 50 22 105 -73 -78 -102 48
7528 48 87 16 57 -109 83 -100 260 65 -130 19 -102 -4 101 147 -74 319 53 -117 -82 128 29 22 26 270
7552 270 -115 -68 -68 35 -3 171 315 -19 28 -33 -116 -70 -9 -18 -190 327 87 11 135 142 187 357 74 -56 -46
7577 -46 -34 5 63 19 -118 55 126 -182 36 212 87 19 -37 67 104 -122 65 150 -3 -103 161 -164 -87 142
$$ packed form
7410d1L39l06J42j68kq2K02Pj24M57p93N05J36m09J83K6l45L61Qj18j04M24p7
7433B21Qj11j64j59K06J19j87J11l9k0J55J46j54l0j94Q7l1k22L43j39P4J22j42
7456@J15Kn0j03l61M67k9j17N9N3J70q8N9P2m37K60k3j05mo4J37K5K15l64P2J94
7482A55p8j02l23Q2L10J32l83K35l6J08o4j60L84k55j18r3J27Q8M0j16m8pj27
7505b49N73k99J1K5k57K08J6J28k3J18n54K95K6J63k32l02M03k8Q3j78nk4J50
7528D8L9p1M1j66J92j83L60j95j95J49j21R8J05M6k21L93k66j70L5K10r9pMK44
7552B70l85M7%J03l8J74J44l34M7o1q3M6O1rj72N17k40p6J24PM5J70k83j30J0
7577d6J2L9N8m4j37J73P1l08K18J76j25o8n6J04L7k26J87Q5j53j00K64l25P7K29
$$ plain form
7601 142 -169 193 -102 -45 227 -148 -6 -35 -204 -239 143 -249 164 174 32 -2 48 -100 -47 -19 -146 -100 29
7624 29 287 30 80 19 57 13 -99 3 -67 -166 -14 1 -147 171 -58 -156 71 -202 223 247 -23 -169 129
7647 129 9 -67 90 -52 275 -135 -102 56 -120 -281 -9 -125 194 240 -14 -7 34 -103 -32 33 15 318 -92
7670 -92 261 128 -352 -56 119 7 -200 -54 74 -264 -90 -123 119 123 -146 -256 -269 -100 156 262 373 -254
7692 -254 164 216 -114 -92 283 47 -204 -105 -115 -285 -123 -157 177 21 2 163 195 -236 235 -81 -134 -49 -105
7715 -105 248 101 79 -67 89 -142 114 169 -80 -235 89 -76 -96 127 -130 201 -147 -189 58 -221 282
7736 282 1 -93 65 332 -99 223 109 509 200 -292 -91 -11 61 -185 140 35 -315 243 31 -194 -132
7757 -132 -91 92 -69 -32 44 14 57 -3 -140 262 15 -4 374 37 24 225 -61 -98 63 250 -132 -17 4
$$ packed form
7601A42l11L62k95N7K72l75J42k9j69l5L82l92M13J0j42l4N0j48N3K8j27M6J29
7624B9K58k57N0o1L8m4j12J02p0r9J52J5j48L18k29r8K27k73M25K4k70j46K98
7647A29j20p6J57j42L27m10L3J58j76j61K72j16L19M6k54PM1j37P1O5j8L03m10
7670i2L53j33m80K96J75j12k07J46J28l38J74l3K42Mk69j10j3J69K56J06J11o27
7692b54M18N2l30K2L75k36k51R9j0j70J62l4L34j56j9J61L2m31M71l16n3Q5n6
7715a05L53j47k2j46J56k31K56N5k49j55L24j65k0K23k57L31l48m2K47k79N03
7736B82k81r4J58K67m31L22j14M00l09m92K01Q0P2k46L25j05l50N58k12k25O2
7757a32M1J83j61L7P6l0M3o0j37M02k47j9L78l37j3K01k86l7J61J87l82J15K1
$$ plain form
7780 4 59 -73 160 298 -27 -104 52 84 -123 198 59 92 107 -158 71 54 -211 -166 91 86 64 144 87 116 16
7805 16 -71 -15 40 -196 -86 -116 279 256 0 49 64 9 -141 3 241 196 64 -425 -30 135 36 146 -178 85
7829 85 -170 -90 170 25 253 144 181 -107 -385 219 265 63 -115 10 302 -7 55 50 42 -123 178 -353 -351 -169
7853 -169 178 20 104 -169 266 -325 -194 -155 -276 174 -61 184 71 126 -41 -21 20 255 -232 -129 -35 -172
7875 -172 -99 70 -18 -73 -113 99 -186 127 47 233 61 119 99 -54 49 42 -47 -47 -21 -344 108 158 -38 -142 49
7900 49 193 44 7 275 -105 -252 -27 -254 -86 71 -220 133 142 -176 116 156 43 -204 96 47 -44 -157
7922 -157 -45 251 -6 -62 13 -70 -220 41 60 -143 -19 104 19 23 42 -71 -49 19 214 60 -52 -19 -104 -42
7946 -42 121 231 -257 -153 103 -89 -96 -26 -4 50 85 71 -8 -329 102 -22 -164 -186 -8 156 -258 277 -153
$$ packed form
7780DN5j32K33J38l25p7J56L2k07L21j39L3J5k65K29j7k65M5K57nk2Q0n7K9j00
7805A6q7N6N5k36J10l0L95k3k56M9J5n5j50J44K38m5j32m89L95J65r9J10l24K63
7829H5k55Q0K60j45K28j09L7k88k78O04M6k02j78J25K92l09O2nqj65L01n31KJ82
7853a69L47j58Q4k73M35n91J31L9j21M50k35K45j13N5j67K0M1K35m87J03R4j37
7875a72P3J69q8n5m0K12k85L13q0J86j72N8k0j53J03pq9%K6l23M52N0j96j04J91
7900D9J44j49l7K68l80j47K25k27J68J57k91L53Rl18K92M0j13k47L00m9r1j13
7922a57J12K96k57n6P5q3j50K61J9k03J24J23q5MJ9j13K2O8J95j54j12L3q5O2
7946d2J63J10m88J04K56j92pP0K2N4L5j4p9l21M31j24j42k2J78J64m14N35m30
$$ plain form
7969 -153 11 32 18 -404 103 69 -251 150 -168 65 -102 47 7 -116 -133 53 -217 9 -20 79 -124 -74 7
7992 7 64 2 -35 160 -47 -74 -76 196 -10 -6 -35 206 127 141 294 257 18 83 -118 -257 134 28 38 73 -132 -186
8018 -186 -281 211 -1 3 -35 -32 -245 -117 178 -22 -108 -56 61 288 38 257 -191 -139 73 -43 -36 150 -139 -263
8042 -263 81 210 -15 115 -35 -50 -5 -111 224 80 2 123 2 94 100 101 18 35 141 -51 48 -152 -21 31
8066 31 -192 233 -163 57 -47 158 115 180 198 -195 -117 141 39 -189 34 -95 172 -116 185 126 -64 310
8088 310 -80 -220 20 -41 216 226 -100 -80 52 61 -121 54 119 80 -35 -90 -70 98 34 -117 19 -224 2
8111 2 495 76 154 -1 -212 1 76 -31 389 -79 -35 385 -139 -159 24 120 -263 86 37 75 113 -75 138
8134 138 144 195 75 -3 -129 12 174 17 47 41 3 -176 -41 -31 86 -97 65 -329 160 110 106 -37 145 168
$$ packed form
7969a53J64K1j4m22N07l4l20M01l18K33j67J49m0j23j7J86k70K26k9R9k03N0Q1
7992GN7o2l7J95k07k7kK72k06Mk9K41p9J4J53l7k39O5k01j39L91j06J0L5k05n4
8018a86r5M92k12Ml8Lk13J28K95k00q6N2J17K27k50K19m48N2K12j16PJ86k89j24
8042b63L44J29k25J30j50j5M5j06L35j44p8J21j21R2OJq3J7J06j92R9k00J31N2
8066C1k23M25l96K20j04K05m3O5J8l93P8K58j02k28K23j29K67k88L01n9j90L74
8088C10l90j40K40o1K57J0l26K0J32Rj82J75O5l9j15n5K0J68o4j51J36k43K26
8111BM93m19P8j55k11K13P5j07M20m68M4M20n24k0J83R6l83L49m9L8L8j88K13
8134A38ON1j20p8j26J41J62j57L0ol8j79J35J0J17j83J62l94M89n0mj43J82K3
$$ plain form
8158 168 37 -165 18 247 12 279 38 189 -284 158 38 62 96 11 -103 -181 -189 -115 -204 100 -119 37 -2
8181 -2 -202 -140 54 152 -176 -256 20 7 -65 36
$$ packed form
8158A68j31k02J83K29k35K67k41J51m73M42j20K4L4q5j14p8qP4q9L04k19J56l9
8181bk00O2J94R8l28q0K76j3p2J01
8191C6
$$ Imaginary data points
##PAGE= N=2
##DATA TABLE= (X++(I..I)), XYDATA
$$ plain form
0 0 0 0 0 -8 8 -8 16 -23 24 -32 40 -48 64 -74 94 -112 132 -159 188 -220 258 -300 348 -400 461 -526 600
27 600 -683 772 -871 984 -1103 1237 -1384 1544 -1718 1912 -2122 2355 -2610 2890 -3202 3542
43 3542 -3924 4348 -4825 5362 -5977 6685 -7506 8477 -9650 11092 -12922 15330 -18650
56 -18650 23555 -31550 46852 -86865 410156 941840 96475 -295834 -8709 527099 424908
67 424908 28699 -127876 100941 184795 65650 -74 174176 256874 107808 -79608 -5212
78 -5212 193857 273668 163381 36160 -51590 -96797 -83571 31676 114105 38258 -114806
89 -114806 -101608 91571 233265 160744 12800 -33372 9540 30075 38442 81928 97042 -3275
101 -3275 -130582 -118327 28020 125444 82687 -3997 -23273 21517 94941 167204 155621 -8951
$$ packed form
0@%%%qJ6j6K4l9M7n6P2q8J12j38J68k06K44k91L47m08M78n58O48p48Q61r87J126
27F00j283J455j643J855k087K340k621K928l262L630m034M477m965N500o092O744
43C542p466Q272r173J0187j1339J2662j4191J5983j8127K0742k4014K8252l3980
56a8650M2205n5105P8402j33717M97021N31684q45365l92309K87125N35808j02191
67D24908l96209j56575K28817Q3854j19145o5724J74250Q2698j49066j87416P4396
78e212J99069P9811j10287j27221q7750m5207J3226J15247Q2429p5847j53064
89a14806J3198J93179J41694p2521j47944m6172M2912K0535Q367M3486J5114j00317
101c275j27307J2255J46347R7424m2757q6684j9276M4790P3424P2263j1583j64572
$$ plain form
113 -8951 -199466 -167923 85587 226123 38536 -219990 -164135 134796 247531 34325 -152352
124 -152352 -27252 195424 166732 -44268 -85502 93920 169614 -21731 -207399 -101342
134 -101342 150792 201576 19499 -99119 6844 160992 157803 45446 -10915 8347 14738
145 14738 961 29343 79363 53714 -50147 -106893 -34831 87405 126529 58884 -21244 -29328
157 -29328 28961 83694 77048 7819 -70835 -96817 -50746 28053 75957 53565 -19863 -73493
169 -73493 -44052 52058 115407 71770 -32426 -72929 -9337 62110 41455 -36695 -67075 -32758
181 -32758 -13604 -38616 -28466 56907 112316 30210 -105674 -108994 37894 134775 38709 -126443
193 -126443 -147433 -15895 79188 31602 -58827 -67758 -19383 -670 -5169 29620 79956 55224
$$ packed form
113h951j90515L1543K53510J40536j87587k58526N5855K98931J12735k13206j86677
124a52352J25100K22676k8692k11000m1234J79422P5694j91345j85668J06057
134a01342K52134N0784j82077j18618J05963J54148l189j12357n6361J9262O391
145A4738j3777K8382N0020k5649j03861n6746P2062J22236L9124o7645q0128q084
157b9328N8289N4733o646o9229p8654k5982M6071P8799M7904k2392p3428n3630
169g3493K9441R6110O3349m3637j04196m0503O3592P1447k0655p8150l0380L4317
181c2758J9154k5012J0150Q5373N5409q2106j35884l320J46888R6881r6066j65152
193a26443k0990J31538R5083m7586r0429q931M8375J8713m499L4789N0336k4732
$$ plain form
205 55224 -42264 -91188 -20069 75784 62600 -42600 -95297 -27722 69319 81774 24843 -6622
217 -6622 15166 34529 21504 19269 52480 71060 24610 -42442 -41885 27200 70899 31618 -32572
230 -32572 -31462 32781 77241 58751 17623 3958 8119 -1756 -13681 5950 38554 25342 -35612
243 -35612 -64582 -10014 63012 56866 -20949 -61774 -8929 65575 66547 4574 -36056 -22698 -1756
256 -1756 -8351 -15259 3484 19603 -1320 -31633 -13639 43224 62118 9553 -48006 -33846 28769
269 28769 51863 9219 -33839 -26921 -2897 -8484 -24164 -4655 34014 28948 -21024 -40847 11365
282 11365 68395 45286 -37683 -76654 -25716 42910 42270 -12013 -41128 -17204 11866 8096 -881
295 -881 16184 33200 10515 -28742 -21846 31825 56851 7454 -59338 -57918 7469 53341 32369
$$ packed form
205E5224r7488m8924P1119R5853j3184j05200n2697O7575R7041J2455n6931l1465
217f622K1788J9363j3025k235L3211J8580m6450o7052N57O9085M3699l9281o4190
230c2572J110O4243M4460j8490m1128j3665M161r875j1925J9631L2604j3212o0954
243c5612k8970N4568P3026o146p7815m0825N2845P4504R72o1973m0630J3358K0942
256a756o595o908J8743J6119k0923l0313J7994N6863J8894n2565n7559J4160O2615
269B8769K3094m2644m3058O918K4024n587j5680J9509L8669n066m9972j9823N2212
282A1365N7030k3109q2969l8971N0938O8626o40n4283k9115K3924K9070l770q977
295h81J7065J7016k2685l9257O896N3671K5026m9397o6792J420O5387M5872k0972
$$ plain form
308 32369 -12620 -21271 4811 21520 15226 10684 17222 12504 -12704 -25288 1092 36196 29331
321 29331 -16449 -42508 -14597 30233 39538 16457 752 4604 5202 -1935 2158 20759 20433 -14085
335 -14085 -41705 -17668 35172 48636 2785 -41207 -25311 26135 44188 13137 -15619 -6050
347 -6050 13795 4650 -18383 -13707 13903 15627 -19046 -37448 -1839 46277 39657 -15413 -44603
360 -44603 -11496 33079 28573 -12377 -31697 -10217 11458 2422 -16453 -10748 8421 6561 -14498
373 -14498 -16568 12978 34617 13643 -26212 -32826 -1158 22152 7943 -18360 -21290 -3925 7069
386 7069 3664 2170 6213 1419 -11595 -12021 9638 26120 11094 -21098 -30029 -5380 17892 9751
400 9751 -12061 -14627 3033 12391 3674 -1090 10463 15228 -4385 -25234 -12590 22306 29759
$$ packed form
308C2369m4989q651K6082J6709o294m542O538m718k5208j2584K6380L5104o865
321B9331m5780k6059K7911M4830R305k3081j5705L852N98p137M093J8601l26l4518
335a4085k7620K4037N2840J3464m5851m3992J5896N1446J8053l1051k8756R569
347f050J9845r145k3033M676K7610J724l4673j8402L5609M8116o620n5070k9190
360d4603L3107M4575m506m0950j9320K1480K1675r036j8875N705J9169j860k1059
373a4498k070K9546K1639k0974l9855o614L1668K3310j4209k6303k930J7365J0994
386G069l405j494M043m794j3014m26K1659J6482j5026l2192q931K4649K3272q141
400I751k1812k566J7660R358q717m764J1553M765j9613k0849J2644L4896P453
$$ plain form
413 29759 -4302 -35742 -21920 17619 30031 4062 -19210 -8910 15185 16888 -100 -5000
425 -5000 7400 9025 -12057 -25255 -5594 24803 22308 -12694 -31341 -8128 25218 24942 -4233
438 -4233 -21201 -8294 8819 6828 -4768 -5821 -1095 -7105 -18055 -14188 6936 17943 2556
451 2556 -19234 -17801 4647 16420 3082 -14943 -15097 -3889 -421 -4665 -2862 3668 -325 -14477
465 -14477 -16434 3473 21420 12862 -12094 -18956 -159 16343 8266 -11845 -15243 -1916 5467
478 5467 -1135 -5730 3455 11480 642 -15362 -10446 12381 20905 307 -22602 -16236 8915 16494
492 16494 -2052 -19048 -11441 5806 8655 -2040 -4439 4847 7858 -4298 -13973 -3311 12804
505 12804 10552 -10041 -19509 -4029 14884 12522 -6289 -13469 -1187 10773 7455 -812 1040
$$ packed form
413B9759l4061l1440J3822L9539J2412k5969k3272J0300K4095J703j6988m900
425e000J2400J625k1082j3198J9661L0397k495l5002j8647K3213L3346k76k9175
438d233j6968J2907J7113j991j1596j053M726o010j0950L867K1124J1007j5387
451B556k1790J433K2448J1773j3338j8025j54J1208L468m244J803O530l993j4152
465a4477j957J9907J7947q558k4956o862J8797J6502q077k0111l398J3327P383
478E467o602m595R185Q025j0838j6004M916K2827Q524k0598k2909O366K5151P579
492A6494j8546j6996P607J7247K849j0695k399R286L011j2156r675J0662J6115
505A2804k252k0593r468J5480J8913k362j8811p180J2282J1960l318q267J852
$$ plain form
518 1040 6433 1635 -8324 -6638 7004 13040 -58 -13893 -8152 10226 16969 3751 -9474 -6333
532 -6333 4860 6928 -112 -2870 1969 2034 -7107 -11257 -89 11797 5684 -10926 -14286 1058
546 1058 14908 8543 -7890 -12392 -2544 4320 -642 -5493 -1731 3503 -1605 -10284 -6549 8098
560 8098 12715 -923 -14672 -8904 8893 14105 172 -12502 -8520 2829 4326 -2706 -3577 3331
574 3331 5327 -2817 -7842 1156 12543 8607 -7119 -13081 -875 12814 9400 -5280 -10772 -1859
588 -1859 6500 3377 -2225 -265 5417 3016 -4825 -4548 5249 9486 -45 -11350 -7877 5250 10971
603 10971 1825 -7682 -4955 3282 5114 679 -1122 2950 4050 -1977 -5471 848 8361 4758 -6628
618 -6628 -9312 1333 10636 6667 -3909 -5188 2198 6077 1697 -2733 458 4287 212 -6544 -4088
$$ packed form
518A040N393m798r959J686J3642O036j3098j3835N741J8378O743j3218j3225L141
532f333J1193K068p040k758M839O5r141m150J1168J1886o113j6610l360J5344
546A058J3850o365j6433m502R848O864m962m851L762N234n108q679L735J4647
560H098M617j3638j3749N768J7797N212j3933j2674L982J1349J497p032q71O908
574C331J996q144n025Q998J1387l936j5726n962J2206J3689l414j4680n492Q913
588a859Q359l123n602J960N682k401p841K77R797M237r531j1305L473J3127N721
603A0971r146r507K727Q237J832m435j801M072J100o027l494O319P513l603j1386
618f628k684J0645R303l969j0576j279P386L879m380m430L191L829m075o756K456
$$ plain form
633 -4088 5103 7883 -1653 -10473 -5372 7282 10018 -583 -8675 -4339 4251 3766 -3774 -5354 188
648 188 2962 -2584 -6989 -1310 6955 4733 -5991 -10261 -558 9151 5953 -5163 -8426 -1415 5525
663 5525 2492 -3397 -2893 2055 2226 -2200 -1924 4231 7073 644 -6733 -4231 5151 8280 1192 -5666
679 -5666 -3489 3201 4442 246 -933 1872 2656 -679 -1851 2761 7085 3764 -5086 -6598 1422
694 1422 7867 4172 -3921 -5177 1403 5040 1346 -1625 434 3527 786 -3750 -2556 4354 5996
709 5996 -1358 -7997 -4666 4665 6917 -623 -6522 -3256 3753 4100 -1835 -3786 -16 2223 -1830
724 -1830 -5420 -1310 4278 2907 -4470 -7264 -729 6075 3881 -3628 -5537 -556 3990 1285 -2583
739 -2583 -2611 388 336 -2632 -2155 2005 3967 19 -4837 -3227 3581 5189 -56 -4365 -2443 2442
$$ packed form
633d088R191K780r536q820N101J2654K736j0601q092M336Q590m85p540j580N542
648A88K774n546m405N679Q265k222j0724m270R703R709l198j1116l263P011O940
663E525l033n889N04M948J71m426K76O155K842o429p377K502R382L129p088o858
679e666K177O690J241m196j179K805P84l335j172M612M324l321q850j512Q020
694A422O445l695q093j256O580L637l694k971K059L093k741m536J194O910J642
709E996p354o639L331R331K252p540n899L266P009L47n935j951L770K239m053
724a830l590M110N588j371p377k794O535O804k194p509j909M981M546k705l868
739b583k8K999n2k968M77M160J962l948m856J610O808J608n245m309J922M885
$$ plain form
755 2442 2527 -754 -2121 778 1694 -1017 -2145 1388 4964 2514 -3193 -4025 1698 5421 2308 -3647
771 -3647 -3707 1270 4091 1344 -1996 -425 2440 1590 -2122 -1284 3666 5163 130 -4579 -2030 3908
787 3908 5212 -520 -4744 -1451 3560 3950 -397 -2180 555 2578 110 -2085 265 3833 2430
802 2430 -2384 -4113 423 4651 2767 -2705 -3874 456 3843 1727 -1139 -1080 1245 923 -1526 -1261
818 -1261 1549 2947 -383 -3292 -1425 2998 4096 -148 -3112 -1192 2534 2957 4 -1406 436
833 436 1172 -603 -1542 462 3157 1650 -2374 -2931 1378 4498 2106 -2593 -2732 1170 2970 1148
849 1148 -1947 -798 1451 1050 -1546 -1176 2067 3348 -3 -3082 -847 3450 4033 -401 -3276 -1073
865 -1073 2582 2745 -519 -1698 656 2092 119 -1177 323 2684 1906 -1394 -2434 567 3559 1898
$$ packed form
755B442Q5l281j367K899R16k711j128L533L576k450n707q32N723L723l113n955
771c647o0M977K821k747l340J571K865q50l712Q38M950J497n033m709K549N938
787C908J304n732m224L293N011L90m347j783K735K023k468k195K350L568j403
802B430m814j729M536M228j884n472j169M330L387k116k866N9K325l22k449K65
818a261K810J398l330k909J867M423J098m244k964J920L726M23k953j410J842
833D36P36j775r39K004K695j507m024n57M309L120k392m699j39L902J800j822
849A148l095J149K249m01k596L70L243J281l351l079K235M297N83m434k875K203
865a073L655J63l264j179K354J436j973j296J500K361p78l300j040L001K992j661
$$ plain form
881 1898 -2113 -2255 399 2750 1407 -1419 -656 1074 1048 -696 -776 1173 2134 19 -2203 -1016 2268
898 2268 2356 -497 -2530 -818 1889 2045 -547 -991 510 1329 -168 -1304 314 1682 562 -2246
914 -2246 -2128 1000 3069 1205 -2238 -1956 782 2054 561 -1478 -511 1235 767 -991 -711 1317
930 1317 1807 -404 -2421 -846 2305 2731 -222 -2580 -852 2005 1866 -543 -1566 165 1320 167
946 167 -1007 30 1650 1016 -1358 -1706 751 2314 1343 -1621 -1857 575 2162 545 -922 -679 823
963 823 825 -206 -284 952 1654 -296 -1549 -872 1835 2061 -705 -1884 -581 1638 1342 -417 -1061 201
981 201 884 12 -850 115 1400 595 -1583 -1493 612 1931 610 -1489 -1716 938 1621 -139 -1105 -238
999 -238 1119 766 -607 -876 525 1395 -332 -2009 -883 1440 1565 -718 -2026 -620 1285 1183 -457
$$ packed form
881A898m011j42K654K351j343k826P63J730k6j744q0J949R61k115k222J187L284
898B268Q8k853k033J712K707J56k592m44J501Q19j497j136J618J368j120k808
914b246J18L128K069j864l443K82K738J272j493k039R67J746m68j758K80K028
930A317M90k211k017J575L151M26k953k358J728K857j39k409j023J731J155j153
946A67j174J037J620o34k374l48K457J563r71k964k36K432J587j617j467K43J502
963H23Kj031p8J236P02j950j253O77K707K26k766j179J303K219k96j759o44J262
981B01O83q72q62R65J285q05k178R0K105J319j321k099k27K654O83j760r66Q67
999b38J357l53j373k69J401Q70j727j677J126K323J25k283j308J406J905j02j640
$$ plain form
1016 -457 -1521 -192 805 53 -1163 -214 877 683 -1271 -1236 700 1613 602 -1211 -825 607 1360
1033 1360 410 -639 -587 614 504 -548 -431 535 806 -344 -908 -170 1494 1529 -465 -1249 -101 1402
1051 1402 833 -429 -774 121 732 118 -379 392 629 387 -876 -826 580 1546 300 -1161 -826 766
1069 766 1046 215 -955 -658 673 425 -207 -350 598 1135 113 -1161 -52 1120 1220 -441 -1036 -165
1087 -165 921 788 -436 -679 6 605 51 -545 16 218 458 -679 -839 240 1216 213 -1098 -787
1105 -787 398 714 110 -870 -625 439 619 -181 -373 182 720 -200 -1096 -385 616 994 -359 -934 -268
1124 -268 945 503 -587 -376 -160 495 151 -143 -168 845 86 -585 -726 539 1297 104 -652 -682 492
1143 492 921 30 -779 -250 332 621 -121 -258 43 949 8 -888 -7 900 774 -134 -1165 -88 1064
$$ packed form
1016d57j064J329R97p52j216R49J091j94j954L5J936R13j011j813L86J432P53
1033A360r50j049N2J201j10j052J17R66K71j150n64P38J664L5j994p84J148J503
1051A402n69j262l45Q95O11o14m97P71K37k42j263N0J406R66j246j461L35J592
1069G66K80q31j170K97J331k48o32j43R48N37j022j274J109J172J00j661n95Q71
1087a65J086j33j224k43O85N99n54n96N61K02K40j137j60J079R76j003j311L11
1105g87J185L16o04r80K45J064J80q00j92N55N38r20q96P11J001L78j353n75O66
1124b68J213m42j090K11K16O55l44k94k5J013p59o71j41J265P58j193p56l0J174
1143D92M29q91q09N29N82K89p42j37L01R06r41q96Q81R07j26r08j031J077J152
$$ plain form
1162 1064 463 -415 -493 161 557 471 -572 -39 273 293 -230 -471 287 844 309 -447 -919 345 725 32
1182 32 -891 -531 423 424 -194 -519 197 342 -135 -798 -339 291 382 -332 -530 -77 523 371 -492 -597 175
1203 175 337 -155 -253 -310 390 501 -212 -505 226 347 78 -519 -427 758 597 107 -427 -38 465 184 -430
1224 -430 -330 242 292 -36 -353 -284 470 478 -161 -446 -97 598 810 -58 -114 171 473 350 -232 25 321 125
1246 125 -263 -228 152 597 132 -555 -493 437 593 125 -689 -83 300 279 -60 -479 -76 324 -120 -537 -61
1267 -61 251 379 -834 -737 -118 308 91 -416 -409 -93 447 -81 -639 -63 178 -17 -451 -300 -13 518 -131
1288 -131 -313 -340 302 384 -177 -257 -13 341 140 -308 -99 225 497 -89 -594 -10 158 476 -429 -735 31
1309 31 206 74 -151 -551 57 161 16 -378 -206 86 131 -385 -334 419 328 195 -387 -334 325 391 -117 -240
$$ packed form
1162A064o01q78p8O54L96q6j043N33L12K0n23k41P58N57n35p56m72J264L80o93
1182C2r23L60R54Jo18l25P16J45m77o63M59O30R1p14j98M53O00j52q63j05P72
1203A75J62m92r8n7P00J11p13k93P31J21k69n97R2J185j61m90n34L89N03k81o14
1224d30J00N72N0l28l17O9P54Qo39k85L49O95K12q68n6K85L02j23n82K57K96j96
1246A25l88L5L80M45m65o87O2R30J56m68q14O06L83k1l39m19M03M00m44m17M76
1267f1L12J28j213R7O19M26k17n07PL16N40n28n58N76K41j95m34J51K87N31o49
1288a31j82k7O42Q2n61q0K44L54k01m48K09L24K72n86n05N84J68L18r05l06P66
1309C1J75j32k25m00O08J04j45l94J72K92M5n16N1P53r1j33n82N3O59O6n08j23
$$ plain form
1331 -240 -207 307 323 7 -294 1 229 -351 -331 -143 361 257 49 -410 304 537 96 -158 -167 117 456 16
1353 16 -336 -185 620 384 -240 -114 177 107 -198 -570 -66 194 349 -4 -369 62 102 232 -127 -402 181
1374 181 317 125 -101 -252 106 211 34 -256 -258 401 156 -324 -291 251 76 202 -223 -69 -41 288 -7
1395 -7 -109 51 68 393 -312 -111 205 69 -72 -257 -21 -31 23 -26 -122 -14 144 72 -300 -208 75 255 -219
1418 -219 -308 -70 136 47 -118 -440 89 94 -160 -58 -256 -144 323 -78 40 -317 239 -192 -221 -123 159 425
1440 425 -87 -198 -176 245 -36 22 168 130 33 73 -163 166 71 223 46 -266 48 118 201 -269 -275 124 89 29
1464 29 -134 30 -12 351 -137 -99 -170 -207 171 -339 49 253 165 -175 -308 -55 353 57 -246 -84 -26 141
1486 141 -33 -211 -6 -30 221 -293 -81 116 282 296 -133 -234 262 180 139 -229 42 334 255 103 -173 141
$$ packed form
1331b40L3N14J6l16l01K95K28n80K0J88N04j04k08m59P14K33m41k54rK84L39m40
1353A6l52J51Q05k36o24J26K91p0l05l72N04K60J55l53l65M31M0J30l59k75N83
1374A81J36j92k26j51L58J05j77k90kO59k45m80L3N42j75J26m25J54K8L29k95
1395gj02J60J7L25p05K01L16j36j41j85K36j0N4m9r6J08J58p2l72R2K83J80m74
1418b19q9K38K06q9j65l22N29Nk54J02j98J12M67m01J18l57N56m31k9R8K82K66
1440D25n12j11K2M21k81N8J46l8r7M0k36L29r5J52j77l12L14P0Q3m70oL99l5o0
1464B9j63J64m2L63m88L8p1l7L78n10L88K04q8l40j33K53M08k96l03J62N8J67
1486A41j74j78K05k4K51n14K12J97J66J4m29j01M96q2m1l68K71K92p9j52k76L14
$$ plain form
1508 141 34 96 -163 186 27 192 -2 -205 -140 279 -106 -75 161 -38 173 255 -253 -137 287 0 -140
1529 -140 20 9 386 -158 -340 -217 -96 455 273 -109 29 14 42 -197 41 -264 268 -53 -152 -51 -36 397
1551 397 -5 -244 -134 268 304 -22 -280 13 362 -116 -256 -423 -128 252 -155 61 -31 396 330 -268 -62
1572 -62 159 -57 226 -157 -9 213 -153 255 31 -213 238 36 -2 -48 -38 147 1 -212 -144 278 171 181
1594 181 -55 -234 -143 127 46 -101 -96 120 -111 23 66 -30 81 3 -177 -104 -199 -102 -91 -333 -172 -12 135 84
1618 84 103 -148 211 53 -199 280 66 121 -167 60 -161 -245 -183 -347 104 152 173 -72 -13 385 170 -23 -113
1641 -113 -189 378 185 -13 -46 -195 374 9 -107 18 -113 180 7 -215 -255 251 60 -121 -78 -94 55 103
1663 103 -98 -100 57 -105 12 -87 168 -124 53 -67 -111 232 104 8 -1 294 168 200 -259 -102 116 9 -69
$$ packed form
1508A41j07O2k59L49j59J65j94k03O5M19l85L1K36j99K11Q2n08J16M24k87j40
1529a40J60j1L77n44j82J23J21N51j82l82J38j5K8k39K38l05N32l21r9J01J5M33
1551C97m02k39J10M02L6l26k58K93L49m78j40j67K95L80m07K16r2M27o6n98K06
1572f2K21k16K83l83J48K22l66M08k24k44M51k02l8m6J0J85j46k13O8M22j07J0
1594A81k36j79R1K70q1j47NK16k31J34M3r6J11p8j80P3r5R7J1k42J61J60J47n1
1618H4J9k51L59j58k52M79k14N5k88K27k21q4O2j64M51M8K1k45N9L98k15j93r0
1641a13p6N67j93j98l3j49N69l65j16J25j31K93j73k22m0N06j91j81M3j6J49M8
1663A03k01kJ57j62J17r9K55k92J77j20m4L43j28r6rK95j26L2m59J57K18j07p8
$$ plain form
1686 -69 -125 -103 227 -54 -74 7 38 427 69 70 -165 66 -13 9 -181 132 102 112 -112 -112 5 309 92 -23 223
1711 223 279 204 -133 -193 -138 20 -35 -367 -211 157 -32 111 -203 -202 69 -84 -157 -109 -210 111 -16 -154 -91
1734 -91 75 316 -3 -282 -380 199 312 -1 -140 0 213 145 -94 57 187 190 -70 -35 278 53 72 -246
1756 -246 -216 -80 196 -91 177 -156 251 -172 -180 -194 -27 375 157 176 -454 150 -39 269 -326 74 155 148 -147
1779 -147 12 -156 -19 62 -98 -67 -110 75 -19 -261 -117 225 57 -127 -16 468 74 124 -399 -81 -81 -80 99
1802 99 94 39 175 312 32 94 -82 165 127 -75 -137 -68 87 60 -404 34 339 68 -51 42 216 359 -172
1825 -172 -170 185 261 257 -263 27 11 344 129 -139 -144 -54 -123 -213 -177 -69 338 -49 -199 129 272 72 -48 -191
1849 -191 -60 156 451 32 -405 -49 129 303 72 -42 241 -37 -99 254 -96 251 42 26 -52 -95 -70 -304
$$ packed form
1686f9n6K2L30k81k0Q1L1L89l58Jk35K31p9K2j90L13l0J0k24%J17L04k17j15K46
1711B23N6p5l37o0N5J58n5l32J56L68j89J43l14JK71j53p3M8j01L21j27j38O3
1734i1J66K41l19k79r8N79J13l13j39J40K13o8k39J51J30Lk60L5L13k25J9l18
1756b46L0J36K76k87K68l33M07m23qj4J67M02k18J9o30O04j89L08n95M00Q1pk95
1779a47J59j68J37Q1j60L1m3J85r4k42J44L42j68j84J11M84l94N0n23L18%JJ79
1802I9nn5J36J37k80O2j76K47l8k02o2O9J55k7m64M38L05k71j19R3J74J43n31
1825a72KL55P6mn20K90j6L33k15k68nR0o9r0L6J08M07l87j50L28J43k00j20j43
1849a91J31K16K95m19m37L56J78J74k31j14K83k78o2L53l50L47k09j6p8m3K5k34
$$ plain form
1871 -304 -55 -75 275 134 64 -229 159 119 262 -456 -58 -212 -57 -85 -172 -46 218 297 -67 -72 14 218 219 -309
1895 -309 -53 -79 588 -59 -143 -51 271 -39 -15 179 -30 324 109 -107 -136 253 -169 29 -225 153 -58 152
1917 152 108 -199 44 37 -299 -171 -80 62 -101 37 -54 217 196 117 -196 105 355 -72 -8 -87 -116 65 -40
1940 -40 -187 -76 13 -76 83 -30 -101 125 237 50 -168 -102 1 44 -75 26 278 141 128 -240 -283 10 -21
1963 -21 -51 -144 398 323 -36 4 -4 23 40 -95 -242 -122 220 -8 -38 107 193 77 93 365 5 153 291 -79
1987 -79 126 172 232 42 -227 -4 58 152 -103 -256 -142 62 -79 -79 -56 -98 46 -102 78 -173 -121 41 -51 -90
2011 -90 -147 134 19 103 -55 -318 56 10 -50 115 106 83 -210 -62 125 183 -203 -109 -123 170 53 -43 -218 -63
2035 -63 187 -155 -127 109 69 89 -96 -384 -176 31 130 -73 -186 248 -127 396 -306 -347 143 396 -71 -9
$$ packed form
1871c04K49k0L50j41p0k93L88m0J43p18L98j54J55k8q7J26K64P9l64nQ6K04Jn28
1895c09K56k6O67o47q4R2L22l10K4J94k09L54k15k16k9L89m22J98k54L78k11K10
1917A52m4l07K43pl36J28R1J42j63J38r1K71k1p9l13L01K50m27O4p9k9J81j05
1940d0j47J11Q9q9J59j13p1K26J12j87k18O6J03M3j19J01K52j37j3l68m3K93l1
1963b1l0r3N42p5l59M0qK7J7j35j47J20L42k28l0J45Q6j16J6K72l60J48J38l70
1987g9K05M6O0j90k69K23O2R4k55j53J14K04j41%K3m2J44j48J80k51N2J62r2l9
2011i0n7K81j15Q4j58k63L74m6o0J65rk3k93J48J87N8l86R4j4K93j17r6j75J55
2035f3K50l42K8K36m0K0j85k88K08K07R9k03j13M34l75N23p02m1M90K53m67O2
$$ plain form
2057 -9 -57 224 131 -138 -22 102 -67 116 -443 -179 34 235 100 -302 104 395 183 -119 79 -61 419
2078 419 -8 -138 -56 8 25 72 -114 -211 324 103 105 68 -30 198 -130 -505 104 -106 -22 103 -48 -172 -96 39
2102 39 -17 2 266 8 -16 72 -67 -45 -258 132 -48 40 109 99 -276 -23 38 -13 -115 -365 128 158 138 39 -91
2127 -91 229 -4 -224 -76 -164 -347 -92 -23 -37 80 70 -6 5 8 236 -38 -42 34 36 213 18 -217 -267 71 344
2152 344 106 -244 243 92 18 162 10 18 247 -35 -111 -39 -67 320 -121 -137 181 208 -14 -77 -117 17 -8 -138
2176 -138 -143 -6 -154 304 -116 15 -4 241 -109 -75 35 -21 124 24 -203 -246 -93 -168 -36 137 118 41 222
2199 222 -269 13 111 265 -44 -120 125 180 153 -82 -200 -91 176 21 15 -83 23 -73 -211 -152 131 -15 9
2222 9 -412 203 20 -81 121 -279 -276 277 -257 -274 -154 -311 220 -54 -20 -10 -16 69 132 -144 167 -140 -93 -18
$$ packed form
2057im8K81r3k69J16J24j69J83n59K64K13K01j35m02M06K91k12l02J98j40M80
2078D19m27j30Q2O4J7M7j86r7N35k21Kl7r8K28l28l75O09k10Q4J25j51j24P6J35
2102C9n6J9K64k58k4Q8j39K2k13L90j80Q8O9j0l75K53O1n1j02k50M93L0k0r9j30
2127i1L20k33k20J48q8j83K55O9j4J17j0p6J1LK28k74mP6KJ77j95k35n0L38K73
2152C44k38l50M87j51p4J44j52QK29k82p6P2k8L87m41j6L18K7k22o3m0J34k5j30
2176a38nJ37j48M58m20J31j9K45l50L4J10n6J45j00k27m3J53p5J32J73j9p7J81
2199B22m91K82R8J54l09p6K45N5k7k35j18J09K67j55or8J06r6j38N9K83j46K4
2222Im21O15j83j01K02m00LN53n34j7J20j57N31k74L4J0oQ5O3k76L11l07M7P5
$$ plain form
2246 -18 -205 -119 40 37 -83 -83 41 54 -94 -258 -252 356 -110 -76 -131 178 223 -91 -389 -52 40 -126 -68 -121 -78
2271 -78 195 336 -162 27 -93 -228 -70 133 57 333 -96 -39 97 -16 161 44 -233 86 36 -57 50 -144
2293 -144 126 -228 37 -17 123 217 32 -206 -1 53 89 172 -252 -188 202 -22 -38 -119 -166 56 230 -31 -304
2316 -304 28 101 -92 139 -157 239 197 -320 3 11 -57 -75 -43 32 5 359 106 -231 -76 -76 296 24 -311 129
2340 129 145 83 -154 59 -293 -25 -99 -34 290 352 33 -82 -104 129 76 -7 158 -178 -23 231 -113 -87 -201
2363 -201 -225 400 -163 -262 -25 195 230 -57 94 82 -74 -340 23 99 272 123 -75 -242 134 -21 42 -2
2385 -2 -245 123 -18 -196 53 19 -281 40 -58 123 49 -181 183 -255 130 -41 221 -145 -123 267 -92 -6
2407 -6 90 -78 -170 400 97 282 -17 -23 76 213 -247 149 -88 93 -94 182 76 14 259 61 -24 449 -130
$$ packed form
2246a8j87Q6J59lj20%J24J3j48j64OO08m66L4n5L09M5l14k98L37R2j66N8n3M3
2271g8K73J41m98J89j20j35J58K03p6K76m29N7J36j13J77j17k77L19n0r3J07j94
2293a44K70l54K65n4J40R4j85k38K05N4L6Q3m24O4L90k24j6q1m7K22J74k61k73
2316c04L32P3j93K31k96L96m2n17L23Qo8j8L2P5k7L54k53l37J55%L72k72l35M40
2340A29J6o2k37K13l52K68p4O5L24O2l19j15k2K33n3q3J65l36J55K54l44K6j14
2363b01k4O25n63r9K37K20L5k87J51j2j56k66L63P6J73j49j98j67L76j55O3m4
2385bk43L68j41j78K49l4l00L21r8J81p4k30L64m38L85j71K62l66K2L90l59Q6
2407fR6j68r2N70l03J85k99oR9J37m60L96k37J81j87K76j06o2K45j98q5M73n79
$$ plain form
2430 -130 -7 -514 -4 -13 96 -159 1 -190 -268 -239 75 117 258 113 -186 -114 94 -194 -178 -177 -412 44 30
2453 30 102 144 237 -47 -203 -59 -46 -49 365 -42 288 5 89 -102 -5 -64 -120 164 1 -94 -134 31 115 -107 -25
2478 -25 205 152 -106 -189 -145 280 114 -39 -99 -268 56 -84 199 -80 -126 -217 11 73 58 54 24 48 -240 30
2502 30 -137 193 -236 -211 -82 -176 186 239 42 121 56 17 -231 386 146 -261 -250 -16 188 349 -27 98 114
2525 114 139 -281 -228 -296 22 56 198 145 -233 100 119 45 -44 208 -116 -204 246 41 52 488 -133 19 98 -224
2549 -224 131 -80 -80 6 21 297 105 -10 75 -303 -217 -233 190 80 211 -223 37 -71 -13 -104 37 18 63 24
2573 24 -172 -105 185 247 253 62 -16 110 315 34 67 84 243 11 111 -196 209 -206 -20 157 -88 136 -17
2596 -17 -82 -65 -28 11 76 109 -256 211 47 81 62 -142 -234 130 58 209 70 -94 -111 -266 5 112 20 -246
$$ packed form
2430a30J23n07N10rJ09k55J60j91p8K9L14M2J41j45k99P2K08k88J6Jk35M56j4
2453C0P2M2R3k84j56J44J3lM14m07L30k83Q4j91R7n9n6K84j63r5m0J65Q4k22Q2
2478b5K30n3k58q3M4M25j66j53o0j69L24j40K83k79m6r1K28O2j5ml0K4k88K70
2502C0j67L30m29K5J29r4L62N3j97P9o5l9k48O17k40m07J1K34K04J61l76J25J6
2525A14K5m20N3o8L18L4J42n3l78L33J9p4q9K52l24q8M50k05J1M36o21J52P9l22
2549b24L55k11%Q6J5K76j92j15Q5l78Q6j6M23j10J31m34K60j08N8r1J41j9M5l9
2573B4j96O7K90O2Oj91p8J26K05k81L3J7J59k32J00l07M05m15J86J77k45K24j53
2596a7o5J7L7L9O5L3l65M67j64L4j9k04r2L64p2J51j39j64j7j55K71J07r2k66
$$ plain form
2620 -246 -78 -173 296 -225 -302 -181 291 257 -6 88 -155 28 5 -123 -153 -119 -9 127 -98 2 67 511 -10
2643 -10 -212 -53 97 136 -360 16 128 217 11 121 -33 -47 54 -120 -283 -36 55 -51 192 150 185 87 51
2666 51 -126 -255 -74 -18 -114 -122 -69 50 -117 -142 98 49 233 -97 159 262 27 -24 -277 -30 -72 48 -73
2689 -73 -72 -185 168 159 -2 51 90 194 273 109 41 80 434 117 114 24 235 -71 68 -64 -13 120 -52 130 -209
2714 -209 -80 -250 -245 354 -159 -52 326 -34 25 317 356 -34 -161 -136 -63 -26 208 5 8 156 -52 -73 308
2737 308 -38 249 77 -62 93 265 109 -99 -281 140 -114 -182 -69 -29 -296 -52 67 -92 136 -33 -139
2758 -139 24 133 78 19 -110 -20 129 -259 7 20 -137 -94 178 -74 -313 89 390 291 -318 -240 105 -6
2780 -6 109 -112 14 186 -138 14 -181 -121 -16 -94 -104 -25 117 -106 62 -86 31 -88 -125 50 -17 -232 53
$$ packed form
2620b46J68r5M69n21p7J21M72l4k63R4k43J83k3j28l0L4J10J36k25J00O5M44n21
2643a0k02J59J50L9m96L76J12Q9k06J10j54j4J01j74j63K47R1j06K43m2L5r8l6
2666E1j77j29J81N6r6qN3J19j67k5K40m9J84l30K56J03k35n1k53K47m2J20j21
2689g3Jj13L53rj61N3L9J04P9j64o8L9L54l17lr0K11l06J39j32N1J33j72J82l39
2714b09J29j70NN99n13J07L78l60N9K92L9l90j27K5P3L7K34k03LJ48k08k1L81
2737C08l46K87j72j39J55J72j56k08j82M21k54o8J13M0k67K44J19j59K28j69j06
2758a39J63J09n5n9j29R0J49l88K66J3j57M3K72k52k39M02L01r9o09P8L45j11
2780fJ15k21J26J72l24J52j95O0J05p8j0P9J42k23J68j48J17j19l7J75o7k15K85
$$ plain form
2803 53 -146 -218 -141 103 192 137 -150 -165 -91 -74 -167 -180 162 -163 40 -5 30 135 -267 -30 -304 -65 -188 113
2827 113 -124 -126 34 -43 22 177 -111 17 12 64 70 -200 -16 45 -149 -262 227 -95 -48 16 99 -43 -152 -42
2851 -42 28 274 27 165 -145 -64 -36 -150 -11 -26 -167 111 144 196 143 32 180 -284 -159 124 -149 -7 236
2874 236 -167 285 308 -82 45 -108 190 -19 14 259 200 58 -252 -344 76 148 -198 242 -131 -75 49 58 -263
2897 -263 -121 -216 219 121 -161 261 -51 126 -141 143 34 159 -39 128 2 68 -57 91 -268 -101 89
2918 89 70 79 43 53 -32 -20 -174 89 -179 -148 11 -17 195 151 -167 -76 -152 -117 -96 51 -140 -12 157 -19 -26 -29
2944 -29 44 -233 40 28 -87 236 7 -35 -254 -114 -55 130 42 -48 -59 172 58 45 180 170 221 -253 259 172
2968 172 4 139 -83 -22 208 -3 183 -130 33 94 22 152 -182 -167 113 27 -272 -94 101 -336 -157 -96
$$ packed form
2803E3j99p2P7K44Q9n5k87j5P4J7r3j3L42l25K03m5L5J05m02K37k74K39j23L01
2827A13k37kJ60p7O5J55k88J28nN2Ok70J84O1j94j13M89l22M7O4Q3j42j09J10
2851d2P0K46k47J38l10Q1K8j14J39j5j41K78L3N2n3j11J48m64J25K83k73J42K43
2874B36m03M52K3l90J27j53K98k09L3K45n9j42l10r2M20P2l46M40l73N6J24Rl21
2897b63J42r5M35r8k82M22l12J77k67K84j09J25j98J67j26O6j25J48l59J67J90
2918H9j9Rl6J0q5J2j54K63k68L1J59k8K12m4l18R1p6L5K1J47j91J28J69j76pl
2944b9P3k77K73j2j15L23k29m2k19J40N9J85q8r0j1K31j14j3J35j0N1m74N12q7
2968A72j68J35k22O1K30k11J86l13J63O1p2J30l34J5K80q6k99J78J95m37J79O1
$$ plain form
2990 -96 225 88 -82 -68 -93 548 291 -127 -144 90 -126 72 -76 201 -42 271 305 -122 26 73 73 52 235
3013 235 229 137 81 -154 31 -142 141 115 -74 -88 -85 183 45 -83 -29 26 -88 122 -88 225 -225 6 -89 -112
3037 -112 52 113 -12 -243 -47 56 39 26 52 -111 90 2 244 -124 -136 -54 -29 -23 102 -116 79 -127 -120 -12
3061 -12 87 259 27 -46 -115 142 -191 69 -76 44 -47 -2 -61 17 -116 -16 -122 203 60 -82 -114 25 -66
3084 -66 -56 -1 -41 -184 71 160 -77 -98 -194 -56 73 -68 -317 -28 -91 98 59 96 119 -56 -54 35 31 108 89 9
3110 9 257 166 24 17 -314 -64 3 10 -309 99 -90 -126 59 -34 83 342 105 -154 64 -105 128 164 -26 40
3134 40 130 -383 -123 -52 -98 44 176 232 -55 131 -3 213 -195 -84 349 175 -4 -103 -216 64 -320 -313 99
3157 99 160 -26 13 320 -49 -484 -247 -82 -152 93 41 -83 123 22 -147 136 -241 43 37 205 467 -101
$$ packed form
2990i6L21j37j70J4k5O41k57m18j7K34k16J98j48K77k43L13L4m27J48M7%k1J83
3013B35or2n6k35J85j73K83k6j89j4LK68j38j28N4N5j14K10k10L13m50K31r5k3
3037a12J64O1j25k31J96J03j7j3K6j63K01q8K42l68j2Q2K5OJ25k18J95k06PJ08
3061a2R9J72k32p3o9K57l33K60j45J20r1M5n9P8j33J00j06L25j43j42l2J39r1
3084f6J0N5m0j43K55Q9k37k1r6J38J29j41k49K89o3J89l9L7K3j75KQ9mP7j9q0
3110IK48r1j42pl31K50O7Pl19M08j89l6J85r3J17K59k37k59K18j69K33L6j90O6
3134D0R0n13K60P1m6J42J32N6k87J86j34K16m08J11M33j74j79r9j13K80l84PM12
3157I9O1j86L9L07l69m35K37J65p0K45n2j24K06j01j69K83l77K84oJ68K62n68
$$ plain form
3179 -101 -204 -10 -51 156 -86 159 211 113 57 -265 -12 104 130 63 102 126 -15 -79 -170 66 18 6 -219 55
3203 55 -52 -74 165 -163 201 -23 -43 -149 -132 -244 -221 323 -72 -328 154 297 365 201 -24 -202 29 -68
3225 -68 117 -40 99 -90 83 9 95 225 -78 -103 -116 68 -139 -222 3 -32 -265 35 97 -195 274 99 58
3248 58 13 200 52 15 -21 -56 6 113 -93 -51 16 325 -314 198 -128 -256 -40 118 10 -71 285 -102 -130
3271 -130 -58 -116 113 122 80 -68 -228 -218 -101 44 -273 108 -17 113 -119 -176 -1 -73 14 -378 -49 2 -30 -159
3295 -159 -36 69 -27 312 -40 47 144 193 -100 110 -54 126 -119 -93 -31 66 8 92 192 -45 -120 -101 -55 -180
3319 -180 90 17 -103 -42 -166 -2 224 -21 -184 102 -155 -166 -124 338 17 -272 -55 -60 44 202 95 3
3341 3 -210 70 86 -33 -280 57 -87 -4 -245 18 171 -30 38 318 95 -306 135 -13 171 -324 -93 -110
$$ packed form
3179a01j03J94m1K07k42K45N2r8n6l22K53J16K6o7L9K4j41o4r1K36m8j2k25K74
3203E5j07k2K39l28L64k24k0j06J7j12K3N44l95k56M82J43O8j64k25j78K31r7
3225f8J85j57J39j89J73p4Q6J30l03k5j3J84k07q3K25l5k33L00O2k92M69j75m1
3248E8m5J87j48l7l6l5O2J07k06M2O7L09o39N12l26j28K16J58j08q1L56l87k8
3271a30P2n8K29Rm2j48j60J0J17J45l17L81j25J30k32n7J75p2Q7l92L29N1l2j29
3295a59J23J05r6L39l52Q7R7M9k93K10j64J80k45K6O2R7n8Q4J00k37p5J9M6j25
3319a80K70p3j20O1j24J64K26k45j63K86k57j1M2M62l21k89K17nJ04J58j07r2
3341Ck13K80J6j19k47L37j44Q3k41K63J53k01O8K80k23m01M41j48J84m95K31j7
$$ plain form
3363 -110 255 103 286 28 57 -203 -81 -51 -125 116 253 -178 247 185 -67 140 -25 -31 -114 -266 -126 -28 -201
3386 -201 -212 126 260 31 -111 -3 -75 -36 -39 17 78 154 -48 -138 37 -229 22 -285 -105 118 98 72 181 -82
3410 -82 -188 -73 -137 224 -364 -35 -191 157 34 -349 -47 16 -276 110 -249 66 44 204 77 -26 -21 -24 204
3433 204 144 224 -39 -68 64 208 66 23 41 207 -167 -197 9 -18 -108 135 -57 143 -25 68 154 18 -157
3456 -157 7 -55 -19 -353 -139 19 -235 178 126 53 -161 83 -99 -62 329 41 146 -100 83 -242 29 27
3478 27 -199 -95 81 69 222 -24 -47 122 -20 -143 -81 -174 -90 -86 -299 1 -29 74 68 350 -85 -192 25 94
3502 94 110 -10 91 -13 -183 98 -158 -76 39 -94 -261 55 34 37 -139 -69 329 73 182 -347 143 -152
3524 -152 41 -156 118 72 -137 150 227 -271 -163 46 -241 -146 45 -1 122 -131 -158 104 -115 154 -29 -243
$$ packed form
3363a10L65j52J83k58K9k60J22L0p4K41J37m31M25o2k52K07j65oq3j52J40R8j73
3386b01j1L38J34k29j42J08p2L9lN6O1P6k02r0J75k66K51l07J80K23k0k6J09k63
3410h2j06J15o4L61n88L29j56L48j23l83L02O3k92L86l59L15k2J60j27j03NlK28
3433B04o0Q0k63k9J32J44j42m3J8J66l74l0K06k7r0K43j92K00j68R3Q6j36j75
3456a57J64o2L6l34K14J58k54M13n2p3k14K44j82L7L91k88J05k46J83l25K71k
3478B7k26J04J76j2J53k46k3J69j42j23O2r3Q4Mk13L00l0J03oK82m35j07K17O9
3502I4J6j20J01j04j70K81k56Q2J15j33j67L16k1Lj76P0L98k56J09n29M90k95
3524a52J93j97K74m6k09K87P7m98J08K09k87R5J91m6J23k53k7K62k19K69j83k14
$$ plain form
3546 -243 13 109 -81 59 -146 -47 27 20 -32 60 -53 -9 24 143 -161 -117 -23 31 -77 -152 101 -58 -108 69 -69
3571 -69 71 51 -413 -113 -42 209 -98 203 116 -57 -45 -299 -30 -289 -56 -100 -164 -144 260 -376 212 163 -65
3594 -65 -48 245 -130 103 -90 38 247 167 -10 101 217 -287 -160 43 295 200 96 -106 31 35 -101 -244
3616 -244 179 62 -323 18 -124 -242 19 91 -79 84 -132 -74 -6 -249 31 -157 135 110 -173 -139 50 29
3638 29 -73 210 119 34 260 73 -479 -316 -261 257 -151 240 72 -56 -91 -233 147 -150 348 -57 194 -4
3660 -4 77 29 -50 137 193 0 -151 95 4 -62 -233 -20 27 -53 152 -193 -144 146 8 3 200 206 57 -142 200
3685 200 -14 255 186 -205 -26 -13 -203 -7 -199 252 -169 -20 -35 196 186 -59 -21 -463 44 -287 201 -296
3707 -296 256 -191 -156 244 25 -179 -214 -39 5 382 12 -141 -2 -231 166 -192 67 245 -74 482 -15
$$ packed form
3546b43K56R6j90J40k05R9P4pn2R2j13M4L3J19l04M4R4N4j08p5K53j59n0J77j38
3571f9J40k0m64L00P1K51l07L01q7j73J2k54K69k59K33m4o4K0M04o36N88m9k28
3594f5J7K93l75K33j93J28K09q0j77J11J16n04J27K03K52r5j04k02J37Mj36j43
3616b44M23j17l85L41j42j18K61P2j70J63k16N8O8k43K80j88K92k5k83L4J89k1
3638B9j02K83r1q5K26j87n52J63N5N18m08L91j68j28l5j42L80k97M98m05K51j98
3660dQ1m8p9J87N6j93j51K46r1o6j71K13M7q0K05l45M9K90j38nJ97Oj49j99L42
3685B00k14K69o9l91J79J3j90J96j92M51m21J49j5K31j0k45L8m42N07l31M88m97
3707b96N52m47L5M00k19k04l5J75M4L77l70j53J39k29L97l58K59J78l19N56m97
$$ plain form
3728 -15 -341 62 102 -136 -160 176 13 269 77 110 61 163 -201 -126 1 123 -172 -252 -73 -87 -10 -53 -71 -210
3752 -210 141 152 164 26 5 91 -124 157 83 -144 72 -8 -228 -169 -1 -73 -144 -118 110 82 48 104 69 13 -111
3777 -111 -113 8 402 -490 118 -11 219 -144 46 227 -92 -92 -231 -199 -108 34 63 144 -149 -276 -11 69 387
3800 387 128 -243 133 104 -7 -13 -224 -226 11 84 23 -325 148 205 52 -103 102 -45 110 384 -287 142 -114
3823 -114 -137 166 -35 72 4 -188 35 275 -30 -61 -91 159 87 -124 7 334 -92 115 61 73 66 26 -8 -124
3847 -124 253 219 -1 -224 81 125 1 27 -167 -35 -52 130 98 64 61 32 -260 -190 134 -88 -38 7 123 -203
3871 -203 -250 245 -63 -36 -5 -101 -135 45 220 -3 -130 215 -147 29 -292 -63 -336 -73 118 -131 49 -112
3893 -112 -114 -45 -233 -113 31 24 39 -170 286 126 157 103 -139 -90 -207 -42 -32 33 -14 283 69 277 94 -326
$$ packed form
3728a5l26M03M0k38k4L36j63K56j92L3m9J02l64P5J27J22k95q0J79j4P7m3j8j39
3752b10L51J1J2j38k1Q6k15K81p4k27K16q0k20N9J68p2p1K6K28k8l4N6l5n6j24
3777a11kJ21L94q92O08j29K30l63J90J81l19%j39L2R1J42K9Q1k93j27K65Q0L18
3800C87k59l71L76k9j11ok11kK37P3o1l48M73N7j53j55K05j47J55K74o71M29k56
3823a14k3L03k01J07o8j92K23K40l05l1l0K50p2k11J31L27m26K07n4J2pm0l4j16
3847a24L77l4k20k23L05M4j24K6j94J32j7J82l2l4lk9k92P0L24k22N0M5J16l26
3871b03m7M95l08K7L1r6l4J80J75k23j27L45l62J76l21K29k73K63J91k49J80j61
3893a12kO9j88J20J44pJ5k09M56j60L1n4k42M9j17J65J0O5m7K97k14K08j83m20
$$ plain form
3917 -326 -190 -113 -159 47 47 -178 65 84 -86 85 -148 36 -2 -233 -142 -5 1 35 98 18 221 -86 47 166
3941 166 175 -168 141 88 16 -117 -94 108 -69 188 21 168 -48 -291 -131 155 255 -98 33 -27 -65 -222
3963 -222 175 -37 19 -198 -373 10 160 298 -95 149 108 167 -63 93 -317 14 -1 -85 77 -190 -197 130
3985 130 121 -132 3 235 -109 -13 173 140 -28 325 -370 -23 235 77 42 61 -150 373 46 -80 3 1 -100
4008 -100 41 467 -118 320 28 47 149 -41 10 102 194 -34 53 -154 -31 69 -112 -72 -229 -37 181 40
4030 40 -22 -9 13 140 -133 -109 116 31 -150 125 60 -40 -70 -66 -188 137 10 90 214 -82 174 -87 130 309
4054 309 -297 86 -47 -110 -42 218 10 -14 -43 171 0 205 -81 -122 159 -172 216 33 -54 -159 193 189 -139
4077 -139 353 107 -226 110 -48 -21 31 148 146 -247 61 -61 120 -48 44 9 145 -120 -31 143 116 126 181
$$ packed form
3917c26J36P7m6K06%k25K43J9j70J71k33J84l8k31R1J37OL4O3q0K03l07J33J19
3941A66Rl43L09n3p2j33K3K02j77K57j67J47k16k43J60K86J00l53J31o0l8j57
3963b22L97k12N6k17j75L83J50J38l93K44m1N9k30J56m10L31j5q4J62k67pL27
3985A30rk53J35K32l44R6J86l3j68L53o95L47K58j58l5J9k11N23l27j26Q3kj01
4008a00J41M26n85M38k92J9J02j90N1R2R2k28Q7k07J23J00j81M0j57J92K18j41
4030D0o2J3K2J27k73K4K25q5j81K75o5j00l0Mj22L25j27Q0J24k96K56k61K17J79
4054C09o06L83j33o3O8K60k08k4k9K14j71K05k86m1K81l31L88j83q7j05L52ml28
4077a39M92k46l33L36j58K7N2J17kl93L08j22J81j68R2l5J36k65Q9J74k7J0N5
$$ plain form
4100 181 -165 10 -116 149 -75 -210 50 8 -11 50 -106 -113 110 -91 -285 240 -88 99 494 -134 306 -49
4122 -49 108 -91 -179 121 -8 248 -71 32 113 60 268 123 393 130 -10 -273 -152 66 102 197 7 -142
4144 -142 134 233 -146 -22 -93 73 -84 152 -69 -186 284 134 -116 256 -69 100 308 -22 106 61 -267
4165 -267 5 13 56 180 -41 -70 -98 59 -136 -96 -70 61 159 229 93 19 -110 -58 -121 73 198 -236 74 100
4189 100 -138 183 -316 -151 115 -133 -215 -239 -12 -120 46 -241 -4 -123 357 -40 -85 9 -267 55 80 -288
4211 -288 -173 -97 -81 105 -316 172 -111 36 174 40 94 -6 42 282 -88 79 -111 -252 75 7 -104 3
4233 3 262 -44 160 -112 89 -132 -284 -316 146 -203 57 51 13 307 76 1 -224 -63 -141 -144 -43 -89 -42 -133
4257 -133 158 -12 187 51 154 83 -142 15 -158 -181 -81 251 395 -95 -67 103 78 -256 145 350 36
$$ packed form
4100A81l46J75j26K65k24j35K60m2j9O1j56pK23k01j94N25l28J87L95o28M40l55
4122d9J57j99q8L00j29K56l19J03Q1n3K08j45K70k63j40k63J21K18L6R5j90j49
4144a42K76R9l79J24p1J66j57K36k21j17M70j50k50L72l25J69K08l30J28m5l28
4165b67K72QM3J24k21k9k8J57j95M0K6J31R8P0j36p4j29N2o3J94J25m34L10K6
4189A00k38L21m99J65K66k48q2k4K27j08J66k87K37j19M80l97m5R4k76L22K5l68
4211b88J15P6J6J86m21M88k83J47J38j34N4j00M8K40l70J67j90j41L27o8j11J07
4233CK59l06K04k72K01k21j52l2M62l49K60ol8K94k31p5k25J61p8lJ01m6M7r1
4257a33K91j70J99j36J03p1k25J57j73k3J00L32J44m90K8J70k5l34M01K05l14
$$ plain form
4278 36 22 168 202 1 158 -16 21 52 -2 94 72 -47 -315 0 -27 13 47 -70 -191 -33 -95 4 -203 -95
4302 -95 59 -205 -70 17 32 68 -79 112 216 106 -21 161 -62 194 71 -231 -157 178 291 -208 103 -209
4324 -209 -177 -78 95 161 -162 48 85 155 241 -32 85 -346 215 34 8 362 18 -26 -118 100 31 -169 -72 -71
4348 -71 190 -136 -182 -281 -250 83 141 -201 157 -10 -56 -215 -3 133 -222 9 -140 -100 -187 -41 -84 -99 213
4371 213 -76 -161 -353 -60 199 166 -12 92 172 -26 -31 -37 -191 -219 -34 -113 72 -3 185 -17 -116 -5 69 17
4395 17 -286 -133 -42 -52 -89 242 -45 301 -72 85 217 60 5 100 371 4 101 -68 -140 18 -249 88 -113
4418 -113 -6 150 169 -65 -141 -89 47 -133 78 -47 -339 109 -131 109 -5 33 -87 -256 -123 -14 63 27
4440 27 -88 3 36 -46 294 44 -152 184 61 118 -288 -35 48 -85 19 -160 120 83 108 -198 -118 -202 -42
$$ packed form
4278C6j4J46L4k01J57j74L7L1n4R6k2j19k68L15k7M0L4j17j21J58o2R9k07J08
4302i5J54k64J35Q7J5L6j47J91J04j10j27J82k23K56j23l02P4L35J13m99L11l12
4324b09L2R9J73O6l23K10L7P0Q6k73J17m31N61j81k6L54l44m4r2K18o9k00R7J
4348g1K61l26m6r9L1L33N8l42L58j67m6j59K12J36l55K31j49M0q7J46m3j5L12
4371B13k89q5j92K93K59l3j78J04Q0j98noj54k8J85p9J85p5J88k02r9J11P4n2
4395A7l03J53R1j0l7L31k87L46l73J57J32j57n5R5K71l67R7j69p2J58k67L37k01
4418a13J07J56J9k34p6N2J36j80K11j25k92M48k40K40j14L8j20j69J33J09P7l6
4440B7j15R1L3q2L40k50j96L36j23N7m06K53Q3j33J04j79K80l7K5l06Q0q4J60
$$ plain form
4463 -42 -275 277 40 -44 -261 65 -237 86 -139 -121 -214 -64 36 -17 -150 20 -46 48 267 -73 126 37 -49
4486 -49 22 42 37 75 -26 -288 -155 161 232 -206 -102 -13 37 90 293 264 0 12 259 86 -33 66 12 81 85 -83
4512 -83 -347 -301 -97 -81 -114 -42 10 249 208 60 -227 91 229 -177 157 -19 92 256 84 93 -145 155 -26
4535 -26 -135 318 -105 -41 -27 -27 -43 -12 -21 -37 -81 234 76 -198 180 -55 -250 -151 226 135 120 140 -204 129 28
4560 28 -164 -44 -33 -225 251 -230 -11 -41 -329 157 28 -136 -228 -160 138 133 -92 148 17 35 27 -448 -14
4583 -14 49 -284 -26 -42 223 -182 -119 -189 -63 -249 -19 -125 -22 173 171 -93 85 204 125 -32 -108 -223 -153
4606 -153 -147 -42 28 -126 122 262 -162 222 53 -111 -40 -354 191 62 47 209 -175 -117 223 -141 126 -451
4628 -451 10 -121 240 -3 9 197 -40 -37 -102 119 167 95 -258 -132 -152 -31 -77 -7 4 -103 62 -152 -107 -210
$$ packed form
4463d2k33N52k37q4k17L26l02L23k25J8r3J50J00n3j33J70o6R4K19l40J99q9q6
4486d9P1K0nL8j01k62J33L16P1m38J04Q9N0N3K03k9k64J2K47j73j19R9n4O9Mj68
4512h3k64M6K04J6l3P2N2K39m1j48k87L18J38m06L34j76J11J64j72Rk38L00j81
4535b6j09M53m23O4J4%j6L1rj6m4L15j58k74L78k35j95R9L77r1j5K0l44L33j01
4560B8j92J20J1j92M76m81K19l0k88M86j29j64r2O8K98nk25K40j31J8qm75M34
4583a4O3l33K58j6K65m05O3p0J26j86K30j06J03J95kk64J78J19p9j57p6j15P0
4606a53OJ05P0j54K48J40m24L84j69j64P1l14N45j29j5J62l84N8L40l64K67n77
4628d51M61j31L61k43J2J88k37Lo5K21M8p2l53J26k0J21m6P0J1j07J65k14M5j03
$$ plain form
4652 -210 68 -2 245 -34 234 -166 -106 -164 30 29 243 -57 68 -232 -223 102 -159 198 -89 -79 -165 79 -178
4675 -178 -66 -74 8 -210 83 189 -21 -5 71 61 -33 68 21 -188 -86 -61 5 -1 -196 -131 -59 -61 62 126 -42 -27
4701 -27 31 -75 -35 71 -352 -115 -179 295 -63 -112 326 47 34 -7 135 -90 261 381 71 20 129 44 -238
4724 -238 -186 -29 -67 58 67 -40 63 13 210 -99 24 137 111 225 -154 11 -59 -247 294 60 -89 23
4746 23 -302 84 130 -87 -68 -76 167 -44 80 314 -151 -254 -131 118 -42 -271 49 -190 69 179 -59 198
4768 198 -23 175 -67 119 3 28 -214 285 74 -159 -201 -198 -13 -360 -52 -43 -207 -240 -133 -220 127 16 200
4791 200 -149 -80 155 -26 -265 -13 12 69 182 200 11 93 164 146 84 17 188 14 70 165 100 154 163 -81 -68
4816 -68 -34 -214 16 64 -211 98 -154 -80 58 -35 31 -95 106 169 -21 -232 -289 488 -275 -170 95 -45 -138
$$ packed form
4652b10K78p0K47k79K68m00O0n8J94jK14l00J25l00RL25k61L57k87J0q6K44k57
4675a78J12qQ2k18K93J06k10J6P6j0r4J01m7k09J02K5O6oj95O5P2kJ23O4j68J5
4701b7N8j06M0J06m23K37o4M74l58m9M38k79j3m1J42k25L51J20l10n1J09q5k82
4724b38N2J57l8J25Rj07J03n0J97l09J23J13k6J14l79J65p0j88N41k34j49J12
4746B3l25L86M6k17J9qK43k11J24K34m65j03J23K49j60k29L20k39K59J10k38K57
4768A98k21J98k42J86j16K5k42M99k11k33m2LJ85l47L08Rj64l3J07q7L47j11J84
4791B00l49O9K35j81k39K52K5N7J13J8j89Q2P1j8o2o7J71j74N6R5o5N4Rk44J3
4816f8L4j80K30M8k75L09k52P4J38r3O6j26K01O3j90k11n7P77p63J05K65j40r3
$$ plain form
4839 -138 54 14 44 9 -226 438 42 -39 137 -88 -105 1 208 137 -184 -69 308 148 37 -7 -98 276 313
4862 313 -375 -174 36 38 -216 206 -51 174 114 -210 -210 60 -92 22 127 -73 -28 97 238 -151 -109 4
4884 4 200 83 102 -82 -267 -283 18 352 51 160 -62 45 161 -239 118 195 -201 -222 -300 -401 -195 -19
4906 -19 -350 -411 15 -88 79 -146 166 87 181 198 355 219 -84 -166 -234 -188 -124 163 174 -17 107 34 -228 -82
4930 -82 40 -271 -116 -261 -9 236 46 116 -126 12 -26 109 -262 -79 40 103 -14 -165 -84 152 298 -61
4952 -61 -412 50 185 -252 -71 279 353 162 39 63 -148 116 -238 123 -100 256 123 -208 -154 181 115 116
4974 116 192 -169 86 306 -161 -97 235 -56 121 183 -80 -142 162 -102 145 3 -228 116 -79 11 139 -39
4996 -39 234 31 -182 114 -60 103 62 18 226 54 8 -46 91 17 -67 -64 263 10 -135 -226 -63 150 59 -226
$$ packed form
4839a38J92m0L0l5k35O64l96q1J76k25j7J06K07p1l21J15L77j60j11m4r1L74L7
4862C13o88K01K10Kk54M22k57K25o0l24%K70j52J14J05k00M5J25J41l89M2J13
4884DJ96j17J9j84j85j6L01L34l01J09k22J07J16m00L57P7l96k1p8j01K06J76
4906a9l31o1M26j03J67k25L12p9R4J7J57j36l03q2o8M6O4K87J1j91J24p3k62J46
4930h2J22l11J55j45K52K45j90P0k42J38l8J35l71J83J19O3j17j51Q1K36J46l59
4952f1l51M62J35m37J81L50P4j91j23K4k11K64l54L61k23L56j33l31N4L35o6J
4974A16P6l61K55K20m67O4L32k91J77O2k63o2L04k64K47j42k31L44j95R0J28j78
4996c9K73k03k13K96j74J63m1m4K08j72m6n4J37p4q4LL27k53j45r1J63K13r1k85
$$ plain form
5020 -226 -5 112 87 -299 74 -143 71 -155 -144 254 22 -274 -48 100 260 143 56 183 -376 244 -1
5041 -1 -25 -205 -263 -237 154 63 -313 -163 101 50 -49 -104 -229 -168 -215 105 39 158 133 -8 293 -205 -155 -75 -126
5066 -126 -267 -85 -70 132 170 -298 59 223 -29 401 51 127 32 -131 -121 61 -26 197 20 -91 74 4
5088 4 103 97 248 -93 160 31 -111 -385 -59 2 176 -10 225 -219 95 38 -2 33 -194 53 -33 32 -137 102
5112 102 197 -15 -219 42 -280 6 -9 -148 115 -83 16 284 80 -94 -197 2 -59 -166 47 59 -30 13
5134 13 128 275 19 72 51 154 -419 2 58 -25 -61 126 8 0 153 81 16 -17 -198 -83 130 106 126 -8
5158 -8 61 76 118 57 -4 64 -143 21 97 191 -189 -192 -24 140 82 -124 -125 -72 87 -48 -53 -5 -234 -314 -22 -314 104
5185 104 -171 64 -142 287 51 -41 -41 -43 -12 -104 -112 -178 115 139 41 -148 183 -100 -6 8 -103 142 118 24 -47 32
$$ packed form
5020b26K21J17k5l86L73k17K14k26J1L98k32k96K26J48J60j17q7J27n59O20k45
5041ak4j80n8K6L91r1l76J50K64n1r9n5j25O1m7L20o6J19k5j41L01m98N0Q0n1
5066a26j41J82J5K02L8m68L57J64k52M30l50P6r5j63J0J82q7K23j77j11J65p0
5088DR9oJ51l41K53j29j42k74L26O1J74j86K35m44L14n7m0L5k27K47q6O5j69K39
5112A02R5k12k04K61l22K86j5j39K63j98R9K68k04j74j03J99o1j07K13J2q9M3
5134A3J15J47k56N3k1J03n73M21N6q3l6J87j18qJ53p2o5l3j81J15K13k4K0j34
5158hO9J5M2o1o1O8k07J64P6R4l80lJ68J64n8k06jN3J59j35nM8k29q0K92k92M18
5185A04k75K35k06M29k36r2%kL1r2qo6K93K4r8j89L31k83R4J4j11K45k4r4p1P9
$$ plain form
5211 32 213 -28 345 -83 -122 -7 259 26 156 -43 -42 -140 -55 -126 -103 -310 -144 -229 -198 72 -61 -285 38
5234 38 -198 -231 -171 -258 -11 -128 62 -108 157 188 14 -14 124 287 153 -173 -217 -94 -258 -109 217 -59
5256 -59 -66 -65 -59 47 137 -156 4 138 250 -90 -141 267 9 276 60 226 -107 60 -331 123 19 71 -267
5279 -267 196 -111 -228 -43 -38 16 -107 -100 67 53 60 -294 68 27 -144 167 37 56 9 282 223 86 89 43 -200
5304 -200 109 -167 -91 29 51 284 139 -40 227 -117 212 182 -41 393 161 -130 50 -32 91 -82 86
5325 86 48 9 -389 -191 164 -11 -57 6 225 75 -89 128 121 -81 -34 164 30 -265 273 -204 -88 308 -89
5348 -89 -142 -99 58 -167 71 99 -52 11 -56 -309 6 -75 59 35 -65 120 229 368 110 45 189 -35 -127
5371 -127 -194 -135 257 -158 -95 -79 14 27 23 168 -10 -66 126 -192 -13 -25 -130 -184 41 98 -191 -3 -370 -268
$$ packed form
5211C2J81k41L73m28l9J15K66k33J30j99Jr8Q5p1K3k07J66q5L1K70j33k24L23
5234C8k36l3O0q7K47j17J90j70K65L1j74k8J38J63j34l26m4J23j64J49L26k76
5256e9pJOJ06R0k93J60J34J12l40n1M08k58K67k16J66l33J67l91M54j04N2l38
5279b67M63l07j17J85NN4j23PJ67j4Pl54L62m1j71L11j30J9m7K73n9j37Lm6k43
5304b00L09k76P6J20K2K33j45j79K67l44L29l0k23M34k32k91J80q2J23j73J68
5325H6l8l9l98J98L55j75m6O3K19j50j64K17pk02M7J98j34k95N38m77J16L96l97
5348h9n3M3J57k25K38K8j51O3o7k53L15q1J34k4j00J85J09J39k58o5J44k24r2
5371a27o7N9L92m15O3J6R3J3mJ45j78n6J92l18J79j2j05n4K25N7k89J88l67J02
$$ plain form
5395 -268 -20 -48 25 -56 -18 97 -189 194 -203 38 48 -60 -293 -81 -138 -84 83 -106 95 -157 63 11 -43
5418 -43 -81 151 -11 108 -186 -140 -28 511 -62 99 -96 -278 -150 20 -104 125 27 -93 1 -22 -276 259
5440 259 -218 16 52 -138 91 186 20 -92 -9 -136 147 57 -213 58 -137 -30 -22 13 174 -1 14 55 -298
5463 -298 -313 -45 62 -21 -100 -144 2 87 226 45 -97 77 -98 -308 -62 182 35 -105 -109 121 392 -199
5485 -199 85 -71 -57 -49 253 153 -162 -126 -361 -106 -73 36 -151 74 -73 117 -210 56 94 125 -106 -101 -22
5508 -22 84 -96 -48 -144 149 48 18 -336 53 -201 57 138 73 86 284 -36 24 -269 -31 308 -333 -62 -116
5531 -116 125 -257 -34 327 -91 76 150 222 -189 99 16 -219 312 157 30 -51 91 69 -143 -43 281 -259
5553 -259 119 -93 -32 -94 204 115 -255 19 502 -296 79 -150 272 24 7 231 -43 54 -208 -304 -55 48
$$ packed form
5395b68K48k8P3q1L8J15k86L83l97K41J0j08k33K12n7N4J67j89K01k52K20n2n4
5418d3l8K32j62J19k94M6J12N39n73J61j95j82J28J70j24K29r8j20R4k3k54N35
5440B59m77K34L6j90K29R5j66j12Q3j27K83r0k70K71j95J07QL5J61j75J5M1l53
5463b98j5K68J07q3p9m4J46Q5J39j81j42J74j75k10K46K44j47j40mK30K71n91
5485a99K84j56J4QL02j00l15L6k35K55L3J09j87K25j47J90l27K66L8L1k31NP9
5508b2J06j80M8r6K93j01l0l54L89k54K58Q1o5J3J98l20O0k93K38L39o41K71n4
5531a16K41l82K23L61m18J67P4P2m11K88q3k35N31j55j27q1J42k2k12J00L24n40
5553b59L78k12O1o2K98q9l70K74M83p98L75k29M22k48j7K24k74R7k62r6K49J03
$$ plain form
5575 48 210 -86 -203 206 8 58 200 68 155 56 103 -138 -107 -112 -325 -73 -68 -154 99 -83 -64 -34 -160 103
5599 103 -137 10 244 145 4 -37 12 -200 -232 178 320 87 12 63 48 85 -149 81 49 -317 -62 -212 -30
5622 -30 -58 -167 158 117 -114 -208 -191 264 32 62 154 19 56 -151 -251 117 -439 -181 3 -144 170 -429 -149
5645 -149 130 308 -47 1 133 246 -24 -186 -70 -42 153 115 167 -43 84 120 -141 -26 -79 167 149 -74
5667 -74 -33 -194 213 186 163 24 408 36 -231 87 6 122 -177 128 169 -158 124 -174 -31 6 111 65 319
5690 319 225 267 119 -116 20 -59 34 -138 37 319 -217 -60 -59 160 34 -132 90 -56 -50 -326 -165 98 75
5713 75 25 -118 107 208 90 180 6 -246 99 294 140 -3 -13 -28 45 59 24 -37 -313 215 -318 111 -155
5736 -155 193 -156 273 -18 256 120 134 -16 158 104 159 17 -40 -28 -293 227 -41 174 75 -36 -47 120
$$ packed form
5575D8J62k96j17M09j98N0J42j32Q7r9M7k41L1nk13K52Nq6K53j82J9L0j26K63
5599A03k40J47K34r9j41m1M9k12l2M10J42k33p5N1j5L7k34K30l2l66K55j50J82
5622c0k8j09L25m1k31r4J7M55k32L0R2j35L7k07j00L68n56K58J84j47L14n99K80
5645a49K79J78l55M8J32J13k70j62J16K8J95l8N2k10J27L6k61J15n3K46j8k23
5667g4M1j61M07k7k3j39L84l72k67L18q1J16k99L05M1l27K82k98J43L7J05m6K54
5690C19r4M2j48k35J36p9R3j72J75K82n36J57JK19j26j66K22j46Ok76J61K63k3
5713G5n0j43K25J01j18R0j74k52L45J95j54j43j0j5P3J4l5o1k76N28n33M29k66
5736a55L48l49M29k91K74j36J4j50J74n4N5j42n7J2k65N20k68K15r9j11j1J67
$$ plain form
5758 120 -49 20 -30 -287 -326 -25 -66 41 -130 -59 152 -45 321 -100 -128 -504 126 -9 13 205 -81 -72 -36
5781 -36 49 -93 68 -102 -92 22 -33 -23 -128 30 -18 72 -35 248 47 -15 -47 69 197 124 89 -91 161 -10
5805 -10 82 -95 -18 136 189 103 121 -81 -160 -115 112 143 -351 -2 -143 -151 23 152 -31 -149 -70 75 37 276
5829 276 -150 -120 159 236 152 -26 -203 82 65 -49 85 -85 -40 3 151 -216 -44 51 248 51 310 -113
5851 -113 -179 -76 3 -10 -19 -49 58 40 -130 193 -43 180 287 -61 -184 -50 -193 -85 -5 264 -155 -148 -246 -218
5875 -218 -211 -221 -57 129 -18 271 44 1 -95 -110 153 -123 -336 32 -10 22 -3 -190 204 254 105 130 53 169
5899 169 -270 331 215 166 4 -112 40 154 194 160 57 171 102 -287 -15 19 251 -163 10 152 45 326
5921 326 126 149 -225 289 213 212 -44 91 -200 21 181 276 91 -141 297 219 -9 -75 -6 -32 196 -96 176
$$ packed form
5758A20j69O9n0k57l9L01m1J07j71P1K11j97L66m21k8l76O30j35K2J92k86RL6
5781c6Q5j42J61j70J0J14n5J0j05J58m8R0j07K83k01o2l2J16J28p3l5j80K52j71
5805a0R2j77P7J54N3q6J8k02p9M5K27L1m94L49j41qJ74J29j83j18P9J45l8K39
5829B76m26L0K79P7q4j78j77K85j7j14J34j70M5M3J48l67J72R5J97j97K59m23
5851a13o6J03P9j3rl0J07j8j70L23k36K23J07l48j23J34j43J08Q0K69m19Pr8K8
5875b18Pj0J64J86j47K89k27m3r6j5K63k76k13L68m2L2k5j87L94N0j49K5p7J16
5899A69m39O01j16m9j62j16J52J14M0l4j03J14o9l89K72L4K32m14J73J42j07K81
5921C26k00K3l74N14p6jk56J35k91K21J60R5j85k32M38p8k28o6O9k6K28k92K72
$$ [...]
8191h2
##END NTUPLES=NMR FID
##END=
