##TITLE=1H_TG-2274
 CDCl3, 8 sc, 
 26.12.2019
##JCAMPDX= 6.0         $$ Bruker NMR JCAMP-DX V2.0
##DATA TYPE= NMR FID
##DATA CLASS= NTUPLES
##ORIGIN= UXNMR, Bruker Analytische Messtechnik GmbH
##OWNER= root
$$ XWIN-NMR		Version 3.5
$$ Thu Dec 26 14:04:25 2019 Russian Standard Time (UT+4h)  she@DPX200
##.OBSERVE FREQUENCY= 200.1315
##.OBSERVE NUCLEUS= ^1H
##.DELAY= (6, 6)
##.ACQUISITION MODE= SIMULTANEOUS
##.ACQUISITION SCHEME= undefined
##.AVERAGES= 8
##.DIGITISER RES= 18
##SPECTROMETER/DATA SYSTEM= spect
##.PULSE SEQUENCE= zg30
##.SOLVENT NAME= CDCl3
##.SHIFT REFERENCE= (INTERNAL, CDCl3, 0, 15.7039)
##AUDIT TRAIL= $$ (NUMBER, WHEN, WHO, WHERE, WHAT)
$$ ##TITLE= Audit trail, XWIN-NMR		Version 3.5
$$ ##JCAMPDX= 5.01
$$ ##ORIGIN= Bruker BioSpin GmbH
$$ ##OWNER= she
$$ F:/spectra/data/she/nmr/H-F/1/audita.txt
$$ ##AUDIT TRAIL=  $$ (NUMBER, WHEN, WHO, WHERE, WHAT)
(   1,<2019-12-26 14:03:05.89 +0400>,<she>,<DPX200>,
      <created by zg, POWCHK disabled, PULCHK disabled
       configuration hash MD5:
       00 E9 B6 7A A2 85 ED C7 34 08 36 98 17 FE 4E 26
       data hash MD5: 16K
       B7 D7 33 00 CB 35 94 39 C6 F4 53 7B 32 C6 FF 98>)
$$ ##END=
$$ 
$$ hash MD5
$$ F2 28 01 13 95 F3 38 BE 1C 5C 1C 65 43 DD AD E5
##$RELAX= 
##$RELAX= 
##$RELAX= 
##$RELAX= 
##$RELAX= 
##$RELAX= 
$$ Bruker specific parameters
$$ --------------------------
##$DU= <F:/spectra>
##$EXPNO= 1
##$NAME= <H-F>
##$PROCNO= 1
##$TYPE= <nmr>
##$USER= <she>
##$AMP= (0..31)
100 100 100 100 100 100 100 100 100 100 100 100 100 100 100 100 100 100 
100 100 100 100 100 100 100 100 100 100 100 100 100 100 
##$AQSEQ= 0
##$AQ_mod= 1
##$AUNM= <au_zg>
##$AUTOPOS= <>
##$BF1= 200.13
##$BF2= 200.13
##$BF3= 200.13
##$BF4= 200.13
##$BF5= 200.13
##$BF6= 200.13
##$BF7= 200.13
##$BF8= 200.13
##$BYTORDA= 1
##$CFDGTYP= 0
##$CFRGTYP= 5
##$CHEMSTR= <none>
##$CNST= (0..31)
1 1 145 1 1 1 1 1 1 1 1 1 1 1 1 1 1 1 1 1 1 1 1 1 1 1 1 1 1 1 1 1 
##$CPDPRG= <>
##$CPDPRG1= <>
##$CPDPRG2= <>
##$CPDPRG3= <>
##$CPDPRG4= <mlev>
##$CPDPRG5= <mlev>
##$CPDPRG6= <mlev>
##$CPDPRG7= <mlev>
##$CPDPRG8= <mlev>
##$CPDPRGB= <>
##$CPDPRGT= <>
##$D= (0..31)
0 1.2 0 0 0 0 0 0 0 0.06 0 0.03 0 0 0 0 0.0002 0 0 0 0 0 0 0 0 0 0 0 0 
0 0 0 
##$DATE= 1577354584
##$DBL= (0..7)
120 120 120 120 120 120 120 120 
##$DBP= (0..7)
150 150 150 150 150 150 150 150 
##$DBP07= 0
##$DBPNAM0= <>
##$DBPNAM1= <>
##$DBPNAM2= <>
##$DBPNAM3= <>
##$DBPNAM4= <>
##$DBPNAM5= <>
##$DBPNAM6= <>
##$DBPNAM7= <>
##$DBPOAL= (0..7)
0.5 0.5 0.5 0.5 0.5 0.5 0.5 0.5 
##$DBPOFFS= (0..7)
0 0 0 0 0 0 0 0 
##$DE= 6
##$DECBNUC= <off>
##$DECIM= 24
##$DECNUC= <off>
##$DECSTAT= 4
##$DIGMOD= 1
##$DIGTYP= 9
##$DL= (0..7)
0 120 120 120 120 120 120 120 
##$DP= (0..7)
150 150 150 150 150 150 150 150 
##$DP07= 0
##$DPNAME0= <>
##$DPNAME1= <>
##$DPNAME2= <>
##$DPNAME3= <>
##$DPNAME4= <>
##$DPNAME5= <>
##$DPNAME6= <>
##$DPNAME7= <>
##$DPOAL= (0..7)
0.5 0.5 0.5 0.5 0.5 0.5 0.5 0.5 
##$DPOFFS= (0..7)
0 0 0 0 0 0 0 0 
##$DQDMODE= 0
##$DR= 18
##$DS= 0
##$DSLIST= <SSSSSSSSSSSSSSS>
$$ [...]
##$SUBNAM2= <"">
##$SUBNAM3= <"">
##$SUBNAM4= <"">
##$SUBNAM5= <"">
##$SUBNAM6= <"">
##$SUBNAM7= <"">
##$SUBNAM8= <"">
##$SUBNAM9= <"">
##$SW= 24.9337058887773
##$SWIBOX= (0..15)
0 0 2 0 0 0 0 0 0 0 0 0 0 0 0 0 
##$SW_h= 4990.01996007984
##$TD= 16384
##$TD0= 1
##$TE= 0
##$TE2= 300
##$TE3= 300
##$TEG= 300
##$TL= (0..7)
0 120 120 120 120 120 120 120 
##$TP= (0..7)
150 150 150 150 150 150 150 150 
##$TP07= 0
##$TPNAME0= <>
##$TPNAME1= <>
##$TPNAME2= <>
##$TPNAME3= <>
##$TPNAME4= <>
##$TPNAME5= <>
##$TPNAME6= <>
##$TPNAME7= <>
##$TPOAL= (0..7)
0.5 0.5 0.5 0.5 0.5 0.5 0.5 0.5 
##$TPOFFS= (0..7)
0 0 0 0 0 0 0 0 
##$TUNHIN= 0
##$TUNHOUT= 0
##$TUNXOUT= 0
##$USERA1= <user>
##$USERA2= <user>
##$USERA3= <user>
##$USERA4= <user>
##$USERA5= <user>
##$V9= 5
##$VALIST= <valist>
##$VCLIST= <CCCCCCCCCCCCCCC>
##$VD= 0
##$VDLIST= <DDDDDDDDDDDDDDD>
##$VPLIST= <PPPPPPPPPPPPPPP>
##$VTLIST= <TTTTTTTTTTTTTTT>
##$WBST= 1024
##$WBSW= 4
##$XGAIN= (0..3)
0 0 0 0 
##$XL= 0
##$YL= 0
##$YMAX_a= 540468
##$YMIN_a= -270092
##$ZGOPTNS= <>
##$ZL1= 120
##$ZL2= 120
##$ZL3= 120
##$ZL4= 120
##$ABSF1= 10
##$ABSF2= 0
##$ABSG= 5
##$ABSL= 3
##$ALPHA= 0
##$AQORDER= 0
##$ASSFAC= 0
##$ASSFACI= 0
##$ASSFACX= 0
##$ASSWID= 0
##$AUNMP= <proc_1d>
##$AZFE= 0.1
##$AZFW= 0.1
##$BCFW= 1
##$BC_mod= 2
##$BYTORDP= 1
##$COROFFS= 0
##$CY= 11.3945322036743
##$DATMOD= 1
##$DC= 2
##$DFILT= <>
##$DTYPP= 0
##$F1P= 16.9975609425685
##$F2P= -3.02152046262296
##$FCOR= 0.5
##$FTSIZE= 0
##$FT_mod= 4
##$GAMMA= 1
##$GB= 0.15
##$INTBC= 1
##$INTSCL= 1
##$ISEN= 128
##$LB= 0.24
##$LEV0= 0
##$LPBIN= 0
##$MAXI= 10000
##$MC2= 0
##$MEAN= 0
##$ME_mod= 0
##$MI= 1.114404
##$NCOEF= 0
##$NC_proc= 0
##$NLEV= 6
##$NOISF1= 3.799351
##$NOISF2= 2.8
##$NSP= 1
##$NTH_PI= 0
##$NZP= 0
##$OFFSET= 15.70392
##$PC= 1
##$PHC0= -10148.84
##$PHC1= 16.2008
##$PH_mod= 1
##$PKNL= yes
##$PPARMOD= 0
##$PSCAL= 0
##$PSIGN= 0
##$REVERSE= no
##$SF= 200.130013532006
##$SI= 16384
##$SIGF1= 3
##$SIGF2= 2
##$SINO= 400
##$SIOLD= 16384
##$SREGLST= <1H.CDCl3>
##$SSB= 0
##$STSI= 0
##$STSR= 0
##$SW_p= 3612.71676300578
##$SYMM= 0
##$S_DEV= 0
##$TDeff= 0
##$TDoff= 0
##$TI= <>
##$TILT= no
##$TM1= 0
##$TM2= 0
##$TOPLEV= 0
##$USERP1= <user>
##$USERP2= <user>
##$USERP3= <user>
##$USERP4= <user>
##$USERP5= <user>
##$WDW= 1
##$XDIM= 8192
##$YMAX_p= 0
##$YMIN_p= 0
$$ End of Bruker specific parameters
$$ ---------------------------------
##NTUPLES= NMR FID
##VAR_NAME=  TIME,          FID/REAL,        FID/IMAG
##SYMBOL=    X,             R,               I
##VAR_TYPE=  INDEPENDENT,   DEPENDENT,       DEPENDENT
##VAR_FORM=  AFFN,          ASDF,            ASDF
##VAR_DIM=   8192,          8192,            8192
##UNITS=     SECONDS,       ARBITRARY UNITS, ARBITRARY UNITS
##FACTOR=    0.0002004,     1,               1
##FIRST=     0,             0,               0
##LAST=      1.6414764,     0,               0
##MIN=       0,             -270092,         0
##MAX=       1.6414764,     540468,          0
$$ Real data points
##PAGE= N=1
##DATA TABLE= (X++(R..R)), XYDATA
$$ plain form
0 0 0 0 0 0 -2 8 -6 8 -9 16 -16 24 -26 33 -41 49 -61 73 -84 98 -119 139 -159 184 -214 245 -278 314 -360
29 -360 408 -458 515 -581 648 -723 809 -898 999 -1109 1229 -1361 1509 -1669 1848 -2046
45 -2046 2270 -2518 2804 -3128 3504 -3943 4467 -5104 5895 -6916 8280 -10216 13184 -18363
59 -18363 29945 -110175 194115 346217 -175501 -270092 28463 136728 -92097 -137073 -17110
70 -17110 -23016 -179462 -125413 100964 121194 -142940 -194628 64394 158500 -54947 -103210
81 -103210 60205 33131 -152769 -97088 109406 100561 -106804 -183455 -13476 184675 125247
92 125247 -96732 -110811 90403 119878 -48972 -84653 8201 -17626 -71780 27452 133631
103 133631 70204 -41709 -25887 87501 116610 -1945 -76087 22250 79518 -31841 -47344
$$ packed form
0@%%%%kJ0j4J4j7K5l2M0n0N9p4R0j10J34j57J82k17K58k98L43l98M59n23N92o74
29c60P68q66R73j096J229j371J532j707J897k108K338k590K870l178L517l894
45b046M316m788N322n932O632p447Q410r571J0999j2811J5196j8496K3400l1547
59a8363M8308j40120L04290J52102n21718r4591K98555J08265k28825m4976J19963
70a7110n906j56446N4049K26377K0230k64134n1688K59022R4106k13447m8263
81a03210J63415k7074j85900N5681K06494q845k07365p6651J69979J98151n9428
92A25247k21979j4079K01214K9475j68850l5681R2854k5827n4154R9232J06179
103A33631o3427j11913J5822J13388K9109j18555p4142R8337N7268j11359j5503
$$ plain form
114 -47344 113672 122049 -60858 -64973 128634 166237 7496 -83333 -22968 72578 89756 4155
126 4155 -69100 -25603 39554 36335 47311 68914 3945 -51825 26204 96701 21216 -78908
138 -78908 -67396 19047 74088 22287 -61810 -7484 112274 59026 -62064 16758 129746
149 129746 7037 -133281 -20046 129426 67513 -45986 -15506 73388 72652 2252 -6262
160 -6262 62087 59247 -28720 -6307 105977 52386 -103669 -58589 98966 68206 -50208 -9908
172 -9908 85673 50795 -36915 -38975 23562 45595 -26821 -91943 -22024 71578 11979 -73077
184 -73077 -6448 68228 7192 -43666 7841 30654 -20593 -44768 -10089 27907 19689 -31234
196 -31234 -29049 52887 64257 -28226 -18776 98723 75284 -65580 -60285 59355 64220 -16764
$$ packed form
114d7344J61016Q377j82907m115J93607L7603j58741r0829O0365R5546J7178q5601
126D155p3255M3497O5157l219J0976K1603o4969n5770P8029P0497p5485j00124
138g8908J1512Q6443N5041n1801q4097N4326J19758n3248j21090P8822J12988
149A29746j22709j40318J13235J49472o1913j13499L0480Q8894p36p0400q514
160f262O8349k840q7967K2413J12284n3591j56055M5080J57555l0760j18414M0300
172i908R5581l4878q7710k060O2537K2033p2416o5122O9919R3602n9599q5056
184g3077O6629P4676o1036n0858N1507K2813n1247k4175L4679L7996q218n0923
196c1234K185Q1936J1370r2483R450J17499k3439j40864N295J19640M865q0984
$$ plain form
208 -16764 -26377 24922 54976 47111 23486 22480 32041 -275 -20402 44696 73034 -27387 -78560
221 -78560 20337 80957 15311 -22894 15424 35002 22032 14041 7692 14918 12212 -38102 -48473
234 -48473 41657 77158 -18147 -58657 33401 88056 38964 -7881 -14640 -7944 13714 26342
246 26342 13713 4254 -9772 -22730 32101 97723 35668 -58614 -3342 88561 34592 -49178
258 -49178 -21198 20754 -4727 -19189 19237 54516 37391 -24000 -43397 33303 79636 -6619
270 -6619 -81502 -25467 31460 8370 1395 13255 -24706 -42393 23698 71316 28420 -40513
282 -40513 -62280 -12211 56559 32842 -59943 -62788 15580 27139 173 31050 38600 -32705
294 -32705 -55752 12138 48330 3452 -55129 -67166 -9089 62487 44735 -27515 -38258 -9064
$$ packed form
208a6764r613N1299L0054p865k3625j006R561l2316k0127O5098K8338j00421n1173
221g8560R8897O0620o5646l8205L8318J9578j2970p991o349P226k706n0314j0371
234d8473R0130L5501r5305m0510R2058N4655m9092m6845o759O696K1658J2628
246B6342j2629r459j4026j2958N4831O5622o2055r4282N5272R1903n3969q3770
258d9178K7980M1952k5481j4462L8426L5279j7125o1391j9397P6700M6333q6255
270f619p4883N6035N6927k3090o975J1860l7961j7687O6091M7618m2896o8933
282d0513k1767N0069O8770k3717r2785k845P8368J1559k6966L0877P550p1305
294c2705k3047O7890L6192m4878n8581j2037N8077P1576j7752p2250j0743K9194
$$ plain form
306 -9064 -4929 19708 48275 -14775 -91369 -42174 49478 41945 -20664 -48537 -32163 19159 54883
319 54883 18843 -30408 -22719 -10862 -17416 12610 34547 -19045 -56841 -4860 46482 37706 11695
332 11695 -17758 -35159 258 39367 16680 -17441 -18498 -21790 -6395 48018 47033 -31768 -51267
345 -51267 17996 53398 22044 -13043 -33332 -25773 13550 27320 2234 -3208 -268 -19521 -373
358 -373 51697 28363 -45763 -41368 18784 33501 14498 -4322 -29263 -24912 22023 39993 12298
371 12298 -10558 -22551 -15772 35422 56834 -12916 -61403 -7897 39862 15696 -4716 -741
383 -741 -9658 -5788 18729 19785 4880 -5738 -23188 -18336 29276 38433 -17960 -36392 -17
396 -17 8254 2128 21342 10040 -31428 -18920 26996 23658 -8817 -24261 -25572 -4031 27590
$$ packed form
306i064M135K4637K8567o3050p6594M9195R1652p533o2609k7873J6374N1322L5724
319E4883l6040m9251P689J1857o554L0026K1937n3592l7796N1981N1342q776k6011
332A1695k9453j7401L5417L9109k2687l4121j057l292J5395N4413r85p8801j9499
345e1267O9263L5402l1354l5087k0289P559L9323J3770k5086n442K940j9253J9148
358c73N2070k3334p4126M395O0152J4717j9003j8820k4941M351M6935J7970k7695
371A2298k2856j1993O779N1194K1412o9750m8487N3506M7759k4166k0412L975
383g41q917L870K4517J056j4905j0618j7450M852M7612R157n6393j8432L6375
396a7Q271o126J9214j1302m1468J2508M5916l338l2475j5444j311K1541L1621
$$ plain form
409 27590 14192 -20651 -10904 7249 -5880 637 22535 -3672 -33834 -7053 16682 -2105
421 -2105 -9410 -4455 -18001 -12716 16319 13437 -8808 -6626 -4955 -11612 4429 7543 -25123 -28358
435 -28358 7145 10552 -6664 3768 4103 -15749 -4622 15385 -6327 -23661 -3347 4739 -3760
448 -3760 -377 -5822 -16596 5575 22417 -4770 -15059 12194 11821 -9813 -3522 -244 -16824
461 -16824 -5909 16994 4134 -7995 8327 9396 -1480 6657 3845 -14256 -3641 12592 -5688
474 -5688 -9548 17735 10064 -18078 -2160 22087 8146 -5156 -2025 -5788 1781 17574 -1255
487 -1255 -24826 -3510 16286 4511 6772 14421 -8420 -15093 17125 20077 -10722 -14267 -439
500 -439 1795 13368 21805 -2011 -17007 2657 10584 3796 13334 6205 -22796 -10295 28972 23852
$$ packed form
409B7590j3398l4843R747J8153j3129O517K1898k6207l0162K6781K3735j8787
421b105p305M955j3546N285K9035k882k2245K182J671o657J6041L114l2666l235
435b8358L5503L407j7216J0432L35j9852J1127K0007k1712j7334K0314Q086q499
448c760L383n445j0774K2171J6842k7187j0289K7253l73k1634O291L278j6580
461a6824J0915K2903j2860j2129J6322J069j0876Q137k812j8101J0615J6233j8280
474e688l860K7283p671k8142J5918K4247j3941j3302L131l763P569J5793j8829
487a255k3571K1316J9796j1775K261P649k2841o673L2218K952l0799l545J3828
500d39K234J1573Q437k3816j4996J9664P927o788R538p129k9001J2501L9267n120
$$ plain form
514 23852 -6105 -12119 -10982 -2835 27074 29037 -13041 -28908 -3197 12087 15478 16612 -13293
527 -13293 -39093 -2523 40848 21250 -18424 -30129 -22549 5010 31877 9507 -30047 -21711
539 -21711 4368 5829 11945 15125 -21335 -44841 -7636 27404 14851 -10348 -26843 -28741 7537
552 7537 41506 15519 -26677 -25353 -7940 6383 28201 14229 -39737 -44149 16647 46615 18390
565 18390 -10947 -18741 -7799 18881 22893 -3342 -12637 -7957 -16436 1809 47022 31139 -34080
578 -34080 -33395 27464 44550 15339 -7481 -19510 -16699 10421 28342 15482 -6080 -22370 -10430
591 -10430 43514 64756 -280 -49938 -4434 42191 18351 -8048 -2897 -4686 -5663 20465 39216
604 39216 26928 1439 -18477 -3803 40526 41281 -15838 -34895 4314 22475 12912 22441 20260
$$ packed form
514B3852k9957o014J137Q147K9909J963m2078j5867K5711J5284L391J134k9905
527a3293k5800L6570M3371j9598l9674j1705P580K7559K6867k2370l9554Q336
539b1711K6079J461O116L180l6460k3506L7205L5040j2553k5199j6495j898L6278
552G537L3969k5987m2196J324J7413J4323K1818j3972n3966m412O0796K9968k8225
565A8390k9337p794J0942K6680M012k6235r295M680q479J8245M5213j5883o5219
578c4080O85O0859J7086k9211k2820j2029K811K7120J7921j2860k1562j6290J1940
591a0430N3944K1242o5036m9658M5504M6625k3840k6399N151j789r77K6128J8751
604C9216j2288k5489j9916J4674M4329P55n7119j9057L9209J8161r563R529k181
$$ plain form
617 20260 -13719 -13600 34131 53572 17170 -31204 -41101 6453 53652 24669 -32552 -18582 28376
630 28376 25227 9047 20055 8222 -24064 -12158 25848 24988 -4411 -23560 -19320 9225 29802
643 29802 11628 -7736 2282 729 -12072 12669 32736 -13751 -57177 -23737 26980 24900
655 24900 -8801 -31172 -17553 23919 31475 -13455 -34274 -7798 -2943 -19136 -2374 13758
667 13758 -15396 -32087 -1023 21551 7137 -11934 -11530 3772 10747 -9953 -20171 9433 13935
680 13935 -31460 -28828 37862 43477 -24451 -34288 24147 40188 -809 -22538 -4806 12892 3054
693 3054 -16017 -5010 20877 5300 -20923 9314 39994 -1001 -35085 5859 32400 -12783
705 -12783 -39558 -1544 26458 2689 -28029 -15304 28123 33142 -16496 -33508 18175 34242
$$ packed form
617B0260l3979J19M7731J9441l6402m8374r897M7554M7199k8983n7221J3970M6958
630B8376l149j6180J1008j1833l2286J1906L8006q60k9399j9149M240K8545K0577
643B9802j8174j9364J0018j553j2801K4741K0067m6487m3426L3440N0717k080
655B4900l3701k2371J3619M1472P556m4930k0819K6476M855j6193J6762J6132
667A3758k9154j6691L1064K2574j4414j9071M04J5302O975k0700j0218K9604M502
680A3935m5395K632O6690N615o7928r837N8435J6041m0997k1729J7732J7698r838
693C054j9071J1007K5887j5577k6223L0237L0680m0995l4084M0944K6541m5183
705a2783k6775L8014K8002k3769l0718J2725M3427N019m9638j7012N1683J6067
$$ plain form
717 34242 -19315 -32318 16336 19736 -22882 -17262 22885 21246 -7073 -4822 22777 29290 -1508
730 -1508 -23012 5892 27878 -17187 -45771 14784 57769 729 -40397 11159 50976 12350
742 12350 -27975 -18431 1905 1233 -12027 -12021 5251 3986 -19391 -9724 28320 14635 -34246 -25045
756 -25045 18366 10204 -23363 -20026 -4708 -11141 -20980 -12180 13682 27664 -3767 -39190 -4046
769 -4046 48379 12659 -58195 -44619 14300 19813 -7959 -10639 -660 234 795 12298 24050 4837
783 4837 -41742 -42818 17223 33304 -27405 -46736 10491 29825 -11276 -13224 21752 9363 -35033
796 -35033 -31286 18511 36962 -12991 -65463 -33937 40321 39098 -18445 -19716 17278 9586 -7502
809 -7502 16699 17965 -32391 -49631 3733 47222 20506 -32096 -28684 31716 52891 -517 -28148
$$ packed form
717C4242n3557j3003M8654L400m2618N620M0147j639k8319K251K7599O513l0798
730a508k1504K8904K1986m5065k8584O0555M2985n7040m1126N1556L9817l8626
742A2350m0325R544K0336o72j3260OJ7272j265k3377R667L8044j3685m8881R201
756b5045M3411q162l3567L337J5318o433r839Q800K5862J3982l1431l5423L5144
769d046N2425l5720p0854J3576N8919N513k7772k680R979Q94N61J1503J1752j9213
783D837m6579j076O0041J6081o0709j9331N7227J9334m1101j948L4976j2389m4396
796c5033L747M9797J8451m9953n2472L1526P4258j223n7543j271L6994p692j7088
809g502K4201J266n0356j7240N3364M3489k6716n2602L412O0400K1175n3408k7631
$$ plain form
822 -28148 10197 14092 -35086 -25105 39099 30305 -38611 -41415 23549 49113 7718 -33530 -22877
835 -22877 10393 13079 -6477 -3055 -1425 -35024 -36764 28741 51270 -18414 -54988 4708 52329
848 52329 20315 -26314 -28628 -5533 4522 -7310 -7179 18051 19497 -15171 -11695 37441 38610
861 38610 -18887 -38739 -2357 21321 13419 1000 -7813 -11276 -4210 6609 21595 23303 -13768
874 -13768 -41428 2827 51634 8588 -56559 -34321 22970 20465 -13030 -15634 2705 6928 -4378
887 -4378 -3863 17112 16896 -26333 -44858 3586 33427 -3809 -24872 7938 21686 630 2363
900 2363 19598 4561 -22352 -14637 22892 38271 -816 -45350 -16599 45722 33078 -25945
912 -25945 -19252 28405 19950 -14856 -4503 15803 -4028 -28598 -14740 15795 17064 -15174 -26282
$$ packed form
822b8148L8345L895m9178R981O4204q794o8916k804O4964K5564m1395m1248J0653
835b2877L3270K686j9556L422J630l3599j740O5505K2529o9684l6574N9696M7621
848E2329l2014m6629k314K3095J0055j1832J31K5230J446l4668L476M9136J169
861C8610n7497j9852L6382K3678p902j2419q813l463P066J0819J4986J708l7071
874a3768k7660M4255M8807m3046o5147K2238N7291k505l3495k604J8339M223j1306
887d378N15K0975k16m3229j8525M8444K9841l7236k1063L2810J3748k1056J733
900B363J7235j5037k6913P715L7529J5379l9087m4534K8751O2321j2644n9023
912b5945O693M7657q455l4806J0353K0306j9831k4570J3858L0535J269l2238j1108
$$ plain form
925 -26282 12249 32716 -4481 -24984 7591 10097 -33266 -28154 22438 20495 -27078 -27448 19815
938 19815 37092 3156 -28400 -10818 24606 13151 -24042 -12701 20724 3435 -24030 3052
950 3052 29999 1769 -20366 6076 26152 7672 -13636 -9663 4860 2288 -20570 -21423 12212
963 12212 20457 -13201 -15037 23478 21957 -20086 -24190 4513 5010 -16652 -19727 -4201 8938
976 8938 4901 -9462 -3099 19210 11911 -14100 -6551 12486 -4596 -21137 1635 17009 -1428
989 -1428 -12013 3835 18324 17665 3979 -7357 4285 17908 -1461 -20272 -3106 8885 -10752
1002 -10752 -10195 19722 23666 -2125 -9881 4022 12783 5130 -14539 -22438 -3862 7838 -7478
1015 -7478 -7906 13689 6795 -15666 2275 30345 9445 -25149 -18921 7331 12666 -2432 -14578
$$ packed form
925b6282L8531K0467l7197k0503L2575K506m3363N112N0592j943m7573l70M7263
938A9815J7277l3936l1556J7582L5424j1455l7193J1341L3425j7289k7465K7082
950C052K6947k8230k2135K6442K0076j8480k1308L973J4523k572k2858q53L3635
963A2212Q245l3658j836L8515j521m2043m104K8703M97k1662l075J5526J3139
976H938m037j4363O363K2309p299k6011P549J9037j7082j6541K2772J5374j8437
989a428j0585J5848J4489o59j3686j1336J1642J3623j9369j8811J7166J1991j9637
1002a0752N57K9917L944k5791p756J3903Q761p653j9669p899J8576J1700j5316
1015g478m28K1595o894k2461J7941K8070k0900l4594O228K6252N335j5098j2146
$$ plain form
1028 -14578 -5135 12914 10279 208 14271 21256 -8713 -20212 15407 27254 -11288 -29666
1040 -29666 -3575 15241 9659 4568 4816 4062 1500 -1154 7138 15589 -7401 -37948 -16469 26034
1054 26034 15326 -20628 -15638 8286 8831 4925 7132 -2401 -16312 -15058 -2420 10563 7416
1067 7416 -18309 -27047 6438 29428 8502 -10350 -2134 -465 -4645 8381 13474 -8781 -24125
1080 -24125 -10460 11005 21581 9667 -16800 -17072 14868 25892 2470 -12792 -10448 -11530 -3035
1093 -3035 14155 7178 -15145 -14706 2462 13263 15484 3708 -17686 -15388 7883 10883 -2583
1106 -2583 -6626 -9455 -13712 2571 22987 11992 -11004 -13085 411 15241 19251 -2969 -26773
1119 -26773 -11842 17076 13842 -2605 -3073 -3711 -3656 12651 22296 3587 -13478 -10029 17 9560
$$ packed form
1028a4578R443J8049k635j0071J4063O985k9969j1499L5619J1847l8542j8378
1040b9666K6091J8816n582n091K48p54k562k654Q292Q451k2990l0547K1479M2503
1054B6034j0708l5954M990K3924N45l906K207r533j3911J254J2638J2983l147
1067G416k5725q738L3485K2990k0926j8852Q216J669m180J3026N093k2255j5344
1080b4125J3665K1465J0576j1914k6467k72L1940J1024k3422j5262K344j082Q495
1093c035J7190o977k2323M39J7168J0801K221j1776k1394K298K3271L000j3466
1106b583m043k829m257J6283K0416j0995k2996k081J3496J4830M010k2220k3804
1119b6773J4931K8918l234j6447m68o38N5J6307R645j8709j7065L449J0046R543
$$ plain form
1133 9560 9531 -7493 -17064 -1820 11718 7451 7997 5959 -12720 -14754 14024 21647 -5524 -22746
1147 -22746 -12663 4722 16453 11258 -9313 -12910 6296 14691 6706 3259 -3660 -14999 -4853
1160 -4853 14448 7371 -8365 -5199 1828 3436 11423 13281 -906 -8518 -3091 170 5285 9056
1174 9056 -7235 -22462 -3324 20574 11962 -5302 -7186 -3949 3421 12095 1329 -16575 -12699
1187 -12699 1297 1439 1450 3321 -5100 -7608 5725 8729 -1493 -2143 -1193 -9740 -7514 5855 3283
1202 3283 -7184 -4551 -742 1045 11085 10686 -9051 -12930 5066 9065 -2722 -7402 -6482 -3173
1216 -3173 6418 8389 -3831 -4654 6402 3694 -4052 165 -795 -8334 -2032 5201 -4559 -6532 6038
1231 6038 5700 -4376 -1460 3793 -651 -429 -174 -7114 -5246 4460 518 -6289 1768 5234 -2367
$$ packed form
1133I560k9j7024r571J5244J3538m267N46k038j8679k034K8778P623k7171j7222
1147b2746J0083J7385J1731n195k0571l597J9206Q395p985l447o919j1339J0146
1160d853J9301p077j5736L166P027J608P987J858j4187p612N427L261N115L771
1174I056j6291j5227J9138K3898q612j7264j884L237P370Q674j0766j7904L876
1187a2699J3996J42J1J871q421k508J3333L004j0222o50R50q547K226J3369k572
1202C283j0467K633L809J787J0040l99j9737l879J7996L999j1787m680R20L309
1216c173R591J971j2220q23J1056k708p746M217r60p539O302P233r760j973J2570
1231F038l38j0076K916N253m444K22K55o940J868R706l942o807Q057L466p601
$$ plain form
1246 -2367 -600 4031 -1849 -2671 3653 -1746 -8031 3325 8271 -3582 -5148 3158 1816 986 6133
1261 6133 124 -8688 -816 7720 1444 -2474 -1652 -4473 764 11804 5187 -7015 -2854 3161 -854
1276 -854 2067 5673 -5074 -8666 3783 8523 2529 2136 -1993 -10545 -1509 12766 5518 -7905
1290 -7905 -5470 -814 984 9572 8156 -8185 -12423 -106 8478 8460 1948 -13643 -14691 8096
1304 8096 18538 380 -10521 -4199 -2561 2070 12585 4912 -14432 -13156 3411 9189 6639
1317 6639 168 -10961 -8872 8164 11603 -288 -5693 -7454 -10312 1546 15853 4409 -14286
1330 -14286 -11921 865 9896 12991 -822 -19854 -11044 11742 9670 -5236 -7214 -7612 -9324 5352
1344 5352 17053 1990 -15993 -11472 2083 9149 5908 -8922 -15624 -3287 5610 2304 3774
$$ packed form
1246b367J767M631n880q22O324n399o285J1356M946j1853j566Q306j342q30N147
1261F133o009q812P872Q536o276l918Q22k821N237J1040o617j2202M161O015m015
1276h54K921L606j0747l592J2449M740n994l93m129q552R036J4275p248j3423
1290g905K435M656J798Q588j416j6341m238J2317Q584j8o512j5591j048K2787
1304H096J0442j8158j0901O322J638M631J0515p673j9344J276J6567N778k550
1317F639o471j1129K089J7036L439j1891n405j761k858J1858J4307j1444j8695
1330a4286K365J2786R031L095j3813j9032Q810K2786k072j4906j978l98j712J4676
1344E352J1701j5063j7983M521J3555P066l241j4830o702J2337Q897l306J470
$$ plain form
1357 3774 3327 -13843 -16163 11563 21763 -4413 -21915 -10363 5158 10513 5790 -9056 -14087
1370 -14087 -1192 9252 8433 5315 -5717 -17446 -4515 18636 11043 -13041 -13413 904 6810
1383 6810 8031 4832 -4517 -7502 -924 3094 8190 10393 -6878 -22217 -1093 24086 10142 -13220
1397 -13220 -10274 2491 6515 8788 4800 -6515 -9619 -2940 5402 11821 5584 -14741 -15162 11273
1411 11273 18274 -2590 -9602 793 531 -2319 6354 8117 -3608 -10322 -6508 4357 15208 6535
1425 6535 -15269 -11463 13295 15002 -3891 -6737 -585 -4155 -2363 9025 7828 -5577 -11288 -3677
1439 -3677 10917 13802 -6175 -18428 1626 16652 -2517 -15169 2395 6264 -11808 -9136 11229
1452 11229 9780 -8364 -11453 1021 10404 1615 -13388 -9468 7043 1516 -11904 -75 13408
$$ packed form
1357C774m47j7170k320K7726J0200k6176j7502J1552J5521N355m723j4846n031
1370a4087J2895J0444q19l118j1032j1729J2931K3151p593k4084l72J4317N906
1383F810J221l199r349k985O578M018N096K203j7271j5339K1124K5179j3944k3362
1397a3220K946J2765M024K273l988j1315l104O679Q342O419o237k0325m21K6435
1411A1273P001k0864p012J0395k62k850Q673J763j1725o714L814J0865J0851q673
1425F535k1804L806K4758J707j8893k846O152l570J792J1388j197j3405n711P611
1439c677J4594K885j9977j2253K0054J5026j9169j2652J7564L869j8072K672K0365
1452A1229j449j8144l089J2474R383q789j5003L920J6511n527j3420J1829J3483
$$ plain form
1465 13408 -4420 -16474 5615 17086 -3607 -16585 -2870 8960 3403 -8599 -9901 3036
1477 3036 9095 -4375 -8537 9464 11988 -9526 -10912 7835 5537 -12088 -9557 3843 4209 -2435
1491 -2435 -2393 3328 7787 -51 -11551 -1843 12754 -762 -18775 -3240 15326 1398 -12542
1504 -12542 279 11331 4383 -2709 -1049 4420 6575 -1733 -9048 285 7442 -3348 -5070 11288
1518 11288 11567 -6216 -3202 14732 11102 -7845 -12738 -1669 9165 6197 -8436 -8913 10073
1531 10073 13660 -3328 -2918 11868 1646 -17245 -5621 14146 5076 -14413 -11699 5866 13151
1544 13151 3720 -7053 -829 7603 -2597 -7452 10861 11688 -19195 -23286 13731 25755 -4195
1557 -4195 -19831 641 17751 10515 -3822 -3708 3206 -2475 -13592 -1465 17668 1812 -23141
$$ packed form
1465A3408j7828j2054K2089J1471k0693j2978J3715J1830n557j2002j302J2937
1477C036O059j3470m162J8001K524k1514j386J8747k298j7625K531J3400L66o644
1491b435M2N721M459p838j1500R708J4597j3516j8013J5535J8566j3928j3940
1504a2542J2821J1052o948p092J660N469K155q308p315R333P157j0790j722J6358
1518A1288K79j7783L014J7934l630j8947m893J1069J0834k968j4633m77J8986
1531A0073L587j6988M10J4786j0222j8891J1624J9767r070j9489K714J7565P285
1544A3151r431j0773O224Q432j0200m855J8313Q27l0883m091L7017J2024k9950
1557d195j5636K0472J7110p236j4337J14O914n681j1117J2127J9133j5856k4953
$$ plain form
1570 -23141 -4999 25908 13693 -12559 -8347 4142 -3247 -10034 -789 6518 -2645 -17056 -9535
1583 -9535 17733 20105 -13987 -26822 4768 22280 -1028 -15136 -2313 518 -8796 -3473 9041
1596 9041 5575 -7796 -9255 7770 23009 7579 -18682 -13550 9420 6013 -9039 -556 9552
1609 9552 -3255 -8475 10912 19723 862 -17413 -11408 10594 17717 -4018 -22115 -6398 13111
1622 13111 4599 -5094 3218 2190 -10179 -3466 15447 11591 -9735 -17635 -4802 10743 8298
1635 8298 -9441 -11349 7746 11552 162 5486 15454 -2689 -20536 -2765 19936 9783 -13248
1648 -13248 -14396 5470 20042 11737 -5154 -3650 6466 1038 -2989 9946 8766 -16570 -19292
1661 -19292 10623 21218 -1046 -15194 -3755 10146 9276 -1271 -4399 1992 -2021 -13633 -3403
$$ packed form
1570b3141J8142L0907j2215k6252M212J2489p389o787R245P307r163j4411P521
1583i535K7268K372l4092j2835L1590J7512k3308j4108J2823K831r314N323J2514
1596I041l466j3371j459J7025J5239j5430k6261N132K2970l407j5052Q483J0108
1609I552j2807n220J9387Q811j8861j8275O005K2002P123k1735j8097J5717J9509
1622A3111q512r693Q312j028j2369O713J8913l856k1326p900J2833J5545k445
1635H298j7739j908J9095L806j1390N324R968j8143j7847J7771K2701j0153k3031
1648a3248j148J9866J4572q305j6891J504J0116n428m027J2935j180k5336k722
1661a9292K9915J0595k2264j4148J1439J3901q70j0547l128O391m013j1612J0230
$$ plain form
1674 -3403 16652 3080 -23070 -10189 21849 19802 -3773 -7630 2701 4936 -835 -3452 -304
1687 -304 608 -5873 -3456 16576 21042 -5231 -16594 8450 20177 -1816 -13014 1650 7193
1700 7193 -4312 -7167 2406 7569 -512 -9438 -298 17713 9373 -15232 -12638 7334 2383 -15068
1714 -15068 -9198 4061 -1561 -7396 3921 12027 5413 -6972 -9311 1532 6616 -7185 -16448
1727 -16448 -1414 11095 -211 -4640 8568 8881 -5660 -4716 8257 8138 -3366 -9326 -4786 5285
1741 5285 5045 -7332 -7684 7619 9266 -3586 -1279 9363 1620 -11193 -6625 1027 -2688 -7697
1755 -7697 -6432 510 6768 2755 -5522 552 9696 -1540 -13750 -2777 6650 -4841 -11650 -490
1769 -490 6428 1663 32 4487 7928 3710 -5781 -5909 7443 8138 -8974 -11337 7143 10031 -2684
$$ packed form
1674c403K0055j3572k6150J2881L2038k047k3575l857J0331K235n771k617L148
1687c04R12o481K417K0032M466k6273j1363K5044J1727k1993j1198J4664N543
1700G193j1505k855R573N163q081q926R140J8011q340k4605K594J9972m951j7451
1714a5068N870J3259n622n835J1317Q106o614j2385k339J0843N084j3801r263
1727a6448J5034J2509j1306m429J3208L13j4541R44J2973j19j1504n960M540J0071
1741E285k40j2377l52J5303J647j2852K307J0642p743j2813M568P652l715n009
1755g697J265O942O258m013q277O074R144j1236j2210J0973R427j1491o809J1160
1769d90O918m765j631M455L441m218r491j28J3352O95j7112k363J8480K888j2715
$$ plain form
1784 -2684 -1177 8487 3073 -3668 2897 9232 2263 -9250 -12270 -554 10619 1307 -12195 -2104
1798 -2104 12439 4439 -5021 3328 5448 -7530 -10794 1061 5826 -1166 -6804 -4864 4423 10683
1812 10683 3827 -2387 1293 308 -4995 2887 12081 -1918 -16535 -4154 12826 9236 -2774 -6037
1826 -6037 -55 8136 8574 -1615 -6462 -3548 -4728 -5551 3810 6277 -6905 -10716 2442 8747 1863
1841 1863 -4013 -7623 -7456 -570 2958 -2800 -7163 -6348 -6869 -1021 9557 4470 -11236 -9272 6343
1856 6343 8605 -251 -7631 -10667 -5147 4646 5439 -745 -1754 -693 -1783 4883 11105 -637 -13346
1871 -13346 -5887 6261 4047 -1297 -3491 -5253 -3200 4280 6060 3389 -421 -7610 -8419 5496
1885 5496 11781 -5199 -17533 -6860 6751 7567 3688 -2187 -6497 -1239 7941 6966 -238 -6979
$$ packed form
1784b684J507R664n414o741O565O335o969j1513l020J1716J1173r312j3502J0091
1798b104J4543q000r460Q349K120j2978l264J1855M765o992n638J940R287O260
1812A0683o856o214L680r85n303P882R194j3999j4617J2381J6980l590j2010l263
1826f037N982Q191M38j0189m847K914j180q23R361K467j3182l811J3158O305o884
1841A863n876l610J67O886L528n758m363Q15n21N848J0578n087j5706J964J5615
1856F343K262q856p380l036N520R793P93o184j009J061j090O666O222j1742j2709
1871a3346P459J2148k214n344k194j762K053P480J780k671l810p189q09J3915
1885E496O285j6980j2334J0673J3611Q16l879n875m310N258R180r75p204o741
$$ plain form
1899 -6979 -10248 -1567 12374 8840 -7016 -6266 5976 7663 4221 6473 3375 -5234 -4146 4891
1913 4891 8161 2945 -5053 -7906 3837 16085 9295 -3606 -3542 1555 1964 4787 5025 -5899 -10141
1928 -10141 1146 9459 4981 -511 -2679 -1769 5248 8235 674 -5259 -2301 -1436 -2369 3121 4680
1943 4680 -3195 -4264 3675 6864 6042 3499 -4272 -7444 1410 6844 -316 -5265 -2411 -153 3926
1958 3926 8617 3196 -7107 -4016 4701 4607 8 -3693 -7127 -4027 4620 3604 -3629 -1435 2367
1973 2367 -577 -170 3714 32 -5869 -4912 -2044 -93 3293 751 -6617 -2995 6394 5585 -778 -1746
1989 -1746 -2724 -3733 2058 5127 -3120 -7780 -171 5026 2822 1230 -472 223 3617 2167 -4323
2004 -4323 -2905 3132 -648 -5184 639 4604 1325 973 2296 -1892 -1733 3862 1915 -3403 -1599
$$ packed form
1899f979l269Q681J3941l534j5856P50J2242J687l442K252l098q609J088R037
1913D891L270n216p998k853J1743J2248o790j2901O4N097M09K823K38j0924m242
1928a0141J1287Q313m478n492k168R10P017K987p561n933K958Q65r33N490J559
1943D680p875j069P939L189q22k543p771l172Q854N434p160m949K854K258M079
1958C926M691n421j0303L091Q717r4m599l701l434L100Q647j016p233K194L802
1973B367k944M07L884l682n901R57K868J951L386k542p368L622R389q09o363r68
1989a746r78j009N791L069q247m660P609N197k204j592j702O95L394j450o490
2004d323J418O037l780m536N823L965l279l52J323m188J59N595j947n318J804
$$ plain form
2019 -1599 1432 85 858 1543 -1096 132 4507 1280 -1440 3090 4405 -1160 -2555 -152 346 2643
2035 2643 4214 -841 -3275 4505 7940 926 -2312 -126 -347 658 4273 1235 -3231 -523 2483
2050 2483 545 1420 3087 -1255 -2193 2089 2798 50 531 -1823 -5540 -839 5516 2255 -2429 -1536
2066 -1536 -986 280 5532 2553 -7220 -6239 3262 5211 -126 -2242 -3748 -2966 3197 5463 -138 -3202
2082 -3202 -1954 -859 2675 5124 -2025 -8563 -2614 4281 1831 466 890 -3197 -3336 3320 4655
2097 4655 -1476 -5023 -4000 -1824 4680 6211 -2903 -8645 -1236 4517 2772 850 -1386 -5156 -2217
2112 -2217 4320 3944 -1422 -5051 -6171 -1334 7935 6939 -5061 -7128 1077 3398 1575 2610 -2034
2127 -2034 -9185 -3971 7403 7842 -1087 -7561 -5915 3261 9893 2915 -6951 -5379 453 1407 3599
$$ packed form
2019a599L031j347P73O85k639J228M375l227k720M530J315n565j395K403M98K297
2035B643J571n055k434P780L435p014l238K186k21J005L615l038m466K708L006
2050B483j938Q75J667m342r38M282P09k748M81k354l717M701O355l261m684Q93
2066a536N50J266N252k979r773R81R501J949n337k116j506P82O163K266n601l064
2082c202J248J095L534K449p149o538N949O895k450j365M24m087j39O656J335
2097D655o131l547J023K176O504J531r114n742P409N753j745j922k236l770K939
2112b217O537l76n366l629j120M837R269r96j2000k067Q205K321j823J035m644
2127b034p151N214J1374M39q929o474J646R176O632o978r866J572N832R54K192
$$ plain form
2142 3599 4304 -4271 -9305 345 9527 6177 -1980 -6387 -5009 3254 8537 1475 -6545 -3831 227
2157 227 2155 5492 3481 -5865 -7548 2429 7836 2954 -2926 -5406 -2729 4045 4817 -1135 -2537
2172 -2537 -131 -2307 -587 7825 5295 -7260 -8611 3081 7577 2281 -3426 -4630 -814 4261
2186 4261 3440 -1226 -1195 -2110 -4083 1693 9287 2235 -9310 -5017 5088 5250 -394 -3181 -3913 -1175
2202 -1175 2890 2979 1318 -500 -5252 -4853 6478 10125 -4007 -11943 -648 7995 1654 -3890 -1661
2217 -1661 -243 -571 628 2888 3791 -1266 -8485 -3647 8225 5430 -7830 -6995 3878 3227 -2472
2232 -2472 578 2624 -2896 -4928 1214 4923 1853 -5909 -7916 587 6607 -963 -6623 856 5167
2247 5167 -1803 -3217 3496 1867 -6514 -6264 966 3732 629 -4397 -3318 4426 4684 -3715 -4070 3579
$$ packed form
2142C599P05q575n034R650R182l350q157m407J378Q263N283p062q020K714M058
2157B27J928L337k011r346j683R977N407m882n880k480K677O774P72n952j402
2172b537K406k176J720Q412k530j2555j351J1692M496n296n707j204L816N075
2186D261q21m666L1r15j973N776P594p052j1545M293J0105J62n644k787p32K738
2202a175M065Q9j661j818m752L99J1331L647j4132p936J1295Q643o341n544K229
2217a661J418l28J199K260R03n057p219M838J1872k795j3260Q35J0873o51n699
2232b472L050K046n520k032O142L709l070p762k007Q503O020p570n660P479M311
2247E167o970j414O713j629q381K50P230K766l103n026J079P744K58q399l55P649
$$ plain form
2263 3579 1364 -6549 -2442 5247 185 -6291 -2538 3325 2546 -1555 -2342 1523 4224 -1636 -7226
2278 -7226 -587 4864 -2561 -8084 992 6719 -47 -2918 1891 3161 -1154 -3045 -376 2752 750
2293 750 -5777 -4665 5089 5912 -4081 -4523 5608 5192 -2960 -1329 4855 915 -5839 -4318 3313 5582
2309 5582 -1795 -7461 1076 11429 3953 -7375 -2125 5939 -1381 -6931 1348 4870 -3548 -6610
2323 -6610 1586 8032 2607 -5808 -4645 4563 5290 -4229 -5324 3247 447 -8091 -1013 10547 2847
2338 2847 -10374 -4529 9151 8575 -2671 -8483 -2024 5547 1664 -4987 -1059 3621 -2707 -4729
2352 -4729 6975 10177 -3609 -9925 797 7354 947 -5469 -5018 -782 398 -736 1671 5693
2366 5693 -537 -9850 -2739 11120 4785 -11582 -10301 3494 6347 -500 -3683 -2588 -1168 -515
$$ packed form
2263C579k215p913M107P689n062o476L753N863p79m101p87L865K701n860n590
2278g226O639N451p425n523R076N727o766k871M809J270m315j891K669L128k002
2293G50o527J112R754Q23r993m42J0131m16q152J631O184l940o754J521P631K269
2309E582p377n666Q537J0353p476j1328N250Q064p320n550Q279L522q418l062
2323f610Q196O446n425q415J163R208P27r519j095Q571k800q538P078J1560p700
2338B847j3221N845J3680n76j1246n812O459P571l883o651L928M680o328k022
2352d729J1704L202j3786o316J0722O557o407o416M51M236J180j134K407M022
2366E693o230r313P111J3859o335j6367J281J3795K853o847l183J095J420O53
$$ plain form
2380 -515 1471 4895 4616 -4505 -8743 2825 10063 -874 -10818 -3527 5736 4749 2341 3317 821
2395 821 -2574 -2185 2171 5756 537 -9692 -7310 8020 11634 -2292 -7717 1056 4896 486 396
2410 396 2088 -1615 -5610 -2635 4606 6386 -2970 -11342 -1765 12084 6962 -5598 -3204 4659 504
2425 504 -3566 1718 3484 -4647 -7503 1589 11050 7989 -4337 -6743 4935 9710 -619 -6916
2439 -6916 538 1356 -5162 -406 9042 4230 -7461 -5031 6880 10139 -348 -9260 -5038 4533
2453 4533 2164 -5285 -1495 2880 -3410 -6140 5679 10299 -2592 -9932 -711 7246 2360 -5920
2467 -5920 -6191 -549 1902 -1402 465 6507 3283 -5770 -2094 9447 4787 -8551 -8473 1749 4416
2482 4416 800 -798 44 1115 723 304 2270 2807 -3380 -7495 487 5976 -1989 -8033 -1939 3352
$$ packed form
2380e15J986L424k79r121m238J1568P238j0937r944P291R263r87k408R76k496
2395H21l395L89M356L585n219j0229K382J5330L614j3926n425Q773L840m410r0
2410C96J692l703l995K975P241J780r356q372R577J3849n122j2560K394P863m155
2425E04m070N284J766q131k856R092R461l061j2326k406J1678M775j0329o297
2439f916P454Q18o518M756R448m812j1691K430J1911L259j0487q912M222R571
2453D533k369p449L790M375o290k730J1819M620j2891p340R221P957m886q280
2467e920k71N642K451l304J867O042l224r053L676J1541m660j3338P8J0222K667
2482D416l616j598Q42J071l92m19J966N37o187m115P982N489p965o044O094N291
$$ plain form
2498 3352 768 -641 935 1680 159 -2343 -3395 970 1873 -5267 -7853 2083 6903 203 -2767
2513 -2767 2599 4506 759 -947 -951 -398 -1035 -1957 346 4478 2838 -3546 -312 7328 3052 -5223
2529 -5223 -815 6141 974 -6052 -3002 2384 1576 -3121 -3294 2006 5839 -79 -4618 814 3930
2544 3930 -3972 -6743 639 2638 -4262 -3903 2625 3489 -622 -991 2260 2971 -1001 -4608 -228 5275
2560 5275 227 -7671 -1793 8319 4218 -3986 -318 5023 2642 -319 589 418 -1454 -2430 -802
2575 -802 2333 2709 -3085 -3670 3696 6107 -1477 -3339 1206 -145 -4671 -2236 1294 -1267 -4137 -2586
2591 -2586 1849 5281 2264 -5012 -4576 2880 3785 -2238 -3739 -2174 -1906 248 4435 2467 -2407 -1663
2607 -1663 1908 3938 3691 -436 -4745 -1689 3684 1642 -3166 -787 807 -1192 963 5406 3995
$$ packed form
2498C352k584j409J576P45j521k502j052M365R03p140k586R936M820o700k970
2513b767N366J907l747j706mN53o37r22K303M132j640o384L234P640m276q275
2529e223M408O956n167p026L050N386q08m697j73N300L833n918m539N432L116
2544C930p902k771P382J999o900L59O528Q64m111l69L251P11l972l607M380N503
2560E275n048p898N878J0112m101q204L668N341k381k961R08j71j872r76J628
2575h02L135L76n794n85P366K411p584j862M545j351m526K435L530k561k870J551
2591b586M435L432l017p276M36P456R05o023j501J565K68K154M187j968m874P44
2607a663L571K030k47m127m309L056N373k042m808K379J594j999K155M443j411
$$ plain form
2622 3995 -1456 -4570 -3296 1060 3337 -2560 -7835 -2519 4515 3126 3 -306 -2371 -3679 2048
2637 2048 5174 -1034 -7117 -4813 533 4655 1792 -3900 -3150 3198 4228 563 1218 1932 -3502 -4744
2653 -4744 2154 4410 -863 -4455 -2279 2359 6129 4343 -1443 -3715 -647 564 1211 2255 -2995
2668 -2995 -8566 -2272 7456 5083 -3138 -4563 577 3567 3330 -875 -5051 -3773 -1293 -723 1618
2683 1618 2899 -1503 -4107 1979 6422 2606 -1607 -1914 -2317 -857 3675 2763 -2495 -3739 -44 3616
2699 3616 6695 3505 -4339 -4387 3558 6286 544 -4158 -4335 -2015 2572 4454 488 -2261 383 2045
2715 2045 1221 2137 281 -4856 -4747 1055 2523 -29 -887 -1485 -1608 2105 4914 1763 -1753 -2917
2731 -2917 -2285 1485 4459 -1050 -6304 -1615 5242 4503 293 -280 -254 121 2569 1422 -1565 -2066 -1666
$$ packed form
2622C995n451l114J274M356K277n897n275N316P034j389l123l09k065j308N727
2637B048L126o208o083K304N346M122k863n692P50O348J030l665O55P14n434j242
2653d744O898K256n273l592K176M638L770j786n786k272L068J211O47J044n250
2668b995n571O294R728k373q221j425N140K990k37m205m176J278K480N70K341
2683A618J281m402k604O086M443l816m213l07m03J460M532r12n258j244L695L660
2699C616L079l190p844m8P945K728n742m702j77K320M587J882l966k749K644J662
2715B045q24R16j856n137J09N802J468k552q58n98j23L713K809l151l516j164
2731b917O32L770K974n509n254M689O857p39m210n73K6L75K448j147k987n01M00
$$ plain form
2748 -1666 -1607 1407 3235 -424 -2508 896 2267 -159 36 630 -2811 -4220 -362 1397 -360 -2248
2764 -2248 -2829 -394 4017 3565 -2494 -3617 783 579 -1837 -704 -515 -2567 -823 2850 1206 -463
2780 -463 257 1102 492 854 246 -1399 -65 44 -2292 -657 2843 1304 -2046 153 2693 910 282
2797 282 -275 -1853 -1462 898 -545 -2789 -67 1971 -99 -434 1209 299 214 1137 -506 -2028 117
2814 117 1335 -476 -474 -14 -27 1365 3883 1170 -2194 335 2500 361 -677 713 -431 -435 1684
2831 1684 1810 624 1580 986 -720 1284 3521 573 -2655 -1008 12 579 1821 629 -2845 -922
2847 -922 3025 2927 604 -718 -2272 -1730 2045 2113 -2776 -3696 500 1843 1439 1955 -102 -2543 -1026
2864 -1026 1540 977 -258 -1211 -3442 -2016 3339 3114 -1512 -2400 -670 569 2694 2419 -2712 -5035
$$ packed form
2748a666N9L014J828l659k084L404J371k426J95N94l441j409L858J759j757j888
2764b248n81K435M411m52o059j123M400k04k416J133J89k052J744L673j644j669
2780d63P20Q45o10L62o08j645J334J09k336J635L500j539l350K199K540j783o28
2797B82n57j578L91K360j443k244K722K038k070l35J643r10q5R23j643j522K145
2814A17J218j811KM60j3J392K518k713l364K529K165k139j038J390j144mK119
2831A684J26j186R56n94j706K004K237k948l228J647J020N67J242j192l474J923
2847i22L947r8k323j322j554N42L775O8m889r20M196J343m04N16k057k441J517
2864a026K566n63j235r53k231J426N355k25m626q88J730J239K125k75n131k323
$$ plain form
2880 -5035 -1202 1712 1726 -297 -2427 -3293 236 4594 1808 -2940 -2621 -767 46 1765 1118 -2992
2896 -2992 -3654 -324 1615 2491 1822 -2299 -4865 675 5268 1598 -3167 -3212 -1802 785 3878 1673
2912 1673 -2929 -3321 550 2851 2858 77 -4474 -3909 2637 4631 211 -2105 -1382 -1293 980 4208 1901
2929 1901 -2262 -3079 -706 2197 4084 685 -5229 -3576 3525 4287 123 -1631 -1454 -1453 1624 4527
2945 4527 867 -3750 -3389 516 3669 3778 -1431 -4825 -288 3597 1607 -479 447 -1593 -3347 1182
2961 1182 4996 856 -3619 -3157 329 3951 2736 -2292 -4173 120 2309 837 1485 500 -3581 -2879
2977 -2879 4026 5110 -1470 -4590 -1484 1921 3117 600 -2626 -1539 1342 447 207 2480 457
2992 457 -4465 -2058 4435 3303 -2223 -2721 -168 1343 1862 803 -877 -1101 -655 -647 1749 3072 -2381
$$ packed form
2880e035L833K914J4k023k130q66L529M358k786m748L19J854Q13J719o47m110
2896b992o62L330J939Q76o69m121k566N540M593l670m765m5J410K587L093k205
2912A673m602l92L871K301Pk781m551N65O546J994m420k316P23Q9K273L228k307
2929A901m163q17K373K903J887l399n914J653P101P62m164j754J77JL077K903
2945D527l660m617L61L905L153J09n209l394M537L885j990k086R26k040j754M529
2961A182L814m140m475M62L486L622j215n028j881M293K189j472O48r85m081P02
2977b879O905J084o580l120L106L405J196k517l226J087K881q95k40K273k023
2992D57m922K407O493j132n526m98K553J511N19j059j680k24M46QK396J323n453
$$ plain form
3009 -2381 -5569 339 4955 786 -3455 -1226 1147 346 -15 -518 -372 -310 -1265 -1509 1681 2468 -2241
3026 -2241 -2918 1651 2510 -1404 -1354 851 -189 -1606 -386 1316 640 -850 -2063 68 3954 1278
3042 1278 -4162 -1762 3499 1315 -3286 -930 2452 334 -1762 -486 1118 1334 -458 -1701 624
3057 624 1734 -1517 -2813 2018 2158 -3051 -2678 3228 3644 -2293 -2565 1681 2589 -326 -2119 -714
3073 -714 1894 899 -3225 -881 4677 1771 -4271 -1051 3993 1511 -2343 -737 1853 170 -776 758
3089 758 1919 652 -2450 -1396 4137 4462 -3015 -4732 3030 5305 -1722 -3589 977 1875 -1085 -749
3105 -749 2414 2548 -329 -2432 -150 4403 1568 -4330 -2605 2828 1675 -2198 896 2528 -1894
3120 -1894 -2611 2525 4379 -516 -4750 -2874 2826 4742 -1546 -5539 -779 3749 407 -1659 1360
$$ packed form
3009b381l188N908M616m169m241K229K373q01l61n03J46O2r55k44L190P87m709
3026b241o77M569Q59l914N0K205j040j417J220J702o76j490j213K131L886k676
3042A278n440K400N261k184m601K356L382k118k096J276J604K16j792j243K325
3057F24J110l251j296M831J40n209L73N906M16n937k72M246R08k915j793J405
3073g14K608r95m124K344N558k906o042L220N044k482l854J606K590j683r46J534
3089G58J161j267l102J054N533L25p477j717P762K275p027j867M566Q98k960L36
3105g49L163J34k877k103K282M553k835n898J725N433j153l873L094J632m422
3120a894p17N136J854m895m234J876N700J916o288l993M760M528l342k066L019
$$ plain form
3135 1360 1344 -3173 -1546 3387 2807 -2535 -4668 -1749 2342 3271 -1254 -2733 623 950 -1415 1001
3151 1001 2375 -3725 -6812 -31 5842 1765 -4547 -4283 850 4558 1835 -2982 -2650 531 -725
3166 -725 -1467 2208 1931 -4730 -4646 2733 4811 155 -3453 -1391 1938 2224 36 -1978 -315 -1652
3182 -1652 -3534 1034 6337 1420 -6210 -2242 6567 4783 -2751 -4385 -1216 1356 349 -225 171
3197 171 84 -2347 -1573 4554 5349 -3142 -6766 1154 5455 -109 -3656 -636 607 -1287 -79 2871
3213 2871 3232 -693 -3564 829 6967 2556 -6160 -5447 2786 3379 -472 296 1807 -535 -386 3273
3229 3273 3836 -647 -4878 -3440 2494 4724 -1341 -5324 -358 3674 624 -1047 1595 650 -3435
3244 -3435 -1962 2130 1980 -1933 -4616 -2427 2344 3259 -1248 -2342 1127 1574 -618 810 2039 -1999
$$ packed form
3135A360j6m517J627M933n80n342k133K919M091R29m525j479L356L27k365K416
3151A001J374o100l087O781N873m077o312K64N133L708k723m817L32L181j256
3166g25p42L675k77o661Q4P379K078m656l608K062L329K86k188k014J663j337
3182a652j882M568N303m917p630L968Q809j784p534j634L169K572j007n74L96
3197A71q7k431P74O127P95q491l624P920M301n564l547L020J243j894J208K950
3213B871L61l925k871M393O138m411q716P13Q233N93l851P68J511k342J49L659
3229C273N63m483m231J438N934K230o065l983M966M032l050j671K642r45m085
3244c435J473M092j50l913k683K189M771R15m507j094L469M47k192J428J229m038
$$ plain form
3260 -1999 -5306 -892 3861 2369 -1461 -2533 1020 4688 2751 -2599 -2483 815 -402 -1878 837
3275 837 1937 -1881 -2910 1599 3333 509 -2010 -1380 708 1421 -1120 -2398 -117 -396 -3169 -1632
3291 -1632 3775 2289 -3859 -1860 4142 3421 -1941 -3550 -1026 1544 -65 -2271 -628 3191 1481
3306 1481 -943 1519 3655 -302 -2563 1284 2384 -1556 -2291 1538 2142 -28 -1230 404 2956
3321 2956 1962 -2227 -1487 2642 2385 -3873 -2925 1756 926 -2477 -1087 1922 1162 190 -161 54 565
3338 565 -353 -2020 -1168 877 -1263 -2070 2215 3512 -610 -1673 2463 3451 150 -2045 -1004 670
3354 670 1540 206 -973 737 2161 -59 -161 3033 2374 -1348 -1368 892 635 -401 -1304 -1873 -1046
3371 -1046 984 1765 1212 378 -882 -2307 942 3164 -961 -5486 -2750 2214 2084 -211 -1220 -661
$$ packed form
3260a999l307M414M753j492l830j072L553L668j937n350J16L298j217j476K715
3275H37J100l818j029M509J734k824k519O30K088P13k541j278K281k79k773J537
3291a632N407j486o148J999O002p21n362j609K524K570j609k206J643L819j710
3306A481k424K462K136l957k261L847J100l940p35L829O04k170j202J634K552
3321B956r94m189P40M129k57o258R48M681q30l403J390L009p60r72l51K15N11
3338E65r18j667Q52K045k140q07M285J297m122j063M136R88l301k195J041J674
3354F70Q70j334j179J710J424k220j02L194o59l722k0K260k57j036r03n69Q27
3371a046K030P81n53q34j260j425L249K222m125m525K736M964j30k295j009N59
$$ plain form
3387 -661 1131 2327 1155 -120 308 -1832 -2322 1610 3403 -1130 -3426 675 3290 2189 1340 637
3403 637 -850 -1192 -123 1444 874 -2036 -4674 -1103 4690 3355 -2557 -2911 1170 1812 4 -691
3419 -691 -1633 -3491 -2272 552 1699 322 -1936 -2578 1123 4395 1098 -2575 -1767 -485 -1207 197
3435 197 1939 -919 -3030 -439 3739 3885 1054 -2696 -3027 1930 3660 -31 -2944 -2484 -895 555
3451 555 3197 2242 -1935 -2439 1669 3571 1047 -1918 -4052 -2938 1040 1941 -803 -1498 -374 -320 1094
3468 1094 3233 1592 -2477 -2988 -376 1735 2065 -85 -3195 -1791 3368 3942 1351 -236 -541 -499
3484 -499 1769 3259 2 -3626 -2492 1056 2722 1824 -460 -1725 592 2703 812 -405 -82 -1979
3500 -1979 -3432 -78 2894 86 -2967 -2190 879 2681 1657 -1053 -3015 -1264 566 292 -385 -734
$$ packed form
3387f61J792J196j172j275M28k140m90L932J793m533k296M101K615j101q49p03
3403F37j487l42J069J567n70k910k638L571N793j335n912l54M081O42j808o95
3419f91r42j858J219K824J147j377k258o42L701L272l297l673Q08J282p22J404
3435A97J742k858k111K591M178J46k831l750l31M957J730l691k913M60J589J450
3451E55K642r55m177n04M108J902k524k965k134J114L978R01k744o95J124N4J414
3468A094K139j641m069n11K612K111L30k150l110J404N159N74k591j587l05M2
3484d99K268J490l257l628J134L548J666q98k284j265K317K111j891j217L23j897
3500a979j453L354K972k808l053P77L069J802j024k710j962J751J830k74o77l49
$$ plain form
3516 -734 -3299 -1750 3352 3087 -1141 -1993 667 1530 770 -496 -1088 -1132 -384 -192 395 1454 606 -1773
3534 -1773 -406 2679 1466 -1727 -1397 -901 -968 -117 -119 -1439 -1503 -261 811 1195 693 -1216 -2412 209
3552 209 1109 -1567 -2894 -576 146 -729 39 444 -20 98 602 -129 409 806 -930 -1952 89 1131
3570 1131 -314 81 1007 509 558 1733 1296 -318 -318 -21 -16 280 15 -1176 347 1796 674 -904 857
3589 857 2048 88 -1119 -326 -257 86 215 -1152 -943 833 1401 144 785 1114 -900 -1105 745 510
3607 510 -1566 -850 254 390 900 1442 699 -224 53 472 1009 1585 -506 -2816 -1029 2358 1494 -690
3625 -690 -1255 -44 688 1743 1489 -1130 -1817 -807 -56 -100 430 -1268 -2351 212 2236 923 -371
3642 -371 -397 -1212 -711 1184 850 -1406 -2318 -1131 133 1814 1393 -1460 -1980 811 2625 515 -1153
$$ packed form
3516g34k565J549N102k65m228q52K660Q63p60j266n92m4P48J92N87J059q48k379
3534a773J367L085j213l193L30M96o7Q51kj320o4J242J072L84n02j909j196K621
3552B09R00k676j327K318P22q75P68M05m64J18N04p31N38L97j736j022K041J042
3570A131j445L95R26m98M9J175m37j614%K97NK96k65j191J523J449j122j578J761
3589H57J191j960j207P93O9L43J29j367K09J776N68j257O41L29k014k05J850k35
3607E10k076P16J104J36N10N42p43r23K77M19N37N76k091k310J787L387q64k184
3625f90n65J211P32J055k54k619o87J010P51m4N30j698j083K563K024j313j294
3642c71k6q15N01J895l34k256r12J187J264J681m21k853n20K791J814k110j668
$$ plain form
3659 -1153 -2191 -2028 -212 2308 -108 -1578 -572 -165 616 1540 1163 -1937 -2428 141 1124 393 167
3676 167 -1309 -1947 767 2478 905 -906 -1111 -1172 1005 2723 422 -3217 -2399 1305 2586 875
3692 875 -550 -1355 -288 2119 2619 -303 -1215 -1332 -926 1706 2702 144 -2273 -501 1405 1997 1692
3709 1692 196 -1892 -1460 1429 2255 440 -1245 -2633 -878 3140 3566 -876 -3257 -621 2047 1748
3725 1748 484 -1492 -2000 -605 1741 1564 282 -1145 -2114 -205 2923 2163 -1338 -2025 -62 285
3741 285 958 1332 -303 -2414 -1304 1899 2703 1403 -1717 -2775 155 3085 1232 -2429 -1805 156
3757 156 464 959 1355 -913 -2197 -369 1946 1171 -382 -1685 -1751 884 1342 -720 -996 421 -218
3774 -218 -610 1111 2168 -805 -2486 -799 1546 1146 -618 -2018 -1326 1753 1728 -825 -762 292 -438
$$ packed form
3659a153j038J63J816K520k416j470J006M07P81R24l77l100m91K569R83p31k26
3676A67j476o38K714J711j573j811k05o1K177J718k301l639Q18L704J281j711
3692H75j425q05J067K407N00k922r12j17M06K632R96k558k417J772J906N92l05
3709A692j496k088M32K889Q26j815j685j388J755M018M26m442k381K636K668k99
3725A748j264j976n08J395K346j77j282j427r69J909L128p60l501o87J963L47
3741B85O73L74j635k111J110L203Q04j300l120j058K930K930j853l661O24J961
3757A56L08M95L96k268j284J828K315p75j553j303o6K635M58k062k76J417o39
3774b18l92J721J057k973j681J687K345m00j764j400O92L079k5k553O3J054p30
$$ plain form
3791 -438 -61 1505 697 -1983 -1761 943 1327 -140 -872 -828 990 973 -527 -789 1158 591 -2132 -605
3809 -605 2819 1226 -1978 -1175 767 1524 502 -788 -938 276 847 117 190 826 -934 -1671 1608
3826 1608 2407 -1222 -2340 1367 2264 169 -1261 -73 822 864 -1081 -980 1377 1538 -1535 -1499 1575
3843 1575 1150 -1483 -661 1500 520 -1031 -207 1213 502 -916 -605 864 1404 -171 -1644 690 2176
3860 2176 -940 -2248 1353 2275 -963 -2387 116 1893 849 -920 -1025 177 1034 7 25 839
3876 839 -3 -2125 -187 2605 827 -2488 -1183 1536 1094 -772 -926 475 452 -482 -475 986 1857 -1156
3894 -1156 -2979 323 3018 282 -2576 -684 1326 816 293 126 -400 -1398 -943 729 1327 42 -2605
3911 -2605 -1350 2905 2353 -1871 -2183 237 1519 -540 -604 736 -208 -1490 -1112 961 2425 -566
$$ packed form
3791d38L77J566q08k680K22K704L84j467p32M4J818j7j500k62J947n67k723J527
3809f05L424j593l204Q03J942P57j022j290j50J214N71p30P3O36j760p37L279
3826A608P99l629j118L707Q97k095j430J188Q95M2j945J01K357J61l073L6L074
3843A575m25k633Q22K161r80j551Q24J420p11j418L11J469N40j575j473K334J486
3860B176l116j308L601R22l238j424K503J777j044j769j05J202Q57j027J8Q14
3876H39q42k122J938K792j778l315J305K719m42j866j54J401k3r34PJ461Q71l013
3894a156j823L302K695k736k858J892K010n10n23j67n26r98M55J672N98j285k647
3911b605J255M255n52m224l12K420J282k059o4J340r44j282L78K073J464k991
$$ plain form
3927 -566 -3488 -764 3290 1858 -2088 -1466 217 -299 -350 1466 794 -1603 -1903 922 3594 1567 -2982
3944 -2982 -3277 1139 2842 -609 -1940 101 626 -1554 213 2784 868 -2450 -1892 2028 3017 292
3960 292 -3011 -2006 1493 1357 -183 271 611 -1549 -949 3260 3159 -1378 -4219 -823 2667 2102 -1404
3977 -1404 -2332 83 1521 1026 205 1298 -538 -3066 -824 2820 2072 -2681 -3008 496 2068 1453
3993 1453 -177 -975 -608 -113 180 1062 1280 -1820 -3218 422 3559 454 -2390 -1558 1156 2205 1202
4010 1202 20 -1006 -816 -535 -94 1095 601 -2251 -1905 2306 3585 -393 -2481 -645 596 -347
4026 -347 -186 -395 -677 -964 -1204 1291 2489 10 -3341 -1127 2912 1727 -1575 -1590 60 -228 -434
4043 -434 -58 554 -668 -1094 237 2810 2479 -1205 -2343 371 1832 -394 -2047 328 1340 -548
$$ packed form
3927e66k922K724M054j432l946O22J683n16n1J816o72k397l00K825K672k027m549
3944b982k95M416J703l451j331K041N25k180J767K571j916l318N58L920R89k725
3960B92l303J005L499j36j540M54L40k160O00M209j01m537k841L396L490n65l506
3977a404r28K415J438m95q21J093j836k528K242L644p48m753l27L504J572o15
3993A453j630p98L67M95K93Q82K18l100j398L640L137l105k844Q32K714J049j003
4010A202j182j026J90K81M41J189m94k852L46M211J279l978k088J836J241r43
4026c47J61k09k82k87k40K495J198k479l351K214M039j185l302j5J650k88k06
4043d34L76O12j222m26J331K573l31l684j138K714J461k226j653K375J012j888
$$ plain form
4059 -548 402 2069 1449 -1234 -1545 285 2137 648 -1990 -1213 1061 973 -1187 -335 1485 -267 -1270
4076 -1270 670 2248 -455 -2307 -1292 540 507 -964 -1425 531 1988 204 -1071 1605 1516 -1194
4092 -1194 -1257 428 767 -1116 -965 664 352 752 355 605 1259 305 -1361 -524 1289 216 -1793 -603
4110 -603 1393 267 -751 43 1178 619 -415 -603 191 1066 -565 -2179 -1040 981 101 -935 329
4127 329 1047 -101 230 1044 143 -1204 -1342 -519 493 479 -865 -746 1245 1918 202 -85 1014 -93
4145 -93 -1661 -535 1527 947 -1237 -1601 258 1787 1216 -1081 -1020 883 880 -226 -185 81 -2124 -1937
4163 -1937 968 2047 -352 -1243 -97 1281 1825 -103 -1455 -578 189 -663 -170 1440 261 -1984
4179 -1984 -303 2997 2786 -432 -1148 48 757 1420 196 -1216 -1035 -338 476 1997 1726 -1175 -2269
$$ packed form
4059e48R50J667o20k683l11J830J852j489k638P77K274q8k160Q52J820j752j003
4076a270J940J578k703j852J015J832l3j471m61J956J457j784j275K676q9k710
4092a194o3J685L39j883J51J629l12M00l97K50O54r54j666Q37J813j073k009J190
4110f03J996j126j018P94J135n59j034j88P94Q75j631j614J139K021q80j036J264
4127C29P18j148L31Q14r01j347j38Q23J012j4j344J19J991O73j716k87J099j107
4145i3j568J126K062n80k184l64J859J529n71k297O1J903lj106M1K66k205J87
4163a937K905J079k399q91J146J378N44j928j352Q77P67q52M93J610j179k245
4179a984J681L300k11l218p16J196P09O63j224j412J81O97Q14J521k71k901j094
$$ plain form
4196 -2269 595 2505 437 -1917 -2275 -1126 -88 689 240 -1127 -694 -344 321 1905 991 -2074 -2678
4213 -2678 107 1378 -77 -1251 -1538 -728 1027 2015 1053 -645 -1053 -403 744 1914 115 -2678
4229 -2678 -2028 1495 2097 540 -529 -615 -400 1171 1396 404 -1047 -1519 -1370 579 1658 -579 -2415
4246 -2415 -673 1750 1522 222 -494 -1613 -1650 -272 830 215 -1052 -1980 -455 2281 2544 -835 -1932
4263 -1932 353 1261 284 -385 -128 -1462 -967 942 1758 495 -727 -758 1214 2452 1113 -1464 -1480
4280 -1480 96 -241 -104 588 236 -1314 -336 1373 2081 -266 -1652 -1424 378 1084 -365 -1785 -941
4297 -941 29 177 856 1131 -214 -1397 536 1935 697 -951 -1115 -767 375 987 -157 -86 538 311
4315 311 47 1114 1354 -763 -1709 -261 1186 493 -683 -906 -468 1093 1181 -231 218 252 -311 -525
$$ packed form
4196b269K864J910k068k354l58J149J038P77m49j367M33L50O65J584r14l065o04
4213b678K785J271j455j174k87Q10J755R88r62j698m08O50J147J170j799k793
4229b678O50L523O02j557j069q6K15J571K25r92j451m72J49J949J079k237j836
4246b415J742K423k28j300p16j119l7J378J102o15j267r28J525K736K63l379j097
4263a932K285R08r77o69K57j334M95J909Q16j263j222l1J972J238j339k577j6
4280a480J576l37J37O92l52j550R78J709P08k347j386K28J802P06j449j420Q44
4297i41R70J48O79K75j345j183J933J399j238j648j64L48J142O12j144P1O24k27
4315C11k64J067K40k117r46J448J447o93j176k23M38J561Q8j412M49L4n63k14
$$ plain form
4333 -525 152 -358 -1856 -1249 269 683 -298 -94 103 78 274 -115 -448 -5 -212 -1295 -603 1048 207
4352 207 -837 311 1277 850 -182 219 -21 91 -5 -489 -634 368 83 -205 566 1243 441 -404 802
4371 802 82 -1468 -721 184 -41 -577 -618 -8 392 830 -366 -221 641 401 -897 -436 421 -517 -1149
4390 -1149 -614 709 554 694 363 -42 221 687 294 -365 -524 -844 -210 1046 1206 -919 -686 897
4408 897 1289 353 41 -165 -724 274 277 -485 -201 -142 -707 -102 1627 1002 -790 -889 -136 371 299 106 -1367
4429 -1367 -1461 348 1367 603 -91 -655 -584 976 1931 -83 -1630 -711 279 563 258 -192 -849 -238 1047
4448 1047 1218 852 502 -805 -890 237 1152 -164 -1554 -1096 -82 1300 1682 161 -1591 -892 1183
4465 1183 900 251 -1237 -1838 -752 1304 1171 -906 -1359 -337 496 1241 857 -644 -1395 -654 563
$$ packed form
4333e25O77n10j498O07J518M14r81K04J97k5J96l89l33M43k07j083O92J651q41
4352B07j044J148R66m27j032M01k40J12r6m84j45J002k85k88P71O77q02q45J206
4371H02p20j550P47R05k25n36m1O10M00M38j196J45Q62k40j298M61Q57r38o32
4390a149N35J323j55J40l31m05K63M66l93o59j59l20O34J256J60k125K33J583
4408H97L92r36l12k06n59R98Lp62K84N9n65O05J729o25j792r9P53N07p2j93j473
4429a367r4J809J019p64o94n64P1J560R55k014j547R19R90K84l05m50o57O11J285
4448A047J71l66l50j307q5J127R15j316j390M58J014J382L82j521j752O99K075
4465A183k83o49j488o01J086K056j33k077m53J022Q33P45l84j501p51P41J217
$$ plain form
4482 563 305 513 -238 -1540 -361 1512 1722 162 -963 -746 78 1303 779 -1314 -1992 -112 852
4499 852 941 723 -900 -1415 439 2157 722 -874 -1336 -741 213 1368 344 -802 -479 94 475 911
4517 911 949 -971 -1818 217 1485 412 -765 -1062 -754 414 1641 752 -600 -1238 -147 508 1615
4534 1615 257 -2169 -1305 1124 1450 290 -371 -402 -34 675 834 274 -1018 -1160 -669 351 1263 48
4552 48 -1577 -860 1071 992 49 -88 -747 -919 247 914 291 -1172 -1550 -327 1321 1573 -785 -1603
4570 -1603 83 1403 46 -523 -114 -531 -707 387 1104 293 -717 -724 408 1067 602 -981 -976 192
4588 192 -141 -556 304 610 -903 -957 491 1525 -26 -1171 -703 248 793 -271 -1107 -164 794 -256
4606 -256 -713 724 833 -1165 -388 885 631 -427 -287 105 234 -92 -270 -11 1075 112 -1201 -24
$$ packed form
4482E63k58K08p51j302J179J873K10j560j125K17Q24J225n24k093o78J880R64
4499H52Q9k18j623n15J854J718j435j596m62N95R54J155j024j146L23N73L81M36
4517I11L8j920q47K035J268j073j177k97L08J168J227q89j352o38J091O55J107
4534A615j358k426Q64K429L26j160o61l1L68P09J59n60j292j42M91J020R12j215
4552D8j625P17J931p9r43j37o59j72J166O67o23j463l78J223J648K52k358q18
4570a603J686J320j357n69M09m17j76J094P17q11j010pJ132O59m65j583NJ168
4588A92l33m15Q60L06j513n4J448J034j551j145M68R51N45j064q36R43R58j050
4606b56m57J437J09j998P77J273k54j058J40L92J29l26j78K59J086r63j313J177
$$ plain form
4624 -24 1650 308 -1431 -169 962 126 -867 128 278 230 -288 -330 411 578 -483 -859 534 520 -402
4643 -402 -624 990 -59 -942 -53 1286 928 -502 -932 375 1139 448 -1065 -568 920 503 -448 -171
4661 -171 974 -512 -1070 103 1235 282 -928 -653 302 756 -17 -546 -552 116 -310 -369 1074 660 -1606
4680 -1606 -1584 1267 1734 -449 -1554 -794 1032 1034 -185 -764 99 183 -794 224 1663 13 -1856 -596
4698 -596 1422 750 -741 -1024 -189 422 389 407 158 -96 -1398 -756 1510 1787 -1212 -2460 460 1975
4716 1975 384 -919 -587 -297 -176 495 784 340 -728 -1401 7 2289 656 -2268 -1369 1217 1329
4733 1329 264 -270 178 -899 -785 716 1576 55 -1541 -1463 1191 2340 78 -1951 -757 686
4749 686 606 169 579 -335 -1537 -40 1655 1163 -676 -1812 -304 1865 2101 -357 -1055 83 431
$$ packed form
4624b4J674j342j739J262J131q36r93R95J50m8n18m2P41J67j061l76J393j4r22
4643d02k22J614j049q83Q89J339l58j430m30J307P64o91j513M97J488m17r51K77
4661a71J145j486n58J173J132r53j210K75R55M54p73n29oO68m26n9J443m14k266
4680a606K2K851M67k183j105P60J826Kj219n79Q63Q4r77J018J439j650j869J260
4698e96K018o72j491k83Q35O11l3J8k49k54j302O42K266K77k999j248K920J515
4716A975j591j303L32K90J21O71K89m44j068o73J408K282j633k924Q99K586J12
4733A329j065n34M48j077J14J501Q60j521j596P8K654J149k262k029J194J443
4749F86q0m37M10r14j202J497J695m92j839j136J508K169K36k458o98J138L48
$$ plain form
4766 431 -189 500 456 -809 -1630 344 1889 1341 -832 -1615 16 1649 1004 -682 -654 -235 -360 -6
4784 -6 1136 663 -1414 -1196 1085 1994 535 -1020 -1030 332 1221 -134 -559 -77 -330 -808 198 1701
4802 1701 211 -1688 -907 1374 1334 -858 -1320 -842 414 455 160 208 518 -573 -1205 878 1743 -714
4820 -714 -2339 -271 1373 354 -664 -482 160 98 -75 147 531 84 -1105 -313 1568 733 -1703 -1511
4838 -1511 1007 1249 -157 -81 202 17 -201 -180 497 688 -978 -1465 532 1597 373 -1310 26 1058
4856 1058 152 -109 -278 -31 -230 -685 357 527 337 -774 -797 759 1054 34 -539 681 460 -442
4874 -442 -671 198 -48 -428 -99 608 963 359 -289 238 812 546 -810 8 680 -24 -1009 -33 736 215
4894 215 -275 -41 427 185 -229 -294 -174 350 -660 -1000 245 1100 -791 -997 257 964 32 -458 -333
$$ packed form
4766D31o20O89m4j265q21J974J545n48k173p83J631J633o45j686K8M19j25L54
4784fJ142m73k077K18K281R09j459j555j0J362Q89j355m25M82k53m78J006J503
4802A701j490j899P81K281m0k192m62M78J256M1k95M8L10j091o32K083Q65k457
4820g14j625K068J644j019j018J82O42o2j73K22L84m47j189P92J881q35k436J92
4838a511K518K42j406P6K83j85k18K1O77J91j666m87J997J065j224j683J336J032
4856A058r06k61j69K47j99m55J042J70j90j111k3J556K95j020n73J220k21r02
4874d42k29Q69k46l80L29P07L55o04o48N27N74k66j356Q18O72p04r85R76P69n21
4894B15m90K34M68k42m14o5J20N24j010l40J245Q55j891k06J254P07r32m90J25
$$ plain form
4913 -333 -302 -741 -440 0 391 -92 -786 461 1620 974 -1054 -472 687 309 -701 -70 196 -519 -288
4932 -288 390 933 934 -345 -963 329 1234 4 -1003 -674 77 -147 67 259 -252 -878 -128 1098 964
4951 964 -56 -1291 -1231 431 747 -560 -738 -26 161 180 843 1217 -519 -1115 107 794 532 -173 -1124
4970 -1124 -612 886 1084 -250 -55 -75 49 244 1387 453 -1360 -1636 307 1001 507 -760 -1360 -60
4988 -60 1126 878 -28 62 -408 -1180 -334 884 -57 -1235 -1175 494 1360 1105 -711 -1097 185 899 562
5007 562 -115 -284 -1154 -707 1142 1863 413 -1268 -507 1160 1329 108 -602 -864 -107 105 335 564
5025 564 233 -1160 -310 1820 1527 -235 -1502 -113 316 657 -260 -777 -794 -485 220 1082 950 -405
5043 -405 -1580 29 1648 457 -1148 -988 -16 577 637 425 182 -491 150 754 1222 267 -1044 -1308
$$ packed form
4913c33L1m39L01M40L91m83o94J247J159o46k028N82J159l78j010O31K66p15K31
4932b88O78N43Jj279o18J292R05j230j007L29P51k24K14J92n11o26P50J226j34
4951I64j020j235O0J662L16j307j78P12J87J9O63L74j736n96J222O87k62p05r51
4970a124N12J498J98j334J95k0J24J95J143r34j813k76J943O94m94j267o00J300
4988f0J186k48r06R0m70p72Q46J218r41j178O0J669Q66k55j816l86J282P14l37
5007E62o77j69q70M47J849P21j450j681P61J667J69j221p10k62P57K12K30K29
5025E64l31j393Q50K130k93j762j267J389M29L41r17n17j7L09P05Q62j32j355
5043d05j175J609J619j191j605J60R72N93O0k12k43o73O41O04M68r55j311k64
$$ plain form
5061 -1308 636 1513 -88 -1211 -400 427 350 690 954 -98 -532 -603 671 604 -388 -1638 -1139 805
5079 805 852 7 -443 -332 -100 343 375 42 -1266 -1120 -541 473 808 -66 -727 145 1230 589 99 -113
5099 -113 -267 -580 -67 761 362 -579 -537 350 1111 808 96 -672 233 410 133 -547 -111 -249 -872 64
5119 64 792 91 -702 -533 651 496 -50 -745 -691 -127 33 -499 27 676 -352 -585 933 1012 -239 -411
5139 -411 79 356 -164 -266 -297 105 595 112 134 983 882 -420 -5 395 40 -627 -272 -56 -385 -74
5159 -74 2 -132 189 615 -303 -196 243 -228 -707 66 -8 -520 -221 249 39 -205 -304 3 599 511 -548
5180 -548 -825 -370 225 370 -55 267 -166 -327 528 971 252 -209 -211 185 -42 204 -149 -833 -63 634 173
5201 173 219 440 -607 -839 279 784 -52 -978 -1126 -231 428 640 -264 -680 -221 572 335 234 -568 -1173
$$ packed form
5061a308J944Q77j601j123Q11Q27p7L40K64j052m34p1J274o7r92j250M99J944
5079H05M7q45m50J11K32M43L2l33j308J46N79J014L35q74o61Q72J085o41m90k12
5099a13j54l13N13Q28l99r41M2Q87P61l03p12p68R05J77k77o80M36j38o23R36
5119F4P28p01p93J69J184j55n46o95N4N64J60n32N26O49j028k33J518P9j251j72
5139d11M90K77n20j02l1M02M90m83K2Q49j01j302M15M00l55o67L55K16l29L11
5159g4P6j34L21M26r18J07M39m71m79P73p4n12K99M70k10k44r9L07N96q8j059
5180e48k77M55N95J45m25L22m33j61Q55M43p19m61kL96k27K46l53o84P70O97m61
5201A73M6K21j047k32J118N05q36r26j48Q95O59K12r04m16M59P93k37j01q02o05
$$ plain form
5221 -1173 -857 117 590 -384 -452 -261 447 859 827 -267 -594 123 -162 152 480 -554 -1317 -546 1115
5240 1115 976 -175 -343 -326 98 909 435 -922 -1130 -317 118 863 -8 -816 -515 391 792 572 161
5259 161 -687 -641 -287 413 349 -638 -802 -820 501 1480 853 -646 -948 -77 821 469 -285 -1014 -842 648
5279 648 1269 557 -469 -568 63 809 869 108 -1105 -1095 -18 674 473 -19 -468 -443 516 963 458 -380
5299 -380 -869 -609 250 686 -60 -1670 -743 466 1079 657 85 -916 -369 633 765 37 -996 -775
5317 -775 -210 645 938 350 -787 -206 629 841 369 -395 -1069 -409 514 174 213 -82 -629 -348 973 1217
5337 1217 -446 -1159 -304 211 566 60 -789 -853 -359 201 661 269 -81 -803 -15 869 415 -810 -773 15
5357 15 277 274 363 193 -140 -284 128 298 381 -678 -1003 42 720 252 -867 -192 379 -88 61 547 319
$$ packed form
5221a173L16R74M73r74o8J91P08M12l2j094l27P17k85L14L28j034p63P71J661
5240A115j39j151j68J7M24Q11m74j357k08Q13M35P45q71q08L01R06M01k20m11
5259A61q48M6L54P00o4r87j64j8J321R79o27j499l02Q71Q98l52p54p29J72J490
5279F48O21p12j026r9O31P46O0p61j213J0J077O92k01m92m49K5R59M47n05q38
5299c80m89K60Q59M36p46j610R27J209O13m22n72j001N47J002J32p28j033K21
5317g75N65Q55K93n88j137N81Q35K12m72p64o74O60R23l40L9k95n47K81J321K44
5337A217j663p13Q55N15L55n06q49o4M94N60M60l92l50p22P88Q84m54j225L7P88
5357A5K62lQ9j70l33j44M12J70Q3j059l25J045O78m68j119O75N71m67J49M86k28
$$ plain form
5378 319 -262 -352 189 436 159 -374 -590 315 496 -178 -234 433 449 -367 -379 411 127 -633 -540 -13 216 -459
5400 -459 -243 -44 592 300 -516 -65 260 -64 -616 435 623 -216 -619 10 250 156 -292 27 522 290
5420 290 -408 -505 278 469 -428 -385 175 364 359 -212 376 -111 -672 -331 266 349 -223 -852 281 1130 138
5441 138 -933 -323 698 -87 -45 300 187 -449 -618 -130 525 116 -662 -993 279 872 149 -543 -324
5460 -324 -65 -296 87 796 67 -976 -615 949 863 -138 -1033 -517 641 254 -501 -109 236 -595 -731
5479 -731 535 1222 -348 -1106 -255 814 732 -302 -571 -71 313 80 120 429 -239 -942 -204 1252 543
5498 543 -1047 -985 134 872 145 -227 -464 -185 138 63 354 517 -958 -1109 481 1191 293 -873 -447
5517 -447 502 478 66 42 -661 -226 325 333 631 20 -817 -611 1033 1134 -554 -1017 -138 549 413 131 85
$$ packed form
5378C19n81r0N41K47k77n33k16R05J81o74n6O67J6q16j2P90k84p60R3N27K29o75
5400d59K16J99O36k92q16M51L25l24n52J051J88q39m03O29K40r4m48L19M95k32
5420B90o98r7P83J91q97M3N60J89nn71N88m87n61L41N97Q3n72o29J133Q49r92
5441A38j071O10J021p85M2L45j13o36j69M88O55m09p78l31J272N93p23o92K19
5460c24K59k31L83P09p29j043L61J564q6j001q95N16J158l87p55L92L45q31j36
5479g31J266O87j570p58Q51J069q2j034k69N00L84k33M0L09o68p03P38J456p09
5498E43j590O2J119P38p27l72k37K79L23p5K91J63j475j51J590P10q98j166M26
5517d47R49k4m12k4p03M35N51QK98o11q37K06J644J01j688m63Q79O87j36k82m6
$$ plain form
5538 85 -447 -623 -233 762 982 -439 -1047 -616 1382 768 -703 -767 -379 211 358 434 298 -397 -559 366
5558 366 1149 385 -1025 -1070 405 1243 -196 -853 -6 82 -111 -79 847 85 -931 -657 200 1117 378 -1155
5578 -1155 -1144 877 705 -278 -110 206 -327 -513 528 715 -340 -1136 -208 835 851 -291 -906 -379 549
5597 549 -72 -358 259 203 -941 -392 1097 887 -632 -951 74 615 479 -273 -595 -118 265 -6 -114
5616 -114 219 -278 -1133 128 1076 153 -611 -257 379 451 79 -415 -401 -94 -321 -411 348 631 -383 -465 433
5637 433 1024 -185 -829 -330 -41 176 -72 87 13 163 -124 444 560 78 -713 -185 726 389 -658 -564
5657 -564 491 -192 -496 -29 477 176 267 4 465 585 139 -1123 -487 377 11 -319 204 924 28 -432
5677 -432 -23 306 -124 -598 -431 169 247 -427 -247 636 239 -804 -235 974 402 -510 -639 393 365 -89
$$ packed form
5538H5n32j76L90R95K20j421o08M31J998o14j471o4L88N90J47P6j36o95j62R25
5558C66P83p64j410m5J475Q38j439o57Q47Q8j93L2R26p62j016K74Q57R17p39j533
5578a155J1K021j72r83J68L16n33j86J041J87j055p96R28J043J6j142o15N27R28
5597E49o21k86O17n6j144N49J489k10j519l19J025N41j36p52l22M77L83k71j08
5616a14L33m97q55J261R48r23p64L54O36P2l72m94J4L07k27r0P59K83j014q2Q98
5637D33N91j209o44M99K89K17k48J59p4J50k87N68J16m82p91N28R11l37j047R4
5657e64J055o83l04M67N06l01R1k63M61J20m46j262O36Q64l66l30N23P20q96m60
5677d32M09L29m30m74J67O00P8o74J80Q83l97j043N69J209n72r12j29J032k8m54
$$ plain form
5697 -89 -423 -376 -183 245 11 464 648 -274 -545 92 412 -256 -551 -526 493 296 88 340 276 -15 -145
5718 -145 -17 674 246 -950 -717 387 698 -157 -571 -82 236 38 260 166 7 -329 -471 347 429 -429
5738 -429 -985 -308 833 574 -96 -431 34 -39 1 203 -235 -266 -520 33 763 994 -142 -721 267 706
5758 706 515 -366 -544 -529 -476 404 887 -7 -486 -648 284 1112 748 -566 -931 217 417 -439 -446 -247 -772
5779 -772 -545 463 755 24 -618 -533 197 1234 89 -1188 -508 198 533 238 370 -24 -625 -338 1044
5798 1044 989 -239 -1287 -680 524 730 148 -678 -71 313 276 713 590 -351 -930 -168 826 165 -935
5817 -935 -732 -268 608 847 -73 -569 140 -674 269 457 113 -952 -993 639 944 63 -398 -429 -147 298
5837 298 637 209 -309 -197 -367 5 864 271 -971 -488 884 1123 198 -32 -253 -152 190 -15 -124
$$ packed form
5697h9l34M7J93M28k34M53J84r22k71O37L20o68k95K5J019j97k08K52o4k91j30
5718a45J28O91m28j196K33J104L11q55m14M89L18j98K22r4j59l36j42Q18Q2q58
5738d29n56O77J141k59o70l35M65p3M0K02m38l1k54N53P30K31j136n79R88M39
5758G06j91q81j78J5N3Q80M83q94m79j62R32Q28l64j314l65J148K00q56pJ99n25
5779g72K27J008K92p31o42Q5P30J037j145j277O80P06L35k95J32l94o01K87J382
5798A044n5j228j048O07J204K06n82q26O07L84l7M37j23r41n79P62R94o61j100
5817i35K03M64Q76K39r20m96P09q14R43J88l44j065m1J632L05q81m61l1K82M45
5837B98L39m28n18J12j70L72Q59n93j242M83J372K39r25k30k21J01L42k05j09
$$ plain form
5856 -124 -212 -308 -493 468 1195 -72 -763 74 754 184 -96 -651 -503 -428 151 406 152 -248 -292 -182 415
5877 415 463 -224 -929 -196 352 -132 -62 178 -81 182 578 743 395 -141 -321 178 638 311 -327 -559 257
5898 257 -28 -78 346 213 -123 12 376 416 -113 -504 -345 186 140 -126 -509 5 292 -263 18 375 162
5919 162 -384 -249 -94 209 67 -705 176 163 116 -43 221 490 -111 -632 142 610 -210 -698 -104 -75 -40
5940 -40 216 312 114 285 -90 -129 72 -154 -253 -466 -126 -113 -132 -151 319 63 -86 300 330 -58 -500 -485 -358
5963 -358 298 17 -279 -436 271 582 414 239 174 -159 -341 222 426 45 -214 -488 -50 615 542 -300 -233
5984 -233 183 22 335 473 -144 -907 -408 372 362 -134 38 -639 138 631 -49 -464 -514 -114 -362 -32 98
6005 98 -363 -554 201 583 421 160 -363 -86 174 287 210 -419 -513 -402 198 870 334 -352 -503 181 755
$$ packed form
5856a24q8r6j85R61P27j267o91Q37O80n70k80n55J48P5N79K55k54m00m4J10N97
5877D15M8o87p05P33N48m84P0K40k59K63L96J65l48n36j80M99M60l27o38k32Q16
5898B57k85n0M24j33l36J35L64M0n29l91J59N31m6k66l83N14K87n55K81L57k13
5919A62n46J35J55L03j42p72Q81j3m7j59K64K69o01n21P74M68q20m88N94K9L5
5940d0K56R6j98J71l75l9K01k26r9k13L40J3j9j9M70k56j49L86L0l88m42J5J27
5963c58O56k81k96j57P07L11j68j75o5l33j82N63K04l81k59k74M38O65p3q42O7
5984b33M16j61L13J38o17p63M99P80j0m96J72o77P77M93o80m15n0M00k48L30J30
6005I8m61j91P55L82j62k61n23K77K60J13p7o29r4J11O00O72n36o86j51O84N74
$$ plain form
6026 755 406 -345 -641 -480 215 463 -255 -282 -136 -169 567 327 320 -725 -687 111 292 291 -135 -721 -599 571
6048 571 810 434 -363 -294 -351 446 651 36 -971 -332 466 629 406 220 -659 -264 888 524 154 -386
6068 -386 -403 -256 493 526 -190 -303 -177 327 692 506 -374 -786 -273 399 467 88 -528 -549 -173 621 845
6089 845 -185 -372 -167 83 286 175 -646 -845 47 429 84 14 -179 -247 79 821 358 -394 -413 -374 55
6110 55 380 393 -321 61 369 511 486 390 -222 -602 -177 644 161 -493 -652 -137 241 346 480 -55 -331
6131 -331 50 146 153 -5 -303 -657 125 549 530 -317 -4 282 59 584 159 -129 -109 62 65 589 -36 -224
6153 -224 -171 322 686 91 -82 82 -12 32 58 -252 6 -58 -318 271 502 -90 -422 -35 537 325 -108 -283
6175 -283 -277 -295 -30 192 62 155 -17 252 315 441 -215 -171 310 99 -159 -265 8 184 73 -10 262 309 11
$$ packed form
6026G55l49p51k96J61O95K48p18k7J46l3P36k40pj045L8P98J81jm26n86J22J170
6048E71K39l76p97O9n7P97K05o15j007O39P98J63k23j86q79L95J152l64l70n40
6068c86j7J47P49L3p16j13J26N04L65j86q80m12N13O72O8l79o16k1L76P94K24
6089H45j030j87K05K50K03j11q21j99Q92L82l45p0j93o8L26P42m63p52j9L9M29
6110E5L25J3p14L82L08J42k5r6o12l80M25Q21m83o54j59N15L78J05J34n35k76
6131c31L81R6Pj58k98l54P82M24j9q47L13K86k23N25m25k88K0J71LN24o25j88
6153b24N3M93L64n95j73J64r4M4K6l10K58o4k60N89K31n92l32L87N72k12m33j75
6175b83Oj8K65K22j30R3j72K69O3J26o56M4M81k11k58j06K73J76j11q3K72M7k98
$$ plain form
6198 11 -17 -158 166 207 -313 -262 294 27 -377 81 287 163 -402 -234 104 -180 38 -32 -93 108 -392 -184
6220 -184 371 408 -54 -484 173 587 -264 -415 -60 174 43 117 150 141 -144 -175 219 738 157 -871 -65 359
6242 359 168 -359 -81 59 5 -59 627 455 -209 -716 -346 722 201 -294 -762 250 437 -31 -157 140
6262 140 -37 -942 145 631 310 -388 -850 -142 673 342 -636 -583 154 -3 -61 273 163 -202 -259 638 713
6283 713 153 -474 -282 125 868 463 -188 -292 -24 -122 -35 229 -265 -728 -635 684 925 -332 -921 -185
6303 -185 257 775 331 -221 -338 220 -106 60 630 -264 -749 -366 753 524 -344 -729 -151 291 356 119
6323 119 -205 -25 -342 -277 594 715 -588 -1034 246 602 -20 -515 -555 -194 232 159 219 110 -352 -439 194
6344 194 942 147 -742 -552 667 437 193 -187 -150 56 -62 261 336 232 -476 -494 816 990 -68 -903
$$ packed form
6198A1k8j41L24M1n20N1N56k67m04M58K06j24n65J68L38k84K18p0o1K01n00K08
6220a84N55L7m62m30O57M14q51j51L55K34j31P4L3rk85l1L94N19n81j028Q06M24
6242C59j91n27K78J40n4o4O86j72o64n07L70J068n21m95m68J012J87m68j26K97
6262A40j77r05J087M86l21o98m62P08Q15l31r78N3P37j57n8L34j10l65n7Q97P5
6283G13n60o27J92M07P43m05o51j04K68r8Q7K64m94m63R3J319K41j257n89P36
6303a85M42N18m44n52j17N58l26J66N70q94m85L83J119k29q68l85N78M42O5k37
6323A19l24J80l17O5Q71J21j303m46J280L56o22m95m0L61M26p3O0j09m62q7O33
6344A94P48p95q89J90J219k30k44l80L7K06j18L23P5j04p08j8J310J74j058q35
$$ plain form
6364 -903 -81 705 183 23 -272 112 -307 182 469 432 -407 -486 -19 507 429 -442 -346 -72 110 -91 17
6385 17 19 100 -531 123 760 199 -295 -629 164 574 209 -565 -493 215 69 -126 217 20 -416 -560 -38 467
6407 467 290 -267 -350 312 460 -51 -537 -176 -135 -284 -28 394 77 -491 -213 200 361 -82 -519 19 449
6428 449 134 -107 -171 25 146 -318 -93 641 -326 -260 13 506 97 -210 139 265 49 -537 -401 124 282
6449 282 -346 -325 -42 262 -304 -647 186 181 -264 -333 -164 18 -371 -118 -179 221 335 -249 338 624 108 -207
6471 -207 -51 500 16 -781 -282 500 -5 -444 -560 67 -53 414 -115 -30 486 -217 64 459 46 -534
6491 -534 -469 48 740 -322 -311 -171 521 442 227 -23 -231 -243 -164 95 640 169 -771 307 397 319 -46 -377
6513 -377 20 214 132 -67 105 18 -104 -76 356 497 -454 -783 -13 735 258 -294 -304 -197 67 59 -37 400
$$ packed form
6364i03Q22P86n22j60k95L84m19M89K87l7q39p9M67N26p8q71R6K74J82k01J08
6385A7KQ1o31O54O37n61m94l34P93M10l65p74P2P08j46j95L43j97m36j44N22N05
6407D67j77n57q3O62J48n11m86L61M1j49K56M22l17n68K78M13J61m43m37N38M30
6428D49l15k41o4J96J21m64K25P34r67O6K73M93m09l07L49J26k16n86J36N25J58
6449B82o28K1K83L04n66l43Q33nm45o9J69J82l89K53o1M00J14n84N87K86n16l15
6471b07J56N51m84p97M99P82n05m39j16O27j20M67n29Q5N16p03K81L95m13n80
6491e34O5N17O92j062J1J40O92p9k15k50k08j2P9K59N45m71r40J078R0p8l65l31
6513c77L97J94q2j99J72q7j22K8M32J41r51l29P70P48m77n52j0J07K64qr6M37
$$ plain form
6535 400 -144 -353 -61 764 397 -651 -664 65 116 183 -47 -392 -232 243 326 698 47 -675 -314 459 624
6556 624 -54 -733 -349 254 202 59 -16 -152 -367 31 510 347 -28 -702 -218 456 642 -133 -455 35 351
6577 351 389 183 261 -301 -422 -108 370 559 -494 -513 -67 663 231 -57 -62 -129 52 395 300 8 -466 -513
6599 -513 148 805 274 -116 -359 213 546 186 -267 -109 -203 -221 132 380 -53 -452 -353 307 500 91 -649
6620 -649 -503 272 124 22 -352 125 -445 -314 220 722 -146 -580 -83 416 170 -65 -579 -149 100 164
6640 164 215 -7 -303 -284 -22 259 225 -358 -624 -92 503 -96 32 -152 -90 -208 -183 63 107 -15 -838 14
6662 14 181 140 -792 -168 393 127 268 -87 62 -93 20 110 276 0 -540 -158 538 306 -79 -6 78 328
6684 328 -357 -277 125 142 -303 -419 -144 1 71 -369 -13 513 367 -696 -55 174 -116 -186 -343 -55 -63 -128
$$ packed form
6535D00n44k09K92Q25l67j048j3P29N1O7k30l45J60M75Q3L72o51p22L61P73J65
6556F24o78o79L84O03n2j43p5j36k15L98M79j63l75o74M84O74J86p75l22M90L16
6577C51L8k06P8n62j21L14M78J89j053j9M46P30m32k88no7J81L43r5k92m74m7
6599e13O61O57n31l90k43N72L33l60m53J58r4j8L53K48m33l99R9O60J93m09p40
6620f49J46P75j48j02l74M77n70J31N34N02q68m34M97M99k46k35n14M30K49O4
6640A64N1k22k96J9K62K81l4n83k66N32N95n99J28j84O2j18K5K46M4j22q23Q52
6662A4J67m1r32O24N61k66J41l55J49j55J13R0J66k76n40L82O96k32l85P3Q4K50
6684C28o85Q0M02J7m45j16K75J45P0m40L56N26j46j063O41K29k90p0j57K88qo5
$$ plain form
6706 -128 -205 481 152 166 -61 -56 302 -290 9 343 -72 -433 -62 -47 336 416 -128 -131 262 52 -422 32 -201
6729 -201 88 -192 -176 131 436 -390 -33 188 215 -13 9 -165 -455 -150 -97 103 103 -118 -411 259 310 -222
6751 -222 -69 274 -22 -248 -110 -134 -118 -275 -117 285 248 110 -146 -266 339 334 -163 -441 32 -146 328 361
6773 361 329 -256 -308 32 339 304 -310 -561 -492 -103 -24 -384 -169 72 -89 319 545 318 -461 -53 78 -33
6795 -33 -83 -487 -398 203 276 519 132 -328 -262 204 460 464 -91 -614 -527 58 531 318 -100 -283 -100 27 226
6818 226 159 -288 -340 -199 81 390 -184 -13 -142 323 388 432 -6 -312 -383 249 362 6 -491 -517 60 440
6840 440 382 -357 -231 183 282 537 311 -256 -332 -235 345 223 343 -136 107 205 351 257 -271 -433 -174 -91
6862 -91 192 96 -37 -530 258 228 -219 118 -337 -425 37 169 186 -325 -580 -558 232 399 365 -518 -74 159
$$ packed form
6706a28p7O86l29J4k27NL58n92K99L34m15l61L71J5L83Q0n44lL93k10m74M54k33
6729b01K89k80J6L07L05q26L57K21K7k28K2j74k90L05N3K00%k21k93O70N1n32
6751b22J53L43k96k26J38k4J6j57J58M02l7j38k56j20O05nm97k78M73j78M74L3
6773C61l2n85n2L40L07l5o14k51O9L89P9l60K15K41j61M08K26k27p79M08J31j11
6795c3n0m04Q9O01P3K43l87m60O6M66K56Mn55n23Q7N85M73k13m18j83J83J27J99
6818B26o7m47n2J41K80L09n74J71j29M65O5M4m38l06p1O32J13l56m97k6N77L80
6840D40n8p39J26M14R9K55k26n67p6R7N80j22J20m79K43R8J46r4n28j62K59Q3
6862i1K83r6j33m93P88l0m47L37m55q8M62J32J7n11k55K2P90J67l4q83M44K33
$$ plain form
6884 159 435 587 -18 -325 -629 115 201 14 -63 -153 136 393 579 -32 -286 -185 -85 39 153 -81 -410
6905 -410 -692 -2 662 165 -234 -457 -127 397 273 -398 -107 -202 -169 293 475 -8 -505 188 95 376 183
6926 183 -197 -336 -296 -67 -53 -63 -392 17 248 368 289 -37 -153 173 159 11 -420 -264 -221 -162 479 60
6948 60 -141 287 -80 126 -50 172 -21 51 -171 160 -155 13 25 6 -59 -315 75 130 -335 -207 -231 84
6970 84 212 -110 -105 -94 20 101 4 84 526 -134 58 167 -76 -41 -42 -125 244 12 70 319 194 -76 -171 60
6994 60 -56 -80 -76 -100 141 -229 96 105 36 -11 -281 -197 249 -94 -318 -293 198 177 128 -9 -25 -162 311 -38 134
7019 134 52 -400 -197 555 479 -253 -582 -367 165 213 168 26 217 59 78 298 73 -92 -459 -3 328 328
7041 328 -260 -95 208 429 146 -112 269 -328 -379 -18 438 343 -593 -363 504 610 279 -407 -4 56 -21
$$ packed form
6884A59K76J52o05l07l04P44Q6j87p7r0K89K57J86o11k54J01J00J24J14k34l29
6905d10k82O90O64m97l99k23L30N24j24o71K91r5L3M62J82m83m97O93r3K81j93
6926A83l80j39M0K29J4j0l29M09K31J20p9l26j16L26j4j48m31J56M3N9O41m19
6948F0k01M28l67K06j76K22j93P2k22L31l15J68J2j9o5k56L90N5m65J28k4L15
6970H4J28l22NJ1J14Q1r7Q0M42o60J92J09k43L5jq3L69k32N8K49j25k70r5K31
6994F0j16k4Mk4K41l70L25Ro9m7k70Q4M46l43k24K5M91k1m9j37j6j37M73l49J72
7019A34q2m52K03P52p6p32l29K15N32M8m5j42J91j58J9K20k25j65l67M56L31%
7041C28n88J65L03K21k83k58L81n97n1L61M56r5r36K30Q67J06l31o86M03O0p7
$$ plain form
7062 -21 228 203 -179 -255 -296 267 256 161 -378 -480 252 155 -266 -379 -233 -306 163 413 161 15 -711 -80 357
7085 357 442 -334 -547 -151 336 441 -471 -279 26 -248 -190 254 295 -478 -673 22 617 340 -423 -173 -371
7106 -371 320 276 161 -203 -230 -251 128 387 14 -436 -610 336 411 27 -392 113 66 304 33 282 73 11
7128 11 -140 433 757 -43 -626 37 379 368 68 35 -99 -164 132 465 148 -86 -310 -34 546 289 -338
7149 -338 -371 -103 222 283 -36 7 -233 -54 315 236 393 -88 -228 -99 548 0 -177 -558 -257 -93 349
7170 349 188 -375 -310 -140 -348 459 250 -225 -354 228 -34 -280 -98 298 26 -119 -34 69 -142 -533 -42
7191 -42 129 173 -44 -443 -172 207 199 109 -225 309 192 -246 209 110 29 -424 -23 278 257 -72 -148 -15 109
7214 109 -191 56 -197 -194 9 -117 291 246 -256 -252 265 456 23 -209 -150 412 5 98 -5 98 -28 -123 -353
$$ packed form
7062b1K49k5l82p6m1N63j1r5n39j02P32r7m21j13J46p3M69K50k52j46p26O31M37
7085C57Q5p76k13L96M87J05r12J92L05k74N8M44M1p73j95O95N95k77p63K50j98
7106c71O91m4j15l64k7k1L79K59l73m50j74R46P5l84m19N05m7K38k71K49k09o2
7128A1j51N73L24q00n83O63L42j1l00l3j34o5K96L33l17k34k24K76N80k57o27
7149c38l3K68L25O1l19M3k40J79L69p9J57m81j40J29O47n48j77l81L01J64M42
7170C49j61n63O5J70k08Q07k09m75j29N82k62k46J82L96k72j45Q5J03k11l91M91
7191d2J71M4k17l99K71L79qr0l34N34j17m38M55r9q1m53M01L01k1l29p6J33J24
7214A09l00K47k53LK03j26M08m5n02MN17J91m33k32N9N62m07R3j03J03j26r5k30
$$ plain form
7237 -353 455 249 129 -312 127 330 -320 -144 334 83 -373 -357 155 157 236 -383 80 -58 17 -374 16 68
7259 68 -47 -306 -277 239 -55 3 -191 433 205 -145 82 69 -48 -71 -60 256 -307 -150 -132 219 237 -117 -224
7282 -224 -204 232 -147 268 -176 100 -340 57 444 -112 229 -294 -118 276 39 -46 -428 -163 93 104 -55
7303 -55 96 -128 -89 87 207 -2 -309 -355 82 294 102 -108 -142 303 142 -152 330 24 -127 -209 202 337
7325 337 -92 -350 -307 -147 227 6 -363 34 -262 -88 142 262 14 -595 -61 392 245 199 -383 -92 254
7346 254 -93 -210 -159 -439 1 40 44 355 -206 -290 165 371 480 -111 -164 -75 367 -48 34 57 -142 -203 19
7369 19 223 218 -388 -199 -33 286 190 -288 -369 -21 -5 348 211 -112 -320 -353 -21 100 63 -370 -577 61 86
7392 86 -61 -122 -108 -103 -118 252 322 92 -314 -459 362 546 -150 -378 -118 133 -145 380 203 -153 -97 0 238
$$ packed form
7237c53Q08k06j20m41M39K03o50J76M78k51m56J6N12KP9o19M63j38P5l91L90N2
7259F8j15k59K9N16k94N8j94O24k28l50K27j3j17k3J1L16n63J57J8L51J8l54j07
7282b24K0M36l79M15m44K76m40L97L87n56L41n23J76L94k37q5l82K65K56J1j59
7303e5J51k24L9J76J20k09l07m6M37K12j92k10l4M45j61k94M82l06j51q2M11J35
7325C37m29k58M3J60L74k21l69L97k96J74K30J20k48o09N34M53j47m6n82K91L46
7346B54l47j17N1k80M40L9ML11n61q4M55K06J09n91n3Q9M42m15Q2K3j99o1K22
7369A9K04no06J89J66L19r6m78q1L48J6L53j37l23k08l3L32J21l7m33k07O38K5
7392H6j47o1J4Nj5L70P0k30m06j45Q21J84o96k28K60K51k78N25j77l56N6R7K38
$$ plain form
7415 238 108 -82 -504 -54 345 375 10 -253 48 215 199 -10 -103 -260 -400 -113 297 135 -357 -438 18
7436 18 174 283 -76 29 183 -63 34 187 -36 -551 -177 -99 453 43 -419 -61 206 120 123 68 -245 54
7458 54 -103 -160 174 386 -72 -247 24 387 56 25 229 -84 26 -246 72 -193 5 -210 178 199 -6
7479 -6 -383 -188 219 -117 -138 -136 435 246 109 -155 86 -17 -225 -30 252 161 -90 -281 -6 -42 62 -48
7501 -48 188 -1 -130 -115 107 -51 -41 -326 24 5 -155 -233 234 172 -381 -99 76 214 -182 -305 -64 -37
7523 -37 124 20 92 27 92 7 236 161 529 115 -105 332 199 39 -115 -80 149 138 11 213 66 137 82
7546 82 188 115 203 -109 -160 407 186 -179 148 19 -181 435 423 117 21 -202 -20 -36 -102 154 -195 -178 8
7569 8 111 428 -66 44 -326 -238 63 -172 -152 -81 -9 93 183 -182 -292 -308 344 135 58 -424 -391 -199 9
$$ packed form
7415B38j30j90m22M50L99L0l65k63L01J67j6k09r3j57j40K87M10j62m92q1M56
7436A8J56J09l59J05J54k46R7J53k23n15L74P8N52m10m62L58K67q6Ln5l13K99
7458E4j57n7L34K12m58j75K71L63l31l1K04l13J10k72L18k65J98k15L88K1k05
7479fl77J95M07l36k1KN71j89j37k64K41j03k08J95K82r1k51j91K75l6J04j10
7501d8K36j89j29J5K22j58J0k85L50j9j60p8M67o2n53K82J75J38l96j23K41K7
7523c7J61j04P2o5O5q5K29p5L68m14k20M37j33j60j54L5K29j1j27K02j47P1n5
7546H2J06p3Q8l12n1N67k21l65L27j29k00O16j2l06r6k23J82j6o6K56l49J7J86
7569HJ03L17m94J10l70Q8L01k35K0P1P2J02R0l65j10j6O52k09p7m82L3J92K08
$$ plain form
7592 9 355 -183 -294 68 141 235 -70 -300 -243 -102 157 92 254 142 -149 -227 439 392 -100 -298 -256 8 428
7615 428 24 -163 -438 -184 242 -74 -38 -28 -528 -41 336 -160 7 -176 -218 185 124 83 -20 28 -397 402
7637 402 517 83 -357 132 117 183 161 -264 5 -275 208 248 180 -341 -219 231 347 63 -31 -367 -253 36
7659 36 26 -46 -153 104 -113 -137 -99 -283 -497 -109 73 139 112 40 -60 135 105 503 -9 -8 -42 -109 10 321
7683 321 146 -308 -306 78 167 100 8 -155 72 28 243 -366 -205 -415 -3 117 -98 -370 -62 37 -41 -88 227
7706 227 459 -230 -28 -60 -25 -379 -102 -193 191 251 70 -134 69 83 -3 160 118 -17 -46 -86 71 -68 193
7729 193 241 -97 -24 46 6 -72 133 -40 164 209 172 232 -54 -337 2 250 -233 -64 -136 -223 -177 -166 -10 -284
7753 -284 -238 -70 375 -10 13 112 -22 439 -65 61 -185 112 -195 56 259 -47 -13 18 -72 60 1 275
$$ packed form
7592IL46n38j11L62P3R4l05k30N7J41K59o5J62j12k91p8O66m7m92j98M2K64M20
7615D28m04j87k75K54M26l16L6J0n00M87L77m96J67j83m2M03o1m1j03M8m25P99
7637D02J15m34m40M89j5O6k2m25K69k80M83M0o8n21J22M50J16k84r4l36J14K89
7659C6j0p2j07K57k17k4L8j84k14L88J82O6k7p2j00J95l0L98n12Jl4o7J19L11
7683C21j75m54KL84Q9o7r2j63K27m4K15o09J61k10M12J20k15k72L08R9p8m7L15
7706B27K32o89K02l2L5l54K77r1L84O0j81k04K03J4q6J63m2j35k9m0J57j39K61
7729A93M8l38P3P0m0p8K05j73K04M5l7O0k86k83L39K48m83J69p2q7M6J1J56k74
7753b84M6J68M45l85K3R9j34M61n04J26k46K97l07K51K03l06L4L1r0J32n9K74
$$ plain form
7775 275 6 126 -166 -213 219 348 -242 64 77 37 361 -37 201 -137 -115 -34 18 398 -28 -230 -183 279
7797 279 54 -48 62 65 148 264 -53 106 1 -33 -102 29 96 -112 -17 -194 -6 -5 16 -105 42 -125 -107 -172
7821 -172 -143 16 -330 -77 262 267 -301 -207 275 -175 222 -121 -410 -185 -79 245 616 32 100 -188 69 38
7843 38 -31 31 -220 61 147 275 232 -52 -20 69 95 326 -81 -189 -168 -278 77 246 -86 -122 -109 -219 137 -26
7867 -26 -63 -362 -252 142 -86 -90 -212 -353 103 24 165 -223 -194 -103 -207 390 402 -37 -180 68 447 127 -397
7890 -397 65 350 282 111 202 225 68 -103 -54 -30 -88 -110 -232 -23 398 113 -100 15 19 -6 21 245 -21 -391
7914 -391 100 251 457 98 -219 116 194 106 -286 165 -496 237 -110 -33 116 90 -352 -119 409 324 196 -12
7936 -12 -135 -107 254 15 -488 -165 -93 30 263 141 -17 -503 172 327 153 -45 -235 302 0 74 246
$$ packed form
7775B75k69J20k92m7M32J29n90L06J3m0L24l98K38l38K2Q1N2L80m26k02M7M62
7797B79k25j02J10LQ3J16l17J59j05l4o9J31O7k08R5j77J88JK1j21J47j67J8o5
7821a72K9J59l46K53L39Nn68R4M82m50L97l43k89K25J06L24L71n84O8k88K57l1
7843C8o9O2k51K81Q6J28m3k84L2Q9K6K31m07j08K1j10L55J69l32l6J3j10L56j63
7867b6l7k99J10L94k28mj22j41M56p9J41l88K9R1j04N97J2m39j43K48L79l20n24
7890c97M62K85o8j71R1K3j57j71M9K4n8k2j22K09M21k85k13J15Mk5K7K24k66l70
7914c91M91J51K06l59l17L35P8q8l92M51o61P33l47P7J49k6m42K33N28q5j28k08
7936a2j23K8L61k39n03L23P2J23K33j22j58m86O75J55j74j98j90N37l02P4J72
$$ plain form
7957 246 -175 -98 18 -29 128 114 -311 -215 -127 170 -276 35 336 42 268 66 -75 -105 -280 -190 69 274
7979 274 51 29 -267 67 277 -77 -179 202 -2 -15 69 -62 11 15 -95 299 154 -187 -215 -97 169 192 -202
8002 -202 -23 -1 -89 -84 0 381 -159 -181 75 -117 128 -54 90 -5 -134 -286 -211 36 94 -525 -69 110 -39
8025 -39 -56 -254 -49 -99 4 3 -228 275 -167 1 65 21 83 -437 17 100 -7 -350 124 259 -116 -172 131
8048 131 268 115 -42 -63 105 393 -20 -277 28 -99 -134 117 -43 44 -104 48 44 187 -17 -114 212 360
8070 360 194 -42 327 234 -83 180 -144 -119 -95 -264 -178 80 212 -39 26 71 -185 -30 219 100 27 29 30 211
8094 211 95 126 -234 -42 248 53 -139 -184 -49 202 -105 -41 35 68 -354 -11 133 99 92 -376 -27 393 -20
8117 -20 -1 -124 -169 -145 182 299 -67 -271 -179 345 584 63 -403 33 108 266 31 -90 21 3 -303 228
$$ packed form
7957B46m21P7J16m7J57j4m25R6Q8K97m46L11L01k94K26k02j41l0j75R0K59K05
7979B74k23k2k96L34K10l54j02L81k04j3Q4j31P3Mj10L94j45l41k8J18K66K3l94
8002b02J79K2q8NQ4L81n40k2K56j92K45j82J44r5j29j52P5K47N8o19M56J79j49
8025c9j7j98K05n0J03jk31N03m42J68O4m4O2n20M54Q3j07l43M74J35l75n6L03
8048A31J37j53j57k1J68K88m13k57L05j27l5K51j60Q7j48J52mJ43k04r7L26J48
8070C60j66k36L69r3l17K63l24K5K4j69Q6K58J32k51O5M5k56J55K49j19p3KJJ81
8094B11j16L1l60J92K90j95j92m5J35K51l07O4P6L3m22L43J44l4pm68L49M20m13
8117b0J9j23m5K4L27J17l66k04R2N24K39n21m66M36P5J58k35j21J11j8l06N31
$$ plain form
8139 228 348 180 -161 -53 60 30 39 31 -346 -133 375 53 24 104 -76 111 72 298 -162 -242 -5 -74 44
8162 44 266 -12 69 -56 105 211 126 -113 14 -54 118 224 24 -264 41 39 138 -6 19 -208 -426 -49 243
8185 243 -335 -89 72 238 501 280
$$ packed form
8139B28J20j68l41J08J13l0Rql77K13N08l22k9Q0j80J87l9K26m60q0K37o9J18
8162D4K22k78Q1j25J61J06q5k39J27o8J72J06k00k88L05kR9j44K5k27k18L77K92
8185B43n78K46J61J66K63k21
8191B80
$$ Imaginary data points
##PAGE= N=2
##DATA TABLE= (X++(I..I)), XYDATA
$$ plain form
0 0 0 0 0 -8 8 -8 8 -16 16 -18 24 -32 40 -49 60 -73 89 -105 123 -147 172 -197 228 -266 305 -348 396 -450
28 -450 513 -576 649 -730 816 -910 1019 -1134 1260 -1399 1553 -1721 1906 -2110 2336 -2588
44 -2588 2868 -3181 3536 -3941 4406 -4950 5592 -6367 7322 -8533 10126 -12328 15580 -20877
58 -20877 30993 -57247 264391 540468 -108751 -191758 162712 290632 776 -62849 84370
69 84370 118467 -19312 32151 212629 196271 -66454 -102594 152889 230634 -21620 -103313
80 -103313 70015 79256 -96235 -43724 151001 114282 -97847 -123471 72113 214666 93476
91 93476 -129321 -119585 92860 115734 -72430 -108482 27746 44014 -13328 60424 139065 48230
103 48230 -67200 -31215 77989 81654 -37278 -93564 15916 89918 -6983 -40962 95610
$$ packed form
0@%%%qJ6j6J6k4L2l4M2n6P2q9J09j33J62j94K28k70L19l69M25m94N71o53P44q46
28d50R63j089J225j379J546j726J929k153K394k659K952l274L627m016M446m924
44b588N456o049O717p477Q347r356J0542j1959J3689j5855J8659k2454K7908l6457
58b0877N1870q8240L21638K76077o49219q3007L54470J27920k89856o3625J47219
69H4370L4097j37779N1463J80478j6358k62725l6140K55483P7745k52254q1693
80a03313J73328R241j75491N2511J94725l6719k12129k5624J95584J42553j21190
91I3476k22797R736K12445K2874j88164l6052J36228J6268n7342P3752P8641r0835
103D8230j15430L5985J09204L665j18932n6286J09480P4002r6901l3979J36572
$$ plain form
114 95610 104615 -71735 -78298 109054 121290 -66793 -136340 -26074 70524 51640 -41353 -91145
126 -91145 -22707 56815 38432 7580 12133 -33029 -75454 -2171 60843 -20889 -106196 -54744
138 -54744 48198 77351 13395 -55350 -2836 101079 48359 -75598 -14009 100840 -247
149 -247 -121900 7316 160856 75658 -55989 -10516 90137 75509 -2799 -9736 56350 60762
161 60762 -16789 -5938 92238 52237 -82208 -26917 137466 102178 -37310 -4404 97188
172 97188 53052 -42317 -27265 44664 56283 -8970 -50330 23773 107763 43457 -48862 11429
184 11429 90392 22634 -44664 8326 41866 -11281 -31886 13308 44253 23323 -19837 -15722
196 -15722 49832 54275 -36075 -41878 57973 36180 -98591 -82720 51808 54014 -45153 -50862
$$ packed form
114I5610R005j76350o563J87352J2236j88083o9547J10266R6598j8884r2993m9792
126i1145O8438P9522j8383l0852M553m5162m2425P3283O3014q1732q5307N1452
138e4744J02942K9153o3956o8745N2514J03915n2720j23957O1589J14849j01087
149b47j21653J29216J53540q5198j31647M5473J00653j4628p8308o937O6086M412
161F0762p7551J0851R8176m0001j34445N5291J64383l5288j39488L2906J01592
172I7188m4136r5369J5052P1929J1619o5253m1360P4103Q3990o4306r2319O0291
184A1429P8963o7758o7298N2990L3540n3147k0605M5194L0945k0930m3160M115
196a5722O5554M443r0350n803R9851k1793j34771J5871J34528K206r9167n709
$$ plain form
208 -50862 15888 35981 5584 -25708 -30776 -17276 -31602 -45232 3518 27518 -55711 -93732
220 -93732 12883 74067 -8978 -60259 -9309 17093 -8942 -22937 -23279 -18978 -16558 -40531 -39002
233 -39002 35927 61325 -33567 -72102 23845 69634 -7062 -63621 -46460 -19141 128 7182
245 7182 -11233 -23824 -21307 -19009 16790 54572 -8998 -95189 -37915 56282 -727 -91065 -48688
258 -48688 18485 -2749 -24041 10929 32097 -61 -49730 -51684 17928 50900 -33406 -95589
270 -95589 -19184 54754 19016 -13257 3106 -12966 -24708 31643 61755 211 -63081 -51323
282 -51323 11890 61067 24636 -58959 -48078 43913 56511 2510 6497 17191 -39930 -54859
294 -54859 18228 47292 -11891 -59073 -38464 25808 72088 31837 -48706 -49590 3378 14215
$$ packed form
208e0862O6750K0093l0397l1292n068J3500j4326j3630M8750K4000q3229l8021
220i3732J06615O1184q3045n1281N0950K6402k6035j3995l42M301K420k3973J529
233c9002P4929K5398r4892l8535R5947M5789p6696n6559J7161K7319J9269P054
245G182j8415j2591K517K298L5799L7782o3570q6191N7274R4197n7009r0338M2377
258d8688O7173k1234k1292L4970K1168l2158m9669j954O9612L2972q4306o2183
270i5589P6405P3938l5738l2273J6363j6072j1742N6351L0112o1544o3292J1758
282e1323O3213M9177l6431q3595J0881R1991J2598n4001L987J0694n7121j4929
294e4859P3087K9064n9183m7182K0609O4272M6280m0251q0543q84N2968J0837
$$ plain form
306 14215 12572 20983 -27607 -80529 -17575 73616 45453 -35117 -45926 -3991 39523 50313
318 50313 2177 -47421 -27189 7144 4524 16388 30950 -12765 -42074 16159 63663 30166
330 30166 -14357 -28701 -25359 10040 42095 10987 -29120 -17044 2238 13151 43218 32263
342 32263 -39577 -49277 28501 56748 2263 -37101 -32565 -8958 26344 32852 -1546 -14576 -41
355 -41 -5054 2964 38199 13244 -53042 -37543 34214 41010 -661 -19546 -23658 -9868 30763
368 30763 38247 -3655 -27661 -18583 -2125 29706 35765 -28803 -65614 -611 52164 13552 -22467
381 -22467 -10754 -6092 -4495 14094 11413 -12794 -19745 -19130 -9680 24751 26503 -28960 -43891 4871
395 4871 21418 987 5198 388 -31796 -18716 27448 18181 -23689 -29120 -11646 9183 28924
$$ packed form
306A4215j643Q411m8590n2922O2954R1191k8163q0570j0809M1935M3514J0790
318E0313m8136m9598K0232L4333k620J1864J4562m3715k9309N8233M7504l3497
330C0166m4523j4344L342L5399L2055l1108m0107J2076J9282J0913L0067j0955
342C2263p1840r700P7778K8247n4485l9364M536K3607L5302O508l4398j3030J4535
355d1n013Q018L5235k4955o6286J5499P1757O796m1671j8885m112J3790M0631
368C0763P484m1902k4006R078J6458L1831O059o4568l6811O5003N2775l8612l6019
381b2467J1713M662J597J8589k681k4207o951O15R450L4431J752n5463j4931M8762
395D871J6547k0431M211m810l2184J3080M6164r267m1870n431J7474K0829J9741
$$ plain form
408 28924 11098 -25257 -15396 13028 2373 -3558 13381 -4845 -32303 -4135 25020 2046
420 2046 -13829 -1478 -4065 -2888 20549 15641 -13452 -12158 27 -4892 2616 7913 -16866 -18962
434 -18962 18324 23132 -4405 -2502 5010 -11590 -6325 14154 -3190 -21819 1118 15045 200
447 200 -1916 196 -6946 7978 22292 -3613 -18631 8921 13634 -12506 -8969 4893 -5546
460 -5546 -40 22205 10195 -8399 6231 12205 -3242 -95 4429 -9244 -1522 17618 3631
473 3631 -6629 17078 14561 -13589 -1104 25313 8422 -11518 -2639 1895 3985 14516 857
486 857 -19401 2556 26501 9547 -632 7711 -6486 -14421 14428 18981 -14250 -16926 7511
499 7511 11435 10560 13415 -7030 -20120 3287 16026 2579 2907 2208 -17162 -5470 30495 20789
$$ packed form
408B8924j7826l6355R861K8424j0655n931J6939j8226k7458K8168K9155k2974
420B046j5875J2351k587J177K3437m908k9093J294J2185m919P508N297k4779k096
434a8962L7286M808k7537J903P512j6600N265K0479j7344j8629K2937J3927j4845
447B00k116K112p142J4924J4314k5905j5018K7552M713k6140L537J3862j0439
460e546N506K2245j2010j8594J4630N974j5447L147M524j3673P722J9140j3987
473C631j0260K3707k517k8150J2485K6417j6891j9940Q879M534K090J0531j3659
486H57k0258K1957K3945j6954j0179Q343j4197p935K8849M553l3231k676K4437
499G511L924q75K855k0445j3090K3407J2739j3447L28o99j9370J1692L5965r706
$$ plain form
513 20789 -16606 -16862 23 9174 24812 20388 -18912 -28585 8164 26014 14772 6168 -12278
526 -12278 -25759 10515 46676 15846 -29225 -25742 680 23175 34270 7166 -29861 -14497
538 -14497 21185 18579 6513 4524 -19324 -32339 8634 40770 12668 -19958 -22501 -9130 20182
551 20182 38450 3497 -39356 -26113 6505 14858 16843 334 -39164 -32068 30249 49278 1159
564 1159 -32242 -23986 -3097 16652 14009 -14930 -23147 -4963 -607 8889 36234 16550 -41949
577 -41949 -32338 33746 42166 -5498 -28691 -21258 -5640 19059 28555 6302 -14766 -15024 4672
590 4672 40383 42398 -22024 -60813 -3904 47616 13247 -23941 -10101 2976 3530 20350 28651
603 28651 4206 -21228 -25387 -4459 28594 21008 -31959 -42840 9216 32320 9073 3602 4790
$$ packed form
513B0789l7395k56J6885R151J5638m424l9300r673L6749J7850j1242q604j8446
526a2278j3481L6274L6161l0830m5071L483K6422K2495J1095k7104l7027J5364
538a4497L5682k606j2066j989k3848j3015M0973L2136k8102l2626k543J3371K9312
551B0182J8268l4953m2853J3243L2618Q353J985j6509l9498P096O2317J9029m8119
564A159l3401Q256K0889J9749k643k8939q217J8184M356R496K7345j9684n8499
577d1949R611O6084Q420m7664k3193P433J5618K4699R496k2253k1068k58J9696
590D672L5711K015o4422l8789N6909N1520l4369l7188J3840J3077N54J6820Q301
603B8651k4445k5434m159K0928L3053p586n2967j0881N2056K3104k3247n471J188
$$ plain form
616 4790 -18400 -15396 27141 33771 -12941 -48578 -32803 19830 52181 14353 -40469 -19115 36150
629 36150 28439 -4893 -946 -1598 -24094 -9341 27808 20567 -14942 -23757 -5139 20853 31139
642 31139 6147 -18351 -6344 2409 -8604 3298 17134 -20974 -52682 -8137 42437 24228
654 24228 -20084 -32091 -9326 22931 18946 -28094 -44925 -9121 6141 -13346 -5975 9973
666 9973 -14560 -29645 2411 21815 -1953 -23732 -17775 -2082 1976 -15370 -23938 766 9726
679 9726 -25753 -25318 32707 33078 -36556 -45216 18942 31077 -20734 -40356 -11298 9293 -1820
692 -1820 -18870 -8409 14663 2642 -23309 -1621 25921 -11348 -45667 -4605 26479 -16633
704 -16633 -41507 2036 30469 254 -27733 -8710 28003 23478 -24382 -37401 13240 30330
$$ packed form
616D790k3190L004M2537O630m6712l5637J5775N2633L2351l7828n4822K1354N5265
629C6150p711l3332L947o52k2496J4753L7149p241l5509q815J8618K5992J0286
642C1139k4992k4498J2007Q753j1013J1902J3836l8108l1708M4545N0574j8209
654B4228m4312j2007K2765L2257l985m7040j6831L5804J5262j9487P371J5948
666I973k4533j5085L2056J9404k3768k1779N957J5693M058j7346q568K4704Q960
679I726l5479M35N8025L71o9634q660O4158J2135n1811j9622K9058K0591j1113
692a820j7050J0461K3072j2021k5951K1688K7542l7269l4319M1062L1084m3112
704a6633k4874M3543K8433l0215k7987J9023L6713m525m7860j3019N0641J7090
$$ plain form
716 30330 -22440 -37211 15398 24793 -20045 -17113 25435 21146 -13107 -11300 13949 14045 -16620
729 -16620 -31757 -2616 20465 -13950 -36629 18482 55502 -5021 -48780 5011 43866 -3525
741 -3525 -45834 -22214 9331 7764 -5760 -4751 10657 11561 -8269 -3252 27231 13877 -31540
754 -31540 -19778 27799 19210 -19842 -14686 10622 7583 -1196 8709 25506 26070 -4821 -31804
767 -31804 -144 42822 4664 -59337 -32111 36824 35501 -7757 -13538 3746 4788 569 3700
780 3700 4392 -14909 -44670 -33577 23256 34208 -26218 -43588 17179 37692 -11611 -24434 11506
793 11506 3389 -35760 -24869 23362 30003 -20462 -55094 -10405 58570 43750 -24669 -28577 18148
806 18148 15244 -12412 1682 8069 -29250 -34223 22780 54342 13266 -36275 -22022 34189 42957
$$ packed form
716C0330n2770j4771N2609R395m4838K932M2548m289l4253J807K5249R6l0665
729a6620j5137K9141K3081l4415k2679N5111L7020o0523m3759N3791L8855m7391
741c525m2309K3620L1545j567j3524J009J5408R04j9830N017L0483j3354m5417
754c1540J1762M7577q589l9052N156K5308l039q779R905J6797N64l0891k6983
767c1804L1660M2966l8158o4001K7226O8935j323m3258n781J7284J042m219L131
780C700O92j9301k9761J1093N6833J0952o0426j7370O0767K0513m9303j2823L5940
793A1506q117l9149J0891M8231O641n0465l4632M4689O8975j4820o8419l908M6725
806A8148k904k7656J4094O387l7319m973N7003L1562m1076m9541J4253N6211Q768
$$ plain form
819 42957 -16959 -46587 -3172 14622 -26495 -20704 37492 26904 -40732 -36085 32620 45977
831 45977 -10075 -45694 -21278 18064 17216 -9792 -11551 -730 -16428 -13710 39266 50756 -19497
844 -19497 -50128 16320 58816 10179 -39744 -26350 10348 20923 7777 4022 21676 21528 -9297
857 -9297 -9115 31539 27095 -29504 -40345 9556 33524 12209 -6937 -9786 -5462 4951 14123
870 14123 15756 7809 -19631 -34136 7606 45770 516 -57690 -23123 41618 31478 -13641
882 -13641 -14845 9927 13298 -149 -2649 10335 8190 -24359 -31968 17166 44648 2353 -24239
895 -24239 10156 27835 -126 -7864 8933 -1721 -23396 -9375 23458 25587 -14045 -44683
907 -44683 -9288 46563 25773 -37954 -29329 23533 15262 -26822 -18083 7643 -7819 -27504 -8630
$$ packed form
819D2957n9916k9628M3415J7794m1117N791N8196j0588o7636M647O8705J3357
831D5977n6052l5619K4416L9342q48k7008j759J0821j5698K718N2976J1490p0253
844a9497l0631O6448M2496m8637m9923J3394L6698J0575j3146l755J7654j48l0825
857i297J82M0654m444n6599j0841M9901K3968k1315j9146k849M324J0413R172
870A4123J633p947k7440j4505M1742L8164m5254n8206L4567O4741j0140m5119
882a3641j204K4772L371j3447k500J2984k145l2549p609M9134K7482m2295k6592
895b4239L4395J7679k7961p738J6797j0654k1675J4021L2833K129l9632l0638
907d4683L5395N5851k0790o3727Q625N2862q271m2084Q739K5726j5462j9685J8874
$$ plain form
920 -8630 20729 15028 -15484 -22251 12891 28894 -10181 -33627 633 12675 -23356 -19308 30029
933 30029 26911 -21946 -19891 28260 35462 -7032 -33407 -8424 26130 12278 -24443 -13314 22927
946 22927 9774 -20299 1966 29508 369 -24996 2074 22067 -2358 -24213 -13723 3989
958 3989 2102 -14511 -11419 18577 24152 -10032 -16855 18046 16903 -25295 -27022 9764 13313 -10751
972 -10751 -9474 10466 19475 10899 -2960 545 18007 10023 -15561 -9373 13436 2052 -14536
985 -14536 7128 23747 3085 -9763 7986 19431 9621 -6208 -13578 -2290 9711 -6055
997 -6055 -22768 -3519 14121 -2497 -6732 18213 18429 -11848 -18989 -248 6936 -4257 -18644
1010 -18644 -18122 3090 15946 348 -5097 12946 8941 -13170 -1148 22621 731 -31966 -17030
$$ packed form
920h630K9359n701l0512o767L5142J6003l9075k3446L4260J2042l6031M048M9337
933C0029l118m8857K055M8151P202m2494k6375K4983L4554j3852l6721J1129L6241
946B2927j3153l0073K2265K7542k9139k5365K7070J9993k4425k1855J0490J7712
958C989j887j6613L092K9996N575l4184o823L4901j143m2198j727L6786L549k4064
972a0751J277J9940R009q576j3859L505J7462p984k5584O188K2809j1384j6588
985a4536K1664J6619k0662j2848J7749J1445r810j5829p370J1288J2001j5766
997f055j6713J9249J7640j6618m235K4945K16l0277p141J8741P184j1193j4387
1010a8644N22K1212J2856j5598n445J8043m005k2111J2022K3769k1890l2697J4936
$$ plain form
1023 -17030 15498 15716 -3586 -11529 680 16976 11937 -3506 2334 8375 -15017 -24762 8769
1036 8769 20409 -17904 -31983 2698 23302 8429 -4075 -3354 -3189 -5013 -6090 -2267 2087 -13755
1050 -13755 -32458 -7150 32520 16998 -23346 -15737 15105 13550 -1263 -2446 -7279 -15782 -8238
1063 -8238 7567 13457 5627 -13265 -14730 16137 33292 4476 -19502 -6138 4203 -1696 3890
1076 3890 8112 -10978 -19982 627 21036 19110 985 -19794 -14356 16297 22142 -8233 -23413
1089 -23413 -10334 -1911 3717 14274 6243 -14740 -10091 11586 16959 8061 -5367 -18580 -10912
1102 -10912 13322 15024 -4002 -8108 -1282 161 11860 24569 9085 -15306 -11034 8408 17047
1115 17047 11195 -9006 -23591 -3415 25881 17073 -6631 -6525 852 1919 11082 14397 -5773
$$ packed form
1023a7030L2528K18j9302p943J2209J6296n039j5443N840O041k3392r745L3531
1036H769J1640l8313j4079L4681K0604j4873j2504P21J65j824j077L823M354j5842
1050a3755j8703K5308L9670j5522m0344P609L0842j555j4813j183m833q503P544
1063h238J5805N890p830j8892j465L0867J7155k8816k3978J3364J0341n899N586
1076C890M222j9090r004K0609K0409j926j8125k0779N438L0653N845l0375j5180
1089b3413J3079Q423N628J0557q031k0983M649K1677N373q898j3428j3213P668
1102a0912K4234J702j9026m106O826J443J1699J2709j5484k4391M272J9442Q639
1115A7047n852k0201j4585K0176K9296q808k3704J06P377J067R163L315k0170
$$ plain form
1128 -5773 -20834 -8797 5703 9700 4441 -9250 -14781 3077 16741 6342 -1803 -2758 -13248
1141 -13248 -12236 12759 16528 -12832 -25315 -4308 14838 16917 4975 -12715 -12927 7884 14878
1154 14878 -368 -7674 -8253 -11766 -1343 15310 7033 -11522 -6016 6102 5510 6231 5084 -8519
1168 -8519 -14628 -3282 2826 2670 2724 -7711 -16815 2683 23385 8851 -13528 -11573 -892 3559
1182 3559 6079 -3732 -17706 -9518 8483 8240 1530 1903 -3023 -5876 5719 8556 -5018 -7702
1196 -7702 -2175 -5754 -3808 8641 6462 -6231 -3082 4962 4929 6851 4843 -11075 -13568 6373
1210 6373 10969 -4525 -8404 -1411 3392 8616 8156 -3568 -5783 5833 4691 -5535 -2016 1736
1224 1736 -4113 94 8475 730 -3867 7531 8229 -4002 -2451 5287 1036 -1845 458 -2782 -1473
$$ packed form
1128e773j5061J2037J4500L997n259j3691n531J7858J3664j0399q145r55j0490
1141a3248J012K4995L769k9360j2483K1007J9146K079j1942j7690k12K0811O994
1154A4878j5246p306n79l513J0423J6653q277j8555N506J2118n92P21j147j3603
1168h519o109J1346O108j56N4j0435r104J9498K0702j4534k2379J955J0681M451
1182C559K520r811j3974Q188J8001k43o710L73m926k853J1595K837j3574k684
1196g702N527l579J946J2449k179j2693L149Q044l3J922k008j5918k493J9941
1210F373M596j5494l879O993M803N224m60j1724k215J1616j142j0226L519L752
1224A736n849M207Q381p745m597J1398O98j2231J551P738m251k881K303l240J309
$$ plain form
1239 -1473 7512 4689 -3753 1896 7526 -702 -2341 3901 -506 -3946 2744 611 -6003 3133 8792
1254 8792 -3446 -6651 3750 4049 -1209 1801 -1214 -9226 -1006 8286 358 -6100 -1828 -1198 1258
1269 1258 8449 1653 -10683 -5666 4020 112 -1292 2780 -4683 -8331 4481 8626 -1463 -4753
1283 -4753 -3999 -7838 -566 11623 2613 -12301 -7074 2616 3213 4364 2014 -11285 -13188 2992
$$ packed form
1239a473Q985k823q442N649N630q228j639O242m407l440O690k133o614R136N659
1254H792j2238l205J0401K99n258L010l015q012Q220R292p928o458M272O30K456
1269A258P191o796j2336N017R686l908j404M072p463l648J2812M145j0089l290
1283d753P54l839P272J2189r010j4914N227R690N97J151k350j3299j903J6180
$$ [...]
8191d02
##END NTUPLES=NMR FID
##END=
