##TITLE=1H_TG-2274-1
 CDCl3, 8 sc, 
 26.12.2019
##JCAMPDX= 6.0         $$ Bruker NMR JCAMP-DX V2.0
##DATA TYPE= NMR FID
##DATA CLASS= NTUPLES
##ORIGIN= UXNMR, Bruker Analytische Messtechnik GmbH
##OWNER= root
$$ XWIN-NMR		Version 3.5
$$ Thu Dec 26 14:10:35 2019 Russian Standard Time (UT+4h)  she@DPX200
##.OBSERVE FREQUENCY= 200.1315
##.OBSERVE NUCLEUS= ^1H
##.DELAY= (6, 6)
##.ACQUISITION MODE= SIMULTANEOUS
##.ACQUISITION SCHEME= undefined
##.AVERAGES= 8
##.DIGITISER RES= 18
##SPECTROMETER/DATA SYSTEM= spect
##.PULSE SEQUENCE= zg30
##.SOLVENT NAME= CDCl3
##.SHIFT REFERENCE= (INTERNAL, CDCl3, 0, 15.7039)
##AUDIT TRAIL= $$ (NUMBER, WHEN, WHO, WHERE, WHAT)
$$ ##TITLE= Audit trail, XWIN-NMR		Version 3.5
$$ ##JCAMPDX= 5.01
$$ ##ORIGIN= Bruker BioSpin GmbH
$$ ##OWNER= she
$$ F:/spectra/data/she/nmr/H-F/1/audita.txt
$$ ##AUDIT TRAIL=  $$ (NUMBER, WHEN, WHO, WHERE, WHAT)
(   1,<2019-12-26 14:09:27.93 +0400>,<she>,<DPX200>,
      <created by zg, POWCHK disabled, PULCHK disabled
       configuration hash MD5:
       00 E9 B6 7A A2 85 ED C7 34 08 36 98 17 FE 4E 26
       data hash MD5: 16K
       05 10 0D 3E 4D 61 0D 32 E8 A8 04 FD E0 A8 48 07>)
$$ ##END=
$$ 
$$ hash MD5
$$ C8 AC 27 AE 9A 53 E6 22 22 3E 08 53 00 EC AA BB
##$RELAX= 
##$RELAX= 
##$RELAX= 
##$RELAX= 
##$RELAX= 
##$RELAX= 
$$ Bruker specific parameters
$$ --------------------------
##$DU= <F:/spectra>
##$EXPNO= 1
##$NAME= <H-F>
##$PROCNO= 1
##$TYPE= <nmr>
##$USER= <she>
##$AMP= (0..31)
100 100 100 100 100 100 100 100 100 100 100 100 100 100 100 100 100 100 
100 100 100 100 100 100 100 100 100 100 100 100 100 100 
##$AQSEQ= 0
##$AQ_mod= 1
##$AUNM= <au_zg>
##$AUTOPOS= <>
##$BF1= 200.13
##$BF2= 200.13
##$BF3= 200.13
##$BF4= 200.13
##$BF5= 200.13
##$BF6= 200.13
##$BF7= 200.13
##$BF8= 200.13
##$BYTORDA= 1
##$CFDGTYP= 0
##$CFRGTYP= 5
##$CHEMSTR= <none>
##$CNST= (0..31)
1 1 145 1 1 1 1 1 1 1 1 1 1 1 1 1 1 1 1 1 1 1 1 1 1 1 1 1 1 1 1 1 
##$CPDPRG= <>
##$CPDPRG1= <>
##$CPDPRG2= <>
##$CPDPRG3= <>
##$CPDPRG4= <mlev>
##$CPDPRG5= <mlev>
##$CPDPRG6= <mlev>
##$CPDPRG7= <mlev>
##$CPDPRG8= <mlev>
##$CPDPRGB= <>
##$CPDPRGT= <>
##$D= (0..31)
0 1.2 0 0 0 0 0 0 0 0.06 0 0.03 0 0 0 0 0.0002 0 0 0 0 0 0 0 0 0 0 0 0 
0 0 0 
##$DATE= 1577354967
##$DBL= (0..7)
120 120 120 120 120 120 120 120 
##$DBP= (0..7)
150 150 150 150 150 150 150 150 
##$DBP07= 0
##$DBPNAM0= <>
##$DBPNAM1= <>
##$DBPNAM2= <>
##$DBPNAM3= <>
##$DBPNAM4= <>
##$DBPNAM5= <>
##$DBPNAM6= <>
##$DBPNAM7= <>
##$DBPOAL= (0..7)
0.5 0.5 0.5 0.5 0.5 0.5 0.5 0.5 
##$DBPOFFS= (0..7)
0 0 0 0 0 0 0 0 
##$DE= 6
##$DECBNUC= <off>
##$DECIM= 24
##$DECNUC= <off>
##$DECSTAT= 4
##$DIGMOD= 1
##$DIGTYP= 9
##$DL= (0..7)
0 120 120 120 120 120 120 120 
##$DP= (0..7)
150 150 150 150 150 150 150 150 
##$DP07= 0
##$DPNAME0= <>
##$DPNAME1= <>
##$DPNAME2= <>
##$DPNAME3= <>
##$DPNAME4= <>
##$DPNAME5= <>
##$DPNAME6= <>
##$DPNAME7= <>
##$DPOAL= (0..7)
0.5 0.5 0.5 0.5 0.5 0.5 0.5 0.5 
##$DPOFFS= (0..7)
0 0 0 0 0 0 0 0 
##$DQDMODE= 0
##$DR= 18
##$DS= 0
##$DSLIST= <SSSSSSSSSSSSSSS>
$$ [...]
##$SUBNAM2= <"">
##$SUBNAM3= <"">
##$SUBNAM4= <"">
##$SUBNAM5= <"">
##$SUBNAM6= <"">
##$SUBNAM7= <"">
##$SUBNAM8= <"">
##$SUBNAM9= <"">
##$SW= 24.9337058887773
##$SWIBOX= (0..15)
0 0 2 0 0 0 0 0 0 0 0 0 0 0 0 0 
##$SW_h= 4990.01996007984
##$TD= 16384
##$TD0= 1
##$TE= 0
##$TE2= 300
##$TE3= 300
##$TEG= 300
##$TL= (0..7)
0 120 120 120 120 120 120 120 
##$TP= (0..7)
150 150 150 150 150 150 150 150 
##$TP07= 0
##$TPNAME0= <>
##$TPNAME1= <>
##$TPNAME2= <>
##$TPNAME3= <>
##$TPNAME4= <>
##$TPNAME5= <>
##$TPNAME6= <>
##$TPNAME7= <>
##$TPOAL= (0..7)
0.5 0.5 0.5 0.5 0.5 0.5 0.5 0.5 
##$TPOFFS= (0..7)
0 0 0 0 0 0 0 0 
##$TUNHIN= 0
##$TUNHOUT= 0
##$TUNXOUT= 0
##$USERA1= <user>
##$USERA2= <user>
##$USERA3= <user>
##$USERA4= <user>
##$USERA5= <user>
##$V9= 5
##$VALIST= <valist>
##$VCLIST= <CCCCCCCCCCCCCCC>
##$VD= 0
##$VDLIST= <DDDDDDDDDDDDDDD>
##$VPLIST= <PPPPPPPPPPPPPPP>
##$VTLIST= <TTTTTTTTTTTTTTT>
##$WBST= 1024
##$WBSW= 4
##$XGAIN= (0..3)
0 0 0 0 
##$XL= 0
##$YL= 0
##$YMAX_a= 261592
##$YMIN_a= -149122
##$ZGOPTNS= <>
##$ZL1= 120
##$ZL2= 120
##$ZL3= 120
##$ZL4= 120
##$ABSF1= 10
##$ABSF2= 0
##$ABSG= 5
##$ABSL= 3
##$ALPHA= 0
##$AQORDER= 0
##$ASSFAC= 0
##$ASSFACI= 0
##$ASSFACX= 0
##$ASSWID= 0
##$AUNMP= <proc_1d>
##$AZFE= 0.1
##$AZFW= 0.1
##$BCFW= 1
##$BC_mod= 2
##$BYTORDP= 1
##$COROFFS= 0
##$CY= 11.3945322036743
##$DATMOD= 1
##$DC= 2
##$DFILT= <>
##$DTYPP= 0
##$F1P= 16.9975609425685
##$F2P= -3.02152046262296
##$FCOR= 0.5
##$FTSIZE= 0
##$FT_mod= 4
##$GAMMA= 1
##$GB= 0.15
##$INTBC= 1
##$INTSCL= 1
##$ISEN= 128
##$LB= 0.24
##$LEV0= 0
##$LPBIN= 0
##$MAXI= 10000
##$MC2= 0
##$MEAN= 0
##$ME_mod= 0
##$MI= 1.114404
##$NCOEF= 0
##$NC_proc= 0
##$NLEV= 6
##$NOISF1= 3.799351
##$NOISF2= 2.8
##$NSP= 1
##$NTH_PI= 0
##$NZP= 0
##$OFFSET= 15.70392
##$PC= 1
##$PHC0= -10152.05
##$PHC1= 21.4008
##$PH_mod= 1
##$PKNL= yes
##$PPARMOD= 0
##$PSCAL= 0
##$PSIGN= 0
##$REVERSE= no
##$SF= 200.130013532006
##$SI= 16384
##$SIGF1= 3
##$SIGF2= 2
##$SINO= 400
##$SIOLD= 16384
##$SREGLST= <1H.CDCl3>
##$SSB= 0
##$STSI= 0
##$STSR= 0
##$SW_p= 3612.71676300578
##$SYMM= 0
##$S_DEV= 0
##$TDeff= 0
##$TDoff= 0
##$TI= <>
##$TILT= no
##$TM1= 0
##$TM2= 0
##$TOPLEV= 0
##$USERP1= <user>
##$USERP2= <user>
##$USERP3= <user>
##$USERP4= <user>
##$USERP5= <user>
##$WDW= 1
##$XDIM= 8192
##$YMAX_p= 0
##$YMIN_p= 0
$$ End of Bruker specific parameters
$$ ---------------------------------
##NTUPLES= NMR FID
##VAR_NAME=  TIME,          FID/REAL,        FID/IMAG
##SYMBOL=    X,             R,               I
##VAR_TYPE=  INDEPENDENT,   DEPENDENT,       DEPENDENT
##VAR_FORM=  AFFN,          ASDF,            ASDF
##VAR_DIM=   8192,          8192,            8192
##UNITS=     SECONDS,       ARBITRARY UNITS, ARBITRARY UNITS
##FACTOR=    0.0002004,     1,               1
##FIRST=     0,             0,               0
##LAST=      1.6414764,     0,               0
##MIN=       0,             -149122,         0
##MAX=       1.6414764,     261592,          0
$$ Real data points
##PAGE= N=1
##DATA TABLE= (X++(R..R)), XYDATA
$$ [...]
$$ plain form
2506 -3552 -572 3889 184 -3734 -173 1508 -1229 -56 2824 -386 -3372 -1365 1262 1927 529
2521 529 -2478 -2523 2051 2733 -1567 -1518 557 -1493 -1640 3904 2800 -4046 -3117 2901 2154 -1304 -1136
2538 -1136 -86 81 751 20 -190 1154 571 -2233 -169 2724 -120 -1424 2345 1356 -3831 -1093
2554 -1093 4727 2353 -2818 -1654 1587 2227 1975 -118 -2241 -413 1925 1754 1834 867 -2868 -1805
2570 -1805 4759 4042 -3182 -2932 2485 2208 -124 1113 986 -1395 -461 1505 1176 1092 547 -1105 150
2587 150 2134 308 -730 1777 157 -3136 598 5016 854 -4044 -1282 1876 1332 981 100 -2918
2603 -2918 -1316 2208 2099 112 -1486 -2279 -163 3938 1470 -3899 -1855 2681 408 -1954 732
2618 732 980 -1785 -421 1751 -513 -1334 930 486 -869 -961 -125 874 2206 -937 -3974 -79 4011
$$ packed form
2506c552K980M461l705l918L561J681k737J173K880l210k986K007K627O65j398
2521E29l007m5M574O82m300M9K075k050j47N544j104o846R29O018p47l458J68
2538a136J050J67O70p31k10J344n83k804K064K893k844j304L769r89n187K738
2554a093N820k374n171J164L241O40k52k093k123J828K338j71Q0r67l735J063
2570a805O564p17p224K50N417k77k332J237j27k381R34J966l29q4n45j652J255
2587A50J984j826j038K507j620l293L734M418m162m898K762L158n44l51q81l018
2603b918J602L524j09j987j598p93K116M101k468n369K044M536k273k362K686
2618G32K48k765J364K172k264q21K264m44j355r2Q36R99J332l143l037L895M090
$$ plain form
2635 4011 160 -3309 -365 658 -1134 1487 2623 -1697 -3570 448 2578 506 -845 -1368 -1048
2650 -1048 1517 1136 -1478 -208 1175 -1775 -1370 3061 1770 -2760 -1458 1559 -122 -656 1879 430
2666 430 -2729 -1050 1964 1828 768 -1036 -3013 177 3767 1154 -1794 -441 -354 -394 2908 2959 -2484
2683 -2484 -3088 2007 2972 -118 -390 58 -1019 571 2303 438 -935 611 190 -30 1781 630
2699 630 -1536 966 2059 -1594 -1336 2780 1577 -1730 -693 1278 421 769 1539 -909 -2131 624
2715 624 1859 645 169 -1321 -1912 1853 3462 -1515 -2862 916 1181 -917 979 1225 -1861 -1456
2731 -1456 1891 1209 -923 -213 16 -570 593 254 -742 542 838 -2045 -1152 2970 1444 -2777 -1745
2748 -1745 1308 288 369 1340 -1641 -2934 666 2771 336 -1746 -2374 -940 2991 3056 -2886 -3570 1171
$$ packed form
2635D011l851l469K944J023j792K621J136m320j873M018K130k072j351n23L20
2650a048K565l81k614J270J383k950M05M431j291m530J302L017j681n34K535j449
2666D30l159J679L014j36j060j804j977L190L590k613k948J353Q7m0L302N1n443
2683b484o04N095R65l090k72M48j077J590J732j865j373J546m21k20J811j151
2699F30k166K502J093l653K58M116j203l307J037J971q57L48P70k448j222K755
2715F24J235j214m76j490n91L765J609m977j347L778K65k098J896K46l086M05
2731a456L347o82k132P10K29n86J163l39r96J284K96k883Q93M122j526m221J032
2748a745L053j020Q1R71k981j293L600K105k435k082o28J434L931O5n942o84M741
$$ plain form
2765 1171 2301 -305 -129 -340 -2433 -383 3085 752 -2767 -1275 1017 206 41 -91 -586 196 550
2782 550 -1456 -1022 2053 1329 -1848 -1059 1352 -623 665 2199 -901 -3410 599 3400 957 -1540
2798 -1540 -1232 -344 1815 2636 -317 -1499 626 540 -182 1655 1890 -1577 -1458 2260 1329 -687 1059
2815 1059 1695 -1667 -817 2081 2164 829 -788 -1942 -518 3623 2855 -1637 -1259 285 343 1672 3428
2832 3428 -719 -4335 234 4186 1530 -683 -1052 -1105 726 2855 836 -1359 -59 394 120 1778
2848 1778 2031 -1540 -1532 2274 1258 -1217 869 2007 -852 -1193 1168 1243 489 505 -898 -1210 1451 1990
2866 1990 -377 -77 482 -841 24 3068 1156 -2833 -579 1958 787 31 816 -500 -1224 919
2882 919 1081 -574 128 316 -1236 111 1703 -408 -1209 774 661 -1720 903 2418 -788 -1984
$$ packed form
2765A171J130k606J76k11k093K050L468k333l519J492K292q11j65j32m95P82L54
2782E50k006M34L075p24l177P89K411j975J288J534l100k509M009K801k443k497
2798a540L08Q88K159Q21k953j182K125q6p22J837K35l467J19L718r31k016J746
2815A059O36l362Q50K898Q3j335j617j154J424M141p68m492L78J544N8J329J756
2832C428m147l616M569L952k656k213l69n3J831K129k019k195J300M53k74J658
2848A778K53l571QL806j016k475K086J138k859l41K361P5p54J6j403l12K661N39
2866A990k367L00N59j323Q65L044j912l989K254K537j171p56P85j316p24K143
2882I19J62j655P02J88j552J347J592k111q01J983j13k381K623J515l206j196
$$ plain form
2898 -1984 465 579 522 1039 -792 -2461 375 2316 -224 -1029 -773 -1777 -249 2722 805 -3360
2914 -3360 -1845 2051 1673 35 -867 -1818 -815 1954 1130 -1618 -959 308 -587 611 1603 -1380 -2366
2931 -2366 1519 1441 -1575 -1048 1493 -113 -1398 122 690 327 728 -713 -1554 646 1871 -287 -755
2948 -755 518 -927 -645 2806 1493 -3140 -1345 2386 1479 -648 -345 -251 -626 921 986 -959 -225
2965 -225 322 -1062 -7 1347 130 -893 1018 567 -2392 -18 3431 199 -2888 -752 1326 811
2981 811 965 -513 -2369 -424 1978 1731 222 -1166 -2489 -892 3631 1946 -3233 -2396 1660 1377
2997 1377 -334 545 -449 -2156 275 2088 684 -737 -573 -746 167 1237 -423 -838 1219 194
3013 194 -2334 134 3071 126 -2973 -163 1408 51 58 298 -1162 -1252 663 1090 -30 -213 -1586
$$ packed form
2898a984K449J14n7N17j831j669K836J941k540q05K56j004J528K971j917m165
2914c360J515L896l78j638r02r51J003K769q24k748O59J267q95J198R92k983r86
2931b366L885p8l016N27K541j606j285J520N68l63M01j441q41K200J225k158m68
2948g55J273j445K82L451j313m633J795L731r07k127L03R4l75J547O5j945P34
2965b25N47j384J055J354j217j023J911m51k959K374L449l232l087K136K078n15
2981H11J54j478j856J945K402k47j509j388j323J597M523j685n179Q37M056k83
2997A377j711Q79r94j707K431J813j404j421J64j73R13J070j660m15K057j025
3013A94k528K468K937k945l099K810J571j357PK40j460r0J915M27j120j83j373
$$ plain form
3030 -1586 -1089 2578 1466 -2656 -1621 1968 -100 -1747 1003 1045 -1562 -855 1022 -220 -894 542
3046 542 41 -492 -91 -591 -323 1341 -105 -2858 -593 3122 218 -2105 -348 -74 -929 649 2143
3063 2143 -1325 -3127 -176 1756 1119 -494 -1648 -1470 1642 1974 -1258 -1525 538 -460 -591 2213
3079 2213 615 -2989 -1048 2009 393 -1408 224 105 -879 -275 404 71 163 -554 -2004 150 2121
3096 2121 -317 -1588 549 -130 -1682 577 2419 -1822 -3364 689 2240 -56 -1318 -769 -419 1110
3112 1110 805 -987 -602 346 -933 -662 1390 31 -2516 -46 2519 -923 -2264 902 1848 -1586
3128 -1586 -1824 215 687 489 -187 -1647 -892 809 474 12 126 -1426 -2075 1696 3365 -1520 -3826
3145 -3826 184 2254 13 -314 -187 -1221 -569 1258 830 -537 -1167 -1174 117 1769 333 -1715 -200
$$ packed form
3030a586M97L667j112m122J035L589k068j647K750M2k607P07J877j242o74J436
3046E42n01n33M01n00K68J664j446k753K265L715k904k323J757K74q55J578J494
3063B143l468j802K951J932o37j613j154J78L112L32l232k67K063r98j31K804
3079B213j598l604J941L057j616j801J632j19r84O04O79l33R2p17j450K154J971
3096B121k438j271K137o79j552K259J842m241j542M053J551k296j262N49L50J529
3112A110l05j792L85R48j279K71K052j359k547K470K565l442j341L166R46l434
3128a586k38K039M72j98o76j460P55J701l35m62J14j552o49L771J669m885k306
3145c826M010K070k241l27J27j034O52J827m28j367o30pJ291J652j436k048J515
$$ plain form
3162 -200 1563 -1122 -1512 1834 1152 -1804 -872 1700 575 -514 280 -211 -1323 754 1393 83 -372
3179 -372 -1339 -1003 1885 2128 -1927 -2104 1618 2035 -638 -93 950 -1341 -1175 1592 1086 -1029 -737
3196 -737 982 245 184 -668 -375 1188 1367 -1406 -932 2360 1151 -1821 -607 1416 -448 -556 2045
3213 2045 595 -2395 -878 1980 1220 -568 -1301 -1119 1146 1954 -268 -1403 408 -221 -950 1622
3229 1622 1703 -1748 -2034 1614 1858 -1251 -748 499 -508 -530 548 607 133 -140 -1168 -395 1500 303
3247 303 -1878 -297 1071 -627 -283 1964 -479 -2842 -368 2253 406 -1143 -528 -596 135 1338
3263 1338 -101 -1668 -544 25 174 1383 421 -2400 -1156 1989 653 -2201 -438 1279 -490 -1119
3279 -1119 700 161 -698 206 159 -659 -228 628 257 306 -612 -1990 58 2709 351 -2854 -704 1854
$$ packed form
3162b00J763k685l90L346o82k956R32K572j125j089P94m91j112K077O39j310m55
3179c72r67L36K888K43m055j77L722M17k673N45J043k291J66K767n06k115K92
3196g37J719p37o1q52K93J563J79k773M74L292j209k972J214K023j864j08K601
3213B045j450k990J517K858p60j788p33J82K265Q08k222j135J811o29p29K572
3229A622Q1l451k86L648K44l109N03J247j007k2J078N9m74k73j028P73J895j197
3247C03k181J581J368j698L44K247k443k363K474K621j847j549O15o8P31J203
3263A338j439j567J124N69J49J209r62k821J244L145j336k854J763J717j769o29
3279a119J819n39q59R04m7q18M31Q56l71M9r18j378K048K651k358l205K150K558
$$ plain form
3297 1854 293 -636 325 -896 -1288 567 1793 -258 -852 -310 55 1281 304 -1437 -522 1766 245
3314 245 -1143 894 1939 -1443 -1518 1421 1226 -669 595 331 -701 -99 1246 913 -513 -555 -743
3331 -743 999 2790 69 -2780 70 2110 298 -455 775 -389 -589 1856 2041 -1315 -1314 1013 1036
3348 1036 562 25 -605 224 1266 5 -1316 438 1568 -757 -261 1202 -229 -1174 1116 1146 -1386
3365 -1386 -1013 1677 1452 -259 -609 -412 397 1517 301 -1340 -115 1066 -485 57 1480 -778
3381 -778 -2111 930 2222 -1135 -1278 1060 333 -746 77 590 71 -274 -292 -81 1395 909 -1457 -902
3399 -902 909 -190 -1139 1433 871 -2340 -1101 2353 1481 -1280 -1482 -374 488 682 409 -731 -1066
3416 -1066 -238 -270 978 1187 -2040 -2226 1317 1912 -1137 -1576 700 -94 -1211 386 871 -790 -799 402
$$ packed form
3297A854j561r29R61j221l92J855J226k051n94N42L65J226r77j741R15K288j521
3314B45j388K037J045l382p5K939j95j895J264k64j032O02J345l33j426m2j88
3331g43J742J791k721k849K850K040j812p53J230j164k00K445J85l356JK327K3
3348A036m74n37o30Q29J042j261j321J754J130k325M96J463j431r45K290L0k532
3365a386L73K690k25j711l50J97Q09J120j216j641J225J181j551N42J423k258
3381g78j333L041J292l357j43K338p27j079Q23N13n19l45j8K11J476m86k366N55
3399i02J811j099r49K572n62l211J239L454q72k761k02J108Q62J94k73j140l35
3416a066Q28l2J248K09l227j86L543N95l049m39K276p94j117J597M85j661rJ201
$$ plain form
3434 402 186 5 -128 -238 460 511 -1320 -938 1915 1261 -2232 -1204 1825 978 -810 353 511 -1083
3452 -1083 -218 1795 538 -1024 -1220 -98 1116 1323 -952 -1306 816 880 -992 -34 1926 -299 -1545
3469 -1545 797 1561 -586 -577 854 -116 -789 637 972 162 -623 -1297 -96 2308 1016 -2384 -1116
3486 -1116 1786 916 -690 365 -12 -1576 234 2318 123 -2019 -591 1072 883 -153 -1216 -837
3502 -837 1365 986 -1204 -457 1118 -137 -662 1101 611 -1596 -483 1524 -64 -1389 217 743
3518 743 74 -478 -733 -237 879 631 -1389 -685 1006 -68 -1025 483 185 -1586 -179 1529 -240
3535 -240 -1593 -140 751 -226 -79 -467 -586 135 597 -722 -484 785 -462 -1173 96 947 -752 -338
3553 -338 563 -1078 -1667 517 1558 -415 -725 -846 73 947 664 -1121 -1513 586 601 -95 248 -733
$$ packed form
3434D02k16j81j33j10O98N1j831L82K853o54l493J028L029q47j788J163J58j594
3452a083Q65K013j257j562j96J122J214K07k275l54K122O4j872R58J960k225j246
3469a545K342P64k147RJ431r70o73J426L35q10p85o74J201K404j292l400J268
3486a116K902q70j606J055l77j564J810K084k195k142J428J663j89j036j063L79
3502h37K202l79k190P47J575j255n25J763m90k207J113K007j588j325J606N26
3518G43o69n52k55M96J116k48k020P04J691j074r57J508k98j771J407J708j769
3535b40j353J453Q91r77J47l88j19P21M62j319K38J269j247p11J269Q51j699M14
3553c38R01j641n89K184J041j973l10j21R19Q74k83j785l92K099J5o96L43r81
$$ plain form
3571 -733 -2007 -208 1825 381 -1599 -614 264 38 431 149 -1039 -518 292 72 -213 682 -327 -1224
3589 -1224 463 739 -723 -499 906 -411 -1382 360 943 -705 -432 -477 -683 149 802 -82 -1184 -311
3607 -311 -66 -313 510 598 -1659 -871 1013 378 -974 -113 -339 -1189 -346 740 -193 -315 181 -841 -814
3626 -814 754 681 -877 -517 214 -516 251 1426 -545 -2013 -267 1497 802 -78 -611 -1438 132 1823
3644 1823 296 -1540 -602 241 305 933 500 -1444 -1056 1264 913 -882 -745 154 -384 -43 735 -652
3662 -652 -540 708 -186 -629 496 354 -489 -10 416 -767 -137 1545 239 -1313 -115 1228 271
3679 271 -46 106 -745 -93 1249 385 -823 147 844 51 97 584 -900 -291 1647 612 -813 -20
3697 -20 927 -25 -11 133 -180 75 780 152 -1048 366 1276 91 51 289 -484 221 1691 682 -1481
$$ packed form
3571g33j274J799K033j444j980R85Q78k26L93k82j188N21Q10k20k85Q95j009q97
3589a224J687K76j462K24J405j317r71J742N83j648K73m5k06Q32O53q84j102Q73
3607c11K45k47Q23Q8k257P88J884o35j352Q61k26q50Q43J086r33j22M96j022K7
3626h14J568p3j558L60P31p30P67J175j971j468J746J764o95q80n33q27J570J691
3644A823j527j836R38Q43O4O28m33j944L88K320l51j795J37Q99n38L41P78j387
3662f52J12J248q94m43J125j42q43M79M26j183O30J682j306j552J198J343r57
3679B71l17J52q51O52J342q64j208R70O97p93M6M87j484O09J938j035j425P93
3697b0R47r52J4J44l13K55P05o28j200J414R10j185m0K38p73P05J470j009k163
$$ plain form
3716 -1481 -405 1336 449 4 199 -839 -387 1335 928 -763 -550 96 -123 992 547 -928 -952 841
3734 841 625 -666 74 649 -566 -303 970 115 -777 205 182 -789 78 438 -230 -369 93 -648 -90
3753 -90 1256 -232 -1619 -503 1027 181 -445 307 -210 -854 669 627 -575 -504 224 -350 69 233 -458
3772 -458 -591 811 5 -1035 89 899 -675 -597 350 105 -570 575 570 -1115 -831 644 552 3 -630
3791 -630 -1010 -312 1179 771 -861 -902 189 -249 180 641 -569 -1800 368 1563 -486 -792 -101 -251
3809 -251 -239 926 153 -776 -176 261 -309 308 344 -901 -567 837 144 -698 372 842 -817 -728 779
3828 779 638 -657 -465 82 73 570 1063 -423 -413 406 40 292 741 -129 -957 1218 1883 -543 -905 695
3848 695 271 -68 162 400 -491 373 612 -136 -384 381 353 566 635 -450 -646 1193 1203 -756 -1019 1070
$$ packed form
3716a481J076J741q87m45J95j038M52J722m07j691K13O46k19J115m45j475k4J793
3734H41k16j291P40N75j215K63J273q55q92R82k3r71Q67L60o68j39M62p41N58
3753i0J346j488j387J116J530q46o26P52n17o44J523m2j202P1P28n74M19J64o91
3772d58j33J402q06j040J124Q10j574P8R47k45o75J145nj685K84J475r2n49o33
3791f30l80O98J491m08j632m1J091m38M29M61j210j231K168J195k049l06O91j50
3809b51J2J165p73r29O00M37n70O17L6j245L34J404o93q42J070M70j659Q9J507
3828G79j41j295J92N47rM97M93j486J0Q19l66K52M49q70q28K175O65k426l62J600
3848F95m24l39K30K38q91Q64K39p48k48P65k8K13O9j085j96J839J0j959k63K089
$$ plain form
3868 1070 1014 -62 107 132 -652 366 1253 135 -691 -568 275 715 1022 -460 -1440 629 1271 -571
3886 -571 -573 688 -101 -689 644 692 -861 -523 642 -130 -366 492 288 -402 -357 -361 -213 494 522 -1522 -712
3907 -712 1153 216 -441 -51 -106 -912 110 1180 -234 -1362 -317 342 -223 -335 -641 -431 535 473 -928
3926 -928 -546 412 -400 -836 372 498 -1128 -299 1021 -11 -1687 31 862 -137 -377 -447 -439 704 730
3945 730 -709 -582 3 -334 -579 1120 141 -1883 -224 1818 512 -1089 -770 305 -299 137 662
3962 662 -301 -497 -119 139 259 374 -673 -920 552 438 -1067 -237 844 -609 -987 770 1111 -738
3980 -738 -757 -60 -176 252 618 120 -671 120 25 233 647 -487 -1647 289 1745 80 -1315 120
3998 120 753 -110 -32 587 -596 -455 553 687 -226 -210 21 319 759 -328 -1016 468 1400 -76 -1118
$$ packed form
3868A070n6j076J69K5p84J018Q87j118q26J23Q43M40L07j482r80K069O42j842
3886e71kJ261p89n88J333M8j553L38J165p72k36Q58k04o90M5mJ48P07K8k044Q10
3907g12J865r37o57L90n5q06J022J070j414j128J045O59n65j12l06K10R66o2j401
3926i28L82R58q12m36J208J26j626Q29J320j032j676J718Q31r99k40p0QJ143K6
3945G30j439J27N85l37k45J699r79k024J659K042j306j601L19J075o04M36N25
3962F62r63j96L78K58J20J15j047k47J472j14j505Q30J081j453l78J757L41j849
3980g38j9O97j16M28L66m98p91P91r5K08M14j134j160J936J456j665j395J435
3998A20O33q63P8O19j183J41J008J34r13J6K31K98M40j087o88J484R32j476j042
$$ plain form
4017 -1118 629 973 -384 -292 755 -430 -635 924 1133 -545 -833 -301 599 964 -418 -956 -110 1231
4035 1231 -184 -990 443 25 -1099 151 1181 -403 -991 229 631 -450 -275 182 -57 -133 -358
4052 -358 -303 595 824 -875 -1150 700 1259 -215 180 276 -833 -601 1377 622 -1178 -718 506 769
4070 769 323 -275 -943 88 957 125 -673 313 531 -511 376 766 -999 -807 824 785 -879 -475 623
4089 623 368 -207 -31 -386 159 630 12 -436 262 -41 -129 502 742 -1237 -1352 1239 1146 -762 -819 703
4109 703 -152 -460 63 93 -162 -258 -328 187 697 -522 -896 318 800 -843 -920 1042 149 -931 -205 1092
4129 1092 154 -956 -38 285 127 430 -52 -483 -140 -205 -71 819 485 -1497 -702 1629 915 -1239 -754
4148 -754 717 171 -174 188 -174 -1014 182 460 -125 -339 -867 -170 421 644 -929 -854 885 322 -1151
$$ packed form
4017a118J747L44j357R2J047j185k05J559K09j678k88N32R00L65j382n38Q46J341
4035A231j415q06J433m18j124J250J030j584n88J220M02j081J75M57k39p6k25
4052c58N5Q98K29j699k75J850N59j474L95R6j109K32J978p55j800M60J224K63
4070G69m46n98o68J031Q69q32p98R86K18j042Q87L90j765J92J631l9j664M04J098
4089F23k55n75J76l55N45M71o18m48O98l03q8O31K40j979j15K591r3j908n7J522
4109G03q55l08N23L0k55r6p0N15N10j219l74J214M82j643p7J962q93j080P26J297
4129A092r38j110R18L23j58L03m82m31L43o5J34Q90l34j982P95K331p14k154M85
4148g54J471n46l45L62l62q40J196K78n85k14n28O97N91K23j573P5J739n63j473
$$ plain form
4167 -1151 -205 725 -99 -555 -167 137 -893 -120 700 -379 -879 -274 -80 865 204 -823 -985 1017
4185 1017 519 -731 -431 535 -640 -299 808 253 -1199 -396 594 215 -278 314 -40 -46 191 -423 218
4204 218 1013 -19 -921 212 924 52 -628 267 -280 -510 806 1171 -466 -1019 -156 728 674 542 -783
4223 -783 -658 742 942 -266 -71 304 -197 134 1267 349 -1329 176 973 -290 -643 172 387 54
4241 54 208 -341 -219 268 265 -997 7 669 27 -146 715 55 -1307 485 1159 -342 -795 117 467
4260 467 -135 574 75 -402 -120 453 -527 -127 314 -491 -718 279 -159 -299 37 574 -592 -651 865 101
4280 101 -663 -14 -91 -350 94 449 -490 -989 122 17 33 300 -559 -1243 564 1055 -27 -1105 -40
4299 -40 78 -10 472 -155 -987 -567 570 -47 -483 -331 -379 31 728 -50 -835 -275 392 -81 -205 338 -10
$$ packed form
4167a151R46R30q24m56L88L04j030P73Q20j079n00O05J94R45o61j027j62K002
4185A017m98j250L00R66j175L41J107n55j452Q03R90l79m93N92l54oK37o14O41
4204B18P95j032r02J133P12q72o80Q95n47k30J316L65j637n53Q63Q84n4j32j325
4223g83J25J400K00j208J95L75n01L31J133r18j678J505P97j263l53Q15K15l33
4241E4J54n49J22M87lj262J004O62o42j73Q61o60j362J792O74j501m53R12L50
4260D67o02P09m99m77K82N73r80M00M41q05k27R97m38j40L36N37j166n9J516p64
4280A01p64O49p7k59M44L55r39m99J111j05J6K67q59o84J807M91j082j078J065
4299d0J18q8M82o27q32M20J137o17m36J52m8M10O97p78p85N60O67m73j24N43l48
$$ plain form
4320 -10 -855 278 315 -440 -60 444 -65 -409 76 72 152 219 -91 -719 191 497 -53 -448 182 -28 -325 916
4342 916 104 -451 -80 879 182 -54 325 -74 -311 97 293 -401 202 592 -479 -369 703 381 -270
4361 -270 500 261 -537 367 1059 25 -662 103 780 345 584 94 -1091 -144 1239 408 -234 -375 -304
4380 -304 200 792 580 -1176 -513 854 395 -224 151 108 -528 77 928 -136 -423 371 68 -233 209
4399 209 153 -265 156 88 -816 167 1067 -185 -779 192 395 -446 267 412 -393 -669 544 300 -84 -97
4419 -97 93 -395 280 160 -417 -482 615 -258 -853 513 566 -387 -145 164 -567 -248 674 -34 -846 -69
4439 -69 379 -56 -142 -466 -1161 -33 962 218 -1018 -406 -96 -52 531 470 -711 -864 662 745 -440 -110
4459 -110 228 -87 455 698 -467 -628 78 -258 -114 46 489 -348 36 332 -215 -340 488 136 -511 -84
$$ packed form
4320a0q45J133L7p55L80N04n09l44M85mQ0O7l10o28R10L06n50l95O30k10k97J241
4342I16q12n55L71R59o97k36L79l99k37M08J96o94O03L90j071J10J072l22o51
4361b70P70k39p98R04O92j034o87P65O77m35K39m90j185R47J383q31o42j41P1
4380c04N04N92k12j756O63J367m59o19L75m3o36O05Q51j064k87P94l03l01M42
4399B09n6m18M21o8r04R83R00j252n94R71K03q41P13J45q05k76J213k44l84j3
4419i7J90m88O75j20n77o5J097q73n95J366N3r53K42L09p31L19R22p08q12P77
4439f9M48m35q6l24o95J128R95p44j236O12L10M4N83o1j181j53J526Q3j185L30
4459a10L38l15N42K43j165j61P06l36J44J60M43q37L84K96n47j25Q28l52o47M27
$$ plain form
4479 -84 220 -341 179 134 -324 -161 653 397 -264 -87 137 81 241 510 -395 -740 762 450 -363 -323 133
4500 133 -388 -49 550 -236 -212 577 524 -640 208 345 -218 118 180 -170 -230 650 383 -693 -247 389 275
4521 275 353 435 -583 -582 678 529 -398 -569 28 -152 546 852 -369 -893 406 233 -122 179 -122 -374
4541 -374 -185 915 -4 -424 -181 263 -458 -35 550 -198 -380 369 -49 -149 197 451 -619 -125 259
4560 259 140 84 166 -597 -580 612 531 -476 -622 -50 -152 -57 596 -132 -779 246 448 -110 -19 133 -421
4581 -421 21 404 -300 -674 473 -70 -526 -271 274 6 -251 359 20 -357 611 949 -258 -782 -237
4600 -237 -142 100 561 -522 -899 406 650 -342 -188 38 -607 -74 1008 211 -574 78 496 109 240
4619 240 79 -324 -94 349 57 -27 95 116 -509 -1 753 276 -492 216 -200 -480 547 485 -437 -636 -40
$$ packed form
4479h4L04n61N20m5m58J63Q14k56o61J77K24n6J60K69r05l45J502l12q13M0M56
4500A33n21L39N99p86K4P89n3j164Q48J37n63L36O2l50o0Q80k67j076M46O36j14
4521B75P8Q2j018JJ260j49r27j71N97j80O98L06j221n24J299j73l55L01l01k52
4541c74J89J100r19m20K43M44p21M23N85p48j82P49m18j00L46K54j070M94L84
4560B59j19n6Q2p63J7J192q1j007j46N72j02R5O53p28o47J025K02n58R1J52n54
4581d21M42L83p04l74J147n43m56K55N45k68k57O10l39l77R68L38j207n24N45
4600b37R5K42M61j083l77J305K44r92J54K26o45N33J082p97p85O52M18l87J31
4619B40j61m03K30M43k92q4J22K1o25N08P54m77p68P08m16k80J027o2r22j99N96
$$ plain form
4640 -40 78 305 170 -331 -335 408 467 -127 -165 -34 -411 -334 532 45 -519 90 542 -271 -599 532 127 -218
4662 -218 153 201 -357 432 346 -499 -310 229 -203 -59 451 -367 -1046 214 1116 -215 -563 92 122 -265
4682 -265 470 263 -485 -572 -71 249 308 129 -702 -349 709 503 -520 101 471 -342 -36 680 232 -781
4702 -781 -76 337 166 -64 141 -217 -253 255 -11 -184 550 -336 -1045 320 1026 -275 -592 60 126 -387
4722 -387 484 641 -445 -369 429 294 118 -123 -240 72 700 266 -456 84 431 -264 -425 718 196 -309
4742 -309 569 638 -556 -518 443 152 86 -303 -59 341 554 -273 -821 -20 567 115 -30 292 -249 -394 870
4763 870 728 -798 -614 730 493 -24 -168 236 -108 566 151 53 401 26 -433 -108 473 275 -695 9
4783 9 218 -579 -198 853 203 -1043 -217 494 524 -233 -238 -456 228 761 -127 -515 135 -387 -423 664 539
$$ packed form
4640d0J18K27j35n01mP43N9n94l8J31l77P7Q66m87n64O09M52q13l28J131m05l45
4662b18L71M8n58P89q6q45J89N39m32J44N10q18o79J260R02j331l48O55L0l87
4682b65P35k07p48q7N01L20N9j79q31L53J058k06j023O21L70q13L06P16m48j013
4702g81P05M13j71k30K05l58l6N08k66j73P34q86p09J365P06j301l17O52O6n13
4722c87Q71J57j086P6P98j35j76k41j17L12O28m34p22N40L47o95j61J143n22n05
4742c09Q78O9j194L8R61k91o6l89K44M00K13q27n48Q01N87m52j45L22n41j45J264
4763H70j42j526J84J344k37n17j44M04l44O74m15r8L48l75m59L25N81j98r70P04
4783IK09p97L81J051o50j246Q26P11L0p57nk18O84N33q88l88O50n22l6J087j25
$$ plain form
4804 539 -818 -893 833 499 -333 -265 79 -283 184 -69 113 -73 104 -135 -151 304 -297 -293 566 571 -698
4825 -698 -446 812 189 -566 -405 167 178 244 570 -334 -246 182 7 -9 573 -280 -604 307 585 -423 -498
4846 -498 256 -117 -550 525 697 -271 -374 417 61 118 243 -86 -54 139 298 21 464 -44 -907 -247
4866 -247 976 328 -535 -258 637 -11 35 696 -326 -690 537 947 484 -24 -8 -75 871 742 -500 -289
4886 -289 578 282 -385 529 332 -612 -120 546 79 -281 249 463 -57 8 106 -16 426 603 -756 90
4906 90 689 158 -176 129 324 -346 -236 965 154 -481 3 450 62 -8 273 -64 584 649 -180 -53 336
4927 336 98 -577 210 529 -115 -131 224 10 -272 620 283 -318 -287 222 69 375 167 -441 -276 229 172
4948 172 -199 -52 -66 -423 457 664 -293 -948 51 973 -240 -702 -297 -404 -68 635 102 -499 -284 48
$$ packed form
4804E39j357p5J726l34q32O8L44l62M67k53J82j86J77k39j6M55o01MQ59Nj269
4825f98K52J258o23p55J61N72J1O6L26r04Q8M28j75j6N82q53l24R11K78j008p5
4846d98P54l73m33J075J72r68j03P91l56N7J25l29L2J93J59k77M43n08q63O60
4866b47J223o48q63K77Q95o48M6O61j022l64J227M10m63n08J6o7R46j29j242K11
4886b89Q67k96o67R14j97r44M92O66m67l60N30K14n20O5R8j22M42J77j359Q46
4906I0N99n31l34L05J95o70J10J201q11o35M84M47l88p0K81l37O48O5q29J27L89
4927C36k38o75P87L19o44j6L55k14k82Q92l37o01L1N09j53L06k08o08J65N05n7
4948A72l71J47j4l57Q80K07r57o55R99R22j213m62M05j07L36P03n33o01K15L32
$$ plain form
4968 48 -117 224 79 -440 -182 307 -211 -609 384 242 -680 -424 403 314 -344 -66 -451 -284 561 582 -12
4989 -12 -313 -219 -581 347 661 -398 -446 173 426 -315 288 630 -365 -260 366 596 221 107 180 -365 -153
5010 -153 341 -196 16 243 -657 -232 955 707 -541 -168 360 -130 -56 615 -33 -805 -124 912 384
5029 384 -519 -198 -232 282 683 -77 -430 314 271 63 122 368 -293 -314 806 413 -308 90 399 197 23
5050 23 598 -43 141 217 -197 75 221 168 -302 157 410 3 -5 440 151 -645 -438 484 98 -111 86 22
5072 22 -2 287 152 -411 -223 -93 -383 235 520 -215 -436 239 111 -629 -38 539 -93 -289 10 97 -285
5093 -285 -176 -232 -391 79 264 -130 -519 -402 -509 -115 730 -50 -844 -517 857 173 -322 -35 -105 -287
5113 -287 -21 550 -552 -439 -294 329 363 216 -548 -565 397 299 -328 165 345 -259 -542 340 173 -364 -112
$$ packed form
4968D8j65L41j45n19K58M89n18l98R93j42r22K56Q27q9o58K78l85J67Q45K1n94
4989a2l01R4l62R28L14j059m8O19K53p41O03L42r95J05O26K30l75j14P3n45K12
5010a53M94n37K12K27r00M25J187k48j248L73N28m90P4O71o48p72O81J036n28
5029C84r03L21l4N14M01p60l53P44m3k08N9K46o61k1J120l93p21L98L09k02j74
5050B3N75o41J84P6m14K72J46n3m70M59K53m07qM45k89p96K07R22l86k09J97o4
5072B2k4K89j35n63J88J30k90O18K85p35k21O75j28p40N91N77o32j96K99Q7l82
5093b85J09n6j59M70J85l94l89J17j07L94Q45p80p94L27J374o84m95K87p0j82
5113b87K66N71j102J13J45O23L4j47p64j7R62r8o27M93J80o04k83Q82j67n37K52
$$ plain form
5134 -112 151 -249 -169 365 173 -371 -260 -110 29 472 -347 -673 -121 605 -135 -373 54 -236 -457 263
5154 263 396 -191 -433 321 -84 -268 89 184 -203 328 -20 -340 239 527 -209 -629 353 7 -168 332
5174 332 146 -526 -356 484 574 -136 -152 41 106 449 158 -441 -433 340 181 83 686 109 -731 -15 492 -90
5196 -90 -477 10 53 -70 149 319 -15 -308 -82 -127 257 367 -297 -316 73 292 -43 502 -87 -322 -67
5217 -67 343 133 -453 -8 -159 -231 40 15 -356 -490 327 -244 -311 107 144 -642 231 366 -506 -587 88 -64
5239 -64 -239 166 86 -101 121 202 -239 67 232 24 -264 5 53 -19 296 516 -634 -381 302 606 -8
5260 -8 -19 -500 -625 322 518 -342 -595 -37 290 7 209 -186 -599 61 620 35 -414 -91 -18 -161 -2
5281 -2 232 -218 -164 119 -539 -118 493 233 -412 -51 28 99 135 482 2 -618 446 558 13 -270 -54 -359
$$ packed form
5134a12K63m00Q0N34j92n44J11J50J39M43q19l26N52P26p40k38M27k90k21P20
5154B63J33n87k42P54m05j84L57R5l87N31l48l20N79K88p36m20R82l46j75N00
5174C32j86o72J70Q40R0p10j6J93O5L43k91n99QP73j59r8O03n77q40P16N07n82
5196i0l87M87M3j23K19J70l34k93K26m5L84J10o64j9L89K19l35N45n89k35K55
5217f7M10k10n86M45j51p2K71k5l71j34Q17n71o7M18L7p86Q73J35q72q1O75j52
5239f4j75M05q0j87K22Q1m41L06J65k08k88K69M8p2L15K20j150K53O83L04o14
5260hj1m81j25R47J96q60k53N58L27k83K02l95m13O60N59n85m49L23P3j43J59
5281bK34m50N4K83o58M21O11k60o45L61P9P1L6L47m80o20J064J12n45k83K16l05
$$ plain form
5303 -359 183 326 -368 -432 100 301 35 333 387 -366 11 548 -321 -530 181 300 -148 -376 101 -28 203
5324 203 34 -368 -601 -16 349 -34 46 92 -294 305 250 -151 -600 -112 578 -244 -419 -215 -545 58 449
5345 449 -353 -437 250 205 -374 87 -25 -435 -295 148 -46 -348 316 37 -250 -90 177 99 -22 27 -376
5366 -376 -166 229 21 -136 -501 -152 -129 171 441 -403 -831 271 574 -442 -129 333 -105 216 592 186
5386 186 -88 -254 -77 -304 -25 171 -442 -194 473 33 -202 151 518 -563 -311 372 -165 -155 166 59
5406 59 -378 577 354 191 -28 -161 -482 251 685 177 -696 -65 256 -134 -123 256 -305 -491 142 381 -240
5427 -240 -70 68 -106 125 175 -28 -81 183 20 -306 76 538 -643 -464 327 94 -107 139 -472 -642
5447 -642 52 404 507 48 -480 -209 259 554 -139 -636 -36 266 2 11 123 -248 -176 464 172 -159 -484
$$ packed form
5303c59N42J43o94o4N32K01k66K98N4p53L77N37q69k09P11J19m48k28M77j29K31
5324B03j69m02k33N85L65l83Q0M6l86N99n5m01m49M88O90q22j75K04l30O03L91
5345D49q02q4O87m5n79M61j12m10J40M43j94l02O64k79k87J60K67p8j21M9m03
5366c76K10L95k08j57l65L49K3L00K70q44m28J102L03j016L13M62m38L21L76m06
5386A86k74j66J77k27K79J96o13K48O67m40k35L53L67j081K52O83n37J0L21j07
5406E9m37R55k23j63k19j33l21P33M34n08q73O31L21l90J1L79n61j86O33K39o21
5427b40J70J38j74K31N0k03n3K64j63l26L82M62j181J79P91k33k01K46o11j70
5447f42O94L52J03m59n28K71M68K95o93m97O00L02k64RJ12l71P2O40k92l31l25
$$ plain form
5468 -484 86 184 74 -218 52 1 229 -57 -331 76 66 -68 -127 -61 -278 -264 405 179 -467 -229 380 116
5490 116 -199 -93 -285 -192 386 226 -554 -282 73 -390 305 110 -311 -635 200 366 -436 -66 249 -346
5510 -346 -189 -302 40 154 -111 -100 -338 362 490 -300 -379 460 -66 -162 596 172 -898 -50 342 267 -280
5531 -280 42 133 94 228 255 -85 -166 377 127 341 212 -91 -142 591 387 -243 4 207 245 -66 88 56
5553 56 -60 57 180 -434 -44 176 -69 108 290 -320 -126 546 365 -264 -52 373 258 -78 209 -215
5573 -215 -502 39 406 10 -238 34 -21 6 404 -170 -436 255 61 -238 167 506 -2 -403 15 76 -100
5594 -100 122 192 -198 -165 394 113 -301 -199 -273 -198 617 122 -716 -324 429 13 -36 168 -404 -553 182 708
5616 708 -28 -460 163 458 45 -113 -110 -379 -252 171 -393 -96 118 -197 -554 -58 -97 -274 -44 335 -124
$$ packed form
5468d84N70R8j10k92K70n1K28k86k74M07j0j34n9O6k17J4O69k26o46K38O09k64
5490A16l15J06j92R3N78j60p80K72L55m63O95j95m21l24Q35J66q02L70L15n95
5510c46J57j13L42J14k65J1k38P00J28p90p9Q39n26r6P58m24j070Q48L92p5n47
5531b80L22R1l9J34K7l40q1N43k50K14j29l03n1P33k04o30K47K03L8l11J54l2
5553E6j16J17J23o14L90K20k45J77J82o10J94O72j81o29K12M25j15l36K87m24
5573b15k87N41L67l96k48K72n5K7L98n74k66O91j94k99M05L39n08m01M18O1j76
5594a00K22P0l90L3N59k81m14J02p4P5Q15m95q38L92P53m16m9K04n72j49P35N26
5616G08p36m32O23K95m13j58Lk69J27M23n64K97K14l15l57M96l9j77K30L79m59
$$ plain form
5637 -124 -426 174 246 -156 -283 305 -91 276 394 -33 -96 -117 -257 -159 410 -211 -394 237 206 -205 -161 210
5659 210 216 -463 260 -93 216 -103 64 -182 -122 358 135 -139 41 -154 188 436 196 -783 -283 400 261
5680 261 -73 300 144 -415 -56 341 108 -440 417 190 268 297 -181 -243 103 403 -120 -249 106 211 -170
5701 -170 3 214 -406 -261 286 197 -465 155 183 135 -28 -303 27 137 92 -259 -166 384 75 -488 176 500
5723 500 -390 -85 290 66 -378 -318 -55 101 40 -104 -429 122 328 -160 -101 133 11 -559 105 87 -175
5744 -175 0 316 -206 -467 206 276 -145 -148 -128 -25 84 110 -415 -551 -83 332 142 76 -241 -377 50 789
5766 789 260 -425 -294 324 2 -46 346 -226 -295 209 -20 -23 407 -23 -109 149 268 -282 -14 300 -282 -643
5788 -643 410 564 20 -339 -88 205 79 -30 244 -80 210 36 -12 520 10 -806 -94 906 255 -355
$$ packed form
5637a24l02O00P2m02j27N88l96L67J18m27o3k1j40R8N69o21j83O31l1m11M4L71
5659B10Oo79P23l53L09l19J67k46O0M80k23k74J80j95L42K48k40r79N00O83j39
5680B61l34L73j56n59L59L97k33n48Q57k27P8K9m78o2L46L00n23j29L55J05l81
5701a70J73K11o20J45N47q9o62O20K8m8j63k75L30J10m5l51R3N50l09n63O64L24
5723E00q90L05L75k24m44O0K63J56o1j44l25N51K06m88N9K34j22n70O64j8k62
5744a75J75L16n22k61O73P0m21lK0J03J09K6n25j36M68M15j90o6l17j36M27P39
5766G89n29o85J31O18l22m8L92n72o9N04k29lM30m30q6K58J19n50K68L14n82l61
5788f43J053J54n44l59K51K93j26j09K74l24K90j74m8N32n10q16P12J000o51o10
$$ plain form
5808 -355 134 165 -136 -142 438 -115 -563 70 -39 -123 487 -231 15 123 409 -33 -157 512 3 -753 20
5829 20 466 -92 -348 -266 186 23 751 -85 -377 -137 159 334 162 181 -629 123 671 266 -479 -87 220
5850 220 -170 -33 418 50 -119 259 178 -320 -112 361 -83 196 -105 63 304 301 -85 -204 313 230 -284
5871 -284 -40 282 -27 -38 363 233 -706 -349 421 240 135 -197 -69 51 391 275 -584 218 228 -206 43
5892 43 158 -71 -316 304 350 -485 60 309 -37 -60 86 174 292 372 -277 -213 84 490 17 -130 35 -386
5914 -386 -109 466 509 -258 -404 543 -15 85 126 -202 -121 468 398 -244 -85 -146 -178 55 519 169 -138 114
5936 114 208 -149 274 235 -108 -52 88 84 -32 93 149 -159 74 458 221 -52 276 -122 2 358 605 -160
5958 -160 -139 389 84 -105 -36 -58 -47 30 192 -166 -86 249 -299 -110 353 -152 -180 232 69 -625 -112 274
$$ packed form
5808c55M89L1l01oN80n53m48O33j09q4O10p18K46J08K86m42j24O69n09p56P73
5829B0M46n58k56Q2M52j63P28q36k92K40K96J75j72J9q10P52N48m05p45L92L07
5850B20l90J37M51l68j69L78q1m98K08M73m44K79l01J68K41ll86j19N17q3n14
5871b84K44L22l09j1M01j30r39L57P70j81j05l32J28J20L40j16q59Q02J0m34K49
5892D3J15k29k45O20M6q35N45K49l46k3J46Q8J18Q0o49O4K97M06m73j47J65m21
5914c86K77N75M3p67j46R47n58J00M1l28Q1N89p0o42J59o1l2K33M64l50l07K52
5936A14R4l57M23l9l43N6J40mj16J25N6l08K33L84k37k73L28l98J24L56K47p65
5958a60K1N28l05j89O9k2J1P7J62l58Q0L35n48J89M63n05k8M12j63o94N13L86
$$ plain form
5980 274 76 105 -107 -243 -142 291 532 -91 7 480 442 125 203 -282 -523 132 595 -262 -341 68 34 -138
6002 -138 354 88 -255 274 40 460 153 140 222 -11 558 -61 -179 203 220 -274 104 523 -241 -166 325
6023 325 -98 -69 337 483 -166 -261 403 -48 -88 -59 -116 -146 535 398 30 -191 256 280 -63 -77 41 -136 110
6046 110 315 -109 -308 -63 151 -98 -37 326 74 271 298 -47 -135 571 -27 25 211 -127 -242 179 61
6067 61 -252 -296 247 323 -33 359 96 -389 219 420 221 -283 255 35 35 83 236 -536 58 -165 223 -59
6089 -59 444 -114 -221 313 260 -174 -320 388 -185 -260 412 -42 -242 -158 -38 -168 220 458 -68 -394 32
6110 32 98 18 135 -171 -388 -122 511 -137 -8 -165 201 -209 -168 174 -82 -20 250 -134 -190 -128 173 -120
6132 -120 122 145 -136 57 452 14 -340 145 300 -80 -30 137 -170 267 231 -2 -106 -79 -59 18 514 261
$$ packed form
5980B74j98K9k12j36J01M33K41o23R8M73l8l17P8m85k41O55M63q57p9M09l4j72
6002a38M92k66l43N29k34M20l07j3Q2k33N69o19j18L82J7m94L78M19p64P5M91
6023C25m23K9M06J46o49r5O64m51m0K9n7l0O81j37l68k21M47K4l43j4J18j77K46
6046A10K05m24j99K45K14k49O1L63k52J97K7l45q8P06n98N2J86l38j15M21j18
6067F1l13m4N43P6l56L92k63m85O08K01j99n04N38k20%M8J53p72N94k23L88k82
6089e9N03n58j07N34n3m34j46P08n73p5O72m54k00Q4J20j30L88K38n26l26M26
6110C2O6q0J17l06k17K66O33o48J29j57L66m10M1L42k56O2K70l84n6O2L01k93
6132a20K42K3k81J93L95m38l54M85J55l80N0J67l07M37l6k33j04K7K0P7M96k53
$$ plain form
6154 261 -480 -333 311 43 87 -294 154 -527 205 452 -77 150 231 213 -212 -114 70 -118 115 174 -129 48
6176 48 192 -417 -758 292 609 -182 -127 -41 -30 142 457 155 -154 332 215 170 106 216 -555 -96 355 419
6198 419 -252 -265 17 21 109 455 -124 241 113 187 -623 -23 13 -28 66 -15 -164 -242 269 -191 -260 44 75 95
6222 95 290 -83 -26 -280 400 40 -529 -73 26 -159 -32 293 -145 -198 455 -13 -17 328 145 -111 -96 -143 187
6245 187 -171 98 -197 -495 -117 367 -54 91 -236 -448 -123 371 61 -349 -142 34 -38 47 -133 -385 -152
6266 -152 424 29 -383 48 92 -290 -100 177 -146 -477 -67 236 -259 -225 216 -313 -19 167 22 -27 525
6287 525 173 -460 -46 182 -504 1 146 -103 -231 199 302 -72 -146 105 295 61 258 -369 -190 65
6307 65 57 263 168 -39 -266 324 538 71 -360 352 465 -34 55 619 -308 12 -19 -122 24 172 127 -227
$$ packed form
6154B61p41J47O44k68M4l81M48o81P32K47n29K27Q1j8m25R8J84j88K33N9l03J77
6176D8J44o09l41J050L17p91N5Q6J1J72L15l02l09M86j17m5o4J10p71M59M51O4
6198D19o71j3K82MQ8L46n79L65j28P4q10O00L6m1R4q1j49p8N11m60o9L04L1K0
6222I5J95l73N7k54O80l60n69M56R9j85J27L25m38n3O53m68mL45j83k56J5m7L30
6245A87l58K69k95k98L78M84m21J45l27k12L25M94l10m10K07J76p2Q5j80k52K33
6266a52N76l95m12M31M4l82J90K77l23l31M10L03m95L4M41n29K94J86j45m9N52
6287E25l52o33M14K28o86N05J45k49j28M30J03l74p4K51J90k34J97o27J79K55
6307F5qK06r5k07k27N90K14m67m31P12J13m99Q9N64r27L20l1j03J46J48m5l54
$$ plain form
6329 -227 101 128 1 394 210 -56 -76 416 412 -86 -452 571 70 -60 92 47 22 -112 443 73 -157 11
6351 11 -37 123 495 -97 -93 597 559 -293 -61 415 -72 -196 148 107 -38 -46 107 -173 -257 63 194 368 168
6374 168 -14 -174 7 453 -425 -334 60 -405 -173 532 -9 -128 -70 288 -16 -289 -90 -35 -84 120 -484
6395 -484 -97 215 147 -519 -78 343 75 -519 51 202 -206 84 94 -175 -357 206 377 262 -97 -148 -262
6416 -262 201 437 -252 -73 336 -57 39 204 -144 -521 64 351 63 -204 -184 -26 162 78 -205 -292 345
6437 345 -60 -283 -158 451 48 -296 259 196 -254 -129 116 108 -260 -61 152 48 134 -24 -199 150 151 -329
6459 -329 -281 -25 8 -365 478 -57 -200 -96 515 -56 -234 123 -50 -158 99 112 -204 -15 -79 -503 0
6480 0 193 -169 -324 473 -163 -365 106 420 -220 -274 -175 228 185 -98 -315 -349 20 398 -117 2 -261 -203
$$ packed form
6329b27L28K7j27L93j84k66k0M92mm98l66J023n01j30J52m5k5j34N55l70k30J68
6351A1m8J60L72n92MO90l8q52K32M76m87j24L44m1j45qJ53k80q4L20J31J74k00
6374A68j82j60J81M46q78R1L94m65K32P05n41j19N8L58l04k73J99N5m9K04o04
6395d84L87L12o8o66M41M21k68n94N70J51m08K90J0k69j82N63J71j15l59n1j14
6416b62M63K36o89J79M09l93R6J65l48l77N85K87k88k67K0J58J88q4k83q7O37
6437C45m05k23J25O09m03l44N55o3m50J25K45ql68J99K13j04Q6j58j75L49Jm80
6459c29M8K56L3l73Q43n35j43J04O11n71j78L57j73j08K57J3l16J89o4m24N03
6480@J93l62j55P97o36k02M71L14o40n4R9M03m3k83k17l4L69L78n15J19k63N8
$$ plain form
6502 -203 -7 118 151 -497 154 445 7 -206 296 216 -446 -98 -144 -65 -24 -280 64 -75 143 -19 -56 331
6524 331 -131 -400 -11 343 -126 -462 261 98 -328 241 114 -118 -341 104 -65 -248 -81 -234 373 412
6544 412 109 -390 89 431 -136 -211 208 295 45 52 138 27 -385 480 -213 -189 -332 -12 308 211 -78 -165 69
6567 69 443 -9 -515 -56 90 32 246 -45 73 -77 271 -130 -182 -6 74 -174 223 275 -84 43 307 -191
6589 -191 -261 -157 126 -283 -149 21 -51 -272 299 -129 -295 -111 192 -195 6 -21 -362 16 138 53 -338
6610 -338 201 -119 -336 181 117 -254 -302 199 45 -54 -102 46 -46 52 25 -197 -198 483 -232 -283 -21 18 -331 -161
6634 -161 -117 -730 -395 509 4 -454 5 -25 -38 50 123 -121 -216 184 197 -135 141 -96 -81 34 222 -500 -249
6657 -249 261 186 -180 -254 244 -184 -43 160 171 -176 -41 -208 93 306 306 -104 186 71 -217 -152 317 17
$$ packed form
6502b03J96J25L3o48O51K91m38k13N02q0o62L48m6P9M1k56L44j39K18j62l7L87
6524C31m62k69L89L54m69l36P23j63m26N69j27k32k23M45j69j83J67j53O07L9
6544D12l03m99M79L42n67p5M19Q7k50PQ6j11m12Q65o93K4j43L20L20r7k89q7K34
6567F9L74m52n06M59J46n8K14k91J18j50L48m01n2J76Q0k48L97N2l59J27K64m98
6589a91p0J04K83m09J34J70p2k21N71m28j66J84L03l87K01k7l41L78J22q5l91
6610c38N39l20k17N17o4l71m8N01j54r9m8J48r2R8k7k22jO81p15n1K62L9l49J70
6634a61M4o13L35R04n05m58M59l0j3Q8P3k44r5M00J3l32K76k37J5J15J88p22K51
6657b49N10p5l66p4M98m28J41K03J1l47J35j67L01K13%m10K90j15k88O5M69l00
$$ plain form
6679 17 -463 -284 302 -67 119 206 274 0 199 -147 -256 -9 152 -48 155 187 26 182 474 -72 33
6700 33 -44 140 4 -155 98 -184 -233 46 -72 -297 34 -3 244 -97 -74 24 -141 374 287 -153 49 -257
6722 -257 -95 48 336 -142 -158 45 441 -3 -174 275 57 119 -30 -251 47 83 -102 -190 -161 124 -166 -83
6744 -83 114 68 102 326 204 -98 -112 -176 -165 -4 294 -124 -244 110 309 120 -189 -16 76 309 -61 -226
6766 -226 -140 221 393 -101 -310 -136 60 -23 -25 -172 110 104 239 -90 -186 89 -29 -160 183 -156 -284 28
6788 28 283 -306 -28 134 113 -197 45 -85 -209 61 177 -262 -182 92 -171 163 137 -16 -201 -233 14 -33
6810 -33 -126 310 147 48 262 76 -193 325 75 63 -117 17 -206 -313 -79 123 -243 -26 -26 -176 -82 90
6832 90 -120 -125 33 -131 -131 158 224 -106 -123 -159 -41 267 130 -205 -270 -62 -60 -74 57 108 107 -160 336 138 -139
$$ packed form
6679A7m80J79N86l69J86Q7O8k74J99l46j09K47J61k00K03L2j61J56K92n46J05
6700C3p7J84j36j59K53k82m9K79j18k25L31l7K47l41K3R8j65N15q7m40K02l06
6722b57J62J43K88m78j6K03L96m44j71M49k18O2j49k21K98L6j85q8K9K85k90Q3
6744h3J97m6L4K24j22l02j4o4J1J61K98m18j20L54J99j89l09J73R2K33l70j65
6766b26Q6L61J72m94k09J74J96q3kj47K82oJ35l29r6K75j18j31L43l39j28L12
6788B8K55n89K78J62k1l10K42j30j24K70J16m39Q0K74k63L34k6j53j85l2K47m7
6810c3r3M36j63r9K14j86k69N18k50j2j80J34k23j07K34K02l66K17%j50R4J72
6832I0k10nJ58j64%K89O6l30j7l6J18L08j37l35o5K08Kj4J31N1jk67M96j98k77
$$ plain form
6857 -139 -312 441 -120 -631 202 -70 59 29 75 -269 196 258 -149 -144 -63 -37 -99 2 -263 -342 -59 91 128
6880 128 -52 58 10 165 213 29 -112 -196 363 -113 -64 268 176 -425 330 178 -60 -139 91 255 -39 245
6902 245 -13 -59 -67 99 -327 261 288 73 -78 181 -170 -25 119 147 -317 84 296 12 117 -240 -158 -217
6924 -217 362 -67 -85 178 107 145 -438 243 -34 46 287 17 -277 -189 142 -181 -78 110 -174 16 350 56
6946 56 -153 -53 348 65 -392 -142 -73 -192 246 291 -314 -180 66 49 22 155 257 -33 -133 202 71 -95
6968 -95 147 -85 -290 261 297 -119 206 393 -7 200 30 64 -13 21 10 106 221 -48 -170 120 231 217 179
6991 179 -119 95 33 342 160 -170 -78 170 190 106 300 10 -146 183 1 -400 -41 -25 -95 44 -10 160
7013 160 -111 318 103 -43 -173 268 85 -110 144 129 -251 237 138 -394 -254 76 159 112 192 182 -31 -263
$$ packed form
6857a39j73P53n61n11Q33k72J29l0M6l44M65O2m07NQ1K6o2J01k65p9K83J50L7
6880A28j80J10m8J55M8j84j41q4N59m76M9L32r2o01P55j52k38p9K30J64k94K84
6902B45k58m6qJ66m26N88K7k15j51K59l51J45J44K8m64M01K12k84J05l57Q2n9
6924b17N79m29j8K63p1L8n83O81k77Q0K41k70k94Q8L31l23J03J88k84J90L34k94
6946E6k09J00M01k83m57K50O9j19M38M5o05J34K46j7k7J33J02k90j00L35j31j66
6968i5K42k32k05N51L6m16L25J87m00K07j70L4p7L4j1R6J15k69j22K90J11j4l8
6991A79k98K14o2L09j82l30R2K48K0q4J94k90j56L29j82m01L59J6p0J39n4J70
7013A60k71M29k15j46j30M41j83j95K54j5l80M88r9n32J40L30Q3m7Q0j0k13k32
$$ plain form
7035 -263 84 -62 -329 146 186 27 48 -62 -81 -174 101 -473 -71 94 -147 -92 44 3 -167 115 7 -136
7057 -136 158 481 -156 -248 -242 137 50 255 66 -126 33 -95 16 60 -144 -7 334 104 182 -344 -109 315
7079 315 182 32 -217 -20 -356 -95 259 -325 47 -22 282 -308 -208 152 -191 -79 171 -106 -295 -190
7099 -190 -121 13 -91 269 59 128 265 -164 57 153 189 120 -103 -163 25 207 154 -123 69 -41 -210 -228 -79
7122 -79 -200 -274 -296 164 -154 -203 -228 413 -25 -152 -23 69 -282 48 -215 -225 -109 435 -119 -99 341 -224 -79
7145 -79 125 -103 -461 208 440 163 -329 -179 55 -19 151 -170 -112 58 -260 39 -180 351 -58 -38 114
7166 114 -92 -82 -41 167 -208 -234 169 -170 17 370 -415 -120 80 396 -295 -95 -182 72 -279 85 90 -144
7188 -144 52 252 209 -196 177 237 -70 115 124 43 15 -68 -269 75 -116 -158 41 15 -80 -177 -21 389 -27 -336
$$ packed form
7035b63L47j46k67M75M0j59K1j10j9r3K75n74M02J65k41N5J36m1j70K82j08j43
7057a36K94L23o37r2OL79q7K05j89j92J59j28J11M4k04J37L41k30P8n26K35M24
7079C15j33j50k49J97l36K61L54n84L72o9L04n90J00L60l43J12K50k77j89J05
7099a90O9J34j04L60k10O9J37m29K21R6L6o9k23o0J88J82n3k77J92j10j69j8J49
7122g9j21p4k2M60l18m9k5O41m38j27J29R2l51L30k63j0J16N44n54K0M40n65J45
7145g9K04k28l58O69K32k77m92J50K34p4J70l21N8J70l18K99k19N31m09K0J52
7166A14k06J0M1K08l75k6M03l39J87L53p85K95K00L16o91K00q7K54l51L64Nk34
7188a44J96K00m3m05L73O0l07J85Rq1k8q3k01L44j91m2J99k6r5r7J56M10m16l09
$$ plain form
7212 -336 81 282 212 -36 -5 -346 113 -35 -55 94 7 -138 73 220 -254 -194 71 461 -252 65 272 -12
7234 -12 276 137 179 -316 64 260 301 -36 -38 170 213 40 89 -159 271 108 -260 -291 189 145 -214 -121 64
7257 64 73 -39 -62 71 8 -55 -177 -5 20 21 -564 348 114 -247 -111 103 24 -107 120 177 50 -93 137 -55
7281 -55 -77 -123 150 222 67 -311 -195 198 -285 -52 100 1 -86 -238 329 -125 -274 -215 277 -96 -71 -159 -257
7304 -257 -135 -155 -8 150 144 -23 -104 -545 290 -352 -205 -335 -93 -60 -158 138 125 -144 59 -88 20 -59 168
7327 168 115 -148 97 -26 -159 -59 99 -126 272 446 85 212 191 -101 -191 -13 -7 -181 194 -40 101 -378
7349 -378 271 164 182 335 -74 -289 486 325 -286 88 265 -194 -149 9 281 164 167 593 -269 7 197
7370 197 388 17 124 123 21 -111 54 -157 -139 267 -144 -210 283 -53 -135 170 262 -258 -145 161 167 72 -199
$$ packed form
7212c36M17K01p0k48L1l41M59j48k0J49q7j45K11J47m74O0K65L90p13L17K07k84
7234a2K88j39M2m95L80J96M1l37kK08M3j73M9k48M30j63l68l1M80m4l59R3J85
7257F4Rj12k3J33o3o3j22J72K5Jn85R12k34l61J36K14p9j31K27N7j27j43K30j92
7281e5k2m6K73P2j55l78J16L93m83K33J52r9q7j52N67m54j49N9M92l73K5q8r8
7304b57J22k0J47J58oj67q1m41Q35o42J47j30K42L3r8K96j3k69K03j47J08p9K27
7327A68n3k63K45j23j33J00J58k25L98J74l61J27k1k92r0J78Oj74L75k34J41m79
7349c78O49j07J8J53m09k15P75j61o11L74J77m59M5J58K72j17LM26q62K76J90
7370A97J91l71J07jj02j32J65k11J8M06m11o6M93l36q2L05R2n20J13L06Or5k71
$$ plain form
7393 -199 -2 -206 -117 38 -145 164 70 387 -156 225 148 -112 93 335 -147 -404 61 -394 81 -193 207
7414 207 -141 -150 142 -197 -22 108 42 -440 13 5 -439 -115 139 -46 -116 -146 190 179 82 -75 -230 -150 78
7437 78 24 -78 222 -166 -336 -99 93 -7 152 123 -27 -437 209 338 -115 -236 224 28 -129 117 -263
7458 -263 -55 136 245 -34 42 -115 -113 56 235 96 -197 39 -118 -5 161 -1 -125 -208 178 -224 185
7479 185 213 -259 107 197 297 20 -229 199 13 -303 289 126 -293 -134 -79 -67 -6 -12 164 -74 -80 357 191
7502 191 280 -297 -287 96 -190 59 -401 203 133 -61 72 71 217 -17 -110 -26 -59 181 226 -116 -192 -347 141
7525 141 5 209 128 -42 -384 104 13 -258 84 -230 -69 -6 255 -64 369 -78 -36 -28 321 318 10 155 231
7548 231 -239 447 29 -12 -36 350 -173 28 45 136 -30 58 -82 -419 21 -20 280 132 96 21 -28 220 -62
$$ packed form
7393a99J97k04Q9J55j83L09r4L17n43L81p7k60K05K42m82k57M65m55M75k74M00
7414B07l48rK92l39J75J30o6m82M53qm44L24K54j85p0l0L36j1r7j57j55Q0K28
7437G8n4j02L00l88j70K37J92j00J59k9j50m10O46J29m53j21M60j96j57K46l80
7458b63K08J91J09k79P6j57KJ69J79j39k93K36j57J13J66j62j24q3L86m02M09
7479A85K8m72L66R0J00k77k49M28j86l16N92j63m19J59N5J2O1oJ76k38oM37j66
7502A91Q9n77J0L83k86K49m60O04p0j94J33jJ46k34r3Q4l3K40M5l42p6j55M88
7525A41j36K04q1j70l42M88r1k71L42l14J61O3K61l19M33m47M2QL49ll08J45P6
7548B31m70O86m18m1k4L86n23K01J7R1j66Q8j40l37M40m1L00j48l6p5m9K48k82
$$ plain form
7571 -62 -292 -130 111 7 66 253 -144 -170 155 239 -228 95 85 -86 15 -30 262 -395 97 272 -299 -24
7593 -24 -48 19 -185 240 -114 -377 18 314 -303 38 -313 -79 272 47 -161 -218 -37 44 -82 -373 160 -428
7615 -428 -129 232 172 -193 87 73 -132 31 225 149 -139 127 178 -113 43 85 -269 -105 184 -275 -100 -7
7637 -7 62 -354 40 184 -180 -277 -230 -138 -149 243 -12 23 88 49 83 9 -72 101 7 348 23 154 -233 118 220
7662 220 -150 -8 -8 90 28 -132 -25 224 78 -270 -139 -127 97 -31 205 299 -155 138 383 3 19 301
7684 301 -234 144 2 185 -110 72 89 -62 -113 97 -141 -229 -38 32 -104 -44 -94 258 -109 -261 223 -7
7706 -7 29 -33 -101 -78 230 295 10 192 13 41 -178 -2 27 -231 78 175 2 -45 -120 35 201 94 -34 -65
7730 -65 -4 319 -67 -66 -99 -406 135 392 -100 -46 195 106 -350 -2 228 24 -63 -167 175 -35 -272 42 -205
$$ packed form
7571f2k30J62K41j04N9J87l97k6L25Q4m67L23j0j71J01m5K92o57M92J75n71K75
7593b4k4O7k04M25l54k63L95K96o17L41l51K34L51k25k08n7J81Q1j26k91N33n88
7615d28K99L61o0l65K80j4k05J63J94p6k88K66N1k91J56M2l54J64K89m59J75R3
7637gO9m16L94J44l64r7M7R2j1L92k55L5O5l9L4p4q1J73r4L41l25J31l87L51J02
7662B20l70J42%R8o2j60J07K49j46l48J31J2K24j28K36R4m54K93K45l80J6K82
7684C01n35L78j42J83k95J82J7j51n1K10k38q8J91P0j36O0n0L52l67j52M84k30
7706gL6o2o8K3L08O5k85J82j79K8k19J76K9k58L09R7j73m7p5J55J66j07j28l1
7730f5O1L23l86Jl3l07N41K57m92N4K41q9m56L48K30k04q7j04L42k10k37L14k47
$$ plain form
7753 -205 31 -77 50 -30 -276 -8 -140 170 119 -228 -3 -259 -220 -65 414 379 -315 173 -24 60 245 -230
7775 -230 -68 41 120 -146 23 269 -60 -147 -63 99 -212 -93 -62 -172 155 75 -149 -342 -109 -92 -22 65 142
7798 142 -350 -205 58 107 -283 114 84 84 100 -52 110 -141 -96 -22 -359 206 28 -255 167 332 -210 27
7820 27 280 -327 -45 94 260 -68 40 212 84 -269 -131 180 405 5 -296 -45 25 -56 -82 122 471
7841 471 -48 -375 -189 155 -40 -8 107 -367 -43 -29 -44 14 3 -74 -181 26 -48 -19 231 115 -142 -212 2
7864 2 -30 -97 -137 68 178 -216 1 126 -60 -103 78 83 287 484 -129 -44 189 68 -40 235 -136 -121 159
7887 159 198 -75 -175 334 32 -37 -52 149 108 97 295 213 -47 -159 8 38 114 -240 -244 412 -33 -249 -135
7910 -135 177 13 -143 -213 57 -154 -13 142 194 3 -102 125 -25 -138 -32 -157 -174 330 -229 157 128
$$ packed form
7753b05K36j08J27q0k46K68j32L10n1l47K25k56L9J55M79l5o94M88j97Q4J85m75
7775b30J62J09P9k66J69K46l29q7Q4J62l11J19L1j10L27q0k24j93K33J7P0Q7P7
7798A42m92J45K63M9l90L97l0%J6j52J62k51M5P4l37N65j78k83M22J65n42K37
7820B7K53o07K82J39J66l28J08J72j28l53J38L11K25m00l01K51P0q1k6K04L49
7841D71n19l27J86L44j95L2J15m74L24J4j5N8j1p7j07K07p4K9K50j16k57p0K14
7864Bl2o7m0K05J10l94K17J25j86m3J81NK04J97o13Q5K33j21j08K75l71J5K80
7887A59L9k73j00N09l02o9j5K01m1j1J98q2k60j12J67L0P6l54mO56m45k16J14
7910a35L12j64j56p0K70k11J41J55N2j91j05K27j50j13J06j25j7N04n59L86k9
$$ plain form
7931 128 -97 -199 -109 -138 -141 -150 -84 -471 -207 9 217 3 133 -200 -358 49 210 32 -351 58 -279 183
7953 183 -41 78 170 -143 285 88 -173 -248 106 -86 -117 -56 -395 -71 311 32 -53 124 265 -255 30 39
7975 39 20 -438 -23 67 -238 -41 -229 224 -198 88 -28 36 -149 -69 -135 241 387 168 -63 310 -116 -316
7997 -316 20 135 -99 226 242 47 -186 -171 83 1 -25 -169 37 159 303 -272 -212 156 3 -114 -43 -86
8019 -86 -197 41 239 -109 -5 21 0 270 217 -105 -96 -9 186 -226 204 -112 -158 -209 -137 -135 -118 -112 -240 103 108 158
8045 158 -55 -281 -124 202 139 -88 -223 -19 96 238 -371 -337 108 -191 -281 93 157 16 -208 5 36 -35
8067 -35 -253 -200 -189 -53 170 181 167 -87 -434 34 34 -14 -184 -209 -46 -306 -1 96 -95 -304 94 216 266 152
8091 152 -31 39 -158 89 145 19 17 29 -241 150 63 -122 -266 -57 28 -5 234 200 -268 121 -175 115 465
$$ packed form
7931A28k25j02R0k9lrO6l87K64K16K08k14J30l33j58M07J61j78l83M09l37M62
7953A83k24J19R2l13M28j97k61p5L54j92l1O1l39L24L82k79q5J77J41n20K85R
7975C9j9m58M15R0l05J97j88M53m22K86j16O4j85Q0o6L76J46k19k31L73m26k00
7997c16L36J15k34L25J6j95k33J5K54q2k6j44K06J22J44n75O0L68j53j17P1m3
8019h6j11K38J98l48J04K6k1K70n3l22RQ7J95m12M30l16m6n1P2KJ7Oj28L43NN0
8045A58k13k26J57L26o3k27j35K04J15J42o09L4M45k99r0L74O4j41k24K13L1p1
8067c5k18N3J1J36K23J1j4k54l47M68%m8j70k5J63k60L05R7j91k09L98J22N0j14
8091A52j83P0j97K47N6j26kJ2k70L91q7j85j44K09Q5l3K39l4m68L89k96K90L50
$$ plain form
8114 465 77 -18 -143 285 -51 -88 -24 95 116 71 92 8 57 85 338 -185 1 10 130 48 -216 163 260 48
8138 48 -90 -23 98 79 -149 -350 -70 -214 79 274 223 -330 -381 245 -56 -283 -177 218 -236 222 343 -167
8160 -167 -132 104 -93 -59 3 -176 -13 -16 -183 -323 -1 120 -30 103 -12 35 -278 -103 -114 -207 96 -222 -251
8183 -251 -228 -153 136 18 -81 482 -137 -46
$$ packed form
8114D65l88r5j25M28l36l7O4J19K1m5K1q4M9K8K53n23J86RJ20q2k64L79R7k12
8138D8j38O7J21j9k28k01K80j44K93J95n1n53n1O26l01k27J06L95m54M58J21n10
8160a67L5K36j97L4O2j79J63lj67j40L22J21j50J33j15M7l13J75j1r3L03l18k9
8183b51K3P5K89j18r9N63o19R1
8191d6
$$ Imaginary data points
##PAGE= N=2
##DATA TABLE= (X++(I..I)), XYDATA
$$ plain form
0 0 0 0 0 0 0 0 8 -8 8 -8 16 -16 24 -24 32 -40 48 -56 64 -75 90 -100 117 -138 157 -180 205 -231 263 -296
30 -296 335 -376 420 -468 525 -582 649 -721 798 -886 981 -1084 1201 -1330 1474 -1634 1818
47 1818 -2027 2268 -2547 2877 -3273 3768 -4391 5211 -6345 8017 -10745 15944 -29398 134534
61 134534 261592 -83223 -103223 89538 135228 5334 21514 81353 38152 -34124 38903
72 38903 133354 77305 -72427 -47478 108670 106049 -42145 -10913 121257 50389 -93264
83 -93264 615 137609 49746 -72151 -10342 72465 44624 5927 19164 20118 -14286 -29010
95 -29010 30330 93193 30721 -77628 -25415 100196 55145 -57494 -10797 67551 10483 -33921
107 -33921 35649 61779 -5610 -32245 7482 31826 14958 -7429 6036 37722 11110 -41425
$$ packed form
0@%%%%%%Qj6J6j6K4l2M0m8N6p2Q8j04J20j39J65j90K17k55K95l37L85m36M94n59
30b96O31p11P96q88R93j107J231j370J519j684J867k065K285k531K804l108L452
47A818l845M295m815N424o150P041q159R602j1556J4362j8762K6689m5342J63932
61A34534J27058l44815k0000J92761M5690j29894J6180N9839m3201p2276P3027
72C8903R4451n6049j49732K4949J56148k621j48194L1232J32170p0868j43653
83i3264R3879J36994q7863j21897O1809Q2807k7841l8697J3237R54l4404j4724
95b9010N9340O2863o2472j08349N2213J25611m5051j12639M6697P8348n7068m4404
107c3921O9570K6130o7389k6635L9727K4344j6868k2387J3465L1686k6612n2535
$$ plain form
119 -41425 7261 78849 7228 -83892 -6395 85401 23777 -37144 5324 15185 -27021 -3009
131 -3009 47271 15723 -44248 -35245 28277 59006 730 -67708 -26810 50501 19238 -34311
143 -34311 10304 31743 -32902 -26001 54188 27485 -59848 -29462 48466 34481 -13417 -10894
155 -10894 7046 6770 -2984 -4372 21265 33357 -9970 -25637 35744 51413 -16199 -22775 36776
168 36776 25001 -14622 25070 56518 4430 -25431 13313 38623 28801 12550 -3850 3778
180 3778 35074 32665 9116 17619 15609 -13794 11007 63497 31849 -24884 2985 42151 17267
193 17267 2150 21073 15601 1346 11167 14342 14195 28822 15871 -15380 -4084 22184 17191
206 17191 22212 27928 -18007 -38263 32908 70245 1971 -46157 -12377 23462 35022 34366 -4067
$$ packed form
119d1425M8686P1588p1621r1120P7497R1796o1624o0921M2468R861m2206K4012
131c009N0280l1548n9971R003O3522L0729n8276o8438M0898P7311l1263n3549
143c4311M4615K1439o4645O901Q0189k6703q7333L0386P7928j3985m7898K523
155a0894J7940k76r754j388K5637J2092m3327j5667O1381J5669o7612o576N9551
168C6776j1775l9623L9692L1448n2088k9861L8744K5310r822j6251j6400P628
180C778L1296k409k3549Q503k010k9403K4801N2490l1648n6733K7869L9166k4884
193A7267j5117J8923n472j4255R821L175j47J4627j2951l1251J1296K6268m993
206A7191N021N716m5935k0256P1171L7337o8274m8128L3780L5839J1560o56l8433
$$ plain form
219 -4067 -42072 -14033 34609 36368 9532 -20746 -32380 10205 52165 13408 -33130 -3434
231 -3434 19499 -11100 -3281 34963 8888 -31779 -9851 16048 3759 2035 7539 -11571 -19085
244 -19085 378 15138 18494 2079 -39531 -35389 30238 42105 -23243 -39735 2628 4963 -9026
257 -9026 11234 5233 -36092 -25649 18852 16075 -14564 -21998 -14599 -473 6214 -14411 -21202
270 -21202 9814 8812 -31921 -22013 19992 3086 -25839 -6009 -1358 -26162 -5844 29099 91
283 91 -41162 -24621 11900 22734 4891 -30323 -36787 7434 28701 -2892 -17797 -9053 -20247
296 -20247 -11009 33037 20256 -40452 -32067 22808 20245 -10959 -8007 -2526 -10501 -1640 8869
309 8869 4902 3076 -7236 -20556 1672 26770 879 -20281 3969 6015 -17378 6758 34806
$$ packed form
219d067l8005K8039M8642J759k6836l0278j1634M2585M1960l8757m6538K9696
231c434K2933l0599P819L8244k6075m0667K1928K5899j2289j724N504j9110p514
244a9085J9463J4760L356j6415m1610M142O5627J1867o5348j6492M2363K335j3989
257i026K0260o001m1325J0443M4501k777l0639p434P399J4126O687k0625o791
270b1202L1016j002m0733R908M2005j6906k8925J9830M651k4804K0318L4943k9008
283I1m1253J6541L6521J0834j7843l5214o464M4221K1267l1593j4905Q744j1194
296b0247R238M4046j2781o0708Q385N4875k563l1204K952N481p975Q861J0509
309H869l967j826j0312j3320K2228K5098k5891k1160K4250K046k3393K4136K8048
$$ plain form
322 34806 -5917 -38221 -458 31145 12934 -5026 -8707 -9940 5858 19049 4881 -4747 -3313
335 -3313 -11720 -1052 31639 15565 -31193 -15013 27605 12071 -13287 4726 11823 -8330 -1723
348 -1723 13081 2297 -2477 4834 -1201 -4166 5482 1504 152 14376 -1192 -29677 -2215 37848
362 37848 10742 -27358 -12624 7235 8104 16526 8835 -24195 -22321 15740 23977 3965 -11722
375 -11722 -22118 -11378 23552 22072 -19128 -22888 5937 4494 -2671 11527 2616 -21160 -7786
388 -7786 13059 2371 -2054 6430 -8507 -18880 3362 14040 193 -4145 -9894 -20545 3157
401 3157 30124 3327 -29907 -14512 7273 8629 13146 2280 -26669 -16891 22786 20615 -8695
414 -8695 -13175 -8383 -4959 13956 14916 -14779 -18364 7884 7940 -5059 2584 2726 -8915 2446 10669
$$ packed form
322C4806m0723l2304L7763L1603j8211j7960l681j233J5798J3191j4168r628J434
335c313q407J0668L2691j6074m6758J6180M2618j5534k5358J8013P097k0153O607
348a723J4804j0784m774P311o035k965R648l978j352J4224j5568k8485K7462M0063
362C7848k7106l8100J4734J9859Q69Q422p691l3030J874L8061Q237k0012j5687
375a1722j0396J0740L4930j480m1200l760K8825j443p165J4198q911k3776J3374
388g786K0845j0688m425Q484j4937j0373K2242J0678j3847m338n749j0651K3702
401C157K6967k6797l3234J5395K1785J356M517j0866k8949R778L9677k171k9310
414h695m480M792L424J8915R60k9695l585K6248N6j2999P643J42j1641J1361Q223
$$ plain form
429 10669 -7259 -5830 16002 5330 -17063 -5749 8862 5026 7526 2299 -20472 -12641 21812
442 21812 18759 -11205 -16071 -6210 2530 19911 15651 -19645 -23990 10960 19431 1469 -923 -5588
456 -5588 -14414 3485 19963 -1295 -16064 -924 1156 -6487 6184 10892 -6903 -8929 -198
469 -198 -3400 4849 18103 -3298 -26084 -4623 18008 7547 -1335 -5559 -19644 -8932 24168
482 24168 17243 -18980 -21530 -1394 6453 11993 5934 -20134 -20496 10058 15568 -3447 -5513 -5672
496 -5672 -13202 1374 14967 -5897 -19556 -669 4328 -9822 -3646 3046 -8643 -8331 1451 -7351
510 -7351 -10071 7227 4723 -13772 -10703 -2225 -4942 3155 7692 -15625 -23811 4801 14137 -5625
524 -5625 -11428 -9336 -13525 14 17395 -1177 -22780 -9042 5596 2248 3637 140 -13544
$$ packed form
429A0669j7928J429K1832j0672k2393J1314J4611l836K500n227k2771P831L4453
442B1812l053k9964m866R861Q740J7381m260l5296m345L4950Q471j7962k392m665
456e588q826J7899J6478k1258j4769J5140K080p643J2671M708j7795k026Q731
469a98l202Q249J3254k1401k2786K1461K2631j0461q882m224j4085J0712L3100
482B4168o925l6223k550K0136P847N540o059k6068l62L0554N510j9015k066j59
496e672p530J4576J3593k0864j3659J8887M997j4150O176O692j1689L12R782q802
510g351k720J7298k504j8495L069Q478k717Q097M537k3317q186K8612R336j9762
524e625n803K092m189J3539J7381j8572k1603J3738J4638l348J389l497j3684
$$ plain form
537 -13544 -7246 9789 2609 -5485 4141 -1828 -15955 382 15980 559 -7646 1200 -5583 -7341
551 -7341 15601 17725 -10970 -17035 2569 13303 13878 5938 -15357 -15189 14163 21600 285 -7045
565 -7045 -5204 -7985 9450 26460 -144 -26553 -2265 22191 8237 -4050 -761 -2768 338
578 338 12022 6197 -5540 -191 2688 -423 6384 5535 -8834 -261 16480 -2524 -18530 8201
592 8201 22982 -4249 -15854 2932 9020 4680 5646 -2442 -11774 211 12831 8137 625 -9499
606 -9499 -15099 7212 26158 -1613 -26040 -922 18588 -1748 -9321 6459 1385 -12007 -1975
619 -1975 7671 1316 -2087 -4018 -8256 -3397 1479 -2114 3005 2549 -22244 -23259 18823 26851 -20669
634 -20669 -36677 -1471 14338 1903 -4056 -10930 -22567 -11463 10975 10715 -8456 -26031 -22478
$$ packed form
537a3544O298J7035p180q094R626n969j4127J6337J5598j5421q205Q846o783j758
551g341K2942K124k8695o065J9604J0734N75p940k1295J68K9352P437k1315p330
565g045J841k781J7435J7010k6604k6409K4288K4456j3954j2287L289k007L106
578C38J1684n825j1737N349K879l111O807q49j4369Q573J6741j9004j6006K6731
592H201J4781k7231j1605J8786O088m340R66q088r332J1985J2620m694p512j0124
606i499n600K2311J8946k7771k4427K5118J9510k0336p573J5780n074j3392J0032
619a975R646o355l403j931m238M859M876l593N119m56k4793j015M2082Q028m7520
634b0669j6008L5206J5809j2435n959o874j1637J1104K2438k60j9171j7575L553
$$ plain form
647 -22478 7308 21215 -10368 -32111 -4760 9197 -14195 -12192 11741 -3258 -28068 -10140
659 -10140 12393 -653 -13959 -6289 -1873 -6642 -9062 -3273 8316 3486 -22686 -21558 15918
672 15918 19739 -16729 -19044 8167 -56 -15068 7789 18673 -12960 -25350 2850 19254 4483
685 4483 -12274 -11019 3603 8532 -4346 -3520 14337 3467 -24640 -6044 28421 9601 -21489
698 -21489 -4822 13963 -3555 -6912 14975 11226 -15416 -16961 8288 24584 9870 -19446 -18023
711 -18023 14688 19684 -5570 -4988 10411 -5898 -14080 19202 27495 -15652 -27108 10849 25434
724 25434 738 -13115 -2363 9062 7185 -3201 -1830 9553 1773 -12112 6339 22666 -5955
737 -5955 -22481 12004 24348 -13005 -20646 14374 18310 -10106 -13434 6365 9953 -2147 -9563
$$ packed form
647b2478K9786J3907l1583k1743K7351J3957k3392K003K3933j4999k4810J7928
659a0140K2533j3046j3306P670M416m769k420N789J1589m830k6172J128L7476
672A5918L821l6468k315K7211q223j5012K2857J0884l1633j2390K8200J6404j4771
685D483j6757J255J4622M929j2878Q26J7857j0870k8107J8596L4465j8820l1090
698b1489J6667J8785j7518l357K1887l749k6642j545K5249J6296j4714k9316J423
711a8023L2711M996k5254N82J5399j6309q182L3282Q293m3147j1456L7957J4585
724B5434k4696j3853J0752J1425j877j0386J371J1383p780j3885J8451J6327k8621
737e955j6526L4485J2344l7353p641L5020L936k8416l328J9799L588j2100p416
$$ plain form
750 -9563 -2686 7122 -370 -9685 4161 10888 -14418 -19205 16194 17007 -25140 -23787 17923 16709
764 16709 -17910 -18672 1667 1289 -8104 -6353 -827 -1619 -9170 -11209 1787 3782 -16929 -17289 10308
779 10308 5110 -26657 -13626 21530 3769 -33971 -21217 10674 8046 -8274 -12668 -11643 -7644
792 -7644 -528 1963 -1844 -14251 -25295 -5576 26613 10521 -34297 -26525 13905 10583 -13971
805 -13971 -6993 1331 -13216 -12240 8600 8189 -10179 -17316 -7732 4233 4960 -6363 -5684 6368
819 6368 -3178 -19741 -1089 20862 -3314 -26260 -3775 15101 -569 -6901 2187 -5905 -15214
832 -15214 -341 12981 5093 -9850 -13279 -373 13369 2962 -15088 -5182 9784 -3747 -9554
845 -9554 11190 10900 -14076 -12516 7149 1215 -8191 5232 8969 -7369 -12351 842 11195 6908
$$ packed form
750i563O877R808p492r315J3846O727k5306m787L5399Q13m2147J353M1710j214
764A6709l4619p62K0339l78r393J751N526p92p551k039J2996J995k0711l60K7597
779A0308n198l1767J3031L5156j7761l7740J2754L1891k628j6320m394J025L999
792g644P116K491l807j2407j1044J9719L2189j6092m4818P772M0430l322k4554
805a3971O978Q324j4547R76K0840m11j8368p137R584J1965P27j1323O79J2052
819F368r546j6563J8652K1951k4176k2946K2485J8876j5670o332R088q092r309
832a5214J4873J3322p888j4943l429J2906J3742j0407j8050R906J4966j3531n807
845i554K0744k90k4976J560J9665n934r406J3423L737j6338m982J3193J0353m287
$$ plain form
859 6908 -9147 -16626 2267 19103 4852 -9287 -2866 -3664 -10190 7190 18603 -7106 -22842
872 -22842 1984 18376 2711 -9617 -7229 -3829 1049 5963 2957 116 -2889 -9553 -2954 11624
886 11624 2451 -16191 -3253 13337 -1731 -12420 3624 5072 -12367 -8817 6723 4330 -3925
899 -3925 -3087 -1794 -1448 -106 -2841 -2970 1738 -5459 -10386 6715 13111 -10713 -19093 4090 9016
914 9016 -8219 -6423 4334 -2508 -6184 3882 2052 -8616 -7492 970 3530 1653 -6108 -7054
928 -7054 5867 6803 -12731 -12807 9686 7853 -11673 -7052 6201 -323 -3359 5112 -2434 -14311
942 -14311 -2444 13983 8718 -7250 -13245 -4681 11708 11260 -10458 -14734 4651 8641 -1329 2178
956 2178 2869 -12087 -8129 13874 10532 -10344 -8100 5621 5460 475 -945 -1857 887 1157 -5018
$$ packed form
859F908j6055p479J8893J6836j4251j4139O421p98o526J7380J1413k5709j5736
872b2842K4826J6392j5665j2328K388L400M878M914l006k841l005o664O599J4578
886A1624r173j8642J2938J6590j5068j0689J6044J448j7439L550J5540k393q255
899c925Q38J293L46J342k735j29M708p197m927J7101O396k3824q380K3183M926
914I016j7235J796J0757o842l676J0066j830j0668J124Q462K560j877p761r46
928g054J2921R36j9534p6K2493j833j9526M621J3253o524l036Q471p546j1877
942a4311J1867J6427n265j5968n995Q564J6389m48k1718m276J9385L990r970L507
956B178O91j4956L958K2003l342k0876K244J3721j61m985j420r12K744K70o175
$$ plain form
971 -5018 472 12402 2478 -13299 -3151 9438 -683 -3120 8269 926 -11683 783 15207
984 15207 3751 -10468 -7433 2201 9996 7414 -6392 -7951 4761 4998 -2976 1970 4126 -8195
998 -8195 -4187 13456 5797 -12493 -3494 10251 623 -8003 -703 5332 4639 373 -7123 -5453 6436
1013 6436 6073 -4375 -2909 -536 -5650 2242 13888 -1604 -20275 -4004 15531 5159 -7738
1026 -7738 -4891 -1656 459 5716 2418 -5470 -4525 -1482 716 6737 3837 -10445 -8012 8329 3761
1041 3761 -8322 713 7322 -6192 -8277 6488 7011 -4559 -5175 -1253 -283 3702 3323 -3114 -2204
1056 -2204 -540 -3668 2688 10162 -3223 -15245 1592 14823 256 -8600 732 1569 -3105 4048
1070 4048 6107 -3583 -5283 1069 3636 3871 -329 -6422 -565 10162 1337 -9450 2904 10913
$$ packed form
971e018N490J1930r924j5777J0148J2589j0121k437J1389p343j2609J2466J4424
984A5207j1456j4219L035R634P795k582j3806j559J2712K37p974M946K156j2321
998h195M008J7643p659j8290Q999J3745r628q626P300O035o93m266p496J670J1889
1013F436l63j0448J466K373n114P892J1646j5492j8671J6271J9535j0372j2897
1026g738K847L235K115N257l298p888R45L043K198O021k900j4282K433J6341m568
1041C761j2083R035O609j3514k085J4765N23j1570o16L922R70L985l79o437R10
1056b204J664l128O356P474j3385j2022J6837J3231j4567q856R332Q37m674P153
1070D048K059r690j700O352K567K35m200o093N857J0727q825j0787J2354Q009
$$ plain form
1084 10913 -2597 -7035 5217 4268 -2748 4090 5064 -5903 -4064 7582 8111 596 -4608 -5227 4235
1099 4235 14263 2860 -10940 -2345 8948 3225 1792 5764 -3883 -8330 7739 13786 -1772
1112 -1772 -7393 1358 3984 3052 3647 234 -2513 2600 1880 -1333 5528 6239 -5251 -4393 6738 3357
1128 3357 -2855 4037 2779 -9236 -3454 11414 6086 -7054 -6035 -671 3841 7412 406 -9997
1142 -9997 -4001 5858 2800 408 480 -6749 -7103 8695 9107 -9481 -10068 5074 4780 -3771 -2220 -1074
1158 -1074 -2207 2124 1119 -6330 -2261 5000 540 -2977 -419 -3705 -3223 8222 4779 -12332 -9033
1173 -9033 8625 7256 -4374 -5125 -3350 -1643 5657 5589 -5753 -6966 1352 2082 1655 3393 -3891
1188 -3891 -7580 3508 7138 -4285 -4605 4281 -283 -6060 2258 5013 -1741 -2361 -829 -3571 1358
$$ packed form
1084A0913j3510m438J2252r49p016O838R74j0967J839J1646N29p515n204o19R462
1099D235J0028j1403j3800Q595J1293n723j433L972r647m447J6069O047j5558
1112a772n621Q751K626r32N95l413k747N113p20l213O861P11j1490Q58J1131l381
1128C357o212O892j258j2015N782J4868n328j3140J019N364M512L571p006j0403
1142i997N996R859l058k392P2p229l54J5798M12j8588n87J5142k94q551J551J146
1158a074j133M331j005p449M069P261m460l517K558l286M82J1445l443j7111L299
1173i033J7658j369j1630p51J775J707P300o8j1342j213Q318P30m27J738p284
1188c891l689J1088L630j1423l20Q886m564n777Q318K755o754o20J532k742M929
$$ plain form
1203 1358 8050 -522 -6466 -119 2769 1531 5216 1784 -9657 -3540 11729 7088 -5275 -3410
1217 -3410 554 533 6536 6327 -4426 -5172 4985 5695 2102 2903 -1244 -4246 6316 10065 -1950
1232 -1950 -4177 5620 3988 -1808 3131 4394 -1197 2068 6030 -317 -1654 5490 4143 102 2563
1247 2563 786 -1568 7108 9326 -4119 -6762 5472 7382 1159 1707 301 -5127 1873 9322 2627
1262 2627 -4118 -523 481 1464 6598 2402 -6781 -1086 6627 292 -1435 5040 890 -6860 264
1277 264 6007 1420 -105 304 -5135 -3109 6618 4696 -3601 -3086 -1744 -1846 6391 8478 -6819 -12462
1293 -12462 2612 9288 1965 -1734 -3981 -6194 1757 8865 240 -7597 -2600 777 1866 4517
1307 4517 -1303 -9071 -254 8607 -1628 -8388 2154 5622 -3011 -3593 108 -1367 894 4481 -2123
$$ packed form
1203A358O692q572n944O347K888j238L685l432j1441O117J5269m641j2363J865
1217c410L964k1O003k09j0753p46J0157P10l593Q01m147l002J0562L749j2015
1232a950k227R797j632n796M939J263n591L265L962o347j337P144j347m041K461
1247B563j777k354Q676K218j3445k643J2234J910o223N48j406n428P000P449o695
1262B627o745L595J004R83N134m196r183N695P713o335j727O475m150p750P124
1277B64N743m587j525M09n439K026R727j922q297N15J342j02Q237K087j5297n643
1293a2462J5074O676p323l699k247k213P951P108q625p837M997L377J089K651
1307D517n820p768Q817Q861j0235o760J0542L468q633n82L701j475K261L587o604
$$ plain form
1322 -2123 -6279 -136 3479 1715 1088 -4643 -7978 4559 12453 -2817 -11908 1852 7605 -1182
1336 -1182 -1659 2461 -1925 -2606 3446 2047 -2519 -454 719 238 2611 32 -3692 3743 7053 -5626
1352 -5626 -7652 8878 9546 -6581 -6542 5196 4259 132 2064 -924 -3897 1793 5869 2019 -1570
1367 -1570 -4689 -2682 8965 9805 -6778 -10914 6661 10669 -2877 -3499 3552 -909 -2830 6142
1381 6142 5202 -5135 -5002 2073 5038 3287 -2042 -5545 2620 6864 -3057 -4838 6279 3735 -7772
1396 -7772 -1121 8642 -239 -6140 2855 3585 -4565 -2186 5234 3095 -2141 -4242 -2367 4492 6176
1411 6176 -3933 -6633 3234 2891 -4429 2059 6073 -5322 -8521 5753 7210 -3888 -3960 1736 -971
1426 -971 -2170 1868 2472 677 -1653 -5892 -1652 8642 4024 -7611 -3568 3495 -1492 -558 8189
$$ packed form
1322b123m156O143L615j764o27n731l335J2537P894j5270r091J3760N753q787
1336a182m77M120m386o81O052j399m566K065J173m81K373k579l724P435L310j2679
1352e626k026J6530O68j6127L9J1738r37m127J932k988k973N690M076l850l589
1367a570l119K007J1647Q40j6583m136J7575M008j3546o22P051m461j921Q972
1381F142r40j0337J33P075K965j751n329l503Q165M244r921j781J1117k544j1507
1396g772O651R763q881n901Q995P30q150K379P420k139n236k101J875O859J684
1411F176j0109k700R867l43p320O488M014j1395l199J4274J457j1098p2N696k707
1426i71j199M038O04j795k330m239M240J0294m618j1635M043P063m987R34Q747
$$ plain form
1441 8189 499 -12545 -4177 10234 7279 -3236 -6409 -4476 2315 8032 2311 -4737 -2718 -867
1455 -867 -635 6344 6512 -8115 -9378 6754 8896 -3751 -3641 3553 488 -2374 1101 1948 1054 2071
1471 2071 -902 -3173 2503 3732 -825 1598 2231 -5976 -2834 10339 7107 -8589 -6206 5833
1485 5833 5071 396 843 -1632 -2320 3361 4225 -531 -58 147 -2229 2043 4845 -1842 -2771 5868 1597
1502 1597 -7346 465 9665 1361 -6436 -777 2444 2219 4333 694 -6588 -2706 5857 5234 628
1517 628 -2629 -5751 726 10053 2354 -10094 -3265 7122 2558 -1632 1643 -1394 -4297 3546 6576
1532 6576 -2904 -5914 746 3479 2289 6 -4266 -2281 5085 1353 -5519 333 4932 -2538 -3444
1547 -3444 5168 1251 -6143 -217 4827 -2225 -3425 3235 3286 -1940 -3093 -1721 1241 4718 -550
$$ packed form
1441H189p690j3044Q368J4411k955j0515l173J933O791N717n721p048K019J851
1455h67K32O979J68j4627j263J6132K142j2647J10P194l065k862L475Q47q94J017
1471B071k973k271N676J229m557K423O33q207L142J3173l232j5696K383J2039
1485E833p62m675M47k475o88N681Q64m756M73K05k376M272K802o687r29Q639m271
1502A597q943P811R200q304p797N659L221k25K114l639p282L882Q563o23m606
1517F28l257l122O477R327p699j2448O829J0387m564m190L275l037k903P843L030
1532F576r480l010O660K733j190k283m272J985P366l732o872N852M599p470r06
1547c444Q612l917p394N926N044p052j200O660N1n226j153J372K962L477n268
$$ plain form
1562 -550 -6335 1154 5515 -1827 -3184 3325 -933 -6194 3173 7462 -3432 -5402 3582 3571 -2441
1577 -2441 -1769 664 1024 1581 -576 -2334 2720 3806 -3045 -2467 3223 -297 -2194 7228 5389 -8677
1593 -8677 -5871 8661 7600 -3622 -3601 431 972 3965 5005 -450 -3711 -2442 1132 6725 6422
1608 6422 -5009 -7432 6516 8807 -3558 -4010 5253 773 -3759 5101 8332 -2757 -5088 2456
1622 2456 4035 187 -289 691 2684 2014 -3482 -953 7883 3575 -9266 -3581 9491 3896 -4056
1637 -4056 2321 3415 -4867 -2380 6895 3415 -5252 -3268 3254 5121 1061 -5227 -3929 4924 2961
1652 2961 -5708 -478 7718 -256 -7168 1891 4574 -4191 -1856 5032 -563 -6350 1104 6992 1402
1667 1402 -5490 -6870 -304 8017 4094 -7020 -4739 3515 939 -1858 2700 -1316 -9227 -178 11600
$$ packed form
1562e50n785P489M361p342j357O509m258n261R367M289j0894j970Q984j1o012
1577b441O72K433L60N57k157j758N054J086o851N78N690l520j897R422j839j4066
1593h677K806J4532j061j1222K1M032N41K993J040n455l261J269L574N593l03
1608F422j1431k423J3948K291j2365m52R263m480m532Q860L231j1089k331P544
1622B456J579l848m76R80J993o70n496K529Q836m308j2841N685J3072n595p952
1637d056O377J094q282K487R275l480q667J984O522J867m060o288J298Q853j963
1652B961q669N230Q196p974o912R059K683q765K335O888n595n787P454N888n590
1667A402o892j380O566Q321l923j1114K281Q254k576k797M558m016p911R049J1778
$$ plain form
1682 11600 2139 -9589 -4431 3092 1743 -679 -2197 -2592 -17 797 -931 541 1115 -5430 -4757
1697 -4757 4669 2979 -5871 -1761 5679 -2542 -8135 1668 5413 -3039 -5471 -221 2045 1648 -512
1712 -512 -4286 -2900 1049 -630 -8 3436 -1794 -8024 1074 8864 -2226 -9755 274 6108 -640
1727 -640 -2736 990 175 -1367 -280 -1012 -519 1775 88 -538 2730 -909 -5628 2170 7542 -3805
1743 -3805 -9085 3232 8722 -801 -4501 -1004 -624 885 3821 861 -3176 -1587 1047 2967 4364
1758 4364 -1938 -8373 -267 8743 1398 -5003 1407 2434 -3600 -614 4910 -307 -4510 138 2689
1773 2689 1112 621 -732 -2023 546 10 -1843 2722 4590 -4195 -5878 4509 5374 -4042 -3195 2145
1789 2145 -866 -1655 4336 2189 -4554 -3923 1489 2908 1824 -2365 -4488 1159 4993 -1605 -4190
$$ packed form
1682A1600r461j1728N158P523j349k422j518l95K575Q14j728J472N74o545O73
1697d757R426j690q850M110P440q221n593R803L745q452k432N250K266l97k160
1712e12l774J386L949j679O22L444n230o230R098P790j1090p529J0029N834o748
1727f40k096L726q15j542J087p32M93K294j687o26L268l639m719P798N372j1347
1743c805n280J2317N490r523l700L497L80J509K936k960m037J589K634J920J397
1758D364o302o435Q106R010p345o401O410J027o034K986N524n217m203M648K551
1773B689j577m91j353j291K569n36j853M565J868q785j683J0387Q65r416Q47N340
1789B145l011p89N991k147o743O31N412J419j084m189k123N647L834o598k585
$$ plain form
1804 -4190 2293 1924 -4521 -7 5156 -1583 -4497 2518 2326 -4252 -2689 3015 2134 -1452 -3381 -2194
1820 -2194 3579 4480 -3819 -6703 1502 3356 -1018 1125 1567 -6235 -5030 6523 5975 -5347 -6642
1835 -6642 797 3303 2185 -548 -3747 -2428 1650 735 -401 1666 -1721 -5895 1634 6325 -2245
1850 -2245 -5821 1945 2295 -3731 -488 3939 -63 -4272 -1738 792 2207 2172 -2491 -3719 1208 2625
1866 2625 -79 1182 657 -5573 -2459 7873 4852 -6627 -4506 4015 2920 -117 253 -1366 -2003
1881 -2003 2498 3020 -701 -773 -303 -704 2362 2409 -3429 -1715 5992 2228 -6569 -1407 5867 1644 -2636
1898 -2636 -762 -701 -345 3570 2516 -3277 -3692 471 2586 3670 805 -6004 -3294 5723 4039 -4374
1914 -4374 -2575 2076 -1103 -879 3620 701 -4031 -1160 1915 570 512 336 -1766 -1088 940 -578
$$ packed form
1804d190O483l69o445M514N163o739k914P015j92o578J563N704q81l586j929J187
1820b194N773R01q299k884Q205J854m374K143M42p802J205J1553n48j1322j295
1835f642P439K506j118k733l199J319M078r15j136K067l387m174P529M691q570
1850b245l576P766L50o026L243M427m002m209K534K530J415l5m663j228M927J417
1866B625k704J261n25o230L114J0332l021j1479K121Q521j095l037L70j619o37
1881b003M501N22l721p2M70m01L066M7n838J714P707l764q797N162P274m223m280
1898b636J874O1L56L915j054n793m15M163K115J084k865o809K710R017j684q413
1914d374J799M651l179K24M499k919m732K871L075j345n8j76k102O78K028j518
$$ plain form
1930 -578 31 2842 -1649 -5863 492 6209 182 -4236 -586 395 -725 2899 2251 -4158 -3570 1933
1946 1933 2888 1085 -560 -3660 -2351 4104 2881 -3465 -2046 1544 -657 -238 2630 -681 -4249
1961 -4249 880 3385 -1059 -1364 1552 194 -887 557 -941 -1523 2415 2260 -3263 -1668 2199 1107
1977 1107 -438 1089 -1853 -3005 3319 4739 -2176 -3609 70 694 1390 2516 -927 -4290 1059
1992 1059 4213 592 -1187 -27 -1347 -121 4011 1464 -2815 -516 2116 -782 831 3336 -1051
2007 -1051 -2758 1427 1428 -372 2163 1299 -3683 -2701 3905 3353 -619 -1329 -2435 -1338 4438 4770 -3177
2024 -3177 -5403 194 2419 2632 2051 -3167 -5993 1473 6753 271 -4217 -1850 65 510 2734 124
2040 124 -3846 -880 2334 -1011 -1368 1378 165 -1720 611 -690 -2627 1711 3333 -3636 -5648
$$ packed form
1930e78O09K811m491m214O355N717o027m418L650R81j120L624o48o409N88N503
1946A933R55j803j645l100J309O455j223o346J419L590k201M19K868l311l568
1961d249N129K505m444l05K916j358j081J444j498n82L938j55n523J595L867j092
1977A107j545J527k942j152O324J420o915j433L679O24O96J126l443l363N349
1992A059L154l621j779J160j320J226M132k547m279K299K632k898J613K505m387
2007a051j707M185Jj800K535q64m982R82O606n52l972p10j106J097N776L32p947
2024c177k226N597K225K13n81n218k826P466N280o482m488K367J915M45K224k610
2040A24l970K966L214l345l57K746j213j885K331j301j937M338J622o969k012
$$ plain form
2055 -5648 1010 3290 596 -1222 -3295 -3766 1477 4695 -486 -4299 -1519 -664 731 3157 -531
2070 -531 -5721 -1208 3747 -145 -1776 1348 -120 -3328 -639 2145 260 26 -342 -3181 -1267 3519
2086 3519 1995 -1338 -1509 -1792 -1356 4174 4979 -4029 -6135 1888 5158 775 -351 -1378 -2759 1080
2102 1080 5004 690 -2807 -1339 441 1329 3179 -3 -3714 192 4401 -41 -2059 1863 1312
2117 1312 -1368 553 1782 -927 32 2534 -39 -1742 1081 1734 104 1154 319 -2561 1187 4131
2133 4131 -266 -3091 1242 2070 -522 1303 1624 -1769 -1229 2563 1126 -1057 514 -28 -538 2071
2149 2071 1830 -1935 -774 2289 -39 -1411 2275 1559 -2407 -289 1953 -313 -448 1376 -846 -2230
2165 -2230 1588 2552 -794 -961 -1016 -1827 1549 4168 -1027 -4788 -313 2198 1055 1510 -931 -5058
$$ packed form
2055e648O658K280k694j818k073m71N243L218n181l813K780Q55J395K426l688
2070e31n190M513M955l892j631L124j468l208K689K784j885k34l68k839J914M786
2086C519j524l333j71k83M36N530Q05r008k106Q023L270m383j126j027j381L839
2102A080L924m314l497J468J780Q88J850l182l711L906M209m442k018L922n51
2117A312k680J921J229k709R59K502k573j703K823O53j630J050q35k880L748K944
2133D131m397k825M333Q28k592J825L21l393N40L792j437k183J571n42n10K609
2149B071k41l765J161L063k328j372L686p16l966K118K242k266j35J824k222j384
2165b230L818R64l346j67n5q11L376K619n195l761M475K511j143M55k441m127
$$ plain form
2181 -5058 -1632 5414 3017 -3148 -3163 -1153 270 3141 2201 -4174 -4020 1648 2724 248 -228 -1497
2197 -1497 -2665 626 2168 -1352 -1507 1549 -653 -3004 1234 2572 -1486 -1007 -175 -2407 -455 4310
2213 4310 1652 -4261 -2837 1062 1972 2074 -516 -4092 -1745 3427 1832 -1317 -458 -673 -2358 1331
2229 1331 3383 -1398 -2735 1365 966 -2504 607 3103 -135 -2430 -963 11 2529 3100 -1821 -4455
2245 -4455 167 3031 1449 1132 -509 -4827 -1470 6757 4574 -4539 -4540 1343 3007 2258 641 -2469
2261 -2469 -2502 1715 2312 1025 401 -1735 -2406 2244 3837 -1640 -3301 2349 2242 -2827 -523 3295
2277 3295 334 -2485 -648 597 540 1390 -238 -1765 -85 299 -344 1702 1190 -4316 -2725 4349
2293 4349 2820 -4447 -2668 2155 167 -1916 694 507 -1796 -670 659 25 4 -1165 -1643 586
$$ packed form
2181e058L426P046k397o165j5K010J423K871r40o375J54N668J076k476m76j269
2197a497j168L291J542l520j55L056k202k351M238J338m058M79Q32k232J952M765
2213D310k658n913J424L899R10J02k590l576K347N172j595l149Q59k15j685L689
2229A331K052m781j337M100l99l470L111K496l238k295J467R74K518N71m921k634
2245d455M622K864j582l17j641m318L357Q227k183r113jN883J664p49j617l110
2261b469l3M217N97j287o24k136o71M650J593n477j661N650j07n069K304L818
2277C295k961k819J837J245n7Q50j628j527J680L84o43K046n12n506J591P074
2293D349j529p267J779M823j988k083K610j87k303J126J329o34k1j169m78K229
$$ plain form
2309 586 1121 -2534 -1544 3271 -21 -5650 -1042 4549 186 -3888 -1438 545 -1074 543 1305 -2121
2325 -2121 -3356 -1270 1703 2637 -640 -6012 -2671 4472 2473 -4435 -2667 773 -1497 -1065 3493
2340 3493 327 -5858 -3163 3219 2812 -1278 -3028 -1886 893 1192 -1599 -1122 1277 -1615 -3913 1678
2356 1678 4061 -2504 -4425 1388 1451 -2538 41 3045 -721 -3576 -659 2597 2185 -1363 -4539 -1266
2372 -1266 3811 1611 -2734 -329 1175 -2503 -885 4624 1040 -4971 -1310 4172 1326 -2529 -561
2387 -561 1316 -174 -1172 -636 1218 3106 -649 -3723 -67 2793 -880 -826 1672 -955 -4117 2440
2403 2440 6172 -1776 -6635 -1080 3642 2295 -219 -2490 -2034 372 1963 670 84 -1794 -4086
2418 -4086 551 5812 216 -6450 -1146 3449 -693 -2596 1454 822 -2538 -1515 1130 993 -930
$$ packed form
2309E86N35l655R90M815l292n629M608N591m363m074K450J983j619J617P62l426
2325b121j235K086K973R34l277n372L341P143j999o908J768L440k270M32M558
2340C493l166o185K695O382m07m090j750J142K779K99k791M77K399k892k298N591
2356A678K383o565j921N813O3l989K579L004l766k855K917L256m12l548l176L273
2372a266N077k200m345K405J504l678J618N509l584o011L661N482k846l855J968
2387e61J877j490r98N36J854J888l755l074L656K860l673N4K498k627l162O557
2403B440L732p948m859N555M722j347k514k271M56K406J591j293n86j878k292
2418d086M637N261n596o666N304M595m142j903M050o32l360J023K645j37j923
$$ plain form
2433 -930 -1831 -1753 616 851 -954 -113 1292 -2882 -4641 2910 4768 -3453 -5913 1307 3190 -1306
2449 -1306 -1436 -328 -1854 -1435 896 1122 -417 -2403 -2008 535 2659 -2025 -4647 1421 3224 -2691
2465 -2691 -3392 2994 1719 -3642 -1999 816 -584 -774 954 -80 -2466 -1529 514 2328 1078 -3638
2481 -3638 -4351 3171 4927 -1817 -4094 198 492 -1393 1985 2218 -2569 -3194 2349 3013 -172 -2266
2497 -2266 -1458 343 2595 857 -1222 522 494 -2391 132 4226 693 -3221 248 2998 -252 -376
2513 -376 2302 177 -3051 -290 3113 2271 232 -2042 -1079 3031 3258 -1245 -1748 1421 582 -51 3590
2530 3590 2642 -3735 -2448 3888 3213 -1555 -1202 935 1311 778 209 -641 893 680 -1322 -171 2932
2547 2932 -1 -1863 1616 1767 -2788 -1155 4459 1694 -3970 -1974 2160 1937 451 -1454 -2458
$$ packed form
2433i30r01P8K369K35j805Q41J405m174j759P551J858q221k460P220J883m496
2449a306j30J108j526M19K331K26j539j986L95K543K124m684k622O068J803n915
2465b691p01O386j275n361J643K815j400j90J728j034k386R37K043J814j250m716
2481c638p13P522J756o744k277M292K94j885L378K33m787o25N543O64l185k094
2497b266Q08J801K252j738k079J744k8k885K523M094l533l914L469K750l250j24
2513c76K678k125l228K761L403q42k039k274R63M110K27m503n03L169q39o33L641
2530C590r48o377J287O336o75m768L53K137L76n33n69q50J534k13k002J151L103
2547B932k933j862L479J51m555J633N614k765n664J996M134k23j486j905j004
$$ plain form
2562 -2458 -198 2115 769 -59 -533 -2883 -1565 3972 3155 -4108 -3928 2720 2533 -1597 -861 122 -1810
2579 -1810 -710 1282 838 -419 -809 -1693 -526 1206 -163 -1494 305 39 -2710 242 4226 -81
2595 -81 -4992 -1541 2580 964 -868 -1013 -2360 -1094 2245 1379 -1628 -2531 -1404 511 3142 484
2611 484 -4462 -2069 3313 1089 -2878 -407 1320 -1434 -788 1552 -379 -1549 672 1158 -1248 -512
2627 -512 345 871 1027 -775 -3040 761 4415 423 -3726 -323 1746 -1 592 2287 -1702 -2533
2643 -2533 1785 3718 592 -1595 -960 34 2003 1608 -933 -287 1431 -227 -733 2741 1932 -2599
2659 -2599 -1423 2517 1083 -295 1457 647 -2551 -352 2931 1417 -659 -1609 -1745 992 3530 624
2675 624 -2737 -1060 714 234 1689 1953 -2861 -3381 2301 3095 -1179 -1971 -149 -454 534 1700 -289
$$ packed form
2562b458K260K313j346q28m74k350J318N537q17p263J80O648j87m130P36R83j932
2579a810J100J992m44j257l90q84J167J732j369j331J799k66k749K952L984m307
2595h1m911L451M121j616j832j45j347J266L339q66l007r03J127J915K631k658
2611D84m946K393N382k224l967K471J727k754O46K340j931j170K221M86k406P36
2627e12Q57N26J56j802k265L801L654l992m149L403K069j747N93J695l989q31
2643b533M318J933l126k187O35R94J969l95k541O46J718j658n06L474q09m531
2659b599J176L940j434j378J752q10l198K199L283j514k076r50j36K737K538k906
2675F24l361J677J774m80J455K64m814n20N682P94m274p92J822l05R88J166j989
$$ plain form
2692 -289 -1516 -454 -2 -294 631 78 -1761 -202 1447 -1488 -1743 1996 1055 -2443 -1517 1920 281
2709 281 -642 457 -1260 -2021 395 1653 -427 -1512 -1331 -1299 1616 2667 -2067 -3409 926 1892 -1038
2726 -1038 -416 615 -2069 -1911 1679 1024 -1889 -1165 -196 -545 245 182 -1047 -340 449 -1697 -1080 2596
2744 2596 1196 -3236 -1466 2360 1002 -100 381 -1073 -1914 1357 3132 -540 -2539 -1175 300
2759 300 3102 2049 -2559 -3354 1921 3352 -371 -1118 223 -1133 324 3124 1146 -2982 -792 2381
2775 2381 679 -500 -70 97 300 959 -520 -768 2062 925 -2252 -1009 1811 177 -598 1659
2791 1659 -730 -2699 677 3771 -160 -3015 -1064 814 1713 1612 -1311 -2227 108 1047 -525 389
2807 389 1086 -1912 -2050 1630 1406 -1718 -618 691 -1567 -1644 1331 1329 -647 -1865 -1817 -324 2642 1007
$$ packed form
2692b89j227J062M52k92R25n53j839J559J649k935k55L739r41l498R26L437j639
2709B81r23J099j717p61K416J258k080j085J81L2K915J051m734j342M335R66k930
2726a038O22J031k684J58L590o55k913P24R69l49P90o3j229P07P89k146O17L676
2744B596j400m432J770L826j358j102M81j454q41L271J775l672j999J364J475
2759C00K802j053m608p95N275J431l723p47J341j356J457K800j978m128K190L173
2775B381j702j179M30J67K03O59j479k48K830j137l177J243K820j634p75K257
2791A659k389j969L376L094l931k855J951J878Q99j01k923r16K335R39j572R14
2807C89O97k998j38L680k24l124J100J309k258p7K975kj976j218M8J493K966j635
$$ plain form
2825 1007 -3529 -3267 649 736 335 1139 -2008 -4546 168 3869 574 -2865 -2149 -750 189 1478 -522
2842 -522 -2815 -1054 466 -323 270 489 -2372 -2734 1233 1363 -2132 -972 1191 -1575 -2155 453 766
2859 766 -769 -633 -932 -1459 738 1352 -1233 -1798 -169 -837 -723 1955 123 -3273 -738 2198 457
2876 457 -1047 -314 -745 -1300 764 1020 -1219 -675 543 -778 106 1651 -536 -1557 534 965 -1277
2893 -1277 562 2140 -796 -2162 479 1653 413 472 -497 -1998 810 2796 151 -1637 -464 -264
2909 -264 407 2752 747 -3445 -1072 3225 1920 -1005 -1043 -641 45 2102 986 -1589 -1151 1261 230
2926 230 276 998 -948 -1900 1255 2030 -1591 -1605 1650 325 -1828 388 937 -350 -421 -844 -1518 636
2944 636 1681 -977 -1655 0 -187 -648 1547 740 -3193 -1921 2588 999 -1763 -1368 -403 -443 302
$$ packed form
2825A007m536K62L916Q7m01Q04l147k538M714L701l295l439P16J399R39J289k000
2842e22k293J761J520p89N93K19k861l62L967J30l495J160K163k766n80K608L13
2859G66j535J36k99n27K197O14k585n65J629o68J14K678j832l396K535K936j741
2876D57j504P33m31n55K064K56k239N44J218j321Q84J545k187j021K091M31k242
2893a277J839J578k936j366K641J174j240N9r69j501K808J986k645j788J173K00
2909b64O71K345k005m192K373M297j305k925l8M02O86K057j116k575M38K412j031
2926B30M6P22j946r52L155P75l621j4L255j325k153K216N49j287p1m23o74K154
2944F36J045k658o78J655j87m61K195q07l933J272M509j589k762L95R65m0P45
$$ plain form
2961 302 660 -1418 -691 461 -833 -577 987 -638 -1837 549 584 -2468 -394 2466 -581 -3823
2977 -3823 -1058 1792 784 -437 -1307 -2580 -962 1866 767 -1616 -2072 -1818 -359 2908 1261 -3826
2993 -3826 -2867 2470 1797 -1284 -827 -224 -1590 -289 2099 187 -1255 -571 -332 319 1491 86 -1697
3010 -1697 920 774 -1720 110 3033 110 -3154 50 2415 207 -318 347 -630 -579 1494 1212 30
3027 30 -342 -865 301 2228 1771 -1643 -833 2769 1344 -1123 972 2077 -831 -504 1643 1230 -333
3044 -333 743 818 -168 601 859 800 1675 580 -1985 214 3608 1562 -2286 4 1536 327 724
3061 724 1833 -656 -1906 1505 2810 533 -845 -1100 -182 2345 2177 -1001 -1808 875 864 -559 1777
3078 1777 571 -2366 -596 2598 1076 -1757 115 950 -281 -404 1025 152 -106 -385 -1005 265
$$ packed form
2961C02L58k078P27J152j294K56J564j625j199K386L5l052K074K860l047l242
2977c823K765K850j008j221q70j273J618K828j099k383m56K54J459L267j647n087
2993c826R59N337o73l081M57O03j366J301K388j912j442O84K39O51J172j405j783
3010a697K617j46k494J830K923k923l264L204K365k208n25O65r77N1K073k82j182
3027C0l72n23J166J927m57l414Q10L602j425k467K095J105k908L27K147m13j563
3044c33J076P5r86P69K58n9Q75j095k565K199L394k046l848K290J532j209L97
3061G24J109k489j250L411J305k277j378k55R18K527j68l178q07K683j1j423K336
3078A777j206k937J770L194j522k833J872Q35j231j23J429q73k58k79o20J270
$$ plain form
3094 265 2263 14 -2166 197 1009 -870 323 1844 -1565 -2960 912 2659 -569 -2051 -477
3109 -477 307 663 389 -1103 -1093 195 -59 -638 936 298 -2322 -327 2286 -356 -2536 821 1842
3126 1842 -1712 -1763 843 1188 -66 -573 -1543 -502 943 807 -361 -197 -545 -1386 1533 2880 -1963
3143 -1963 -3963 1038 3204 203 -1006 283 -274 -99 1612 979 -1106 -735 221 945 1759 259 -1500
3160 -1500 5 1923 -195 -1370 2111 1871 -1934 -486 2550 1160 -838 160 317 -333 866 2219
3176 2219 393 -395 -128 336 2104 1963 -1628 -1948 2097 2743 -731 -559 1794 141 -672 2168 1893
3193 1893 -1226 -436 1422 947 -243 -203 66 1387 1089 -1012 -893 2398 1514 -1849 -791 1646 88
3210 88 -495 1789 937 -2301 -200 2440 1114 -901 -844 -35 1250 1472 -568 -1355 212 996 -397
$$ packed form
3094B65J998k249k180K363Q12j879J193J521l409j395L872J747l228j482J574
3109d77P84L56k74j492J0J288k54n79J574o38k620J995K613k642k180L357J021
3126A842l554n1K606L45j254n07r70J041J445j36j168J64l48q41K919J347m843
3143a963k000N001K166l001j209J289n57J75J711o33k085L71R56P24Q14j500j759
3160a500J505J918k118j175L481k40l805J448L036j390j998R98J57o50J199J353
3176B219j826p88K67M64J768j41l591l20M045O46l474J72K353j653q13K840k75
3193A893l119P90J858m75j190M0K69J321k98k101J19L291q84l363J058K437j558
3210H8n83K284q52l238K101K640j326k015N7Q09J285K22k040p87J567P84j393
$$ plain form
3227 -397 787 1743 -1780 -2040 1843 1912 -1852 -1244 950 -14 -475 730 537 -608 -607 -587 -412 1459 331
3246 331 -2056 -309 1665 -63 -753 1037 -254 -2853 213 2841 253 -2056 -661 404 173 850
3262 850 -12 -1303 -3 821 663 819 10 -1750 -1105 2117 1051 -2415 -254 1557 -14 -1304 586
3279 586 995 -773 -67 599 -495 -99 790 443 69 -192 -1028 546 2813 357 -2806 -367 2590
3296 2590 712 -1084 10 109 -874 1355 1760 -424 -1428 46 811 862 265 -1125 -491 1824 685
3313 685 -1262 217 1497 -872 -1176 1568 1605 -595 -78 709 -568 -128 1202 489 -617 -797 -76
3330 -76 1209 1908 -761 -2837 -34 2360 88 -1161 374 -55 -433 999 1267 -1726 -1714 1320 1666
3347 1666 78 -437 -707 -180 1129 -247 -1458 197 1269 -542 -1111 991 261 -1111 805 1268
$$ packed form
3227c97J184R56l523k60L883O9l764O08K194r64m61J205j93j145JK0J75J871j128
3246C31k387J747J974j728o90J790j291k599L066K628k588k309J395J065k31O77
3262H50q62j291J300Q24j58J56q09j760O45L222j066l466K161J811j571j290J890
3279E86M09j768P06O66j094L96Q89l47l74k61q36J574K267k456l163K439K957
3296B590j878j796J094R9r83K229M05k184j004J474P65N1n97j390O34K315j139
3313F85j947J479J280k369l04K744L7k200N17P87j277M40J330p13j106j80P21
3330g6J285O99k669k076K803K394k272j249J535m29l78J432K68k993J2L034L46
3347A666j588n15k70N27J309j376j211J655J072j811n69K102p30j372J916M63
$$ plain form
3363 1268 -1595 -1090 1603 1150 -868 -1054 -61 193 827 -95 -1281 116 1062 -190 -63 1049 -782
3380 -782 -1831 1052 2239 -829 -1586 938 609 -796 -151 587 -112 -419 -413 32 1143 545 -1374 -999
3398 -999 1637 766 -674 1128 884 -1885 -1071 2564 1409 -1771 -1176 895 943 754 389 -920 -687
3415 -687 652 494 635 788 -1486 -1262 1643 2337 -766 -1495 1431 901 -854 446 1565 -538 -673
3432 -673 643 635 -82 428 -18 2 398 -419 -675 1664 1065 -2013 -1226 2195 1171 -1015 -226 591 -892
3451 -892 -204 1694 169 -1418 -448 684 1043 682 -854 -1374 823 1239 -1029 -629 1328 -255 -1952
3468 -1952 850 1849 -744 -1084 607 110 -697 294 849 -302 -863 -1006 255 1519 278 -2647 -1265
3485 -1265 1825 1165 -1555 -541 47 -1287 -30 1705 -368 -2501 -849 1377 578 -601 -829 -1010
$$ packed form
3363A268k863N05K693m53k018j86R93K54O34r22j186J397R46j252J27J112j831
3380g82j049K883J187l068p57K524l29j405O45P38o99l07OM45J111n98j919L75
3398i99K636q71j440J802k44k769Q14L635j155l180N95K071M8j89l65j309K33
3415f87J339j58J41J53k274K24K905O94l103p29K926n30j755J300J119k103j35
3432f73J316qp17N10m46K0L96q17k56K339n99l078P87L421j024k186P89Q17j483
3451h92O88J898j525j587R70J132L59l61j536n20K197M16k268M00J957j583j697
3468a952K802R99k593l40J691m97q07R91N55j151n61j43J261J264j241k925J382
3485a265L090o60k720J014N88j334J257J735k073k133J652K226p99j179k28j81
$$ plain form
3501 -1010 871 583 -1363 -1316 935 -231 -1242 357 533 -1553 -906 1449 76 -1742 -18 1459
3517 1459 -57 -532 -449 120 559 506 -1170 -763 1130 677 -1054 328 674 -976 305 1858 71
3534 71 -1642 298 1384 170 -453 89 215 689 640 -193 -272 1200 730 -959 429 1316 -398 102
3552 102 1033 -101 -878 912 1975 -491 -883 301 1044 1388 792 -784 -1113 1132 1659 14 297
3569 297 -43 -637 563 2148 319 -1771 -157 1330 827 321 561 -319 -180 1261 548 221 339 -6
3587 -6 -825 722 1588 -218 -348 1220 -81 -941 759 1169 -226 -774 132 25 557 949 -119 -1096
3605 -1096 -113 554 52 701 417 -1080 -689 1362 768 -1161 -249 418 -618 -223 558 -135 -732 106
3623 106 -210 -161 404 685 -1064 -986 137 -251 177 685 -690 -2074 80 1604 372 -1295 -726 -886
$$ packed form
3501a010J881k88j946M7K251j166j011J599J76k086O47K355j373j818J724J477
3517A459j516m75Q3N69M39n3j676M07J893m53j731J382L46j650J281J553j787
3534G1j713J940J086j214o23N42J26M74m9q33p9J472m70j689J388Q87j714N00
3552A02R31j134p77J790J063k466l92J184P43L44n96j576l29K245N27j645K83
3569B97l40n94J200J585j829k090J614J487n03n06K40q80J39J441p13l27J18l45
3587fq19J547Q66j806j30J568j301q60J700M10j395n48R06j07N32L92j068r77
3605a096R83O67n02O49k84j497L91K051n94j929R12O67j036L95P81o93n97Q38
3623A06l16M9N65K81j749P8J123l88M28N08j375j384K154J524j232j667N69j60
$$ plain form
3641 -886 211 1440 214 -1826 -952 787 636 269 137 -1203 -1028 1581 747 -1350 -735 606 -110
3658 -110 69 638 -324 -878 637 485 -518 64 511 -282 -51 456 -430 -166 993 235 -1324 89
3676 89 1300 249 -670 -152 -81 33 973 101 -952 3 1209 57 166 320 -492 -492 1073 765 -1112
3695 -1112 45 1221 249 -375 352 307 63 1020 490 -652 550 1186 152 -420 171 79 280 1240 606
3714 606 -1544 -374 1475 732 -565 -87 -530 222 1119 795 -808 -733 502 722 295 259 -874 -737
3732 -737 1299 1326 -711 -430 828 -133 -273 651 225 -745 49 354 -197 -128 556 -298 -208 164 -54 -372
3752 -372 931 194 -1874 -268 1360 287 -729 -61 124 -733 376 588 -952 -899 334 206 -142
3769 -142 239 -185 -888 360 211 -945 -215 830 -155 -1199 132 282 -699 464 193 -1172 -692 937
$$ packed form
3641h86J097J229j226k040Q74J739j51l67j32j340J75K609q34k097O15J341p16
3658a10J79N69r62n54J515j52j003N82M47p93K31N07q86K64J159p58j559J413
3676H9J211j051r19N18P1J14R40q72j053R55J206j152J09J54q12%J565l08j877
3695a112J157J176r72o24P27m5k44R57n30j142J202O36j034n72N91r2K01R60o34
3714F06k150J170J849p43j297M78m43P52Q97l24j603P5J235K20m27l6j133J37
3732g37K036K7k037K81J258r61j40R24m26r70P94L05n51O9O84q54R0L72k18l18
3752c72J303p37k068J606J628j073j016O68J85q57J109K12j540N3J233j28l48
3769a42L81m24p03J248j49j156P30J045r85j044J331J50r81J163k71j365M80J629
$$ plain form
3787 937 568 -461 -717 -589 156 1199 745 -1396 -1059 284 459 -57 395 -995 -1276 458 1759 -321
3805 -321 -1534 -81 130 -61 509 79 -865 -280 762 -169 73 282 -468 -575 724 234 -623 304 972
3824 972 -769 -692 996 770 -281 -404 79 -306 503 708 -636 -962 426 440 -182 516 -345 -981 861
3843 861 1433 -1037 -1458 474 376 -363 -265 144 -520 28 341 -298 -623 425 374 -372 -62 -416 -670 824
3863 824 840 -1329 -1486 1104 918 -855 -594 -284 -520 322 991 -244 -1245 -212 212 513 286 -915
3881 -915 -1420 244 831 -290 -920 530 -171 -982 174 607 -873 -790 438 17 -380 236 260 -277 -395
3900 -395 -230 -68 709 365 -1084 -698 1339 303 -1058 -472 394 -678 -219 988 -355 -1386 -216
3917 -216 874 283 -426 -718 -89 530 417 -1004 -484 647 70 -620 389 486 -713 -357 1435 213
$$ packed form
3787I37l69j029k56J28P45J043m54k141L37J343J75n16M52j390k81J734J301k080
3805c21j213J453K11j91N70m30r44N85J042r31K42K09p50j07J299m90q57R27O68
3824I72j741P7J688k26j051j23M83l85Q09K05j344l26J388J4o22O98q61o36J842
3843H61N72k470m21J932r8p39R8M09o64N48L13o39l25J048n1p46L10l54k54J494
3863H24J6k169j57K590j86j773K61L10k36Q42O69j235j001J033M24L01k27j201
3881i15n05J664N87j121o30J450p01q11J156M33j480Q3J228m21l97O16K4n37j18
3900c95J65J62P77l44j449L86K037j036j361N86Q66j072M59J207j343j031J170
3917b16J090n91p09k92O29O19j13j421N20J131n77o90J009R7j199L56J792j222
$$ plain form
3935 213 -1257 57 1018 21 -974 -303 130 826 612 -506 -740 435 364 -241 805 136 -1240 -253
3953 -253 1630 460 -1344 -300 993 98 -166 132 -257 -447 118 81 221 334 -524 -803 539 1160
3971 1160 -771 -571 1089 224 -1016 515 860 -385 -675 16 306 -174 297 -258 -667 294 97 3
3989 3 49 -573 -1312 341 1490 47 -1740 -257 631 -627 -729 179 -378 -874 612 361 -625 -742 -275
4008 -275 -166 163 -712 -638 329 1170 -549 -1592 273 1071 -522 -797 406 -394 -793 657 711 -1056
4026 -1056 -1313 227 685 533 -352 -1498 -11 1283 -140 -1219 17 494 -757 -121 770 -396 -1287
4043 -1287 -20 557 -549 -710 126 63 -212 -141 -210 566 787 -976 -1170 642 849 -143 -561 207 -223
4062 -223 -355 1041 616 -1194 -619 799 855 -166 -349 -580 160 944 84 -773 384 548 -410 230 677
$$ packed form
3935B13j470J314R61r97r95O71M33O96k14j118k34J175p1o05J046o69j376R87
3953b53J883j170j804J044J293q95k64K98l89j90N65l7J40J13q58k79J342O21
3971A160j931K00J660q65j240J531L45j245k90O91K90m80M71n55m09R61j97r4
3989CM6o22p39J653J149j443j787J483Q88j258j02R08n57m96J486k51r86j17M67
4008b75J09L29q75P4R67Q41j719j043J865P98j593k75J203q00l99J450N4j767
4026a056k57J540M58j52q85j146J487J294j423j079J236M77j251O36Q91j166q91
4043a287J267N77j106j61Q36o3k75P1o9P76K21j763j94J812K07r92m18P68m30
4062b23j32J396m25j810N75J418N6j021j83k31P40P84q60q57J157J64r58O40M47
$$ plain form
4081 677 -507 -657 1159 767 -1043 -617 951 576 -682 -160 115 563 639 -112 -441 254 512 -291 355
4100 355 735 -914 -888 1318 997 -937 -666 549 -1 -433 239 172 -638 -628 -230 193 244 -266 -985 -127
4120 -127 805 -433 -848 793 452 -1224 -272 1287 -30 -1233 -220 350 219 -509 -349 -429 -335 -167
4138 -167 -101 275 119 -1169 -664 1437 702 -1745 -1319 964 371 -695 229 -222 -783 26 532 -130 -426
4157 -426 -319 -312 474 408 -1068 -940 630 524 -1226 -483 458 -338 -967 -17 -41 -787 -219 442 -226 -879
4177 -879 -99 -305 438 134 -929 -992 964 696 -936 -955 593 -234 -376 159 -80 -1240 -296 829 255
4196 255 -287 -129 -50 -276 122 111 -41 356 -68 -1129 144 1211 -9 -742 130 110 -721 837 1326
4215 1326 -422 -1157 510 1246 393 -16 -703 -431 1151 1138 -620 -420 505 -115 211 1082 266 -1171
$$ packed form
4081F77j184j50J816l92j810M26J568l75j258N22K75M48P6p51l29O95K58q03O46
4100C55L80j649K6K206l21j934K71J215n50m32O72o7q10J0L98M23N1n10p19Q58
4120a27R32j238m15J641l41j676R52J559j317j203J013N70j31p28J60q0R4J68
4138a67O6L76j56j288N05K101p35k447M26K283n93j066R24m51n61Q09N06o62k96
4157d26J07PP86o6j476J28J570j06j750P43R41p96o29R50k4p46N68O61o68o53
4177h79P80k06P43l04j063o3J956k68j632j9J548q27j42N35k39j160R44J125n74
4196B55n42J58P9k26L98j1j52L97m24j061J273J067j220p33Q72k0q31J558M89
4215A326j748p35J667P36q53m09o87K72J582j3j758K00R25o20L26Q71q16j437
$$ plain form
4233 -1171 -11 1241 -88 -800 78 187 -137 -99 -182 -337 460 445 -809 -221 508 -18 -363 375 -145
4252 -145 -786 331 1254 -356 -1375 121 362 9 3 280 -514 -58 493 218 -159 252 -306 -436 374
4271 374 184 -362 -48 27 -865 -654 662 495 -690 -367 -48 -71 424 341 -614 -709 173 26 42 -51 -747
4292 -747 -723 463 1045 -780 -874 255 404 -162 -49 -24 -858 -515 875 11 -659 -321 -62 -226 388 50
4312 50 -576 -173 458 -381 -546 209 -16 -453 238 571 -653 -321 425 229 -501 -32 315 -275 -188 118
4332 118 -623 -141 296 -135 -602 232 34 -225 415 553 -709 -422 1047 -133 -180 127 9 -252 -34
4351 -34 511 -527 -132 301 -514 -274 442 515 -386 -23 25 -488 206 924 -110 -1649 79 882 -159
4370 -159 -283 -4 -949 -59 784 397 -632 -560 -224 368 624 108 -848 -633 858 353 -733 -213 164
$$ packed form
4233a171J160J252j329p12Q78J09l24L8q3j55P97j5j254N88P29n26l45P38n20
4252a45o41J117R23j610j019J496K41l53oK77p94M56N51k75l77M11n58j30Q10
4271C74j90n46L14P5q92K11J316j67j185L23L19k3M95q3r55r5Q82j47J6r3o96
4292g47K4J186N82j825r4J129J49n66J13K5q34L43J390q64o70L38K59j64O14l38
4312E0o26M03O31q39j65P55k25m37O91L33j224L32P46j96p30M69L47n90Q7L06
4332A18p41M82M37m31m67Q34j98k59O40J38j262K87J469j180m7L07j18k61K18
4351c4N45j038L95M33q15K40P16P3r01L63M8n13O94P18j034j539J728Q03j041
4370a59j24K79r45Q90Q43l87j029P2L36N92K56n16r56K15J491n05j086N20L77
$$ plain form
4389 164 -355 -12 758 -39 -519 332 140 -168 24 -262 -538 50 -187 -497 -443 580 -150 -739 14 423
4409 423 -191 -117 209 -376 -491 588 494 -558 -320 237 60 60 260 -201 -337 492 -32 -608 361 754 -418
4430 -418 -408 224 -351 31 600 36 -989 -445 610 44 -124 -264 -644 121 746 292 -1060 -126 483
4449 483 283 -28 134 -614 -636 597 768 -555 -526 68 -320 182 560 -281 -593 324 -65 -161 309 363 -591
4470 -591 -204 451 -304 -633 138 330 -324 -188 777 -306 -390 -144 -57 200 511 -5 -564 -419 576 -163
4490 -163 79 144 -192 -316 436 253 -779 -461 495 151 21 190 -316 -301 113 293 -834 137 211 -8
4510 -8 -481 94 -305 -193 671 153 -1025 -286 717 64 -172 -41 -500 -307 710 657 -304 -440 -32 -178
4530 -178 270 579 -508 -957 331 663 -254 -289 58 -14 -27 676 42 -647 -177 300 -220 -5 155 -309
$$ packed form
4389A64n19L43P70p97m80Q51j92l08J92k86k76N88k37l10N4J023p30n89P53M09
4409D23o14P4L26n85j15J079r4j052K38N57j77%K00m61j36Q29n24n76R69L93j172
4430d18J0O32n75L82N69n64j025N44J055n66j68j40l80P65O25m54j352R34O09
4449D83k00l11J62p48k2J233J71j323K9N94l88N02L78q41l12R17l89r6M70N4r54
4470e91L87O55p55l29P71J92o54J36R65j083q4K46Q7K57L11n16n59J45R95p39
4490a63K42O5l36j24P52j83j032L18R56l44j30J69n06J5M14J80j127R71P4k19
4510hm73N75l99J12Q64n18j178P39J003o53k36J31m59J93J017n3r61j36M08j46
4530a78M48L09j087m49J288L32r17l5L47p2j3P03o34o89M70M77n20K15J60m64
$$ plain form
4550 -309 -374 272 -226 -294 273 179 -755 -550 232 223 -34 -49 -618 -438 706 281 -506 -224 326 326 -295 297
4572 297 -86 -616 246 576 104 -460 -52 -20 -125 365 -89 -408 636 507 -595 17 559 298 -228 253
4592 253 -233 -192 618 844 -574 -413 433 280 338 235 -491 -941 621 865 -340 -669 -110 -321 -219 961
4612 961 161 -1007 -239 646 402 -88 244 -204 160 251 180 -193 198 214 -482 177 738 130 -549 276 101
4633 101 -369 335 473 -272 -820 428 746 -226 152 -443 -736 329 138 -246 -524 130 85 -288 254 -8
4653 -8 -889 -107 609 -238 -467 474 211 -299 -119 105 -268 192 206 -393 -157 196 -11 -247 242 -193 -671
4674 -671 263 954 -329 -1354 -327 18 -190 -45 -82 -630 -274 451 282 -1 -108 -636 -359 711 347
$$ packed form
4550c09o5O46m98o8N67r4r34K05P82rk57j5n69J80J144m25p87K82N50%o21N92
4572B97l83n30Q62L30m72n64M08L2j05M90m54l19J044j29j102O12N42k61n26M81
4592B53m86M1Q10K26j418J61Q46j53N8j03p26m50J562K44j205l29N59k11J02J180
4612I61q00j168P68Q85k44m90L32m48L64R1p1l73L91J6o96O59N61o08o79Q25j75
4633A01m70P04J38p45n48J248L18r72L78n95k93J065j91l84k78O54m5l73N42k62
4653hq81P82P16q47k29R41k63n10J80K24l73M60J4n99K36L53k07k36M89m35m78
4674f71R34O91j283j025J027L45k08J45l7n48L56P25j69k83j07n28K77J070l64
$$ [...]
8191a11
##END NTUPLES=NMR FID
##END=
